##TITLE=1H_DE-80H_X3
 200.13MHz, d2o
 8 sc
 
 19ns.26.2.2025
##JCAMPDX= 6.0         $$ Bruker NMR JCAMP-DX V2.0
##DATA TYPE= NMR SPECTRUM
##DATA CLASS= NTUPLES
##ORIGIN= UXNMR, Bruker Analytische Messtechnik GmbH
##OWNER= pz
$$ XWIN-NMR		Version 3.5
$$ Mon Jun 23 11:40:28 2025 Russian Standard Time (UT+4h)  Yarkov@DPX200
##.OBSERVE FREQUENCY= 200.1313
##.OBSERVE NUCLEUS= ^1H
##.ACQUISITION MODE= SIMULTANEOUS
##.ACQUISITION SCHEME= undefined
##.AVERAGES= 8
##.DIGITISER RES= 18
##SPECTROMETER/DATA SYSTEM= spect
##.PULSE SEQUENCE= zg30
##.SOLVENT NAME= CDCl3
##.SHIFT REFERENCE= (INTERNAL, CDCl3, 0, 15.4208)
##AUDIT TRAIL= $$ (NUMBER, WHEN, WHO, WHERE, WHAT)
$$ ##TITLE= Audit trail, XWIN-NMR		Version 3.5
$$ ##JCAMPDX= 5.01
$$ ##ORIGIN= Bruker BioSpin GmbH
$$ ##OWNER= Yarkov
$$ C:/Bruker/XWIN-NMR/data/yarkov2/nmr/H-C/1/pdata/1/auditp.txt
$$ ##AUDIT TRAIL=  $$ (NUMBER, WHEN, WHO, WHERE, WHAT)
(   1,<2025-06-23 11:39:35.46 +0400>,<Yarkov>,<DPX200>,
      <created by zg, POWCHK disabled, PULCHK disabled
       configuration hash MD5:
       00 E9 B6 7A A2 85 ED C7 34 08 36 98 17 FE 4E 26
       data hash MD5: 16K
       04 A4 A4 DE 6F 3A 3B 2E 6F 88 84 56 4A F8 76 7A>)
(   2,<2025-06-23 11:39:40.70 +0400>,<Yarkov>,<DPX200>,
      <Start of raw data processing
       efp BC_mod = 2 LB = 0.25 FT_mod = 6 PKNL = 1 PHC0 = -1713.766 PHC1 = 10.1666 SI = 16K 
       data hash MD5: 16K
       36 68 DD C9 20 47 03 3C 85 59 89 8C 39 91 E8 A5>)
(   3,<2025-06-23 11:39:46.50 +0400>,<Yarkov>,<DPX200>,
      <abs ABSG = 5 
       data hash MD5: 16K
       C9 0F DB 9D D1 05 A7 63 48 FD 5A 19 89 DB 55 E1>)
$$ ##END=
$$ 
$$ hash MD5
$$ A8 75 9C 59 BB C6 29 F0 17 35 A6 0C E6 81 72 E8
##$RELAX= 
##$RELAX= 
##$RELAX= 
##$RELAX= 
##$RELAX= 
##$RELAX= 
$$ Bruker specific parameters
$$ --------------------------
##$DU= <C:/Bruker/XWIN-NMR>
##$EXPNO= 1
##$NAME= <H-C>
##$PROCNO= 1
##$TYPE= <nmr>
##$USER= <yarkov2>
##$AMP= (0..31)
100 100 100 100 100 100 100 100 100 100 100 100 100 100 100 100 100 100 
100 100 100 100 100 100 100 100 100 100 100 100 100 100 
##$AQSEQ= 0
##$AQ_mod= 1
##$AUNM= <au_zg>
##$AUTOPOS= <>
##$BF1= 200.13
##$BF2= 200.13
##$BF3= 200.13
##$BF4= 200.13
##$BF5= 200.13
##$BF6= 200.13
##$BF7= 200.13
##$BF8= 200.13
##$BYTORDA= 1
##$CFDGTYP= 0
##$CFRGTYP= 5
##$CHEMSTR= <none>
##$CNST= (0..31)
1 1 145 1 1 1 1 1 1 1 1 1 1 1 1 1 1 1 1 1 1 1 1 1 1 1 1 1 1 1 1 1 
##$CPDPRG= <>
##$CPDPRG1= <>
##$CPDPRG2= <>
##$CPDPRG3= <>
##$CPDPRG4= <mlev>
##$CPDPRG5= <mlev>
##$CPDPRG6= <mlev>
##$CPDPRG7= <mlev>
##$CPDPRG8= <mlev>
##$CPDPRGB= <>
##$CPDPRGT= <>
##$D= (0..31)
0 0.7 0 0 0 0 0 0 0 0 0 0.03 0 0 0 0 0 0 0 0 0 0 0 0 0 0 0 0 0 0 0 0 
##$DATE= 1750664375
##$DBL= (0..7)
120 120 120 120 120 120 120 120 
##$DBP= (0..7)
150 150 150 150 150 150 150 150 
##$DBP07= 0
##$DBPNAM0= <>
##$DBPNAM1= <>
##$DBPNAM2= <>
##$DBPNAM3= <>
##$DBPNAM4= <>
##$DBPNAM5= <>
##$DBPNAM6= <>
##$DBPNAM7= <>
##$DBPOAL= (0..7)
0.5 0.5 0.5 0.5 0.5 0.5 0.5 0.5 
##$DBPOFFS= (0..7)
0 0 0 0 0 0 0 0 
##$DE= 6
$$ [...]
##$SUBNAM3= <"">
##$SUBNAM4= <"">
##$SUBNAM5= <"">
##$SUBNAM6= <"">
##$SUBNAM7= <"">
##$SUBNAM8= <"">
##$SUBNAM9= <"">
##$SW= 18.0517328524113
##$SWIBOX= (0..15)
0 0 2 0 0 0 0 0 0 0 0 0 0 0 0 0 
##$SW_h= 3612.71676300578
##$TD= 16384
##$TD0= 1
##$TE= 0
##$TE2= 300
##$TE3= 300
##$TEG= 300
##$TL= (0..7)
0 120 120 120 120 120 120 120 
##$TP= (0..7)
150 150 150 150 150 150 150 150 
##$TP07= 0
##$TPNAME0= <>
##$TPNAME1= <>
##$TPNAME2= <>
##$TPNAME3= <>
##$TPNAME4= <>
##$TPNAME5= <>
##$TPNAME6= <>
##$TPNAME7= <>
##$TPOAL= (0..7)
0.5 0.5 0.5 0.5 0.5 0.5 0.5 0.5 
##$TPOFFS= (0..7)
0 0 0 0 0 0 0 0 
##$TUNHIN= 0
##$TUNHOUT= 0
##$TUNXOUT= 0
##$USERA1= <user>
##$USERA2= <user>
##$USERA3= <user>
##$USERA4= <user>
##$USERA5= <user>
##$V9= 5
##$VALIST= <valist>
##$VCLIST= <CCCCCCCCCCCCCCC>
##$VD= 0
##$VDLIST= <DDDDDDDDDDDDDDD>
##$VPLIST= <PPPPPPPPPPPPPPP>
##$VTLIST= <TTTTTTTTTTTTTTT>
##$WBST= 1024
##$WBSW= 4
##$XGAIN= (0..3)
0 0 0 0 
##$XL= 0
##$YL= 0
##$YMAX_a= 213764
##$YMIN_a= -160794
##$ZGOPTNS= <>
##$ZL1= 120
##$ZL2= 120
##$ZL3= 120
##$ZL4= 120
##$ABSF1= 15.48356
##$ABSF2= -2.56829
##$ABSG= 5
##$ABSL= 3
##$ALPHA= 0
##$AQORDER= 0
##$ASSFAC= 0
##$ASSFACI= 0
##$ASSFACX= 0
##$ASSWID= 0
##$AUNMP= <proc_1d>
##$AZFE= 0.1
##$AZFW= 0.1
##$BCFW= 0
##$BC_mod= 2
##$BYTORDP= 0
##$COROFFS= 0
##$CY= -3
##$DATMOD= 1
##$DC= 0
##$DFILT= <>
##$DTYPP= 0
##$F1P= 0
##$F2P= 0
##$FCOR= 1
##$FTSIZE= 16384
##$FT_mod= 6
##$GAMMA= 0
##$GB= 0
##$INTBC= 1
##$INTSCL= 3.241238e-09
##$ISEN= 128
##$LB= 0.25
##$LEV0= 0
##$LPBIN= 0
##$MAXI= 10000
##$MC2= 0
##$MEAN= 0
##$ME_mod= 0
##$MI= 1.114404
##$NCOEF= 0
##$NC_proc= -8
##$NLEV= 6
##$NOISF1= 3.799351
##$NOISF2= 2.8
##$NSP= 0
##$NTH_PI= 0
##$NZP= 0
##$OFFSET= 15.42076
##$PC= 1
##$PHC0= -1713.766
##$PHC1= 10.1666
##$PH_mod= 1
##$PKNL= yes
##$PPARMOD= 0
##$PSCAL= 0
##$PSIGN= 0
##$REVERSE= no
##$SF= 200.130020202817
##$SI= 16384
##$SIGF1= 3
##$SIGF2= 2
##$SINO= 0.751879
##$SIOLD= 32768
##$SREGLST= <19F.Aceton>
##$SSB= 0
##$STSI= 16384
##$STSR= 0
##$SW_p= 3612.71676300578
##$SYMM= 0
##$S_DEV= 0
##$TDeff= 16384
##$TDoff= 0
##$TI= <>
##$TILT= no
##$TM1= 0
##$TM2= 0
##$TOPLEV= 0
##$USERP1= <user>
##$USERP2= <user>
##$USERP3= <user>
##$USERP4= <user>
##$USERP5= <user>
##$WDW= 1
##$XDIM= 16384
##$YMAX_p= 497116554
##$YMIN_p= -1867637
$$ End of Bruker specific parameters
$$ ---------------------------------
##NTUPLES= NMR SPECTRUM
##VAR_NAME=  FREQUENCY,     SPECTRUM/REAL,   SPECTRUM/IMAG
##SYMBOL=    X,             R,               I
##VAR_TYPE=  INDEPENDENT,   DEPENDENT,       DEPENDENT
##VAR_FORM=  AFFN,          ASDF,            ASDF
##VAR_DIM=   16384,         16384,           16384
##UNITS=     HZ,            ARBITRARY UNITS, ARBITRARY UNITS
##FACTOR=    0.220516191357247, 1,           1
##FIRST=     3086.15704130773, 0,            0
##LAST=      -526.559721698046, 0,           0
##MIN=       -526.559721698046, -1867637,    0
##MAX=       3086.15704130773, 497116554,    0
$$ Real data points
##PAGE= N=1
##DATA TABLE= (X++(R..R)), XYDATA
$$ [...]
7477A602632J31183o4753p8429J26769J07482m8914p4041L2919R3488o7470M6893
7466A807759Q1268M1359J58587j46897J15842L9241K01269R2271m6158k6140J48854
7455B467255O9455j36009m159L1052p5394L9058J40244N8846m0227k9855R2915
7444B613181J51941M734r1502J29492R8335R6617L384Q5976N9517P7466J43620
7433C372761q7145m3507n6384N3453O8047R3779K7964r410N4713k0652l4963N4510
7421C473166O2939N0936J01805P18j53538L3236N2257J11999K10894k5065j34965
7410C784382J4423L513l7533J40112J406j1474J70788q2861K20440J70609q7683
7399D286122P0683Q6949j35438j32586R2822K53684R2395K9342l4479j5753J20010
$$ plain form
7477 1602632 1733815 1669062 1590633 1717402 1824884 1775970 1701929 1734848 1828336 1760866 1807759
7466 1807759 1889027 1930386 2088973 1942076 2057918 2097159 2298428 2390699 2344541 2318401 2467255
7455 2467255 2536710 2400701 2396542 2427594 2352200 2391258 2531502 2590348 2550121 2520266 2613181
7444 2613181 2765122 2769856 2678354 2807846 2906181 3002798 3006182 3092158 3151675 3229141 3372761
7433 3372761 3285616 3242109 3185725 3239178 3307225 3401004 3428968 3419558 3474271 3453619 3418656 3473166
7421 3473166 3536105 3587041 3688846 3689564 3536026 3569262 3621519 3733518 3944412 3919347 3784382
7410 3784382 3798805 3802318 3764785 3904897 3906303 3894829 4065617 3982756 4203196 4373805 4286122
7399 4286122 4356805 4443754 4308316 4175730 4268552 4522236 4614631 4643973 4609494 4593741 4713751
7388D713751J62444o8762k8794J40931K26481N6939q583M7293O6703k07083j14498
7377D986822R6848q1118o071Q6603Q2699k3353M744r2132q7030m3206J69298j9898
7365E074206Q7658r9707J1203K57502J59611P3527n3375M7158K01551R4014P8413
7354E931761J30958k8080J63703Q2497J30399j4547l0159Q6245O0091K34626J1284
7343F758778M4115k5017K83266J3821J3241J5875J52974J93938Q9043M9660J63882
7332G753576J04649J51548J88634J90659P5966L7716o9443J31044K33529J0348
7322H808226n8354R8856P9576P3649M5995m254L6117q0594o5897o8893m6044j20290
7310H698093j35262j29654j00195j85607P9858m2877l1621O4487J0078j47992
$$ plain form
7388 4713751 4876195 4807433 4778639 4919570 5146051 5202990 5194407 5241700 5308403 5101320 4986822
7377 4986822 5083670 5002552 4996481 5083084 5165783 5142430 5147174 5055042 4968012 4924806 5094104 5074206
7365 5074206 5161864 5062157 5073360 5330862 5490473 5564000 5510625 5557783 5759334 5853348 5931761
7354 5931761 6062719 6034639 6198342 6280839 6411238 6396691 6366532 6452777 6512868 6747494 6758778
7343 6758778 6802893 6777876 7061142 7074963 7088204 7104079 7257053 7450991 7540034 7589694 7753576
7332 7753576 7858225 8009773 8198407 8389066 8465032 8502748 8433305 8564349 8797878 8808226
7322 8808226 8749872 8848728 8928304 9001953 9047948 9043694 9079811 8999217 8933320 8864427 8818383 8698093
7310 8698093 8562831 8433177 8332982 8147375 8227233 8184356 8152735 8217222 8227300 8079308
7300H079308k4583J18965K46963M6941L8059L4454K34203Q6623N0285N4025o7588
7289H897655r3050j58269l800j77360j13478M272j62468k17950j36124j83265
7279G656163j23766p0042j27176l8026j55931m4976J38417l5173j97595q4222
7269F917673k9959j08181q9653P0528r8141j40512K0430M0658J91152J6639k4249
7258F766385J1341p1308l9587l7084K8553J11215k2119j23221O0850J12771J8860
7247F816656p3032k10795j1513k205j7581l5189o1917J5807J3477p7792j28133
7236F227783j63618K5191k1134q7815p9222N0493M6911l1037l3861o0399P5086
7225E948378q4360n9496n5299l2147j1393O5084J10831O1150m3326j31168r4855
$$ plain form
7300 8079308 8054725 8173690 8420653 8467594 8505653 8540107 8774310 8860933 8911218 8965243 8897655
7289 8897655 8804605 8646336 8642536 8465176 8351698 8355970 8193502 7975552 7839428 7656163
7279 7656163 7532397 7462355 7335179 7297153 7141222 7096246 7234663 7199490 7001895 6917673
7269 6917673 6887714 6779533 6689880 6760408 6662267 6521755 6542185 6582843 6773995 6790634 6766385
7258 6766385 6777726 6706418 6666831 6629747 6658300 6769515 6747396 6624175 6685025 6797796 6816656
7247 6816656 6743624 6532829 6521316 6519111 6501530 6466341 6404424 6420231 6433708 6355916 6227783
7236 6227783 6064165 6089356 6068222 5980407 5901185 5951678 5998589 5967552 5933691 5873292 5948378
7225 5948378 5864018 5804522 5749223 5717076 5705683 5770767 5881598 5942748 5899422 5768254 5673399
7214E673399J17589Q5801k2687j46274n8325J70728j4122j73037N1050J269K7707
7203E713098L7658j05349Q1865n9903Q5041j3663K6374O8629o0006J04982P7418
7192E956144l8887j75J28915K76028M9334M9907K10723R3451P3849O4617L0616
7181F894522J68887L12630O1251m9015J60809K40564P4582p3331L6620j75417
7171G652102j43194k3290r1086r9129j45343q8674k41782j28003l2832j54891
7161F503878k48349Q9253K1677k03844o7452Q4842p1392k21081j0189J5561q8250
7150E804654L0411m6086J37487p6099L7438M1737j07645R1865k3197n8816K1205
7139E852954o278J13661n282J3117l1302j36820N5395J52863j9175j712M0481
$$ plain form
7214 5673399 5790988 5876789 5854102 5707828 5649503 5820231 5806109 5633072 5684122 5685391 5713098
7203 5713098 5750756 5645407 5727272 5667369 5752410 5738747 5765121 5833750 5773744 5878726 5956144
7192 5956144 5917257 5917082 6045997 6322025 6371359 6421266 6631989 6725440 6799289 6863906 6894522
7181 6894522 7063409 7376039 7437290 7388275 7549084 7789648 7864230 7790899 7827519 7652102
7171 7652102 7508908 7485618 7394532 7295403 7150060 7061386 6819604 6691601 6658769 6503878
7161 6503878 6255529 6344782 6366459 6162615 6095163 6180005 6108613 5887532 5877343 5892904 5804654
7150 5804654 5835065 5788979 5926466 5850367 5887805 5929542 5821897 5913762 5890565 5831749 5852954
7139 5852954 5846676 5960337 5955055 5968172 5936870 5800050 5855445 6008308 5989133 5987421 6027902
7128F027902Q0230r8181J65369p002l2450r8038n4709P9867M0237l152j63067
7117E937006J71502n5024M6790J7877K5108M0917P754p1453M7896n1335O6687
7106F183725J8449O3945m9307M1137N0391P208j2462Q9976p7098l7251J50464
7095F429177N8226Q194r972j0889J3526k1832L7226r9413O9104o416r5500O7808
7083F439239Q5856K0501J5531J74091j64641k15294N2743J64120P4292L2828o3620
7072F615646m4923o7630l2428K3516j8537Q7738l8722L6772J25799m7245r1814
7061F548172k5830p8188R4049r8868M1737J2019j0856J39841j24357J31771R811
7050F639301j1704O5848p869P5257K454j5694r458J8596K4695J0801k2660j12872
$$ plain form
7128 6027902 6108132 6009951 6175320 6168318 6135868 6037830 5983121 6062988 6103225 6100073 5937006
7117 5937006 6108508 6053484 6100274 6118151 6143259 6184176 6191930 6120477 6168373 6117038 6183725
7106 6183725 6202174 6266119 6216812 6257949 6308340 6315548 6303086 6393062 6315964 6278713 6429177
7095 6429177 6487403 6495597 6485625 6474736 6488262 6466430 6503656 6404243 6473347 6466931 6371431 6439239
7083 6439239 6525095 6545596 6561127 6735218 6570577 6355283 6408026 6572146 6646438 6679266 6615646
7072 6615646 6570723 6503093 6470665 6494181 6475644 6563382 6524660 6561432 6687231 6639986 6548172
7061 6548172 6522342 6444154 6538203 6439335 6481072 6493091 6482235 6622076 6497719 6629490 6639301
7050 6639301 6627597 6693445 6685576 6760833 6763287 6747593 6738135 6756731 6781426 6792227 6769567 6656695
7038F656695P5583N764K2308q1979r8566o1484p8671r4051J15284M6039L9853
7027F546775K2767O1982p635k46212m0378J41267Q9470n8241q4454l4521L4701
7016F425521j04492k7165P1432J3422q0686r4367J03505m2791N9849N1896j32916
7005F243208j2714K766k4340M9952M7551R1468j08459M5503o5554j27370j23822
6994F018189q8611k3262p4576L2367K1703M9631M2792j9114q5787n1610m6321
6983E775401j46388J8097O1989n3245j44457O5438P3133j01853K1940J1032P4679
6972E655766j65712k1993j48345J11210K0836q3486J41748l1836o9468j05132
6962E303588j32549J03445j4617o5354q982J05602n7086N911m9492O1850K700
$$ plain form
7038 6656695 6732278 6738042 6760350 6678371 6579805 6518321 6439650 6345599 6460883 6506922 6546775
7027 6546775 6569542 6631524 6623889 6377677 6337299 6478566 6568036 6509795 6425341 6390820 6425521
7016 6425521 6321029 6293864 6365296 6378718 6298032 6203665 6307170 6264379 6324228 6376124 6243208
7005 6243208 6230494 6233260 6208920 6258872 6306423 6397891 6289432 6334935 6269381 6142011 6018189
6994 6018189 5929578 5906316 5831740 5864107 5885810 5935441 5978233 5959119 5873332 5821722 5775401
6983 5775401 5629013 5647110 5709099 5655854 5511397 5576835 5649968 5548115 5570055 5581087 5655766
6972 5655766 5490054 5468061 5319716 5430926 5451762 5368276 5510024 5478188 5408720 5303588
6962 5303588 5171039 5274484 5259867 5194513 5185531 5291133 5234047 5239958 5190466 5252316 5255016
6951E255016p9402n2356j82201M8333K6616L5503O9663n2128j56526K8305j24461
6940D816362R6398j3872m4191J64615j7321m9147m7334j9829q9466m536j14362
6929D677317j16212Q1566j00729O7029m8146K9875r067M5471j51710q2106k6568
6918D366720k9671n5626M0223j6004o3425R3323k13619Q897R4855o7247j49477
6907D008949o1128O0000o6459K9885m8553Q3267J06502k35985K7772j08649j01222
6896C694379P9681K554j32045K1279J93951n1750j14632j5240K9899j27436r407
6885C571233j9660j05438m097j02788p3268O3243m9870P840Q8675k2794r0218
6874C262858K8381r2853O7559o2108R668N343P4217n8860j67196J7526n5465L0078
$$ plain form
6951 5255016 5175614 5123258 4941057 4989390 5016006 5051509 5121172 5069044 4912518 4940823 4816362
6940 4816362 4912760 4898888 4854697 5019312 5001991 4952844 4905510 4885681 4796215 4791679 4677317
6929 4677317 4561105 4642671 4541942 4608971 4560825 4590700 4581633 4627104 4475394 4393288 4366720
6918 4366720 4337049 4281423 4321646 4305642 4242217 4335540 4121921 4130818 4225673 4158426 4008949
6907 4008949 3947821 4007821 3941362 3971247 3922694 4005961 4112463 3876478 3904250 3795601 3694379
6896 3694379 3774060 3776614 3644569 3665848 3859799 3808049 3693417 3678177 3708076 3580640 3571233
6885 3571233 3551573 3446135 3442038 3339250 3265982 3329225 3279355 3287195 3375870 3353076 3262858
6874 3262858 3291239 3198386 3265945 3203837 3213505 3218848 3293065 3234205 3067009 3084535 3029070 3059148
6862C059148l5212q5306q8487J31395p7327N4518N6160l8220j68764J1275r6824
6851B722356k0697M9298n593N0646N4507K1654j06772j28790J45853j03278J5871
6840B695055j11291K3543L6885J1226m6887m4684m3209J4404j2033J0646M6877
6829B580532n741j11335l1161M017m0872N3912L0785o9235j00242Q5757m029M9999
6817B442387O3338N5375j39986l0856k18658j2004J48277P1041J20427l1763K7252
6806B494830K1754o0574J02894J00540K7104p6866q296l7882L1397j44726q0175
6795B370000j30078l078o489J1290j72145L5451J1664m339n9422k7770n3523q5410
6783A886151j1968j658j36193R186L9246l9693p846o4954P8018q0328j4983o0363
$$ plain form
6862 3059148 3023936 2938630 2850143 2981538 2904211 2958729 3014889 2976669 2807905 2819180 2722356
6851 2722356 2701659 2750957 2745364 2796010 2850517 2872171 2765399 2636609 2782462 2679184 2695055
6840 2695055 2583764 2607307 2644192 2655418 2608531 2563847 2520638 2535042 2523009 2533655 2580532
6829 2580532 2574791 2463456 2432295 2436312 2395440 2449352 2480137 2410902 2310660 2396417 2392388 2442387
6817 2442387 2505725 2561100 2421114 2390258 2171600 2159596 2307873 2378914 2499341 2467578 2494830
6806 2494830 2516584 2456010 2558904 2659444 2686548 2609682 2601386 2563504 2594901 2450175 2370000
6795 2370000 2239922 2236844 2230355 2241645 2069500 2104951 2116615 2112276 2052854 2025084 1971561 1886151
6783 1886151 1874183 1872525 1736332 1745518 1784764 1745071 1737225 1672271 1750289 1669961 1654978 1594615
6771A594615K6462J3727J8683k8229Q2136j22743r0192J00338N0346m2560p5395
6760A527188j52815J46380Q4348n6691o1513R9573K0788j26867j29537M3855O9482
6749A464191M9288r6928M3469J834n987J12056j1327J00824j16633L2099J00990
6738A673876j25697j07932N4218j26197o5434M9978L998L5055m9532K0817P2888
6727A436038L115J6180J02502N8354k3455Q8284n9767n3820o2399L1806P1669
6716A608507j6995J11507N8020j10147j54355o4474J34277J2685q1790M3559n8077
6705A482717l3664O3266J9209J7750j10621O5425J31452R7751j28726j70219J17425
6694A551765J76157j95370j1898l0442o8613K2731j98568J0757p3646K9822R6349
$$ plain form
6771 1594615 1621077 1634804 1653487 1625258 1707394 1584651 1494459 1594797 1645143 1602583 1527188
6760 1527188 1374373 1520753 1605101 1548410 1486897 1586470 1607258 1480391 1350854 1394709 1464191
6749 1464191 1513479 1416551 1460020 1461854 1455867 1567923 1556596 1657420 1540787 1572886 1673876
6738 1673876 1548179 1440247 1494465 1368268 1302834 1352812 1356810 1391865 1342333 1363150 1436038
6727 1436038 1439153 1455333 1557835 1616189 1592734 1681018 1621251 1567431 1505032 1536838 1608507
6716 1608507 1591512 1703019 1761039 1650892 1496537 1432063 1566340 1579025 1497235 1540794 1482717
6705 1482717 1449053 1512319 1531528 1549278 1438657 1504082 1635534 1733285 1604559 1434340 1551765
6694 1551765 1727922 1532552 1520654 1490212 1421599 1444330 1245762 1256519 1182873 1212695 1309044
6683A309044J01799M0410o3444r0719l4323J2919o6325j9416L2168M5161r6065
6672A171209m885J39203l8723j14294J8745O0193j02135p224k0904j1171K8144
6661A118158R1553l9392o7731q4050K5214M7968K5696J21474j10594p6405l4637
6650A017254j0865N7330J18935o0365m7587p0901J11211O3947O2851J51744k2028
6639A371526k9942K2969K7128j18951k9086J61210L9529r5587J71878o162K2968
6628A537480P063K7174J32298j8418J15293J3362J67092j64011r2514K16158Q9335
6617B030312J0212J17950P8568J6529J04924j17331J39285j0741K06828K30881
6607B807417N0475J67448J33341J94367J73695K28287K16035K1886j15668M2531
$$ plain form
6683 1309044 1410843 1451253 1387809 1297090 1262767 1275686 1209361 1189945 1222113 1267274 1171209
6672 1171209 1166324 1305527 1266804 1152510 1171255 1231448 1129313 1122089 1101185 1090014 1118158
6661 1118158 1209711 1170319 1102588 1018538 1043752 1091720 1117416 1238890 1128296 1051891 1017254
6650 1017254 1006389 1063719 1182654 1122289 1074702 1003801 1115012 1178959 1241810 1393554 1371526
6639 1371526 1341584 1364553 1391681 1272730 1243644 1404854 1444383 1348796 1520674 1514512 1537480
6628 1537480 1544543 1571717 1704015 1685597 1800890 1814252 1981344 1817333 1724819 1940977 2030312
6617 2030312 2040524 2158474 2237042 2253571 2358495 2241164 2380449 2369708 2576536 2807417
6607 2807417 2857892 3025340 3158681 3353048 3526743 3755030 3971065 3992951 3877283 3919814
6597C919814j45129k29927K0156r849n5554J8523N5974O7839Q5633K3848P3726
6586C825054q9069n9545K0614K3060k7075J14638M1989k3440J31984J37188R359
6575D104757j62103l2733J27036N7872q8569j90372o3j02384M9909j14412q187
6564C640751j493o7350N59k5105J01643j30642j7946R1372l4382N8838O061q1371
6552C540935J17369P0409M9424N251o8477J65461J1163r6466m2113j19467j89441
6541C444048r9211j39043m2370m5813p8081l0227k61784k5326R6947K0417r8980
6530B740577q3495p3782j67783j27898R0100n1149J1502j947k0116J4088q9334
6519B240763l3129q9435q9230O9311p9229m6075l1499j06752N0926j43637O919
$$ plain form
6597 3919814 3774685 3544758 3564914 3555065 3499511 3518034 3574008 3641847 3727480 3751328 3825054
6586 3825054 3735985 3676440 3697054 3720114 3693039 3807677 3849666 3826226 3958210 4095398 4104757
6575 4104757 3942654 3909921 4036957 4094829 4006260 3815888 3815825 3713441 3763350 3648938 3640751
6564 3640751 3639258 3571908 3572467 3547362 3649005 3518363 3500417 3591789 3557407 3616245 3622306 3540935
6552 3540935 3658304 3728713 3778137 3783388 3714911 3880372 3891535 3795069 3752956 3633489 3444048
6541 3444048 3344837 3205794 3163424 3117611 3039530 3009303 2747519 2722193 2819140 2839557 2740577
6530 2740577 2657082 2583300 2415517 2287619 2377719 2326570 2338072 2336125 2316009 2330097 2240763
6519 2240763 2207634 2118199 2028969 2098280 2019051 1972976 1941477 1834725 1885651 1742014 1748933
6508A748933Q3879K0061Q503n6283M1583o5054J01524n8813J62367m7550j11070
6497A828080p6950K8102o9671K2482K2486q5083M1378J02548p3414j3327o714
6486A719917j28923J59421Q948j64476j02338o924N6741p4382k2340j4455M592
6475A435781q193n2110l8295M0071K8381N7748m7925m7520m4211n0356Q5704p7728
6463A281347O3997j1966q7627j15942j00184J23691J51193n298k0479o2430L3832
6452A250134m233K7231N9777K5391j26692m126J34715k0246N2596j8225j00662
6441A275660J17809M6530l5882Q2042J4113J6721K6051J9494p3203j3786J10998
6430A586547J131L4318K3319n5950L5979N4799j34484K3453P0244L2492m5789
$$ plain form
6508 1748933 1832812 1852873 1861376 1805093 1846676 1781622 1883146 1824333 1986700 1939150 1828080
6497 1828080 1751130 1779232 1709561 1732043 1754529 1669446 1710824 1813372 1739958 1726631 1719917
6486 1719917 1590994 1750415 1759363 1594887 1492549 1485625 1542366 1467984 1445644 1431189 1435781
6475 1435781 1427588 1375478 1337183 1377254 1405635 1463383 1415458 1367938 1323727 1273371 1359075 1281347
6463 1281347 1345344 1333378 1245751 1129809 1029625 1153316 1304509 1299211 1278732 1216302 1250134
6452 1250134 1245901 1273132 1332909 1358300 1231608 1227482 1362197 1341951 1394547 1376322 1275660
6441 1275660 1393469 1439999 1404117 1486159 1500272 1516993 1543044 1562538 1489335 1475549 1586547
6430 1586547 1587678 1621996 1645315 1589365 1625344 1680143 1545659 1569112 1639356 1671848 1626059
6419A626059r512n015j58297L3621J50250n0235j51329J2994J16977L085M8643
6408A617241q7704j0926o834k9580P2215l2881M6779J02076j19362J64696o6544
6397A649176p4498M0871P09J1225p479J8111j16827o8244J14556R7340N8610m7256
6385A676294j8212O2232M7938n4017L6711M9031K6785j8062m8951K7777l9750
6374A747776L9613M1470j13027P5113O8921j61386k0062Q4928j3753k641R1953
6363A838905o6813j35925Q3978J82513J09630o9911j34817O9315n8523J62896
6353A981248l9702o9393J7385j3191m6105k3080J61027Q6898J7660j07403J9068
6342A984412M7752Q3910j04398q4937J15063R7741J2511J06304J34000o3545J9329
$$ plain form
6419 1626059 1616547 1611532 1453235 1486856 1637106 1586871 1435542 1448536 1565513 1568598 1617241
6408 1617241 1529537 1518611 1511777 1482197 1554412 1521531 1568310 1670386 1551024 1715720 1649176
6397 1649176 1574678 1615549 1616258 1627483 1620004 1638115 1521288 1453044 1567600 1664940 1723550 1676294
6385 1676294 1658082 1720314 1768252 1714235 1750946 1799977 1826762 1808700 1759749 1787526 1747776
6374 1747776 1787389 1828859 1715832 1790945 1859866 1698480 1678418 1763346 1749593 1746952 1838905
6363 1838905 1772092 1636167 1720145 1902658 2012288 1942377 1807560 1876875 1818352 1981248
6353 1981248 1941546 1872153 1889538 1876347 1830242 1807162 1968189 2055087 2072747 1965344 1984412
6342 1984412 2032164 2116074 2011676 1926739 2041802 2139543 2152054 2258358 2392358 2328813 2348142
6331B348142l8045j1737R5450K13671N835M6946O8247O1144J29616j2996o3159
6320B843114J8919J41186M2497J7403J6728l2447K38Q1905J43932K5405O8481
6309C367361l4163J0349J72178Q7686K0565J7448r55J68254J57002k4762m2472
6298C898491L0690L0827n6931R1999N8326J22608J03179k7370J14469N2924K14443
6287D633655M2786R7701J9373J04179K27319N2215L0308K70424O6743q7497j09789
6276E347417O5553J80522o5711J44654J54271l4397n044K287k8625K17308J80350
6265F158585q3667R7511N7401k4235j3974J55402Q5767l216l7389l9614J15971
6254F468542Q6079j23158J12027N1092N200l9156k3163N4192K3515J22293q5266
$$ plain form
6331 2348142 2310097 2298360 2393810 2607481 2613316 2660262 2728509 2789653 2919269 2906273 2843114
6320 2843114 2862033 3003219 3045716 3063119 3079847 3047400 3047638 3129543 3273475 3298880 3367361
6309 3367361 3333198 3343547 3515725 3603411 3623976 3641424 3640469 3808723 3965725 3940963 3898491
6298 3898491 3929181 3960008 3903077 3995076 4053402 4176010 4279189 4251819 4366288 4419212 4633655
6287 4633655 4676441 4774142 4793515 4897694 5125013 5177228 5207536 5477960 5544703 5457206 5347417
6276 5347417 5412970 5593492 5527781 5672435 5826706 5792309 5787265 5789552 5760927 5978235 6158585
6265 6158585 6074918 6172429 6229830 6205595 6191621 6347023 6432790 6429574 6392185 6352571 6468542
6254 6468542 6554621 6431463 6543490 6594582 6599782 6560626 6537463 6591655 6615170 6737463 6652197
6243F652197J56264j42641R3480j1660J06140J44575q0690q5580r5962m8178j03852
6232F584093K6756q0435j90264n5190J07856l2179j19323K6716J5854j9169j782
6221F262933O2836o2030p5185N4812O1844j62739K3230m2809p4542Q1444K3081
6210F152875J2153k8288j28014J67631M5341n3109P4426k3248N6660N4605p8962
6199F252070N7914l2748m6317J71377L5n5479N4902j08750M1623Q7800j523N5324
6187F476228k9768J81647J48594J67321j08460o1644J7400J87936J28905K0996
6177G129155R0293N9560K62531m7712M4595J44136J66010P7228K13260J82586
6167H321642J92962J59759M5412J47420K09947L19438K61330K62735M27879J44325
$$ plain form
6243 6652197 6808461 6665820 6759300 6747640 6853780 6998355 6917665 6832085 6736123 6687945 6584093
6232 6584093 6610849 6530414 6340150 6284960 6392816 6360637 6241314 6268030 6283884 6264715 6262933
6221 6262933 6325769 6263739 6188554 6243366 6305210 6142471 6165701 6122892 6048350 6129794 6152875
6210 6152875 6165028 6136740 6008726 6176357 6221698 6168589 6243015 6219767 6276427 6331032 6252070
6199 6252070 6309984 6277236 6230919 6402296 6402331 6346852 6401754 6293004 6334627 6422427 6420904 6476228
6187 6476228 6446460 6628107 6776701 6944022 6835562 6773918 6791318 6979254 7108159 7129155
6177 7129155 7219448 7279008 7541539 7493827 7538422 7682558 7848568 7925796 8139056 8321642
6167 8321642 8514604 8674363 8719775 8867195 9077142 9396580 9657910 9920645 10348524 10492849
6157A0492849J54005M87153M59875L15980L84901M27885J04448K36008J99413
6148A3262517J46336Q5090M7209J0589L8190j00281j7657K17363l8962l6166K22497
6137A3836725M59865L55695K89044L41110L07452N76945N77977N94655O76091
6128A8015559P67085N34766L15516J04567P9251k26669k66318m24833n82198j68569
6118A8148157k08281j43319j69743j94040k26859l548L0854P2938J04480K6072
6108A7436711K29256J12498K17326K90322L22396L57966K64717J89079k9083j38340
6098A9252848j48471k60599k63238l49718k39557j95866j96588l42995j84184
6089A7071632P357K3448O7329J429Q5221J48312J06880K99558K66166K54818J31213
$$ plain form
6157 10492849 10646854 11134007 11593882 11909862 12294763 12722648 12827096 13063104 13262517
6148 13262517 13408853 13493943 13541152 13551741 13589931 13489650 13471993 13689356 13650394 13614228 13836725
6137 13836725 14296590 14652285 14941329 15282439 15589891 16166836 16744813 17339468 18015559
6128 18015559 18782644 19317410 19632926 19737493 19816744 19590075 19323757 18898924 18316726 18148157
6118 18148157 17939876 17796557 17626814 17432774 17205915 17202367 17233221 17306159 17410639 17436711
6108 17436711 17665967 17778465 17995791 18286113 18608509 18966475 19231192 19420271 19391188 19252848
6098 19252848 19104377 18843778 18580540 18230822 17991265 17795399 17598811 17255816 17071632
6089 17071632 17078989 17102437 17169766 17171195 17256416 17404728 17511608 17811166 18077332 18332150 18463363
6078A8463363j34699l2922j61107k33575r9139j20497n2368p7547k001J58481
6068A7707989Q298q2675J23570J58080l4244l6690K2594R3938p7072k06471n6477
6057A7620840k12944k94168p5956k33337k50256n4938j95813j25187J4316k06677
6047A5985880j21644k8265o7300j15914M5302K18085J44102l9115k02864j43010
6037A5675257k33681k62270k91246n36279m32126k57422l48204l40352j23327
6028A2850350j28712L1247k06615j13635N5800j0401k5948o2159l0854K48553
6018A2607626J24481J46910K50732R3608J70639J74451J03379K18503L26406L11716
6008A4528451L24556M27778M66010M54328N74936N54323N51030O10486M61030
$$ plain form
6078 18463363 18328664 18295742 18134635 17901060 17801921 17681424 17629056 17551509 17549508 17707989
6068 17707989 17716287 17633612 17757182 17915262 17881018 17844328 17866922 17960860 17883788 17677317 17620840
6057 17620840 17407896 17113728 17037772 16804435 16554179 16499241 16303428 16178241 16192557 15985880
6047 15985880 15864236 15835971 15768671 15652757 15698059 15916144 16060246 16021131 15818267 15675257
6037 15675257 15441576 15179306 14888060 14351781 13919655 13662233 13314029 12973677 12850350
6028 12850350 12721638 12752885 12546270 12432635 12488435 12478034 12452086 12389927 12359073 12607626
6018 12607626 12732107 12879017 13129749 13223357 13393996 13568447 13671826 13890329 14216735 14528451
6008 14528451 14853007 15280785 15746795 16201123 16776059 17330382 17881412 18491898 18952928
5999A8952928K04085K03661O2828n6890j58847n0611j23558k46153n5557J2860
5989A8744746o9081j4359J13162p5670M06600L81915L65463M08155N74606O72768
5979B1508305O88595Q34399Q01319J041282R84690O41226M89436L68883n8483
5970B7299652m26128p77809q81785j025961j025289j001085q20599n53202o58634
5961B0129160m97431k13376k48356k17707j00806J15845J32011J65404J20701
5952A9385445L16666K80875K96075K45095K49461J56780o8560k88701l74187k61828
5942A9937121n15416p58948p50793n40547o75033n80834l46660n05439k89853
5933A4973598l92724l05194k49552l22591k83018j67954p2550j70237j38774q4257
$$ plain form
5999 18952928 19157013 19360674 19423502 19366612 19207765 19157154 19033596 18787443 18731886 18744746
5989 18744746 18675665 18661306 18774468 18698798 19105398 19487313 19852776 20260931 20835537 21508305
5979 21508305 22196900 23031299 23832618 24873900 25858590 26499816 26989252 27358135 27299652
5970 27299652 26873524 26095715 25213930 24187969 23162680 22161595 21340996 20787794 20129160
5961 20129160 19631729 19418353 19169997 18952290 18851484 18967329 19099340 19264744 19385445
5952 19385445 19702111 19982986 20279061 20524156 20773617 20930397 20861837 20573136 20198949 19937121
5942 19937121 19421705 18662757 17911964 17371417 16696384 16115550 15768890 15263451 14973598
5933 14973598 14580874 14275680 14026128 13703537 13420519 13252565 13180015 13009778 12871004 12786747
5923A2786747k37523p5264p0329k58097j23265r5569r3363n3648l9495L6577j82044
5912A1594727r1836j0344j39707q3260j01199L2134R545j10540r6502L7770K5266
5901A1066054j02965r1304o0945j03535J1838L6214j65218j7637j0395j69122
5891A0392985j25186j17026N1510j07426J03992p8049r9474N4010n6945j20345
5881I898046q2944O2280J1054k4006l0358j5450j9893q291k4154k00542j90678
5870I375064j26054Q4679J00469n0345m9410o9236J3494o6887O1523J4141J8824
5859I306262K9147o2406j9952L7024Q5403N361k1063J7163Q5442r8842o2556R4311
5847I395294J34509n757P7335P2223l392J33325Q5822k0211J27509J49449J46766
$$ plain form
5923 12786747 12549224 12473960 12403631 12145534 12022269 11926700 11833337 11779689 11740194 11776771 11594727
5912 11594727 11502891 11492547 11352840 11269580 11168381 11200515 11210060 11099520 11003018 11040788 11066054
5901 11066054 10963089 10871785 10810840 10707305 10719143 10755357 10590139 10572502 10562107 10392985
5891 10392985 10267799 10150773 10202283 10094857 10198849 10120800 10021326 10075336 10018391 9898046
5881 9898046 9815102 9877382 9888436 9864430 9834072 9818622 9798729 9790438 9766284 9565742 9375064
5870 9375064 9249010 9333689 9434158 9383813 9334403 9265167 9278661 9211774 9273297 9287438 9306262
5859 9306262 9335409 9273003 9253051 9290075 9375478 9380839 9359776 9376939 9462381 9363539 9300983 9395294
5847 9395294 9529803 9524046 9601381 9673604 9670212 9803537 9889359 9869148 9996657 10146106 10292872
5836A0292872o0856O6330J46720P4565K34424M7386Q5984J39431K51L0906N769
5825A1063782K31214R290J70793J23276J21130J26879N0446K15985L8136L7895
5815A2188826R2192J78374J0128K27015J61287N8939J66319J36567J0360L1165
5805A3261172O9943P4869J63690P3907J17828J78414J8908R8570J35727K90826
5795A4483854J76503p546J67969K41846J08207K25751K09028K25579K79338J43419
5785A6253948J07519K60914M49944O12994L08134J79971K91878M51530M13631
5776A9330463L91387L51558J65463M05113K43762L17097M19369L34317K83451
5767B2241980M28042O53329M78318N79744O27878O48350P87326O55089O97042
$$ plain form
5836 10292872 10232016 10298346 10445066 10519631 10754055 10801441 10887425 11026856 11027107 11058013 11063782
5825 11063782 11294996 11304286 11475079 11598355 11719485 11846364 11896810 12112795 12150931 12188826
5815 12188826 12281018 12459392 12469520 12696535 12857822 12916761 13083080 13219647 13230007 13261172
5805 13261172 13331115 13405984 13569674 13643581 13761409 13939823 13958731 14057301 14193028 14483854
5795 14483854 14660357 14652811 14820780 15062626 15170833 15396584 15605612 15831191 16110529 16253948
5785 16253948 16361467 16622381 17072325 17685319 17993453 18173424 18465302 18916832 19330463
5776 19330463 19721850 20073408 20238871 20643984 20887746 21204843 21624212 21958529 22241980
5767 22241980 22670022 23323351 23801669 24381413 25009291 25657641 26444967 27100056 27797098
5758B7797098Q59396O68507Q47025Q85657P82897Q08629Q00595P95166R73529
5749C5218499Q61016Q32146J072004J073899J044988J160514J347273J355355
5741D3965694J309470J425268J521851J615168J743787J664088K055432J919578
5733E7220336J942141J932721J884124J887525K033483K308025K231768K296504
5725G3736627K435389K431980K561138K600456K409332K679776K822745L080955
5717I4758398L280413L478607L657864M145253M213882M570993M522727M704015
5709A27332152M698994M283570M300615M146560L990715L904103L818779L770954
5701A60246442L731784M050981M639826N276744O062679O614701P202085P495752
$$ plain form
5758 27797098 28656494 29325001 30172026 31057683 31840580 32649209 33449804 34244970 35218499
5749 35218499 36079515 36911661 37983665 39057564 40102552 41263066 42610339 43965694
5741 43965694 45275164 46700432 48222283 49837451 51581238 53245326 55300758 57220336
5733 57220336 59162477 61095198 62979322 64866847 66900330 69208355 71440123 73736627
5725 73736627 76172016 78603996 81165134 83765590 86174922 88854698 91677443 94758398
5717 94758398 98038811 101517418 105175282 109320535 113534417 118105410 122628137 127332152
5709 127332152 132031146 136314716 140615331 144761891 148752606 152656709 156475488 160246442
5701 160246442 163978226 168029207 172669033 177945777 184008456 190623157 197825242 205320994
5693B05320994P608789P665967P297356O919401O391293N312171L576188R68162
5685B51060321j756068m435131o643941q174861r101524r808502j0362038j0878702
5677A89899554j1117137j1183615j0813149j0096405r353977q528007p673630
5670A21133634o830861n879164n381489m763384m284332l696617l434735l098695
5662H3764357k799134k591442k125137j834200j667063j398383j140714j023245
5654F9185039r14618r53613q68833j118201j516154j898392k256306k215828k056522
5645E5386572j804142j481743j350468j187908j024485r93100p40320q28405q05265
5636D5170736p79312o83708o41031o40200m88510n17182l81290k19984l17028
$$ plain form
5693 205320994 212929783 220595750 227893106 234812507 241203800 246515971 250092159 251060321
5685 251060321 249304253 244869122 238225181 230050320 220948796 211140294 200778256 189899554
5677 189899554 178782417 167598802 156785653 146689248 137335271 128807264 121133634
5670 121133634 114302773 108423609 103042120 98278736 93994404 90297787 86863052 83764357
5662 83764357 80965223 78373781 76248644 74414444 72747381 71348998 70208284 69185039
5654 69185039 68270421 67316808 66447975 65329774 63813620 61915228 59658922 57443094 55386572
5645 55386572 53582430 52100687 50750219 49562311 48537826 47544726 46804406 45976001 45170736
5636 45170736 44391424 43707716 43066685 42426485 41937975 41420793 41039503 40819519 40502491
5627D0502491j69023q4917p1767J36594L10428J85387M09931L20222J3911m55511
5617D1097746r16666j348579j484491j271833r98938p07827p08078n78500o07057
5608C2475777m59497k78848k30691k56767k34407l31586l20312j27103k93688
5599B9942878k46080j10117k28258j94435q7881M7593j74865j17503n1892J10874
5589B8890314R2615J08522k40352k46818k47460n39462o21557n18831j93661k25468
5579B6257842l37986k69603j40200r8108r2210j66362j71324k58396k62626j13402
5569B4347625J9534j09055n7237l5883j24189L4237j97733j13562k1817R486j40604
5558B3610802n4643j6863j19690L6470J0209p5210R8445j6160R2861p4743K7288
$$ plain form
5627 40502491 40333468 40248551 40176784 40313378 40623806 40809193 41219124 41539346 41553257 41097746
5617 41097746 40181080 38832501 37348010 36076177 35077239 34369412 33661334 33082834 32475777
5608 32475777 32016280 31737432 31506741 31249974 31015567 30683981 30363669 30236566 29942878
5599 29942878 29696798 29586681 29358423 29163988 29076107 29123700 28948835 28831332 28779440 28890314
5589 28890314 28982929 29091451 28851099 28604281 28356821 27817359 27195802 26676971 26483310 26257842
5579 26257842 25919856 25650253 25510053 25411945 25319735 25153373 24982049 24723653 24461027 24347625
5569 24347625 24367159 24258104 24200867 24164984 24040795 24075032 23877299 23763737 23741920 23751406 23610802
5558 23610802 23556159 23539296 23419606 23456076 23466285 23391075 23489520 23473360 23566221 23491478 23518766
5547B3518766J24998O7831J09513J03402m9650J60380P1581O6765J76339K07811
5537B4557736K75919J90648j41526K02461K97282K90327M38021J74835K81223
5528B6566926K45724L37315N10336M65249N57098P40707P12813P51889O81554
5519C1569611N43579L85517L52503K86654K2895o0331l68364l08148l45889l93319
5509C1684708k86384k23035j35945J4870K76958Q0185L18011L86779N30515L96718
5499C3043380P88100Q71891Q73765J146251J331621J241817J122473J120993Q06915
5490D2347206L43063j85467l97827n28840r28630r71583r00460q33987p85455
5481C7158020o34895o95835n91660m70951l10259j51106j09343O0739m8218l7670
$$ plain form
5547 23518766 23643764 23711595 23821108 23924510 23874860 24035240 24106821 24173586 24349925 24557736
5537 24557736 24833655 25024303 24882777 25085238 25382520 25672847 26110868 26285703 26566926
5528 26566926 26812650 27149965 27660301 28125550 28682648 29423355 30136168 30888057 31569611
5519 31569611 32113190 32498707 32851210 33137864 33160759 33100428 32732064 32423916 32078027 31684708
5509 31684708 31398324 31175289 31039344 31054214 31331172 31411357 31729368 32116147 32646662 33043380
5499 33043380 33831480 34703371 35577136 36723387 38055008 39296825 40419298 41540291 42347206
5490 42347206 42690269 42504802 42106975 41578135 40649505 39677922 38777462 37943475 37158020
5481 37158020 36523125 35827290 35235630 34764679 34454420 34303314 34193971 34254710 34206492 34168822
5471C4168822K83905L9008L40958L33346K11843J64198L23974n667k51905m99198
5461C5109284n80927p13805q07807q69364r33092q12936p10286o19091o18906
5452B8443070m63404m42826l61965k10202j20073j00555k09869k87509l29326
5443B5917341m30842m12865m96697m65608n20947p09139n58698l07927l95103
5434B1619515l40938m72095k98901j22829m7187j46084n6251k67246k39659j55590
5424A9472735p5042l1951k34693j00569K7879j65691k62399J3317p0524k57542
5414A8315520l7275q7979Q3758P170p0939K0690r7809p3061N9785p527K6583r4843
5402A8044073o4753k5861o0821o427J9983J2496m3516J0746J31685N3685L571
$$ plain form
5471 34168822 34452727 34491735 34832693 35166039 35377882 35542080 35866054 35860387 35608482 35109284
5461 35109284 34528357 33814552 33006745 32137381 31204289 30391353 29681067 29061976 28443070
5452 28443070 27979666 27536840 27174875 26964673 26844600 26744045 26534176 26246667 25917341
5443 25917341 25486499 25073634 24576937 24111329 23590382 22881243 22322545 22014618 21619515
5434 21619515 21278577 20806482 20507581 20384752 20337565 20191481 20135230 19867984 19628325 19472735
5424 19472735 19397693 19365742 19131049 19030480 19058359 18892668 18630269 18643586 18573062 18315520
5414 18315520 18278245 18190266 18274024 18281194 18210255 18230945 18133136 18060075 18119860 18112333 18138916 18044073
5402 18044073 17979320 17953459 17892638 17886211 17906194 17918690 17875174 17885920 18017605 18071290 18074861
5391A8074861R3096K9639J34436J09222J94377J07868J86099K86616K58485L03000
5381A9777699L23461N19739L14768J71308o1117l10434n00619o34496o27912m32275
5371A8540122l11014k96962l18681k93292j50063j69945k7148j18180k59013j26611
5361A6469213j47805r5373j52856R246j3767k08087k63946o7495J76582j60597
5351A5545115l55933j20858M9690j26695j68888j36205K5970J9396n2790M1455
5341A4720257j13022j03351j00280R4669J7051k4780j98659m4514K65984r2589
5331A4420766j5839o4257p9965n4432K7625k71709j17937j58637j69446n3771
5321A3462398r7915p1496q9028k0245k6162L8815j18578j04784j35331L3247J05104
$$ plain form
5391 18074861 18167957 18197596 18332032 18441254 18635631 18743499 18929598 19216214 19474699 19777699
5381 19777699 20101160 20620899 20935667 21106975 21045858 20735424 20234805 19600309 18972397 18540122
5371 18540122 18229108 17932146 17613465 17320173 17170110 17000165 16973017 16854837 16595824 16469213
5361 16469213 16321408 16226035 16073179 16082425 16068658 15860571 15596625 15529130 15705712 15545115
5351 15545115 15189182 15068324 15118014 14991319 14822431 14686226 14712196 14731592 14678802 14720257
5341 14720257 14607235 14503884 14403604 14498273 14515324 14490544 14291885 14247371 14513355 14420766
5331 14420766 14404927 14340670 14260705 14206273 14233898 13962189 13844252 13685615 13516169 13462398
5321 13462398 13364483 13292987 13203959 13183714 13157552 13196367 13077789 12973005 12837674 12870921 12976025
5310A2976025j08347j07552k1732K841q3288j24776k14350p7769k1788p0878j8968
5299A2129418j90479k0781p7331N2339o5998p4268q6095m6311J44429j22551r1505
5288A1550867J49389j71283j66403l5454l0465j41339l2080n4660q7981l4036
5278A0946555j05360l5979L4542j59360j80024Q0216p9654N5097Q4720k56090
5268A0384663J7784R2864O190K2990p6647N4353L9951n0804k415o0103J083Q6753
5256A0516662l9636J13072r7815K40049J45036J9617M813m8228N3861J38444R5040
5245A1140915J15353J35346K40550m8673l16052k27629j83415j33123k48024j5616
5235A0459632Q0962k04320N1286J4580l3979q0021m3592m5765l1302n1327J05197
$$ plain form
5310 12976025 12867678 12760126 12738394 12741235 12657947 12533171 12318821 12241052 12219264 12148386 12129418
5299 12129418 11938939 11918158 11840827 11893166 11827168 11752900 11666805 11620494 11764923 11642372 11550867
5288 11550867 11700256 11528973 11362570 11327116 11296651 11155312 11123232 11068572 10980591 10946555
5278 10946555 10841195 10805216 10839758 10680398 10500374 10580590 10500936 10556033 10640753 10384663
5268 10384663 10402447 10495311 10501501 10524491 10447844 10502197 10542148 10491344 10488929 10428826 10429909 10516662
5256 10516662 10477026 10590098 10492283 10732332 10877368 10896985 10901798 10853570 10907431 11045875 11140915
5245 11140915 11256268 11391614 11632164 11583491 11267439 11039810 10856395 10723272 10475248 10459632
5235 10459632 10540594 10336274 10387560 10402140 10368161 10288140 10244548 10198783 10167481 10116154 10221351
5224A0221351K4542M1226L0306j02173Q9813j16811m6787Q3348L8833k1632n2526
5213A0189490j9178P1454j7715q1341N7492O5522J03950j4387l8886k1558k0635
5202A0274208O284O9394L0274K7353j01737j05333N6070J34987Q915m3710q085
5191A0348620M079o3605j9037J19563K7540m3409o252l617J5019J21028m574P8191
5179A0573546M8953L5346J9041J09151J13026n0440j49277J10840n9383J43232
5169A0894035J06943j08976p5280L5831N7525j0110M5667r263J30616Q1248K53670
5158A1401906J13050j28893j3336j02834J30728M1491K465J06035Q1968j8858
5148A1613722L5263K1507L4809k025O9242n4166j1307J24223J9348K0202J95043
$$ plain form
5224 10221351 10245893 10287119 10317425 10215252 10305065 10188254 10141467 10224815 10263648 10242016 10189490
5213 10189490 10170312 10241766 10224051 10142710 10200202 10265724 10369674 10355287 10316401 10294843 10274208
5202 10274208 10280492 10349886 10380160 10407513 10305776 10200443 10256513 10391500 10400415 10356705 10348620
5191 10348620 10352699 10289094 10270057 10389620 10417160 10373751 10367499 10363882 10378901 10499929 10495355 10573546
5179 10573546 10622499 10657845 10676886 10786037 10899063 10848623 10699346 10810186 10750803 10894035
5169 10894035 11000978 10892002 10816722 10852553 10910078 10899968 10945635 10936372 11066988 11148236 11401906
5158 11401906 11514956 11386063 11372727 11269893 11400621 11442112 11444577 11550612 11632580 11613722
5148 11613722 11648985 11670492 11705301 11703276 11772518 11718352 11707045 11831268 11850616 11870818 12065861
5137A2065861n5965O299J1192K07066K16390j73854J2939J68364J1653Q1382J14556
5126A2665883J48941M5332M8973J15968k0095M1707J03342J68416O2954J02711
5116A3484132l3408j0099J79781Q0858L658N6300J28948J68576J31892K12294
5106A4402932K25274J74021K63729J87792J50613J8322J09058K83622J42197R2896
5096A6050456J55710o2425n6141J92974N8841J91277j6296J53133J99866J80600
5086A7047995J54010R2011j60013j60240o9553J58070M0243N7215l5325R0498
5076A7214911R5013J4266J86851L0362R0473R9601J28945R8910Q6019J83511J40850
5065A8369712l3626r1878M7509J26036R1323J0871j12700k16J19768J66304n2575
$$ plain form
5137 12065861 12009896 12016195 12027387 12234453 12450843 12276989 12289928 12458292 12469945 12551327 12665883
5126 12665883 12814824 12860156 12909129 13025097 13005002 13046709 13150051 13318467 13381421 13484132
5116 13484132 13450724 13440625 13620406 13701264 13704922 13761222 13890170 14058746 14190638 14402932
5106 14402932 14628206 14802227 15065956 15253748 15404361 15422683 15531741 15815363 15957560 16050456
5096 16050456 16206166 16143741 16087600 16280574 16339415 16530692 16514396 16667529 16867395 17047995
5086 17047995 17202005 17294016 17134003 16973763 16904210 17062280 17102523 17159738 17124413 17214911
5076 17214911 17309924 17324190 17511041 17541403 17631876 17731477 17860422 17959332 18045351 18228862 18369712
5065 18369712 18336086 18244208 18291717 18417753 18509076 18519947 18407247 18407031 18526799 18693103 18640528
5054A8640528r4914O7997K68671J12575O5669J27112L3595Q6519R7714O94J08904
5043A9515064J35532J25774J54259O3279O5561J41029N1924J39070o7520J24852
5033B0448824R8362K9070O9446J16080J33756K0923P8325J45285J98417M6550
5023B1385038K32848J82760J6020K06696J40769J66709L94250L45302J26674K00634
5013B3397700K11560J24213L79129L99469M34020K10844L62813L92954L54358
5004B6267060M58004M51941L85942M97727N19525O61853N07383P86025R02031
4995C1437491O49235Q19416J072347R87410J230646J299380J328164J439518J584623
4986D1848230J648386J872142J986637J979509J983549J992858J806518J320089
$$ plain form
5054 18640528 18545614 18613611 18882282 18994857 19060526 19187638 19221233 19307752 19405466 19406160 19515064
5043 19515064 19650596 19776370 19930629 19993908 20059469 20200498 20252422 20391492 20323972 20448824
5033 20448824 20547186 20576256 20645702 20761782 20895538 20916461 20994786 21140071 21338488 21385038
5023 21385038 21617886 21800646 21816666 22023362 22164131 22330840 22725090 23070392 23197066 23397700
5013 23397700 23609260 23733473 24112602 24512071 24946091 25156935 25519748 25912702 26267060
5004 26267060 26725064 27177005 27562947 28060674 28580199 29242052 29749435 30535460 31437491
4995 31437491 32086726 32906142 33978489 34965899 36196545 37495925 38824089 40263607 41848230
4986 41848230 43496616 45368758 47355395 49334904 51318453 53311311 55117829 56437918
4978E6437918Q04637M63324p3680k88386n81097j097701r08880p41896o83676
4969E3330563n29200l30155m78547n91122p65096o66129o80139m05656m02607
4960D8481912J224j0155J67537K76838L53481N75289O79651O20474Q21429J043983
4950E3011663Q30629J238535J162067R64115Q40982M04701J32614j34372j31154
4941E8319780n20893m73566l31301m45280l60568j09464r8192L9240J86456L17014
4931E6523226M53801L82520M28008M74077Q25277P38043Q74790J032347R22161
4922F2654250J215809J346858J432092J749627J859188J940367K174399K553773
4914G6926363K893980L029662L216472L602104L880294M002358L657942L651423
$$ plain form
4978 56437918 57242555 57705879 57632199 57343813 56762716 55665015 54756135 54014239 53330563
4969 53330563 52801363 52471208 51992661 51401539 50636443 49970314 49290175 48884519 48481912
4960 48481912 48483136 48472981 48640518 48917356 49270837 49846126 50525777 51146251 51967680 53011663
4950 53011663 53842292 55080827 56242894 57207009 58047991 58452692 58585306 58450934 58319780
4941 58319780 57798887 57325321 56994020 56548740 56188172 56078708 55980516 56019756 56206212 56523226
4931 56523226 56977027 57359547 57787555 58261632 59086909 59824952 60699742 61732089 62654250
4922 62654250 63870059 65216917 66649009 68398636 70257824 72198191 74372590 76926363
4914 76926363 79820343 82850005 86066477 89668581 93548875 97551233 101209175 104860598
4906A04860598L271508K722828J830226J089314K58175o59295q58949j524714
4898A10989691j727417j980321j880053j881330j604315j246374q18772l63174
4890I9487935j91004J53879K16070M54579O65476P63200J028938R49111J206475
4881A04734659J440665J750206K021266J985270K101432J839975J782582J721477
4873A19377532J524337J572213J471350J098433J036764J091451R11788N96710
4865A28680578O70894Q07707P67685J123861J406647J826544K329270K592839
4857A40206025L009859L244392L443630L980047M572801M869746N462220O004460
4849A74793180O263118O323058O091792N202045K705093q14756m590071q213700
$$ plain form
4906 104860598 108132106 110854934 112685160 113774474 114032649 113373354 112514405 110989691
4898 110989691 109262274 107281953 105401900 103520570 101916255 100669881 99851109 99487935
4890 99487935 99296931 99450810 99666880 100121459 100786935 101550135 102579073 103528184 104734659
4881 104734659 106175324 107925530 109946796 111932066 114033498 115873473 117656055 119377532
4873 119377532 120901869 122474082 123945432 125043865 126080629 127172080 128083868 128680578
4865 128680578 129351472 130159179 130926864 132050725 133457372 135283916 137613186 140206025
4857 140206025 143215884 146460276 149903906 153883953 158456754 163326500 168788720 174793180
4849 174793180 181056298 187379356 193471148 198673193 201378286 200563530 195973459 187759759
4841A87759759r677952q835511p539431o360899m991786l802614k840200j943936
4833A41767430r62947l77300K83661R55107J350531J553188J933624J853226J311235
4824A49667755O36110m89544j395498k392700l480384m443771m957382n156891
4816A27987695n308236n333542n031240m567159m373931l996297l460715l121307
4808I2795268k802724k672152k231165j966308j900014j718961j254409j190321
4800G7059214q73061o73846k95021k55960k22273J79315K57530O74640O57839
4791G6508377Q37305Q01068R42533J336317J447043J751966J932016J976709K293221
4782H9826555K317086K537163K647317K741501K948134L137688L223685L093197
$$ plain form
4841 187759759 178081807 169246296 161706865 155345966 150354180 146551566 143711366 141767430
4833 141767430 140804483 140427183 140710844 141665951 143016482 144569670 146503294 148356520 149667755
4824 149667755 150303865 149814321 148418823 146026123 142545739 138101968 133144586 127987695
4816 127987695 122679459 117345917 112314677 107747518 103373587 99377290 95916575 92795268
4808 92795268 89992544 87320392 85089227 83122919 81222905 79503944 78249535 77059214
4800 77059214 76186153 75512307 75217286 74961326 74739053 74918368 75175898 75850538 76508377
4791 76508377 77345682 78146750 79089283 80425600 81872643 83624609 85556625 87533334 89826555
4782 89826555 92143641 94680804 97328121 100069622 103017756 106155444 109379129 112472326
4774A12472326L190933L122701K812689K490603K189255J921855J588854J322868
4766A31112084Q23477O91897L24698J39838j35162j12012k00424j2826L7758K99625
4756A32968953M45874N48625O18615O90646Q84001J001642J321935R91688J034371
4747A40506350P86775K16972K37761j11542o91671q58315j128491j551848j666038
4738A35739953j880262k252056k121659k111074k168500k316436k114286j901421
4730A18874259j791616j770595j500662j292060j082185q53549q29299o74674
4722A09079619m70537m77386k47183r3080K95024L15105L87947M84509O67977
4713A09941995N77948R04343J082242J292603J700361J835046K273358K714215
$$ plain form
4774 112472326 115663259 118785960 121598649 124089252 126278507 128200362 129789216 131112084
4766 131112084 131935561 132627458 132952156 133091994 132956832 132844820 132644396 132631570 132669328 132968953
4756 132968953 133414827 133963452 134582067 135272713 136156714 137158356 138480291 139471979 140506350
4747 140506350 141293125 141510097 141747858 141636316 140944645 140086330 138957839 137405991 135739953
4738 135739953 133859691 131607635 129485976 127374902 125206402 122889966 120775680 118874259
4730 118874259 117082643 115312048 113811386 112519326 111437141 110583592 109754293 109079619
4722 109079619 108609082 108131696 107884513 107791433 108086457 108401562 108789509 109274018 109941995
4713 109941995 110519943 111424286 112506528 113799131 115499492 117334538 119607896 122322111
4705A22322111L316892L910820M227755M516191M079238L287177K054422R43945
4697A48658551Q39822J104475J960025K809863L959105N285238O425269P519559
4689A78561907Q571398R153799R003900P894115N703348L915848L131825L583555
4681B29519695M883970O193236O946164O712783N414885M274587M327614O160883
4673B74433817R014511J2654844J7047582K1507893K6161868L0248032L2652956
4666D23721503L2017774K6695633J4681644l213572k2288069l5228179l9442797
4659C96943937l7395718l3109453k8587675k3986856k0211919j7217312j4874413
4652B21560591j3010024j1374496j0526413r586749q707577q018203p366143o769970
$$ plain form
4705 122322111 125639003 129549823 133777578 138293769 142373007 145660184 147714606 148658551
4697 148658551 149498373 150602848 152562873 155372736 159331841 164617079 171042348 178561907
4689 178561907 187133305 196287104 205291004 213185119 218888467 222804315 225936140 229519695
4681 229519695 234403665 240596901 247543065 254255848 259670733 263945320 268272934 274433817
4673 274433817 283448328 296103172 313150754 334658647 360820515 391068547 423721503
4666 423721503 455739277 482434910 497116554 493902982 471614913 436386734 396943937
4659 396943937 359548219 326438766 297851091 273864235 253652316 236435004 221560591
4652 221560591 208550567 197176071 186649658 177062909 168355332 160337129 152970986 146201016
4644A46201016o054719n545384n164683m819190m393141m027531l835835l521763
4636A08838770l218505l086954k912634k649986k542168k355464k298548k154972
4628H7619539k045671k104475j861412j602672j687955j726019j671342j599766
4620G3320227j484188j385697j236983j333997j376793j323889j229578j095049
4612F2854053j071612j066852j063783p93750q38404p67901o08050n75691p21466
4603E5346544p93701m94874n26863n85922k95703k55500l93500k44769l38157
4594E1417555l33925k71859l02795j15121j63567k28289J389j00005j78422j1598
4584D9713363K52545P8810j06105N9907K16394K91021J30638K74410L77564L34833
$$ plain form
4644 146201016 140146297 134600913 129436230 124617040 120223899 116196368 112360533 108838770
4636 108838770 105620265 102533311 99620677 96970691 94428523 92073059 89774511 87619539
4628 87619539 85573868 83469393 81607981 80005309 78317354 76591335 74919993 73320227
4620 73320227 71836039 70450342 69213359 67879362 66502569 65178680 63949102 62854053
4612 62854053 61782441 60715589 59651806 58858056 58019652 57251751 56643701 56068010 55346544
4603 55346544 54552843 54057969 53531106 52945184 52649481 52393981 52000481 51755712 51417555
4594 51417555 51083630 50811771 50508976 50393855 50230288 50001999 50003388 49903383 49724961 49713363
4584 49713363 49965908 50044718 49938613 49998520 50214914 50505935 50636573 50910983 51288547 51623380
4574E1623380L86365K39573K75929J80147M1499J54088R1510J22787K16084J94478
4564E3525840M75651O00738M66226P95163J001691J234912J852776K261107K661348
4555F4875452L221124L981516M510465M877564M593248L774048K572014P50854
4547I3156285j260868l282761m637070n186094n347534n304009m682518l777492
4539E9677939k982214k455600k018278j850698j596354j310964j354930j259916
4531D4848985j354964j491475j117369j008903j019489r46512q44854o97364o33697
4522C5734358o86380n02467m98099n39933l28978l08495l98498k62045m01687
4513C1807776k42320j16307k50429m29337l14950j45182l64156j84741k32868
$$ plain form
4574 51623380 52009745 52249318 52525247 52705394 52746893 52900981 52992491 53115278 53331362 53525840
4564 53525840 54001491 54602229 55068455 55863618 56865309 58100221 59952997 62214104 64875452
4555 64875452 68096576 72078092 76588557 81466121 86059369 89833417 92405431 93156285
4547 93156285 91895417 88612656 83975586 78789492 73441958 68137949 63455431 59677939
4539 59677939 56695725 54240125 52221847 50371149 48774795 47463831 46108901 44848985
4531 44848985 43494021 42002546 40885177 39876274 38856785 37910273 37065419 36368055 35734358
4522 35734358 35047978 34545511 34047412 33507479 33178501 32870006 32471508 32209463 31807776
4513 31807776 31565456 31449149 31198720 30769383 30454433 30309251 29945095 29760354 29527486
4504B9527486l36742l62716j80502j65483k40870j05800k22138k11584k40312
4495B7461339j46590O0274q8171p3856j64120k61176m9906N4294k28747j50313
4485B6413028j46227j78447k06456m8898m8287l6165L614j26914j32949j15765
4475B5376534j8527n3021j40407k2394j16015k7490q9980j90701J40625R2806
4465B4951430O7120k4906p0740K5210Q8448l2180J97036J10552k102K46145J72859
4454B5728872K19463L57944L35238M97403Q30540Q03986N86548J9977o47815p95553
4444B7936603n22919m94621m68561l19594k23998k37278R6322p4862j55989P9857
4434B5614960O8393Q1281J15882L87072J85990K67855N34503O06427N41842M8582
$$ plain form
4504 29527486 29190744 28828028 28647526 28482043 28241173 28135373 27913235 27701651 27461339
4495 27461339 27314749 27375023 27286852 27212996 27048876 26787700 26737794 26792088 26563341 26413028
4485 26413028 26266801 26088354 25881898 25833000 25784713 25748548 25752162 25625248 25492299 25376534
4475 25376534 25358007 25304986 25164579 25142185 25026170 24998680 24908700 24717999 24858624 24951430
4465 24951430 25018550 24993644 24922904 24948114 25036562 25004382 25201418 25311970 25309868 25556013 25728872
4454 25728872 25948335 26306279 26641517 27138920 27969460 28773446 29359994 29379971 28732156 27936603
4444 27936603 27413684 26919063 26450502 26130908 25906910 25669632 25765954 25691092 25535103 25614960
4434 25614960 25683353 25764634 25880516 26267588 26453578 26721433 27255936 27862363 28404205 28452787
4424B8452787k24802o41903o37664m31592m00595k17304j11934j15451N1841K4129
4414B5747512R4232Q1243K24971J38905J35123J62415k0218m1332J02412m5623
4404B6579640m0970R4928j54857o5530p1727p9862J36597K90363Q2268Q9484K27146
4393B7087480K48898K52436K40334J22315j6693j40633j03289n0992j29547k2661
4383B7487648P1532k9031M8630L63021M92796L3939J84869M22848J59337n2098
4373B9183491j28631j89681J01340j26697j59597k38885k04171r5787m1529q0340
4363B8019513J27460j6250O763P4939L1161n8468r8832k15912l3152j49244j66395
4352B7521583J61089m4731p9895j43336R1726J42038J30743K33956K09717J57559
$$ plain form
4424 28452787 28227985 27586082 26948418 26516826 26116231 25898927 25786993 25671542 25723383 25747512
4414 25747512 25841744 25922987 26147958 26286863 26421986 26584401 26564183 26522851 26625263 26579640
4404 26579640 26538670 26633598 26478741 26413211 26341484 26261622 26398219 26688582 26770850 26860334 27087480
4393 27087480 27336378 27588814 27829148 27951463 27934770 27794137 27690848 27639856 27510309 27487648
4383 27487648 27559180 27530149 27578779 27941800 28434596 28468535 28653404 29076252 29235589 29183491
4373 29183491 29054860 28865179 28966519 28839822 28680225 28441340 28237169 28141382 28099853 28019513
4363 28019513 28146973 28130723 28137486 28212425 28243586 28185118 28086286 27870374 27837222 27687978 27521583
4352 27521583 27682672 27637941 27558046 27414710 27506436 27648474 27779217 28013173 28222890 28380449
4342B8380449J74393K16972J31806o4143K27102n6142j67339j31654k24027j67025
4332B8320392j23802j23238k37156k03591l1833j4830p0009N7699l544l01393
4322B7268695m17079l19580l96645l70000m06071l80974k95361k19652j32424
4313B4330909j05472j67524k63969K0019j3137j80624j27662q6053m6867l791
4303B3355829o2233J04364k7770j36651j40778l69963l13878m47309k99718j91239
4293B1470654j82839k29943k39821r5029m4733j62960l29347j94054j4965L3927
4283B0010890k6536j49188p8814P1330k17850l49l4430Q0325k4140M1619N8859
4272A9731716N4207J31157N472o2266L0157L3808p9222P5096J24965L6732j280
$$ plain form
4342 28380449 28554842 28771814 28903620 28839477 29066579 29010437 28843098 28711444 28487417 28320392
4332 28320392 28196590 28073352 27836196 27632605 27600772 27585942 27515933 27573632 27570088 27268695
4322 27268695 26851616 26532036 26135391 25765391 25359320 24978346 24682985 24463333 24330909
4313 24330909 24225437 24057913 23793944 23813963 23800826 23620202 23492540 23406487 23359620 23355829
4303 23355829 23293596 23397960 23370190 23233539 23092761 22722798 22408920 21961611 21661893 21470654
4293 21470654 21287815 21057872 20818051 20723022 20678289 20515329 20185982 19991928 19976963 20010890
4283 20010890 19984354 19835166 19756352 19827682 19609832 19609483 19575053 19655378 19631238 19672857 19731716
4272 19731716 19785923 19917080 19922552 19860286 19890443 19924251 19845029 19920125 20045090 20081822 20080542
4261B0080542j44205J98075R9349P2118K5467k12224o8923r5878k41576k00798
4251A9511947k27785M5006j00823k63361k26304j77652r0075j93440j16411k73402
4241A7887700k3436q8341j18461k47890k17170j17145R970o9123q7527n9785j56138
4230A6712654j44402k0911j5822m0329j18850j51439r0281q3635M8104m7308j51404
4219A5896377p2989j26660j19438j6256K3375L5002n4690j33737r1064j24931
4209A5214989j10008k03614P2107K3356j15503j32673q9302l1256O7918k20770
4199A4475244p189j0721q2682K7226p2842j11587P03m4634l0100j12594l4535
4188A3996289J11391m1723j69315k17769J22463p4079p7949j83402r4967r2191
$$ plain form
4261 20080542 19936337 20134412 20233761 20305879 20331346 20119122 20050199 19954321 19712745 19511947
4251 19511947 19284162 19329168 19228345 18964984 18738680 18561028 18470953 18277513 18161102 17887700
4241 17887700 17864264 17775923 17657462 17409572 17192402 17075257 17085227 17016104 16928577 16868792 16712654
4230 16712654 16568252 16547341 16531519 16491190 16372340 16220901 16130620 16046985 16095089 16047781 15896377
4219 15896377 15823388 15696728 15577290 15561034 15584409 15619411 15564721 15430984 15339920 15214989
4209 15214989 15104981 14901367 14973474 14996830 14881327 14748654 14659352 14628096 14696014 14475244
4199 14475244 14468055 14457334 14374652 14401878 14329036 14217449 14218152 14173518 14143418 14030824 13996289
4188 13996289 14107680 14065957 13896642 13678873 13801336 13727257 13649308 13465906 13370939 13278748
4178A3278748j2889l5695n2403K4774o1935k5603J8620j16342q2803j21660j25646
4167A2687166K4633l6398j07445j9203n3607m7822r5657j14433j162j6938O3151
4156A2282285k53891o2518J04998n1910P7495J5806j41635j67304R8090n5167
4146A1846249j02344J05450k01153n4629m4630j22636j38123P8549L3872j48330
4136A1252275q0789j09923j14552J9880J09174j53189J02480j1960j31154k52229
4126A0630013P5385M7673j37233k0986r828j36907m6786J3735m5303k02205l7062
4115A0130496K5540N2380k369n2021j25689o0077l024j24698j39958j07033Q0338
4104I673885P9531n2817m6472l3578q1229R7313k01394M1888n5356R1936m6400
$$ plain form
4178 13278748 13265859 13230164 13177761 13202535 13140600 13114997 13133617 13017275 12934472 12812812 12687166
4167 12687166 12711799 12675401 12567956 12548753 12495146 12447324 12351667 12237234 12236072 12219134 12282285
4156 12282285 12028394 11965876 12070874 12018964 12096459 12112265 11970630 11803326 11901416 11846249
4146 11846249 11743905 11849355 11648202 11593573 11548943 11426307 11288184 11366733 11400605 11252275
4136 11252275 11171486 11061563 10947011 10966891 11076065 10922876 11025356 11013396 10882242 10630013
4126 10630013 10705398 10753071 10615838 10594852 10585024 10448117 10401331 10415066 10369763 10167558 10130496
4115 10130496 10156036 10208416 10206047 10154026 10028337 9968260 9965236 9840538 9700580 9593547 9673885
4104 9673885 9753416 9700599 9654127 9620549 9539320 9636633 9435239 9477127 9421771 9513707 9467307
4093I467307j05825j48916J70275Q720j28803r5766k8553m4342n1853j7349J19614
4082I144509R2913j02042l0498j01256N9148R9821l6248j26413J52921J6882j15051
4071I054686k5415J55523N0193k28434o4580R9415j29136r4729l955J21243p6558
4060H858253J27775p6574j53371N5221J16617p0818O7680K4720r213J12178j97495
4049H854973m1648K3805k21942k4835k4190o40O3355p5567M1194j12279K5915
4038H508141j00602k5390R3129q4108J4975r912m6692j579j3521p716n4977o5605
4026H206143J56588L6815n5375q7103j76971j52905K2167L7085J9107j07259j18570
4015G779722j05394o3281j32191q5831O1196l6335N8972L8929k6281j04260o6887
$$ plain form
4093 9467307 9361482 9212566 9382841 9391561 9262758 9166992 9138439 9094097 9042244 9024895 9144509
4082 9144509 9237422 9135380 9104882 9003626 9062774 9162595 9126347 8999934 9152855 9169737 9054686
4071 9054686 9029271 9184794 9234987 9006553 8941973 9041388 8912252 8817523 8813568 8934811 8858253
4060 8858253 8986028 8909454 8756083 8811304 8927921 8857103 8924783 8949503 8940290 9052468 8854973
4049 8854973 8813325 8837130 8615188 8590353 8566163 8565523 8628878 8553311 8594505 8482226 8508141
4038 8508141 8407539 8382149 8475278 8391170 8406145 8396233 8349541 8347962 8334441 8326725 8271748 8206143
4026 8206143 8362731 8399546 8344171 8257068 8080097 7927192 7949359 7986444 8005551 7898292 7779722
4015 7779722 7674328 7611047 7478856 7393025 7454221 7417886 7476858 7515787 7489506 7385246 7318359
4004G318359k4035R6090p6373m0482N233j26411j45998K6841O6808M83k9440l0963
3992G040112P8438k8651j65484r561M0765J6997j26281L3359M817Q0606O4667
3981G029784k01843R0558k3471M4675K314j21563O8626k3007L8640j13084r2255
3970F699374M5928k2375l0260J31570q5749l1284r6828l0700l993R8422K1680
3959F695785j12528J08782K5802k00452k6376J73840L5323k0839o4532p160j21352
3948F486293J91212J31789m8403N0197p5669j73387l7892l9519N7851M8240M5862
3937F636574q7635P3678K5423K7189k9901o8236p0028j40167Q1615J31761R6218
3926F676491M5448n5862j4959J82173n0250J223K0514R5562r5760J42220k0409
$$ plain form
4004 7318359 7294324 7390414 7314041 7273559 7278792 7152381 7006383 7033224 7100032 7100515 7071075 7040112
3992 7040112 7118550 7089899 6924415 6914854 6955619 6972616 6846335 6879694 6884511 6965117 7029784
3981 7029784 6827941 6918499 6895028 6939703 6942017 6820454 6889080 6866073 6904713 6791629 6699374
3970 6699374 6745302 6722927 6692667 6824237 6738488 6707204 6610376 6579676 6575683 6674105 6695785
3959 6695785 6583257 6692039 6717841 6517389 6491013 6664853 6700176 6679337 6614805 6607645 6486293
3948 6486293 6677505 6809294 6760891 6811088 6735419 6562032 6524140 6484621 6542472 6590712 6636574
3937 6636574 6548939 6622617 6648040 6675229 6645328 6577092 6507064 6366897 6448512 6580273 6676491
3926 6676491 6721939 6666077 6651118 6833291 6783041 6784264 6804778 6900340 6804580 6946800 6926391
3915F926391N802J69634m5301M6174n2255P3464N4357n485l1928J39252j40326
3904G139779q083J61339J14781K144M5883q9473j65288K3883J20622n5866r1722
3893G197999P0662J61524P1043n7187j26246o5860J03899O4247n0299N7668q1130
3882G346320q9875J05559K3743r3333o5627n7811J8841J63829J72791M4537K695
3871G571669j01425O8625O538j47533J26291K04055N6982j0682L9867m3916N0782
3860G821253K2176J12287J27260J188K0237J59559j585N7140J48057J60231l1782
3849H596021n8615K2614Q8738k8551J62291J19273Q1150M0337l1853J06138J54872
3838I252415L5575l5669R3627J13087l7257K5327N6720J67477j9741l0957Q3114
$$ plain form
3915 6926391 6932193 7101827 7056526 7102700 7050445 7123909 7178266 7172781 7140853 7280105 7139779
3904 7139779 7131696 7293035 7407816 7409960 7455843 7366370 7201082 7224965 7345587 7289721 7197999
3893 7197999 7268661 7430185 7501228 7444041 7317795 7251935 7355834 7420081 7369782 7427450 7346320
3882 7346320 7256445 7362004 7385747 7292414 7226787 7168976 7187817 7351646 7524437 7568974 7571669
3871 7571669 7470244 7538869 7545407 7397874 7524165 7728220 7785202 7774520 7814387 7770471 7821253
3860 7821253 7843429 7955716 8082976 8084164 8104401 8263960 8262375 8319515 8467572 8627803 8596021
3849 8596021 8537406 8560020 8648758 8620207 8782498 8901771 8982921 9023258 8991405 9097543 9252415
3838 9252415 9287990 9252321 9345948 9459035 9421778 9447105 9503825 9671302 9651561 9620604 9703718
3827I703718K2829P97j1692J20913N6387J83482O8498n3185J2067J67637k519
3816A0268932j9826R2119N4245K1770O8662M3041K713L1478r65j04896m8150L062
3804A0412185J06191J0198k47881m9946J85334J83540p1696k11899m7161j60986
3794A0107879j09211j25448K09809l973o6890m9206j09455J91755l2268n3275
3784I959717q4573l1260Q8286k7643q6246J13790M2481N0385p9490L6258r3418
3773I888287J2959Q1398j87308j19788M8216l2770p8246j19833o0225n8352P1046
3762I445384n2005o2581k9785r3519K4996l6144q3133K0194l7094r3636M664p8599
3750H928742K9257O6796n2631j29846O2120P9005K8077o9754l1867j5327R2643
$$ plain form
3827 9703718 9726547 9727344 9715652 9836565 9892952 10076434 10144932 10091747 10103814 10271451 10268932
3816 10268932 10249106 10341225 10395470 10417240 10485902 10528943 10531656 10563134 10562169 10457273 10409123 10412185
3804 10412185 10518376 10528574 10280693 10230747 10416081 10599621 10527925 10316026 10268865 10107879
3794 10107879 9998668 9873220 10083029 10079056 10012166 9962960 9853505 10045260 10012992 9959717
3784 9959717 9875144 9843884 9932170 9904527 9818281 9932071 9974552 10024937 9945447 9981705 9888287
3773 9888287 9901246 9982644 9795336 9675548 9723764 9690994 9612748 9492915 9432690 9374338 9445384
3762 9445384 9393379 9330798 9301013 9207494 9232490 9196346 9113213 9133407 9096313 9002677 9007341 8928742
3750 8928742 8957999 9024795 8972164 8842318 8904438 8983443 9011520 8941766 8909899 8894572 8987215
3739H987215o6759N0169l9981n0717Q6543j11050r3891k7742p081O4207n3514
3728H737399M3885j88568K9426J90363k9306j09767j48381j19349J47038J96646
3718H749386J30052r1047M1432K0782j87045J27118J13124l6955L8177L2612n8249
3707H879387r5166m9698J74457l5024L0103m3252K6589L3290R2971n0353K2520
3696H985824n7479o8564K9765J9285j08231p7829l2239P3653P8240n5649k1747
3685H765029P1926R302j26449N1112j58898m2050J11634J32923N7539k9572O6651
3674H909147l3096K4266N5418J7667P8022K8508O2765L3535K6694R6091L0284
3663I329301R8944Q5204M3339m930J37781J30702J08069J08698K12286Q3815q5475
$$ plain form
3739 8987215 8920456 8970625 8930644 8879927 8966470 8855420 8761529 8733787 8726706 8790913 8737399
3728 8737399 8781284 8592716 8622142 8812505 8783199 8673432 8525051 8405702 8552740 8749386
3718 8749386 8879438 8788391 8829823 8850605 8663560 8790678 8903802 8866847 8905024 8937636 8879387
3707 8879387 8784221 8734523 8908980 8873956 8904059 8860807 8887396 8920686 9013657 8963304 8985824
3696 8985824 8928345 8859781 8889546 8908831 8800600 8722771 8690532 8764185 8842425 8786776 8765029
3685 8765029 8836955 8846257 8719808 8770920 8612022 8569972 8681606 8814529 8872068 8842496 8909147
3674 8909147 8876051 8900317 8955735 8973402 9051424 9079932 9142697 9176232 9202926 9299017 9329301
3663 9329301 9428245 9513449 9556788 9551858 9689639 9820341 9928410 10037108 10249394 10333209 10247734
3652A0247734N8058l2962P3903O8845J50146P9077n8147J14720n0142P3056J46223
3641A0870511m2990O4551m1142J88624J57063P3213j48760r4918N5922J24812
3631A1206886J73144M5367K6731l9730p7653J33419k0389L6780J24707R8551J5560
3620A1723373M6897P9020K9838J0306J7207N4751N3105K09099P2055J03311J16883
3609A2515845M6712J5491J95242J00320K23765K34941M1590Q2611J49772J53338
3599A3759627J01749R0494Q3906L5498J27590K46155M4104K78769J93396K6439
3589A4987727K36230K85857J40800J6741J23001K74108M27073J88835L7531J93488
3579A6911391K99409L50722K58909K37612L75826J83303K34484K93461L43769
$$ plain form
3652 10247734 10305792 10272830 10346733 10415578 10565724 10644801 10586654 10701374 10651232 10724288 10870511
3641 10870511 10827521 10892072 10850930 11039554 11196617 11269830 11121070 11026152 11082074 11206886
3631 11206886 11380030 11425397 11452128 11412398 11334745 11468164 11447775 11484555 11609262 11707813 11723373
3620 11723373 11770270 11849290 11879128 11889434 11906641 11961392 12014497 12223596 12295651 12398962 12515845
3609 12515845 12562557 12578048 12773290 12873610 13097375 13332316 13373906 13456517 13606289 13759627
3599 13759627 13861376 13951870 14035776 14071274 14198864 14445019 14489123 14767892 14961288 14987727
3589 14987727 15223957 15509814 15650614 15667355 15790356 16064464 16491537 16680372 16717903 16911391
3579 16911391 17210800 17561522 17820431 18058043 18433869 18617172 18851656 19145117 19488886
3570A9488886L48765L94188M01538M43954L57413M09441L78896K91257L82054
3561B2896392N22451N83227N64635O64375N97279N02723O96104Q45657O80093
3552B8552936O94175Q09660P20746Q12277O77855P50730Q26309R40352J038761
3543C5823801J077240J195236J176017J363322J623391J651705J900006J955462
3535D7766180K030362K333677K531696K609829K809235L030088L241729L225082
3527F9577878L272091L419120L057093K779988K142240J525468Q90883M56657
3519H7121418m5888o16930q72805j125307j144544j283300j438861j157666j150056
3510G8286061j095961j208879j222217r50938j016219p80549m82612n08802l93112
$$ plain form
3570 19488886 19837651 20231839 20633377 21077331 21434744 21844185 22223081 22514338 22896392
3561 22896392 23418843 24002070 24566705 25231080 25828359 26331082 27027186 27872843 28552936
3552 28552936 29247111 30056771 30777517 31589794 32267649 33018379 33844688 34785040 35823801
3543 35823801 36901041 38096277 39272294 40635616 42259007 43910712 45810718 47766180
3535 47766180 49796542 52130219 54661915 57271744 60080979 63111067 66352796 69577878
3527 69577878 72849969 76269089 79326182 82106170 84248410 85773878 86664761 87121418
3519 87121418 87075530 86458600 85585795 84460488 83315944 82032644 80593783 79436117 78286061
3510 78286061 77190100 75981221 74759004 73808066 72791847 72011298 71528686 71019884 70626772
3501G0626772k85022j92466k63751o7882j3972k7480J32686j1806p4871j52859
3491F9669349l55260m92812n96356j138106j553537j848856k091047k349607k650985
3482E6592783k478108k428936k501658k255000k045205j943860j695945j811132
3474C9432939j383237j131506j210347j127198r27562r50628q73102r54575o92183
3465C0182601m67052l53346m87315m41871k77026j99275j56444k29965j95534
3456B7374773Q6437J73618K11704M29756N41180M69178O40614P20664M89656k70766
3446C0866814j246566j488869j145326p53151o40236n33418l89241l21492m61286
3437B3887229m17707l42819k48809k19005k23992j23861j37608j25041L0828J6358
$$ plain form
3501 70626772 70341750 70149284 69885533 69817651 69803679 69776199 69908885 69897079 69822208 69669349
3491 69669349 69314089 68821277 68224921 67086815 65533278 63684422 61593375 59243768 56592783
3482 56592783 54114675 51685739 49184081 46929081 44883876 42940016 41244071 39432939
3474 39432939 38049702 36918196 35707849 34580651 33653089 32702461 31829359 30874784 30182601
3465 30182601 29715549 29362203 28874888 28433017 28155991 27956716 27800272 27570307 27374773
3456 27374773 27461210 27634828 27846532 28276288 28817468 29286646 29927260 30647924 31137580 30866814
3446 30866814 29620248 28131379 26986053 26232902 25592666 25059248 24670007 24348515 23887229
3437 23887229 23469522 23126703 22877894 22658889 22434897 22311036 22173428 22048387 22079215 22095573
3427B2095573J05948J87443K80945K96518M91559O92647J159582J247388J318116
3418B7875719J592590J696517Q16606q87716k398936k561183j768992j395536
3410B2969069j185199o65309n21690m73578m20198m45309k81301k78667l38841
3401A8358977k46223k25038j57934o2895L3053j71309k18676J04934J81323O1942
3391A7658154J22709L20542L59171O40239O57209P06954P11266J68577n60569
3382B0784252j196099j268298r02200m82208n82099k35781l62593l08181j82684
3373A5264109k67682k39475l16387l21674j94396j57382k63589j92916J0243o3708
3363A3257143k08752k21825j53133r5105o4773j72655L0436j08898k78303m6104
$$ plain form
3427 22095573 22201521 22388964 22669909 22966427 23457986 24150633 25310215 26557603 27875719
3418 27875719 29468309 31164826 31981432 31093716 28694780 26133597 24364605 22969069
3410 22969069 21783870 21118561 20596871 20123293 19703095 19257786 18976485 18697818 18358977
3401 18358977 18112754 17887716 17729782 17666887 17699940 17528631 17309955 17414889 17596212 17658154
3391 17658154 17780863 18101405 18460576 19100815 19758024 20464978 21176244 21344821 20784252
3382 20784252 19588153 18319855 17417655 16935447 16353348 16117567 15754974 15446793 15264109
3373 15264109 14996427 14756952 14440565 14118891 13924495 13767113 13503524 13310608 13320851 13257143
3363 13257143 13048391 12826566 12673433 12578328 12513555 12340900 12371336 12262438 11984135 11938031
3353A1938031m2225p3129m9454o159n2693q6964p7348j9444o2693j70420j53694
3342A1143808k499j4925r7746k41185q9488m7498j72642M9923K9170j78099p3069
3331A0305750l2907j49398k2488P0360j27810m265M443r8340l8809L3527k3258
3320I916805M3693j61926o8825m1080N864J662r2345n4605q435q8404r9654K7122
3308I379872O7778O3640m4115M5798K8746p4740P2645p3134m8712M1514O9036
3297I528328p5430J42728N1870J32785J6213j04125K529j89060L1910L8469j50805
3286I425412O1134l9781l1303k61205p2733J25688p4311j10529K7125p470j40349
3275H901678J61724K21847J95528N3968N806q9300j9799l2561m30j6267n7899
$$ plain form
3353 11938031 11895806 11822677 11773223 11767064 11714371 11627407 11550059 11530615 11467922 11297502 11143808
3342 11143808 11141309 11126384 11028638 10787453 10697965 10650467 10477825 10527748 10556918 10378819 10305750
3331 10305750 10272843 10123445 10100957 10171317 10043507 10039242 10043685 9945345 9906536 9940063 9916805
3320 9916805 9960498 9798572 9729747 9688667 9694531 9696193 9603848 9549243 9540808 9452404 9352750 9379872
3308 9379872 9447650 9511290 9467175 9512973 9541719 9466979 9539624 9466490 9417778 9459292 9528328
3297 9528328 9452898 9595626 9647496 9780281 9796494 9692369 9694898 9505838 9537748 9576217 9425412
3286 9425412 9486546 9446765 9415462 9154257 9081524 9207212 9132901 9022372 9049497 9042027 8901678
3275 8901678 9063402 9285249 9480777 9534745 9540551 9451251 9431452 9398891 9398461 9382194 9324295
3264I324295N7051Q3542j9142M816K5159k7495k7306N2889R1855k6688K04821
3253I743797l5146k24042O120O3983J11668N4433L3933Q2818N563J3826O4706
3242I921659Q0077J48247R8847J17247o7868J49380P6930K2530K0334o5329K46587
3231A0748641L06623j9465L2908K55674O2636M3430J12362K21823K81798K29132
3221A2275562Q9779K36879L02244L56753K55233L07355L77453L44668M76655L32929
3211A5355510M86355K06112j5592J35852K26373R7043J31561J25288J73222J36759
3201A7058483k5494J11929J41232k61J59680J69823K18924J20165O7460J99994
3191A8221935K94025L50837M41451M55942N99267N64166O17341P87897Q00567
$$ plain form
3264 9324295 9381346 9464888 9445746 9450562 9475721 9448226 9420920 9473809 9565664 9538976 9743797
3253 9743797 9708651 9484609 9490729 9554712 9666380 9720813 9754746 9837564 9843127 9856953 9921659
3242 9921659 10001736 10149983 10248830 10366077 10298209 10447589 10524519 10547049 10567383 10502054 10748641
3231 10748641 11055264 11035799 11068707 11324381 11387017 11430447 11542809 11764632 12046430 12275562
3221 12275562 12365341 12602220 12904464 13261217 13516450 13823805 14201258 14545926 15022581 15355510
3211 15355510 15841865 16047977 16032385 16168237 16394610 16491653 16623214 16748502 16921724 17058483
3201 17058483 17032989 17144918 17286150 17285889 17445569 17615392 17834316 17954481 18021941 18221935
3191 18221935 18515960 18866797 19308248 19764190 20363457 20927623 21544964 22332861 23133428
3182B3133428N85141O5616m07175m80725n22201o97758o92444l50901l24582k81955
3172B0026444k34496o9984k33661l70718j31425M0143j33516k07913j09020j20140
3162A8455714m5746m8238l118K7663J17153l7764O3521J49264K68442J09499P9763
3151A9136153O8780N2339M4787l57103k61514l63197m99266m33422o15035m33139
3141A6339383l51942k12873j96986k75909k51599k72391l70052j13044j50721
3132A4143866k54359l05383k12310l02469j81564j44798j95294k19250j11904
3123A2216535K3426k14616r7262k7074j76704j69980j25872q0398L5042j47003
3113A1236094j03855j82280j00876o9610P9306p1073j23803j29536J9861M9274
$$ plain form
3182 23133428 23718569 23784185 23377010 22896285 22374084 21676326 20983882 20632981 20308399 20026444
3172 20026444 19791948 19721964 19488303 19117585 18986160 19026303 18892787 18684874 18575854 18455714
3162 18455714 18409968 18361730 18358612 18386275 18503428 18465664 18529185 18678449 18946891 19056390 19136153
3151 19136153 19204933 19257272 19302059 18944956 18683442 18320245 17820979 17387557 16772522 16339383
3141 16339383 15987441 15774568 15577582 15301673 15050074 14777683 14407631 14294587 14143866
3132 14143866 13889507 13584124 13371814 13069345 12887781 12742983 12547689 12328439 12216535
3123 12216535 12239961 12025345 11928083 11901009 11724305 11554325 11428453 11348055 11383097 11236094
3113 11236094 11132239 10949959 10849083 10779473 10858779 10787706 10663903 10534367 10554228 10603502
3103A0603502j90416j57424n3828O5386p5598j42855j662r7856r1742k2112k12161
3092I623234K4034q0937K7687R0641J4078j42853r3913J09936k2249p5919N8455
3081I532194o1356k7692M1428M8531l9886R6266l8636p3445N6849J22242J28408
3070I784903k5238J20079J50178K17452N0472K36214K95256J98131M30284M89868
3060A1947599L71883M27181M18880J18876O6170m2517l66360o39730n29136o62037
3050A1110809m37429l50993l76323m13578l79025k03549k32078k03902k72570
3041H241362j47943j84209k43741j63486j26136k0559j85541m6882j23749j55205
3031F843911m2818j6036o7115j80601k26592j9342L5139p86j96305k03126j39232
$$ plain form
3103 10603502 10413086 10255662 10201834 10267220 10191622 10048767 10047105 9949249 9857507 9835395 9623234
3092 9623234 9647268 9566331 9594018 9684659 9698737 9555884 9461971 9571907 9549658 9473739 9532194
3081 9532194 9470838 9443146 9484574 9533105 9493219 9589485 9550849 9477404 9534253 9656495 9784903
3070 9784903 9759665 9879744 10029922 10247374 10297846 10534060 10829316 11027447 11457731 11947599
3060 11947599 12319482 12746663 13165543 13284419 13350589 13308072 12941712 12301982 11772846 11110809
3050 11110809 10673380 10322387 9946064 9532486 9153461 8949912 8717834 8513932 8241362
3041 8241362 8093419 7909210 7665469 7501983 7375847 7355288 7169747 7122865 6999116 6843911
3031 6843911 6801093 6785057 6717942 6537341 6310749 6291407 6326546 6325760 6129455 5926329 5787097
3020E787097r6375J50778l1198N4217j53931l0669k18368K8902K1627k17289m4395
3009E250396O561M9074k966n5099k12189j28560j0156r4898K13403k1091j14616
2998D879859M4971j759j14607j85853q312j18234n8653m8646o0200Q4150q8248
2987D324468j1176Q3719l8735o4807q4452p2981Q1374o757J7156q1744j62031
2976C984034K5706J09134j44108R061K0272k3157r3632O461j17982j45225M4592
2965C675156R3532l1767r8672J80926l8445m6140j43448k16570J74513p12p5562
2954C472811Q993m7183N8318j1084j80246N4721J56720j48437Q3323r4372k80819
2943C072745Q6325N2112m4523j8005l5225O7147j21357j49533O44O9376J56996
$$ plain form
3020 5787097 5690722 5841500 5810302 5864519 5710588 5679919 5461551 5490453 5512080 5294791 5250396
3009 5250396 5256957 5306031 5303065 5247966 5035777 4907217 4897061 4802163 5015566 4994475 4879859
2998 4879859 4924830 4923071 4808464 4622611 4614299 4496065 4437412 4388766 4328566 4412716 4324468
2987 4324468 4313292 4397011 4358276 4293469 4209017 4136036 4217410 4210653 4227809 4146065 3984034
2976 3984034 4009740 4118874 3974766 3983827 4004099 3980942 3887310 3893771 3775789 3630564 3675156
2965 3675156 3768688 3736921 3638249 3819175 3780730 3734590 3591142 3374572 3549085 3548373 3472811
2954 3472811 3481804 3434621 3492939 3481855 3301609 3356330 3513050 3364613 3447936 3353564 3072745
2943 3072745 3159070 3211182 3166659 3148654 3113429 3180576 3059219 2909686 2910330 2979706 3136702
2932C136702m4922L389k4601j58352L4420j50144j2392l0800N1590q4131N6814
2921B777573L0756j71443j65806P2520l7335k36650J22752P2693l7831L9928j71216
2910B295941N1206j5440j22213N4425R9807q5543l5539K3833n9255p5826o5112
2899B066284M4767j7078k1738K3025P1024o5936K5833j36508j27118J9850P3966
2888A956371l83j33968o5306q1969J9289J01595N6369J5869J7670l4619k5345
2877A825573k1808p6161o761Q9043j20068M01j0232j81242j02913N7019J27088
2866A579939k9866l9329q7984k3242P9138P2537m0195k5840j78420n3760J08448
2855A361426M3816j368P9600k90708l8124J26604J3236N3204n1156j17157n7096
$$ plain form
2932 3136702 3091780 3095169 3070568 2912216 2946636 2796492 2784100 2753300 2804890 2720759 2777573
2921 2777573 2808329 2636886 2471080 2543600 2506265 2269615 2392367 2465060 2427229 2467157 2295941
2910 2295941 2347147 2331707 2209494 2263919 2363726 2278183 2242644 2266477 2207222 2131396 2066284
2899 2066284 2111051 2093973 2072235 2095260 2166284 2100348 2126181 1989673 1862555 1882405 1956371
2888 1956371 1955988 1822020 1756714 1674745 1694034 1795629 1851998 1867867 1885537 1850918 1825573
2877 1825573 1803765 1727604 1720843 1809886 1689818 1690219 1679987 1498745 1395832 1452851 1579939
2866 1579939 1550073 1510744 1422760 1399518 1478656 1551193 1510998 1485158 1306738 1252978 1361426
2855 1361426 1405242 1403874 1483474 1192766 1154642 1281246 1294482 1347686 1296530 1179373 1122277
2844A122277k4292M7003k7291l2688j9212J2455l3537j57383K4149J14197P7664
2833A103342j7995j4983j58556K5217J21203m0409O6523n344q3844q0187L9798
2822I54765O01M5132l525j13619n555l1408l7488M3301j7100j45365Q2476Q039
2810G80254P2829P1869j591n0876q6076q5424j2583K5938l2521j52763K3784l4567
2798E18273J86758o5628n0604m6614L1263J10933m5461j7686k3719M3568m3148
2787E97935N2342J13418m0547j59108j1025l2765o937J25098m5347o7307p6907
2776D48850Q5915J1491k4231J03304m8054p9196M749Q2681j34068R3898r8751
2765D46588J6288J06107M383p5360K3469R3580l2741l1497m0974j1570K6824n3274
$$ plain form
2844 1122277 1097985 1144988 1117697 1085009 1065797 1078252 1044715 887332 911481 1025678 1103342
2833 1103342 1085347 1070364 911808 937025 1058228 1017819 1084342 1078998 995154 914967 954765
2822 954765 955366 1000498 996973 883354 877799 846391 808903 852204 835104 689739 772215 780254
2810 780254 853083 924952 923361 872485 786409 700985 688402 714340 681819 529056 552840 518273
2798 518273 705031 639403 588799 542185 573448 684381 638920 621234 597515 641083 597935
2787 597935 650277 763695 723148 564040 553015 520250 513313 638411 593064 525757 448850
2776 448850 534765 546256 522025 625329 577275 498079 502828 585509 451441 545339 446588
2765 446588 462876 568983 573366 498006 521475 615055 582314 550817 509843 498273 525097 471823
2753D71823j36497j5976O3969J0478L2035P8894l5063j01194J8161K6495p070
2742D06055Q2513j61898j49333K1170J43431O1612n1317J8865j0082K5818L7856
2731D24690n0068l04M837r1415J65774k1621j17953N4195p107P257M3374j9786
2719C91873j68219j17357J17851O652l9499K972O2344l3324L3128L1058n3542
2708B33937Q7981N8486n4974j6425k18027l5830J13754j17213P3057Q0045p5885
2697A28906j9301k3508l0188j8469Q2807P9430j6742o9755n4483n3716m6665k2615
2685f4299J28575Q920O6695Q1337m9058n8087Q1539O9230k9372j23128M088L1479
2673A47919p5752o9893o044K9009J10490Q0830O0963j42595j40257J02569O9468
$$ plain form
2753 471823 335326 319350 383319 393797 425832 504726 469663 368469 386630 413125 406055
2742 406055 488568 326670 177337 198507 341938 403550 352233 371098 361016 386834 424690
2731 424690 374622 374318 379155 287740 453514 431893 313940 368135 361028 368285 411659 391873
2719 391873 223654 106297 224148 230800 191301 194273 256617 223293 256421 287479 233937
2708 233937 321918 380404 325430 309005 90978 55148 168902 51689 124746 204791 128906
2697 128906 109605 86097 55909 37440 120247 199677 182935 113180 58697 4981 -41684 -64299
2685 -64299 64276 73196 139891 221228 172170 114083 195622 264852 235480 112352 116440 147919
2673 147919 72167 2274 -3770 25239 135729 216559 277522 134927 -5330 97239 166707
2662A66707R0746M341L0832l2589R3010r9759N0242P9287j80954k4617l3275j6164
2650A27807j08694N3196J79761p7447q874j50442n5502m2495J49781N3962K4004
2639A45057m9569O2912k195q086p6333j5895l1292q4428j0935l7120r989K94084
2627A76211Q4831j32775j7164O6998o8762r2012j8962q7699N3315k1131o6146
2616a23296j0684K2159O7166l9018K9152J1705N8777m334J8399n8825j11033R6535
2604d3297P001p7604M6229J18894m977j03518L9399J13459P176J607k30156J8601
2592a07186l302K9846K6266N1912N4907r9732n2770n8720r8982Q8530J39596J23839
2580I4204J8488j75678M4533J7741J04146M9510j43824o0224o6753q3653J83112
$$ plain form
2662 166707 257453 261794 292626 260037 353047 253288 303530 382817 201863 177246 143971 127807
2650 127807 19113 72309 252070 174623 165749 15307 -40195 -82690 67091 121053 145057
2639 145057 95488 158400 156205 148119 71786 55891 24599 -59829 -70764 -107884 -117873 176211
2627 176211 261042 128267 111103 178101 109339 17327 -1635 -89334 -36019 -57150 -123296
2616 -123296 -133980 -111821 -44655 -83673 -54521 -42816 15961 11627 30026 -28799 -139832 -43297
2604 -43297 -36296 -113900 -67671 51223 46246 -57272 -17873 95586 102762 104369 -125787 -107186
2592 -107186 -110488 -80642 -54376 -2464 52443 -47289 -100059 -158779 -257761 -169231 -29635 94204
2580 94204 112692 -62986 -18453 -712 103434 152944 9120 -51104 -117857 -201510 -18398
2569a8398N9622n4045j38458m883J05584p6013N5711Q9860L9907j46632j19379
2558b07124p64l435p1054J36479K6000k6373O6218J20140q1419j92484J0168N5622
2546a68026l0764j9089M8258M6595J7858O5966j51956p5214k2252J48921k590
2535a42293J1846m1097k9048r6289J08237K18832p8539K4721j33111j14466O1253
2524b09954m2216J45043N4028N3140k2941j4153n5488j00824O9067l8145k14Q6159
2512g6498n3750R0580j9463J4990M2433o4330K4240M4007m0915q0303j10283L8153
2500a91139O5504J63624L8096n725K0714k7509N4415j90728k8114l5978N110P7581
2488e4149R8357J50154j09393m8440R3311k48317P6695J14277l5674j3500p476
$$ plain form
2569 -18398 41224 -12821 -151279 -156162 -50578 -126591 -70880 18980 58887 -87745 -207124
2558 -207124 -207888 -211323 -282377 -145898 -119898 -146271 -80053 40087 -41332 -233816 -223648 -168026
2546 -168026 -198790 -217879 -169621 -123026 -105168 -39202 -191158 -266372 -288624 -139703 -142293
2535 -142293 -130447 -171544 -200592 -296881 -188644 30188 -48351 -23630 -156741 -271207 -209954
2524 -209954 -252170 -107127 -53099 41 -22900 -37053 -92541 -193365 -124298 -162443 -162657 -76498
2512 -76498 -130248 -39668 -59131 -44141 -1708 -66038 -41798 2209 -38706 -119009 -229292 -191139
2500 -191139 -125635 37989 76085 70360 91074 63565 117980 -72748 -100862 -136840 -131730 -54149
2488 -54149 44208 194362 84969 36529 129840 -118477 -41782 72495 36821 23321 15845
2477A5845j38151q0054Q1481N6883r158M801N2886L6956Q1812n2907n2672J07093
2465A04815o4762l2542K2760R1092O2240J18844j6235p1008j39029M616p3768
2454G023J97935J47368K7392K2649m3019r8487k577j5702J57090m6494m2714J30343
2442D40807n069N3765P5561N4166K1241R2507n6139J2533J03038r2685Q1951J95012
2430I76688O0417l6416L9154O6072j3887J75486R0583M5350K44809J7225J70740
2419A836221K32409K33017L45496K98449J32001J51736O9014O3406J38695J37088
2409C637532J07711J66971K87579L47384M04358M27563N27537N94233M29011M89721
2399G419600O07613P19710R74036J284878J524283J681338J723228K329735K736515
$$ plain form
2477 15845 -122306 -202360 -120879 -63996 -73154 -68353 -15467 21489 103301 50394 -2278 104815
2465 104815 40053 7511 30271 121363 183603 302447 286212 215204 76175 80791 7023
2454 7023 204958 352326 379718 402367 359348 260861 258284 242582 399672 353178 310464 440807
2442 440807 435738 489503 565064 619230 640471 732978 676839 689372 792410 699725 781676 976688
2430 976688 1037105 1000689 1039843 1105915 1092028 1267514 1358097 1403447 1648256 1665481 1836221
2419 1836221 2068630 2301647 2647143 2945592 3077593 3229329 3298343 3361749 3500444 3637532
2409 3637532 3745243 3912214 4199793 4547177 4951535 5379098 5906635 6500868 6929879 7419600
2399 7419600 8027213 8746923 9720959 11005837 12530120 14211458 15934686 18264421 21000936
2390B1000936L876061N460380P535570N901357l621945n244104n026710n818830
2382B4062715l958900l101805k344190j779645j395947j128736p94406p35721
2374H823365l50321m62781n09051m88316n30493m58226n94764m46048m43421m20298
2364D119646k48864k42528k20910k51448j49346j52599j09593k59739q0548j15762
2354B288309o1838n2550j19422r5392j32390k23678q0612J03415j49587o1916
2344A414339J688M8312p5571j48530n4237N8320P6159k16410j18979M7969j09826
2333I23234J0218N3550j72729j9327M0581j91886j28278N9033L9918n781q3866
2322E24667j34534Q9853J7807J0414k857j53716Q0001j4433L1470n1959P4759
$$ plain form
2390 21000936 24876997 30337377 37872947 43774304 40152359 34908255 29881545 24062715
2382 24062715 20103815 17002010 14657820 12878175 11482228 10353492 9559086 8823365
2374 8823365 8473044 8010263 7501212 7012896 6482403 6024177 5429413 4983365 4539944 4119646
2364 4119646 3870782 3628254 3407344 3155896 3006550 2853951 2744358 2484619 2404071 2288309
2354 2288309 2226471 2173921 2054499 1959107 1826717 1603039 1522427 1625842 1476255 1414339
2344 1414339 1416027 1464339 1388768 1240238 1186001 1244321 1320480 1104070 985091 1033060 923234
2333 923234 933452 987002 814273 794946 835527 643641 515363 574396 614314 608533 524667
2322 524667 390133 479986 497793 508207 505350 351634 431635 417202 448672 396713 471472
2311D71472j6914J9809K8025j56846j229j47320M6718J69063o163j37953o8600
2300B00062J17039n6480m1306r3957J01524J03111j02525m4939o081J24197l0688
2289B69957q632J7124j819K9917p0477j4741M5666j21310q1254n7895j5189J76716
2277A68063j11021L602k6300o3712M2327L2270J68146j21237r5213Q753Q926o6965
2265e2361Q2460O2405j38881J63348R5629j43556n5252j07104P6716l4337K7163
2254b3770N6702m4283L8652m0452M221k83602N6644K95214l5450K4822N855p7681
2242b3128p5113r9448P2333K9812R2494L1959j51218J11152J58280j08467l2608
2231F048J5255j7077q5955J00095q5596p0539J41935j98142k9886R1361L5727
$$ plain form
2311 471472 454558 474367 502392 345546 344317 196997 243715 412778 406615 268662 200062
2300 200062 317101 260621 219315 125358 226882 329993 227468 182529 176448 300645 269957
2289 269957 261325 278449 276630 306547 236070 221329 266995 145685 64431 6536 -8653 168063
2277 168063 57042 60644 34344 -29368 12959 45229 213375 92138 -3075 5678 14604 -52361
2265 -52361 30099 92504 -46377 116971 212600 69044 13792 -93312 -16596 -50933 -23770
2254 -23770 32932 -11351 27301 -13151 -8930 -292532 -235888 59326 23876 48698 54553 -23128
2242 -23128 -98241 -197689 -125356 -95544 -3050 28909 -122309 -11157 147123 38656 6048
2231 6048 21303 4226 -81729 18366 -67230 -137769 4166 -193976 -223862 -132501 -96774
2220i6774O6392n9090q2801o0713j1808L34J47558m2358k4223k3921l6795o8434
2208b92633O1890J62646l2082j36398K3885N3678J874J6127n4411P1138J7818
2197a06468n8302O0581m0541L9441Q0419j03841L0413k5923l822O370j2427n1264
2185a85364m1734L843n4918j06090J85303N6878n9234P7828j57633j4247J30697
2174a64671l1163Q6554k1047j02038j6865J22001K0598j06563L3079J261J21342
2163e7512q1959j12057J21106K512k20678l8139J21532o6633J4299m1699P6578
2152b82650O4882K4460m0837j4941j0367j11092n8060J64747Q7432L4641N8273
2141h3512m7182r6850Q6183j060L2976Q38o6752l672j16097M8994N8706O037M1446
$$ plain form
2220 -96774 -30382 -89472 -172273 -232986 -244794 -244460 -96902 -139260 -163483 -187404 -224199 -292633
2208 -292633 -230743 -68097 -100179 -236577 -212692 -159014 -157140 -141013 -195424 -124286 -106468
2197 -106468 -164770 -104189 -144730 -105289 -24870 -128711 -98298 -124221 -128043 -121673 -134100 -185364
2185 -185364 -227098 -223255 -278173 -384263 -198960 -142082 -201316 -123488 -281121 -295368 -164671
2174 -164671 -195834 -109280 -130327 -232365 -249230 -127229 -106631 -213194 -180115 -178854 -57512
2163 -57512 -139471 -251528 -130422 -127910 -348588 -386727 -265195 -331828 -317529 -359228 -282650
2152 -282650 -217768 -193308 -234145 -249086 -259453 -370545 -428605 -263858 -176426 -141785 -83512
2141 -83512 -130694 -227544 -141361 -142421 -109445 -108607 -175359 -179031 -295128 -246134 -187428 -181391 -139945
2128a39945l881p9414L2536J18495P717j74811J16066J26642L4980o2824j4072
2117c8511O8164n3744j47299n6145J08120n328L8902J11363j2137q6579m8351
2106a21545K502m0206q4377J4273N7123J17272j67710p9289J75684J2819j22064
2095b35518K0780Q3780j44269n9100O8565J18819N4573o8219j1585m3043J00789
2084a14428j32216N8760O1968m5947K1567m1036K5204J52743l4721l8993o4330
2073a51429m8334J8834O7391r6494P8772j08688M7557R4294m3227j08421q9959
2062c39704K15844j58521m422J01037M4105j03594J2034J75355R8403j91660r262
2051a60385p5236L5494l473J5806k4790l936P1980M0307j70470l0569K11496J7550
$$ plain form
2128 -139945 -143826 -223240 -190704 -72209 -64492 -239303 -123237 3405 38385 -24439 -38511
2117 -38511 29653 -24091 -171390 -227535 -119415 -124743 -85841 25522 13385 -73194 -121545
2106 -121545 -119043 -159249 -243626 -229353 -172230 -54958 -222668 -301957 -126273 -113454 -235518
2095 -235518 -214738 -130958 -275227 -334327 -265762 -146943 -92370 -160589 -172174 -215217 -114428
2084 -114428 -246644 -187884 -125916 -171863 -150296 -191332 -166128 -13385 -48106 -87099 -151429
2073 -151429 -199763 -180929 -113538 -210032 -131260 -239948 -192391 -98097 -141324 -249745 -339704
2062 -339704 -123860 -282381 -286803 -185766 -141661 -245255 -233221 -57866 40537 -151123 -160385
2051 -160385 -235621 -200127 -203600 -187794 -212584 -216520 -144540 -104233 -274703 -305272 -93776 -76226
2039g6226m9450J7258l1984j32018L1473J95491l7916l5130K420o9272J09811
2028g5543q6478q1043O6692j87198J4195p235N7262K9017N2642r7479J21891O0459
2016a32818k7682j925j52490J0343j08738J6939O7281n161N3376M0306n8282p3891
2004c72742J29964P9529J8501j88629Q5009l5247J30528p9711q338M0603m3571
1993b44104J36344j23757k1659m6531J54313j7167K5413N5726m4647r6689k7509
1982b50267O6909j1051j63490N9746O9985n3005j6965O8694O9769j3262j76229
1971c49166Q3424m629Q6557r5921R9599J1226R0903J28813k83725n5462k5417
1960c13798j8066M5957M2583j02054M7030P9831j53986K2259J5633J29614M4277
$$ plain form
2039 -76226 -125676 -108418 -140402 -272420 -240947 -45456 -83372 -118502 -116082 -185354 -75543
2028 -75543 -162021 -243064 -176372 -363570 -349375 -356610 -299348 -270331 -217689 -315168 -193277 -132818
2016 -132818 -160500 -162425 -314915 -304572 -413310 -396371 -329090 -334251 -280875 -240569 -298851 -372742
2004 -372742 -242778 -163249 -144748 -333377 -248368 -283615 -153087 -232798 -241136 -200533 -244104
1993 -244104 -107760 -231517 -253176 -299707 -145394 -162561 -137148 -81422 -126069 -222758 -250267
1982 -250267 -183358 -194409 -357899 -298153 -228168 -281173 -298138 -229444 -159675 -172937 -349166
1971 -349166 -265742 -270371 -183814 -279735 -180136 -168910 -78007 50806 -232919 -288381 -313798
1960 -313798 -331864 -285907 -243324 -345378 -298348 -218517 -372503 -350244 -334611 -204997 -160720
1949a60720m21K1419J959j5495o5451J12081L1352j79959L2072M8969K6400k7881
1937a75675j40978K00836j1363j40989M2444j9812n0873L0800J37865o9346m1591
1926b38682P7431r8615J21451j2862k49083N4J05133N9192P446O7919L83q0364
1914b40597K13156J11319j44351r3241j19894L4436k717n6550Q9313M3238q7073
1903b52961K8195o870m5956j75116L7101J08924O4569J04122j4221r8513l2938
1892b83664K4526m3086K6620P9479q108N5385K2463J7689q8619o4891K6320j9124
1880b55010o7021J0531m5848L9212J35675l2100J9756l8415m3213l850k3043k914
1868c06240J21253j6371J4489R8749m5364j70408M0243M1155J24400L0703j94950
$$ plain form
1949 -160720 -161141 -139722 -137763 -153258 -218709 -106628 -75276 -255235 -223163 -174194 -147794 -175675
1937 -175675 -316653 -115817 -127180 -268169 -225725 -245537 -296410 -265610 -127745 -197091 -238682
1926 -238682 -161251 -259866 -138415 -151277 -400360 -400306 -295173 -235981 -228535 -160616 -160233 -240597
1914 -240597 -27441 83878 -60473 -153714 -273608 -239172 -241889 -298439 -209126 -165888 -252961
1903 -252961 -224766 -231636 -277592 -452708 -415607 -306683 -242114 -137992 -152213 -250726 -283664
1892 -283664 -259138 -302224 -275604 -196125 -204233 -148848 -126385 -108696 -197315 -262206 -235886 -255010
1880 -255010 -322031 -311500 -357348 -318136 -182461 -214561 -194805 -233220 -276433 -280283 -303326 -306240
1868 -306240 -184987 -201358 -186869 -88120 -133484 -303892 -263649 -222494 -98094 -67391 -262341
1857b62341k0944R0065j15328n0347J53713J73226j62509j1499P7611q1832r04
1846b11089R33L5975Q6370l2849m7486q9024q2872J31479j5563o4387J31377l5788
1834a92924l7393R7729J78815m5148j29277j26768n6498J17188j2695j03500O266
1823c04205P8964J18329O7531j25876O009O2545p7872P5686n7167m2384p9283
1812b77723N4220k0518L1949k0322O3658O1947Q2238l2358j24167q214J44106
1801d5184K4221j02190L0906o4464M1179j2329j29288j4038J58231M7589j18310
1790a83677p3112P9171j1150Q5079m0454J1457j76928L390J42543n643j19707
1779b89031O8283O4094J5419Q077j23604P5601r707J3416k4375J3356M8199o4175
$$ plain form
1857 -262341 -283285 -193220 -308548 -358895 -205182 -31956 -194465 -205964 -128353 -210185 -211089
1846 -211089 -210156 -174181 -87811 -120660 -168146 -257170 -340042 -208563 -224126 -288513 -157136 -192924
1834 -192924 -230317 -132588 46227 1079 -128198 -254966 -311464 -194276 -206971 -310471 -304205
1823 -304205 -225241 -106912 -39381 -165257 -159248 -96703 -174575 -98889 -156056 -198440 -277723
1812 -277723 -223503 -244021 -212072 -232394 -168736 -106789 -24551 -56909 -181076 -189290 -45184
1801 -45184 -20963 -123153 -92247 -156711 -115532 -127861 -257149 -271187 -112956 -65367 -183677
1790 -183677 -256789 -177618 -188768 -103689 -144143 -132686 -309614 -306224 -163681 -169324 -289031
1779 -289031 -220748 -156654 -141235 -133158 -256762 -181161 -190868 -177452 -201827 -188471 -140272 -204447
1767b04447J20548J1565n8716k0249O580L6107q160j00161n853J7117p5413K0846
1755b60236R7066N4728l3893M3030L2531m4751l3816R6665J7017j92982j39163
1744c63804M8734J36175M9242L45J09113j5186n8134J8960R1258n4537j64183
$$ plain form
1767 -204447 -83899 -72334 -131050 -151299 -144719 -108612 -116772 -216933 -222786 -205669 -281082 -260236
1755 -260236 -163170 -108442 -142335 -99305 -66774 -111525 -145341 -48676 -31659 -224641 -363804
1744 -363804 -315070 -178895 -129653 -129308 -20195 -35381 -93515 -74555 16703 -37834 -202017
$$ [...]
##END NTUPLES=NMR SPECTRUM
##END=
