##TITLE=1H_DE-80H_X3
 200.13MHz, d2o
 8 sc
 
 19ns.26.2.2025
##JCAMPDX= 6.0         $$ Bruker NMR JCAMP-DX V2.0
##DATA TYPE= NMR SPECTRUM
##DATA CLASS= NTUPLES
##ORIGIN= UXNMR, Bruker Analytische Messtechnik GmbH
##OWNER= pz
$$ XWIN-NMR		Version 3.5
$$ Fri Jun 20 14:44:18 2025 Russian Standard Time (UT+4h)  Yarkov@DPX200
##.OBSERVE FREQUENCY= 200.1313
##.OBSERVE NUCLEUS= ^1H
##.ACQUISITION MODE= SIMULTANEOUS
##.ACQUISITION SCHEME= undefined
##.AVERAGES= 8
##.DIGITISER RES= 18
##SPECTROMETER/DATA SYSTEM= spect
##.PULSE SEQUENCE= zg30
##.SOLVENT NAME= CDCl3
##.SHIFT REFERENCE= (INTERNAL, CDCl3, 0, 15.4891)
##AUDIT TRAIL= $$ (NUMBER, WHEN, WHO, WHERE, WHAT)
$$ ##TITLE= Audit trail, XWIN-NMR		Version 3.5
$$ ##JCAMPDX= 5.01
$$ ##ORIGIN= Bruker BioSpin GmbH
$$ ##OWNER= Yarkov
$$ C:/Bruker/XWIN-NMR/data/yarkov2/nmr/H-C/1/pdata/1/auditp.txt
$$ ##AUDIT TRAIL=  $$ (NUMBER, WHEN, WHO, WHERE, WHAT)
(   1,<2025-06-20 14:43:34.85 +0400>,<Yarkov>,<DPX200>,
      <created by zg, POWCHK disabled, PULCHK disabled
       configuration hash MD5:
       00 E9 B6 7A A2 85 ED C7 34 08 36 98 17 FE 4E 26
       data hash MD5: 16K
       17 5C 38 C5 6A F6 C3 F4 6D 01 20 EE 0F CC 70 5F>)
(   2,<2025-06-20 14:43:38.75 +0400>,<Yarkov>,<DPX200>,
      <Start of raw data processing
       efp BC_mod = 2 LB = 0.25 FT_mod = 6 PKNL = 1 PHC0 = -1717.772 PHC1 = 14.16658 SI = 16K 
       data hash MD5: 16K
       FD EC 93 B6 6B 8F 92 0D 43 51 5D C1 E8 4A 89 8B>)
(   3,<2025-06-20 14:43:43.48 +0400>,<Yarkov>,<DPX200>,
      <abs ABSG = 5 
       data hash MD5: 16K
       77 09 DA B2 AC 13 19 36 97 06 48 8A FD CE 7B 85>)
$$ ##END=
$$ 
$$ hash MD5
$$ F5 98 55 7F 97 FA F8 56 02 2C CD 9C 8B EC 6F BA
##$RELAX= 
##$RELAX= 
##$RELAX= 
##$RELAX= 
##$RELAX= 
##$RELAX= 
$$ Bruker specific parameters
$$ --------------------------
##$DU= <C:/Bruker/XWIN-NMR>
##$EXPNO= 1
##$NAME= <H-C>
##$PROCNO= 1
##$TYPE= <nmr>
##$USER= <yarkov2>
##$AMP= (0..31)
100 100 100 100 100 100 100 100 100 100 100 100 100 100 100 100 100 100 
100 100 100 100 100 100 100 100 100 100 100 100 100 100 
##$AQSEQ= 0
##$AQ_mod= 1
##$AUNM= <au_zg>
##$AUTOPOS= <>
##$BF1= 200.13
##$BF2= 200.13
##$BF3= 200.13
##$BF4= 200.13
##$BF5= 200.13
##$BF6= 200.13
##$BF7= 200.13
##$BF8= 200.13
##$BYTORDA= 1
##$CFDGTYP= 0
##$CFRGTYP= 5
##$CHEMSTR= <none>
##$CNST= (0..31)
1 1 145 1 1 1 1 1 1 1 1 1 1 1 1 1 1 1 1 1 1 1 1 1 1 1 1 1 1 1 1 1 
##$CPDPRG= <>
##$CPDPRG1= <>
##$CPDPRG2= <>
##$CPDPRG3= <>
##$CPDPRG4= <mlev>
##$CPDPRG5= <mlev>
##$CPDPRG6= <mlev>
##$CPDPRG7= <mlev>
##$CPDPRG8= <mlev>
##$CPDPRGB= <>
##$CPDPRGT= <>
##$D= (0..31)
0 0.7 0 0 0 0 0 0 0 0 0 0.03 0 0 0 0 0 0 0 0 0 0 0 0 0 0 0 0 0 0 0 0 
##$DATE= 1750416214
##$DBL= (0..7)
120 120 120 120 120 120 120 120 
##$DBP= (0..7)
150 150 150 150 150 150 150 150 
##$DBP07= 0
##$DBPNAM0= <>
##$DBPNAM1= <>
##$DBPNAM2= <>
##$DBPNAM3= <>
##$DBPNAM4= <>
##$DBPNAM5= <>
##$DBPNAM6= <>
##$DBPNAM7= <>
##$DBPOAL= (0..7)
0.5 0.5 0.5 0.5 0.5 0.5 0.5 0.5 
##$DBPOFFS= (0..7)
0 0 0 0 0 0 0 0 
##$DE= 6
$$ [...]
##$SUBNAM3= <"">
##$SUBNAM4= <"">
##$SUBNAM5= <"">
##$SUBNAM6= <"">
##$SUBNAM7= <"">
##$SUBNAM8= <"">
##$SUBNAM9= <"">
##$SW= 18.0517328524113
##$SWIBOX= (0..15)
0 0 2 0 0 0 0 0 0 0 0 0 0 0 0 0 
##$SW_h= 3612.71676300578
##$TD= 16384
##$TD0= 1
##$TE= 0
##$TE2= 300
##$TE3= 300
##$TEG= 300
##$TL= (0..7)
0 120 120 120 120 120 120 120 
##$TP= (0..7)
150 150 150 150 150 150 150 150 
##$TP07= 0
##$TPNAME0= <>
##$TPNAME1= <>
##$TPNAME2= <>
##$TPNAME3= <>
##$TPNAME4= <>
##$TPNAME5= <>
##$TPNAME6= <>
##$TPNAME7= <>
##$TPOAL= (0..7)
0.5 0.5 0.5 0.5 0.5 0.5 0.5 0.5 
##$TPOFFS= (0..7)
0 0 0 0 0 0 0 0 
##$TUNHIN= 0
##$TUNHOUT= 0
##$TUNXOUT= 0
##$USERA1= <user>
##$USERA2= <user>
##$USERA3= <user>
##$USERA4= <user>
##$USERA5= <user>
##$V9= 5
##$VALIST= <valist>
##$VCLIST= <CCCCCCCCCCCCCCC>
##$VD= 0
##$VDLIST= <DDDDDDDDDDDDDDD>
##$VPLIST= <PPPPPPPPPPPPPPP>
##$VTLIST= <TTTTTTTTTTTTTTT>
##$WBST= 1024
##$WBSW= 4
##$XGAIN= (0..3)
0 0 0 0 
##$XL= 0
##$YL= 0
##$YMAX_a= 82819
##$YMIN_a= -47629
##$ZGOPTNS= <>
##$ZL1= 120
##$ZL2= 120
##$ZL3= 120
##$ZL4= 120
##$ABSF1= 15.51771
##$ABSF2= -2.53414
##$ABSG= 5
##$ABSL= 3
##$ALPHA= 0
##$AQORDER= 0
##$ASSFAC= 0
##$ASSFACI= 0
##$ASSFACX= 0
##$ASSWID= 0
##$AUNMP= <proc_1d>
##$AZFE= 0.1
##$AZFW= 0.1
##$BCFW= 0
##$BC_mod= 2
##$BYTORDP= 0
##$COROFFS= 0
##$CY= -3
##$DATMOD= 1
##$DC= 0
##$DFILT= <>
##$DTYPP= 0
##$F1P= 0
##$F2P= 0
##$FCOR= 1
##$FTSIZE= 16384
##$FT_mod= 6
##$GAMMA= 0
##$GB= 0
##$INTBC= 1
##$INTSCL= 3.241238e-09
##$ISEN= 128
##$LB= 0.25
##$LEV0= 0
##$LPBIN= 0
##$MAXI= 10000
##$MC2= 0
##$MEAN= 0
##$ME_mod= 0
##$MI= 1.114404
##$NCOEF= 0
##$NC_proc= -8
##$NLEV= 6
##$NOISF1= 3.799351
##$NOISF2= 2.8
##$NSP= 0
##$NTH_PI= 0
##$NZP= 0
##$OFFSET= 15.48907
##$PC= 1
##$PHC0= -1717.772
##$PHC1= 14.16658
##$PH_mod= 1
##$PKNL= yes
##$PPARMOD= 0
##$PSCAL= 0
##$PSIGN= 0
##$REVERSE= no
##$SF= 200.130006530122
##$SI= 16384
##$SIGF1= 3
##$SIGF2= 2
##$SINO= 0.751879
##$SIOLD= 32768
##$SREGLST= <19F.Aceton>
##$SSB= 0
##$STSI= 16384
##$STSR= 0
##$SW_p= 3612.71676300578
##$SYMM= 0
##$S_DEV= 0
##$TDeff= 16384
##$TDoff= 0
##$TI= <>
##$TILT= no
##$TM1= 0
##$TM2= 0
##$TOPLEV= 0
##$USERP1= <user>
##$USERP2= <user>
##$USERP3= <user>
##$USERP4= <user>
##$USERP5= <user>
##$WDW= 1
##$XDIM= 16384
##$YMAX_p= 454078952
##$YMIN_p= -499044
$$ End of Bruker specific parameters
$$ ---------------------------------
##NTUPLES= NMR SPECTRUM
##VAR_NAME=  FREQUENCY,     SPECTRUM/REAL,   SPECTRUM/IMAG
##SYMBOL=    X,             R,               I
##VAR_TYPE=  INDEPENDENT,   DEPENDENT,       DEPENDENT
##VAR_FORM=  AFFN,          ASDF,            ASDF
##VAR_DIM=   16384,         16384,           16384
##UNITS=     HZ,            ARBITRARY UNITS, ARBITRARY UNITS
##FACTOR=    0.220516191357247, 1,           1
##FIRST=     3099.82766796948, 0,            0
##LAST=      -512.889095036305, 0,           0
##MIN=       -512.889095036305, -499044,     0
##MAX=       3099.82766796948, 454078952,    0
$$ Real data points
##PAGE= N=1
##DATA TABLE= (X++(R..R)), XYDATA
$$ [...]
8097B04718j1326J83503p3527j529j42285O0935r4388o0972m4418M4636J12899
8086A78246k2175q1310J73888P5058j66813j3560m0151k9905M1992j2602R0820
8075A93488J20389P588l5426j45000Q0431R608j2114m6849J16082j54287L6119
8064A70029j11146L0950J70303L4490k4953N8866j05184j63789o6381N7811o1569
8053a0573q879l5984R5257J96633n9495N854j83230j8040J050o3551J24878J61562
8041B05482l4590k1355n6218L9159M6953J58586p9215j83655k7463m4995J04645
8030A07334L0231n6673O8462o841l6599m9781N3406K1785N8389j5341l4212P3227
8018B13387j9714L864o361R6509o5987m5827j21683k4515k3761N2001r380J07130
$$ plain form
8097 204718 193392 376895 303368 301839 159554 220489 126101 65129 20711 65347 178246
8086 178246 156071 74761 248649 323707 156894 143334 103183 73278 115270 102668 193488
8075 193488 313877 321465 286039 141039 221470 231078 218964 172115 288197 133910 170029
8064 170029 58883 89833 260136 294626 269673 328539 223355 59566 -6815 50996 -10573
8053 -10573 -19452 -55436 39821 236454 176959 182813 -417 -18457 -17407 -80958 43920 205482
8041 205482 170892 149537 93319 132478 179431 338017 258802 75147 47684 2689 107334
8030 107334 137565 80892 149354 142513 105914 56133 109539 131324 189713 174372 140160 213387
8018 213387 193673 197537 191176 287685 221698 175871 54188 29673 5912 57913 48533 155663
8006A55663q329j23440J2835Q3930R9390n452j72631O6861Q0460n2530k4041j29385
7994a6669o5929o8848N7234Q4747J70602R8222j2899o2605j0479J9834J1428K7917
7982B32555J532j66103Q5546K05144n2292j88951J6264O9024L6914J0281J7711
7971B67625j55758R1226O46j47487m7603K7236M4878k0683O3313l7589M4278P7122
7959B07204j7430R5091o7283Q79N131j01467J26135m0884P6841P867M4708n408
7947C31384N4235q4734n7548n5852J9851L2782j5465m437j8380M12P0565l1285
7935B41528p2792k9841K1714J02802j28325j07788j02123J56492n1809K638N1187
7924H3683R1327j3488j00814K2606J51596L1696j68032r252J443k8844N1607N9445
$$ plain form
8006 155663 147334 23894 36729 120659 220049 214597 41966 108827 189287 136757 112716 -16669
7994 -16669 -82598 -151446 -94212 -9465 161137 259359 246460 183855 173376 193210 204638 232555
7982 232555 234087 67984 153530 358674 306382 117431 133695 202719 239633 249914 267625
7971 267625 111867 203093 203739 56252 8649 35885 80763 60080 123393 85804 130082 207204
7959 207204 189774 284865 217582 218461 223592 122125 248260 207376 284217 292084 336792 331384
7947 331384 385619 300885 243337 187485 207336 240118 224653 220216 201836 202248 272813 241528
7935 241528 168736 138895 160609 263411 135086 27298 -74825 81667 29858 32496 83683
7924 83683 175010 161522 60708 83314 234910 266606 98574 89322 90765 61921 113528 172973
7912A72973P6970l9929l5128P9645j17723O4890J30027M8597k0220j5595k6390
7901C18117q6448p5678n6028m5278K0417K4662j3717O2125j05791n2908j6704
7890b7231J2085L7930N3969M7818J21405k8181j99783J88933j5956q7674J17749
7879B21064Q2855m6058k8465q0093N5280L0194q9247J5717j62499L2376k0406
7868A0718J10373k1405p280j73591R869J27625K5914J67228j49605q3190q1530
7857f4874O9777J08682J12990n9515k237n257k8309r817j16532J11393K4796j03711
7845C7386J630p5458N4149k5014J20519P360j39548j184O4841J40613k0422P1249
7833B36121j00171J15621j49283p4937l3164N207N7162M4852j19203K8191q6149
$$ plain form
7912 172973 249943 210014 174886 254531 136808 201698 331725 380322 360102 344507 318117
7901 318117 231669 155991 99963 54685 75102 99764 86047 148172 42381 -10527 -27231
7890 -27231 -15146 22784 76753 124571 245976 217795 18012 206945 190989 103315 221064
7879 221064 303919 257861 229396 149303 204583 234777 145530 161247 -1252 31124 10718
7868 10718 121091 99686 92406 -81185 -71316 56309 82223 249451 99846 16656 -64874
7857 -64874 4903 113585 226575 167060 164823 159566 131257 121440 4908 116301 141097 37386
7845 37386 39016 -36442 17707 -7307 113212 120572 -18976 -20160 44681 185294 164872 236121
7833 236121 135950 251571 102288 27351 -5813 -606 56556 101408 -17795 10396 -75753
7822g5753n9790J0530J73300j30818j72433m804K79936L4173j84728r7150L3912
7811a93625N7215J61778j99703m4421k80288P18224J515145p25589k39888k42085
7801E26763j21638L1364N551j65774K3470j1967L6551n0088K17498m9825q0195
7790C61710o2435L2806j29806L2988N1772J02446j44725m584J11175j72573l3920
7779A44854K0435N5479N5275K6533m8374j20946L3561N2783j04030J42873O737
7768B65180o998K6732N599r8239k7424J89524n9089p9294R135p8580k6236J15655
7756B35965L6881k4485N9493Q1170M0919j82761K1914P5527j01216K13473J4545
7745D71425j09776Q9738L3179o4273r6459K19194K7291j27387m7721K54227n0435
$$ plain form
7822 -75753 -135543 -125013 48287 -82531 -254964 -259768 20168 54341 -130387 -227537 -193625
7811 -193625 -136410 25368 -174335 -218756 -499044 219180 1734325 1008736 768848 526763
7801 526763 405125 436489 442040 276266 299736 287769 324320 274232 491730 441905 361710
7790 361710 299275 332081 202275 235263 287035 389481 244756 240172 351347 178774 144854
7779 144854 165289 220768 276043 302576 254202 133256 166817 219600 115570 258443 265180
7768 265180 258182 284914 290513 192274 164850 354374 295285 215991 225126 146546 120310 235965
7756 235965 272846 248361 307854 389024 429943 247182 269096 344623 243407 456880 471425
7745 471425 361649 451387 484566 420293 323834 543028 570319 442932 395211 649438 599003
7734E99003k479J1835Q4389Q932l6523P385J09842J832l4218j27933K28653o0364
7722G90354M443Q8237m6421l4717J912j15985r6098j50961l9158J13414O851r8977
7710D22894O3397Q3869l1366J76131j82164o8260l1665r1746Q0911L9667M5298
7699E06966J2657k1446j21862j03419K2511J18383n1085O5652j7843p7469R7401
7688D30446J02125j463j58052k8143J81951K0131m8951m5013o0975j13812M2506
7677C20750N4222k4248J516j3962j09089N2450l3185J14388L3979L5900M5082
7666D77803j7108J7792M4928N321K2986O1569q8733K693Q574J62395K3297l4121
7654F87396p849Q2764J42494O4217k26557O6353J2373q483j11034L0667L2298
$$ plain form
7734 599003 596524 608359 692748 701680 665157 672542 782384 784216 749998 622065 850718 790354
7722 790354 794797 883034 836613 801896 803808 687823 591725 440764 401606 515020 521871 422894
7710 422894 486291 570160 538794 714925 532761 464501 432836 341090 422001 461668 506966
7699 506966 519623 498177 376315 272896 295407 413790 362705 428357 410514 333045 430446
7688 430446 532571 531108 373056 344913 526864 546995 498044 453031 392056 278244 320750
7677 320750 374972 350724 352240 338278 229189 281639 248454 362842 396821 432721 477803
7666 477803 460695 478487 523415 528736 551722 613291 524558 527251 535825 698220 721517 687396
7654 687396 679547 762311 904805 969022 742465 808818 821191 812708 701674 732341 764639
7643G64639P9628q8355K7387m1266L8946o8150p1311j47154J9611J7783R3363
7632F25121k6151j44526P4091j37640q6648R8502l1298L2875K28023m4652R945
7621E97642j48648j17419j47145J18337J09751p3162M2193r4948J1272J1090K3121
7610C32084N8665m9662R711O1691j53614m7924k5853k4566l7981J13741L4454
7599B70746j26558J16961n5985j8691M1239J1161K7292j52497Q1213J5625N4556
7588B65062J9260L5187J13315J00926j19659j30615n0994j7120L0159L3111N5573
7577C34205Q3042j527j40643k8120J50451n0461j75174J21019M1531P7029j23417
7566B87935O3965N6824o2283M8590m9997L3233j00323r9035J60774J06096j52172
$$ plain form
7643 764639 844267 755912 783299 742033 780979 712829 641518 494364 513975 531758 625121
7632 625121 598970 454444 528535 390895 304247 402749 371451 404326 632349 587697 597642
7621 597642 448994 331575 184430 302767 412518 339356 381549 286601 297873 308963 332084
7610 332084 390749 341087 350798 412489 258875 210951 185098 160532 122551 236292 270746
7599 270746 144188 261149 205164 186473 227712 238873 266165 113668 194881 210506 265062
7588 265062 284322 319509 432824 533750 414091 283476 232482 215362 245521 278632 334205
7577 334205 417247 415720 275077 246957 397408 346947 171773 292792 334323 411352 287935
7566 287935 351900 408724 346441 395031 345034 378267 277944 178909 339683 445779 293607
7555B93607M7677J37962o2595R4992j04902o4959J6286L3240J9632J44988J5197
7544E71125j59018R4477Q7856j62626j19270Q0685J28797J3076n9261m3422n1257
7533C81162L661K5089k6097P7427j648k1339l5755l9692k8552K5675L0448R7831
7521D88210j14103j00634N0874J42883P1862R2406r448o3890N7858l4396r9606
7510D82016L1256J9578K2444j1033K0342q8428m3559L5651J4579N5089J15981
7499F53916J4802l9807K0345j11775Q7246o1817O8440l6298P4363m1489j56318
7488D71608K2579J04844L9443o0527k2497j25085j7674M6886O7072m267P4926
7477E97308l2778M7314J94540M7479k5117r5028M118O5244L2061j88352o6040
$$ plain form
7555 293607 341284 479246 416651 511643 406741 341782 358068 391308 410940 555928 571125
7544 571125 412107 506584 594440 431814 312544 393229 522026 535102 475841 432419 381162
7533 381162 384823 409912 383815 461242 459594 438255 402500 362808 334256 359931 390379 488210
7521 488210 374107 273473 324347 467230 539092 631498 622050 558160 616018 581622 482016
7510 482016 513272 532850 555294 544261 564603 476175 432616 468267 482846 537935 653916
7499 653916 668718 628911 649256 537481 624727 562910 631350 595052 669415 627926 471608
7488 471608 494187 599031 638474 577947 555450 430365 412691 459577 526649 522382 597308
7477 597308 564530 611844 806384 853863 828746 733718 737836 803080 835141 646789 580749
7466E80749N1863o848l9203K54780R4374j23482l1154M9645K14610j50859j13535
7455G80940Q8567N0388l510j5343J0836j6050M572j7907Q0606R2606j53646k2545
7443H79514o4887P1875R9107N5183P6491P3566J1241M5288j9496O2898N9199J16491
7431A466470j5697j49977J8731J16928J04303n9720p5612Q3606Q9932l654J28130
7420A703440j157L6979q1341Q9219J53335j18363j81895J24111n4753O1385N9170
7409A790130n6614J98283o1149m9912K48917Q2123o3885J78912k8855o7908P2707
7398B242749q2685J3709j7442j75401J53742M2364j43063m8708M3623o5789l8917
7387A924182l250p7914J66460M9576m7574M6011M9136q8499P5450n4328o6676
$$ plain form
7466 580749 632612 625764 586561 841341 935715 812233 781079 830724 1045334 894475 780940
7455 780940 869507 919895 916385 901042 911878 895828 900400 882493 963099 1055705 902059 879514
7443 879514 814627 886502 985609 1040792 1117283 1190849 1202090 1247378 1227882 1290780 1349979 1466470
7431 1466470 1450773 1300796 1319527 1436455 1540758 1481038 1405426 1489032 1578964 1575310 1703440
7420 1703440 1702283 1739262 1657921 1747140 1900475 1782112 1600217 1724328 1669575 1730960 1790130
7409 1790130 1733516 1931799 1870650 1820738 2069655 2151778 2087893 2266805 2237950 2170042 2242749
7398 2242749 2160064 2173773 2156331 1980930 2134672 2177036 2033973 1985265 2028888 1963099 1924182
7387 1924182 1920932 1843018 2009478 2059054 2011480 2057491 2106627 2018128 2093578 2039250 1972574
7376A972574O2334P3032l9251j24939j79269M1376J35576l000O0439L7979j06263
7365A930588J10194N0663q2439j73859M2276N957N914J16044P0560K3093J18874
7354B217865l4795p5163O7478n4201k0532L5271j00680J66420R2594j09724O7941
7343B252474J37118j1252n6637k6339m4275q4539O055K5632r4253n9345l2454
7332B012185j00903j42586K0415J0401k0873n306J2596P1360L1443q1762R807
7321A816777p8820O1720M6037O2642N0419J37005L0969J0915N0127R0882m1083
7310B237590q0768k9484O9464j7054j2183m8331k9932n6027J86910J5569j70325
7299B065429K475L847r5002o4680P7924l3498j4246J1915q214L8847j10572Q2386
$$ plain form
7376 1972574 2034908 2107940 2068689 1943750 1764481 1805857 1941433 1938433 1998872 2036851 1930588
7365 1930588 2040782 2091445 2009006 1835147 1877423 1883380 1889294 2005338 2075898 2098991 2217865
7354 2217865 2183070 2107907 2175385 2121184 2100652 2135923 2035243 2201663 2294257 2184533 2252474
7343 2252474 2389592 2378340 2321703 2295364 2251089 2166550 2172605 2198237 2103984 2044639 2012185
7332 2012185 1911282 1768696 1789111 1799512 1778639 1773333 1785929 1857289 1888732 1806970 1816777
7321 1816777 1737957 1799677 1845714 1908356 1958775 2095780 2126749 2137664 2187791 2278673 2237590
7310 2237590 2156822 2127338 2196802 2179748 2167565 2119234 2089302 2033275 2220185 2235754 2065429
7299 2065429 2067904 2071751 1976749 1912069 1989993 1956495 1942249 1954164 1945950 1984797 1874225 1956611
7287A956611J61783k49922k058Q1359j61922k1310q8124M4993J33547M765o6690
7276A793032J18845L122n3852O0649L4262j22499k7818J59981p3196p8931K0354
7265A833949n2713m18j09093O6780J8815m1613J19257P3899m9353l5896o1675
7254A761939q4558N8080p8966j22822r0388J19087P4333r7716j54862k470J18870
7243A500527m7709K0695p8405j37799J8705J29037P5L3815R1085L2406N2693o5667
7231A549458p6961Q9135r437r3816j32454o8771J5034l8314q0264j5373M3762
7220A181999n1024L030l0238k3343l5947R8139j63181j224P3010J8524j23177
7209I46568J50715o0328p3767K9008N9511O008r3492J13924J10127r6008j06735
$$ plain form
7287 1956611 2118394 1868472 1866414 1947773 1785851 1764541 1676417 1721410 1854957 1859722 1793032
7276 1793032 1911877 1914999 1861147 1921796 1956058 1833559 1805741 1965722 1892526 1813595 1833949
7265 1833949 1781236 1780818 1671725 1738505 1757320 1715707 1834964 1908863 1859510 1823614 1761939
7254 1761939 1677381 1735461 1656495 1533673 1443285 1562372 1636705 1538989 1384127 1381657 1500527
7243 1500527 1452818 1473513 1395108 1257309 1276014 1405051 1405126 1438941 1530026 1562432 1615125 1549458
7231 1549458 1472497 1561632 1552195 1458379 1325925 1257154 1272188 1233874 1153610 1138237 1181999
7220 1181999 1130975 1134005 1103767 1080424 1044477 1142616 979435 978211 1051221 1069745 946568
7209 946568 1097283 1036955 963188 992196 1051707 1057715 964223 1078147 1188274 1092266 985531
7198I85531L564N495o0723J0719j12046R3993N53N6126J1157q3537J14162J05683
7186A130677o1885j08148O6888K8935k359n3140J121j56392R9692N8341J5080
7175A018810o2485p7018K6888L0192j56244J39317P206n0585j5839j32835Q2023
7164H09430J15077l6963p6941O8034N9227N967l3050J03698j19741M681P8650
7153I78069q0960j47272N388R977K11235K7694k11380j33491J02985J13883K6872
7142I03000J29647K2352L5204j9000L0233r4710l4079K2009p6763p9019P5031
7131I13905q0407m010N1388m3758K9003L5307j60852o5665J13380P1718K4146
7120H84155J25039j67233j43184P734J17080J27939o3179K2308p4069O7217m4825
$$ plain form
7198 985531 989095 994590 933867 944586 832540 926533 927086 983212 994369 910832 1024994 1130677
7186 1130677 1068792 960644 1027532 1056467 1054108 1000968 1002089 845697 945389 1003730 1018810
7175 1018810 956325 879307 906195 936387 780143 919460 926666 876081 860242 727407 809430
7164 809430 924507 887544 810603 878637 937864 943831 910781 1014479 894738 899419 978069
7153 978069 897109 749837 755225 765202 976437 1004131 792751 659260 762245 876128 903000
7142 903000 1032647 1054999 1090203 1071203 1101436 1006726 972647 994656 917893 838874 913905
7131 913905 833498 829488 880876 837118 866121 901428 740576 674911 788291 860009 884155
7120 884155 1009194 841961 698777 706511 823591 951530 888351 910659 836590 903807 858982
7109H58982R8946N7583k5647K1664R123P8969K7567R879J952j31677J23634M9161
7097A180136l301k0559l6774k02234j8159O2270P654J25205Q4800o949j63835
7086A008254J4490o4323o8042j54327Q3862O8542p7436m717J3489k4725J29516
7075I24583m1675j13013j1909J20598K5174J30440j29926k8525l9978k3603N1957
7064H64123J43399q159j26299n0162J09610j2242p4455k8481J46198J36233j51314
7053I48451j7075J44213M131L4270o6801k5954L7097n2839M7365m9164l2575m9816
7041I21303k8275O798M8057n1772j6885q5182k594m6315M5871J30620P1694k29152
7029G64168j18393J37129M3805j33429R4006N1970m8886j8726m9229J21055L7366
$$ plain form
7109 858982 957928 1015511 989864 1011528 1020651 1099620 1127187 1137066 1139018 1007341 1130975 1180136
7097 1180136 1176835 1156276 1119502 917268 899109 961379 969033 1094238 1179038 1172089 1008254
7086 1008254 1022744 958421 890379 736052 819914 888456 811020 806303 819792 795067 924583
7075 924583 882908 769895 757986 878584 903758 1034198 904272 875747 835769 812166 864123
7064 864123 1007522 999363 873064 822902 932512 920270 845815 817334 963532 1099765 948451
7053 948451 931376 1075589 1079720 1113990 1047189 1021235 1058332 1005493 1052858 1003694 971119 921303
7041 921303 893028 899826 947883 896111 879226 794044 791450 745135 791006 921626 993320 764168
7029 764168 645775 782904 826709 693280 787286 839256 790370 771644 722415 843470 880836
7018H80836J9486O835l4236J4671O0762N4168k82514r037l9793N5881L3652m8415
7006G12296k0662N0021j39400J01389Q1992j12902L5097k0637L5156j38341J2713
6995E96722j6046P1969K9649q2572p3716L8877Q8475j14371j7732J41873j20258
6984E42870n9165Q5382o4511R8049M17l5072j37995o493J65157J28346O850K0322
6972G44157l8089m1609P777r0044Q8055m9541l1519j7367O8151l1246J41669l7472
6960G12922n1181L0659q0401n312o3461J75356L9039r4096p8122J745J4405m5826
6948E55727n614O3516Q3302q336n3298n5093K25312M5935n8247k7037J24322k2499
6936H67990o4225R2687l8153J86142L0060M9325L384L5209L7588j5606J1601J02051
$$ plain form
7018 880836 900322 907157 872921 887592 948354 1002522 720008 710971 671178 727059 760711 712296
7006 712296 691634 741655 602255 703644 785636 672734 707831 687194 722350 584009 596722
6995 596722 580676 652645 682294 599722 526006 564883 653358 538987 521255 663128 542870
6984 542870 483705 569087 504576 602625 603042 567970 429975 423482 588639 716985 723835 744157
6972 744157 706068 664459 672236 582192 670247 620706 589187 571820 639971 608725 750394 712922
6960 712922 661741 692400 611999 606687 543226 718582 757621 663525 585403 587148 601553 555727
6948 555727 550113 613629 696931 688595 635297 580204 805516 851451 793204 766167 890489 867990
6936 867990 803765 896452 858299 1044441 1074501 1123826 1127210 1162419 1200007 1184401 1196002 1298053
6924A298053L158r7142j32014j93619m5369L0932J01881J41054q2517R5204k47113
6913H72508k28195J31358J17401o5246k48716J6714K21603k212K8290n4321n8301
6902G30883k683l1812L0014o2122J408n042p8427r5903m7396M828m725P0266N3554
6889E62843j50772n4229J24598J30248j54031N472r7387p7827J799J99759j04960
6878C85513k6955j1203M2388j4448R1849J56653o2472R8453m4686j95517P919
6867D27494j55339Q3868R125J18082J6876l8193M4245p6778J70977o2623j32884
6856D04850J64672j19290j18212J12357J02646L3050j18252k810p7088k0619n4992
6845C06312N0691J01329j22683j8622P2934j2046j328N5676L8746j5044N3667
$$ plain form
6924 1298053 1301211 1204069 1072055 878436 833067 863999 965880 1106934 1024417 1119621 872508
6913 872508 644313 775671 893072 827826 579110 595824 817427 815215 843505 789184 730883
6902 730883 728200 696388 726402 664280 665688 660646 582219 486316 438920 443748 439023 509289 562843
6889 562843 412071 357842 482440 612688 458657 464129 366742 288915 290714 490473 385513
6878 385513 358558 347355 389743 375295 467144 623797 561325 659778 615092 419575 427494
6867 427494 272155 356023 365148 483230 500106 461913 506158 429380 600357 537734 404850
6856 404850 569522 450232 332020 444377 547023 580073 461821 459011 381923 361304 306312
6845 306312 357003 458332 335649 317027 389961 377915 376587 432263 471009 455965 509632
6834E09632j20087J11950O9742k5168N9869J1265k26168Q4899j5217j33686J12323
6823D39354q0832j48204P5470J13494r2229J15251O2076l0880J670L6054p1253
6812D19971L0406P5424J8372P6535j29668k0469o1885K12797j36394j27345J77853
6801E35597j02532p7329l5984K3246j5080o4323J56095k2610o3072N4033J9502
6790D07543n9910m0792m3258K07551r1212O2798Q8319P7881O3863R0496k21194
6779E42085j19510n132J3281m3061q3428J32531N6539j11341l3716J59852J16288
6768F24388j23665r5479K37865j06146j15472p4735K16675n5644j34917K3262
6758C96132J67962O169j1000m2805K8866R079R271k3490j51733O9054K42940j11146
$$ plain form
6834 509632 389545 501495 571237 546069 605938 617203 391035 475934 460717 327031 439354
6823 439354 358522 210318 285788 399282 307053 422304 484380 453500 455170 491224 419971
6812 419971 450377 525801 544173 620708 491040 470571 408686 621483 485089 357744 535597
6801 535597 433065 355736 319752 342998 327918 263595 419690 397080 334008 388041 407543
6790 407543 347633 306841 263583 471134 379922 442720 531039 608920 672783 763279 542085
6779 542085 422575 417443 430724 387663 304235 436766 493305 381964 348248 508100 624388
6768 624388 500723 405244 643109 536963 421491 346756 563431 507787 372870 396132
6758 396132 564094 570263 559263 516458 545324 554403 563674 540184 388451 457505 700445 589299
6746E89299j94115R6970L633J1405P8572j15615L4392k7826J44048l667o133j31463
6734D79500n6117P4383R2530r667p0237K4414r7208n495J07543k5482J14673r4313
6722E34524k8782J0322j1666j15595J2708J45547p9404J35257k2676K7418K4188
6711F31841J14238j74744k3701o0420q1312K50909K224j55857K9693O4723k0054
6700E77540j08740M6137P4481J40885k9948J48760J7724p2977M6999m0187k7130
6689G73544o5830J01583J42886M473k2195j18182l451J39570J1099q1634M4411
6678I26274J13590n6362n7990j3143N4365J46185J81304J18385N7589L8769j48888
6667A360078j5932q6218L8519M0180M774J16890M3254j56459J21751J00705m5196
$$ plain form
6746 589299 395184 492154 495787 507192 585764 470149 504541 476715 620763 617096 610963 479500
6734 479500 423383 497766 590296 580629 510392 534806 437598 432103 539646 514164 628837 534524
6722 534524 505742 516064 504398 388803 401511 547058 467654 602911 580235 607653 631841
6711 631841 746079 571335 547634 487214 405902 656811 659035 503178 532871 597594 577540
6700 577540 468800 514937 589418 730303 700355 849115 866839 793862 840861 800674 773544
6689 773544 707714 809297 952183 956656 934461 816279 812828 952398 963497 881863 926274
6678 926274 1039864 983502 925512 912369 966734 1112919 1294223 1412608 1470197 1508966 1360078
6667 1360078 1344146 1257928 1296447 1336627 1341401 1458291 1501545 1345086 1466837 1567542 1522346
6656A522346J29671J8271q1760j31047j20014K3000J18916q1223J12170q5736
6646A424594N8785J44702l648j02395K0480J57800j4274p954R3684j05808J22744
6635A788710J05321J11764l0917j8318n6306L5197k2891m7947k2778M6865J86292
6624B074992q4238P4237K58607K6074Q162k6128J20277K84925J57176J12839M3539
6613C050462J40667l0638J49889k9212J78852L07797J63984L72053L13784J77980
6603D795618q446K20236L64515L32630L61025K38872O38371O15023N30823O39957
6593H728624O04906P50943R81870J037629J116824J569881J846406K030684K193783
6584B0861550J759582J030799q5862j364473k115918k358907k150876j870122
$$ plain form
6656 1522346 1652017 1670288 1588528 1457481 1337467 1360467 1479383 1398160 1510330 1424594
6646 1424594 1483379 1628081 1624433 1522038 1542518 1700318 1686044 1678090 1771774 1665966 1788710
6635 1788710 1894031 2005795 1974878 1956560 1900254 1935451 1912560 1864613 1841835 1888700 2074992
6624 2074992 1990754 2064991 2323598 2349672 2357834 2331706 2451983 2736908 2894084 3006923 3050462
6613 3050462 3191129 3160491 3310380 3281168 3460020 3767817 3931801 4303854 4617638 4795618
6603 4795618 4787172 5007408 5371923 5704553 6065578 6304450 6942821 7557844 8088667 8728624
6593 8728624 9333530 10084473 11066343 12103972 13220796 14790677 16637083 18667767 20861550
6584 20861550 22621132 23651931 23566069 22201596 20085678 17726771 15575895 13705773
6576A3705773j450175j101607q48811o33129q30353m76276k85808n69065n60076
6567F950473l14795l85258k81940j84331j50929j12994j39280j75169k48268l93390
6557D564119j91203j46245j03394p3551j26417q1592j40276o6921j57976j97509
6547C279035K2828k5320j64008l8066k28855l5791N203j39014o111j39248P206
6536B537859j731p3974q0869k9193j1516m2551j0124q2217j05938o7976K2532
6525B054302L5498m5108j61894L0050j00507J12894j7086M7360P5252k6728n2891
6514A951142j4608k7189j06750j87667l0566N0238J70868k8986m4408J6709j00197
6503A648586q2629j5835Q1104k9185j07619j05890P0307O02R3431o4277M870M1409
$$ plain form
6576 13705773 12255598 11153991 10305180 9672051 8841698 8365422 8079614 7510549 6950473
6567 6950473 6635678 6250420 5968480 5784149 5633220 5520226 5380946 5205777 4957509 4564119
6557 4564119 4372916 4226671 4123277 4049726 3923309 3841717 3701441 3634520 3476544 3279035
6547 3279035 3301863 3276543 3112535 3074469 2845614 2809823 2815026 2676012 2669901 2530653 2537859
6536 2537859 2536128 2462154 2381285 2352092 2340576 2298025 2287901 2205684 2099746 2031770 2054302
6525 2054302 2089800 2044692 1882798 1912848 1812341 1925235 1908149 1955509 2030761 2004033 1951142
6514 1951142 1936534 1909345 1802595 1614928 1584362 1634600 1805468 1776482 1732074 1748783 1648586
6503 1648586 1565957 1550122 1631226 1602041 1494422 1388532 1458839 1459441 1552872 1488595 1493465 1534874
6491A534874m7484J5356r5908j6239K37635o2894J7590l5529J3197N0798L0430
6480A641826j33287j9450O1201k7090M2599P3497L7224j12043P2654p4927K0023
6469A582227K3391l3923o6070N4587J03205o3142j24027J47869P1844K9675j24041
6458A601595j47996J49188n7945L4970m6714p9873P0645N3992P0610N4064J22066
6447A824602N0026j2909j01977O5879n140j6686M1513M5586P817m9867Q0538l3948
6435A895434j21992K6294j15173j8386K3283J21169R4812j08032J14770J46575
6425B058754M6288j7578M7458P811J0583O1724m249n9314N9545M0866k860k0881
6413B228147K7382J0476n7382P3864L6240J9450J05141J24162k2131o3318j4187
$$ plain form
6491 1534874 1487390 1502746 1406838 1390599 1628234 1565340 1582930 1547401 1560598 1611396 1641826
6480 1641826 1508539 1489089 1550290 1523200 1565799 1639296 1676520 1564477 1637131 1562204 1582227
6469 1582227 1605618 1571695 1505625 1560212 1663417 1600275 1476248 1624117 1695961 1725636 1601595
6458 1601595 1453599 1602787 1544842 1579812 1533098 1453225 1523870 1577862 1648472 1702536 1824602
6447 1824602 1874628 1861719 1759742 1825621 1820481 1803795 1845308 1890894 1898711 1848844 1929382 1895434
6435 1895434 1773442 1799736 1684563 1666177 1689460 1810629 1905441 1797409 1912179 2058754
6425 2058754 2105042 2087464 2134922 2142733 2153316 2215040 2210791 2151477 2211022 2251888 2249028 2228147
6413 2228147 2255529 2266005 2208623 2282487 2318727 2338177 2443318 2567480 2545349 2482031 2467844
6402B467844l70P3215M3343O6980l7540J13046J02447l6165M6421O9917j5207
6391B893931Q1070O3843K8767p2193n641J56242N4171J3915J34664J62280J02318
6380C613367P8815r5124P271N4572J39711J49144K2186J51531J74753P6472J59787
6369D532485J0878J04480J49821K15781K17295J99265K90362J26253J83917J56083
6359F186620K69846J71075M06325L84323K67151K84243L30559N06873N09050N23997
6349I840062N11362M96564P39894P59925Q04661P29054P68600J032294J263351
6340A6945767J331037J549214J622213J952034K432014K722055K554577J622397
6332C2731308M28504O1576L69324Q69853J436676J877538K582683L484707M260781
$$ plain form
6402 2467844 2467474 2540689 2584032 2651012 2613472 2726518 2828965 2792800 2839221 2909138 2893931
6391 2893931 2975001 3038844 3067611 2995418 2989777 3146019 3200190 3214105 3348769 3511049 3613367
6380 3613367 3692182 3597058 3604329 3658901 3798612 3947756 3969942 4121473 4296226 4372698 4532485
6369 4532485 4543363 4647843 4797664 5013445 5230740 5430005 5720367 5846620 6030537 6186620
6359 6186620 6456466 6627541 7033866 7418189 7685340 7969583 8300142 8807015 9316065 9840062
6349 9840062 10351424 10847988 11587882 12347807 13152468 13881522 14650122 15682416 16945767
6340 16945767 18276804 19826018 21448231 23400265 25832279 28554334 31108911 32731308
6332 32731308 33159812 33221388 33590712 34460565 35897241 37774779 40357462 43842169 48102950
6323D8102950N676682P104938Q223450R183756R801545P604773K622258k858542
6315I5461810n682118n179540m065042k954192j656591K88730K543514M737883
6307H3494454O291591N308833K253908j003223j877730O30468L737072O090910
6299A04926283O208244L733264p78000m343164n632537m211857k607891j521883
6291I5772459k89752J454954M19011k465403n439253n537483l360524j168923
6283G9385086N95844K385502M336875O127437P463672M471393j942325q532604
6275I4290880j1667463j0421908q000455o035506m734143m057547l349779k859062
6267D3165017k182303j496935j121895j247477j377545j460675j677045j632931
$$ plain form
6323 48102950 53779632 60884570 69108020 78291776 88093321 95698094 98320352 95461810
6315 95461810 89779692 84600152 80535110 77580918 75924327 76213057 78756571 83494454
6307 83494454 89786045 95094878 97348786 96345563 94467833 95098301 98835373 104926283
6299 104926283 111134527 114867791 114089791 109746627 104114090 99902233 97294342 95772459
6291 95772459 95482707 96937661 97356672 94891269 89452016 83914533 80554009 79385086
6283 79385086 79980930 82366432 86703307 92830744 100294416 104765809 102823484 94290880
6275 94290880 82623417 72201509 64201054 58165548 53431405 49373858 46024079 43165017
6267 43165017 40982714 39485779 38363884 37116407 35738862 34278187 32601142 30968211
6259C0968211j377980j107311p07572m16437m86334n41161o81084o76925p90601
6250B4182806r10497r37363p81420l99393k28974M9715O3626j15653m06353r81413
6240A9535081j229355j247328j049333q31916o94649n66712m90639l68767k94215
6231A2762167l76412l29472l15589l40087j73501j14688k90939j29378k6577J57420
6221A0822944J91734N8129J49128k73859m32595n55251m01624l98788l09531k11537
6211H638750j97452j28856l8025j46245j32592N495p0322k24169n5591j43470
6201G507523n8478M7619k13788l7077n4872k31913k5476P3910J17655O5693n9990
6190G130806M5040k2429J57140K04971k88166k99186l05272k10140k07214r7989
$$ plain form
6259 30968211 29590231 28482920 27775348 27358911 26872577 26331416 25650332 24973407 24182806
6250 24182806 23272309 22334946 21553526 21154133 20925159 20974874 21038500 20922847 20516494 19535081
6240 19535081 18305726 17058398 16009065 15177149 14482500 13915788 13425149 13056382 12762167
6231 12762167 12385755 12056283 11740694 11400607 11227106 11112418 10821479 10692101 10665524 10822944
6221 10822944 11014678 11072807 11221935 10948076 10515481 9960230 9558606 9159818 8850287 8638750
6211 8638750 8441298 8312442 8274417 8128172 7995580 8001075 7930753 7706584 7650993 7507523
6201 7507523 7449045 7496664 7282876 7245799 7190927 6959014 6933538 7007448 7125103 7190796 7130806
6190 7130806 7175846 7153417 7310557 7515528 7227362 6928176 6622904 6412764 6205550 6107561
6180F107561j21337j53868j78676L3623M43j05366R6581p9903q8227K8642K3677
6169E563150j51133j56494P619o4534k8877O7138j14685j25824Q2249N7384N0008
6158E186001M3555j4325L4779n319N5835p8665l7183P490J19881q2418l7166J40928
6146E333393j70419J76339M8139N8908J17141O0114J31226M3700Q3203J11513
6136E993257J32558O1439P3274J1258l33927l38310j50738M4724p2165m1589p6293
6125E303488P654p1282j57416P1951L0023r8053j21381r8991N0522Q6320J56920
6114E159755O7638j00589p9186p9013j8255j21176o2160P453n4915l0431M2450
6103D731571j31544m3439j23819j084j07036r1812N0451j17286j3418J6491K9353
$$ plain form
6180 6107561 5986224 5832356 5653680 5687303 5687746 5582380 5678961 5599058 5510831 5539473 5563150
6169 5563150 5412017 5255523 5263142 5198608 5169731 5236869 5122184 4996360 5078609 5135993 5186001
6158 5186001 5229556 5215231 5250010 5244691 5300526 5221861 5184678 5192168 5312049 5229631 5192465 5333393
6146 5333393 5162974 5339313 5387452 5446360 5563501 5623615 5754841 5798541 5881744 5993257
6136 5993257 6125815 6187254 6260528 6271786 5937859 5599549 5448811 5493535 5421370 5379781 5303488
6125 5303488 5311142 5239860 5082444 5154395 5184418 5086365 4964984 4865993 4916515 5002835 5159755
6114 5159755 5227393 5126804 5047618 4968605 4950350 4829174 4767014 4774467 4719552 4689121 4731571
6103 4731571 4600027 4556588 4432769 4431685 4324649 4232837 4283288 4166002 4152584 4169075 4198428
6092D198428N8735j13203n1400q2982r6431m8198J0060p7015m1542K9176O2043
6081C847671j44425j68945p7167O9319j23926J23804J22206n8811j07103j47625
6071C334998r9597j6342j07092M2843M5973l7449j48219J36792R0813j70842M4101
6060C115979o7259o3979j03252N9154k2014m4252n771l703N8157q5168p5586K2972
6048B785278Q4289m6153o7379L4149k6588p4091L2735M3704L0188n1421p8896
6037B665815o3795P4466j320j22949Q802J77775J02384n2268j41227j76576k2253
6026B448854n0939J03482n8492K6004O0858O2229K8273j52531Q6818P578J3819
6015B575953J31013k0381K3651l0353J12723j63108j52069J35263l6089j82254
$$ plain form
6092 4198428 4257163 4143960 4092560 4009578 3913147 3864949 3875009 3797994 3756452 3785628 3847671
6081 3847671 3703246 3534301 3457134 3526453 3402527 3526331 3648537 3589726 3482623 3334998
6071 3334998 3235401 3219059 3111967 3154810 3200783 3163334 3015115 3151907 3242720 3071878 3115979
6060 3115979 3048720 2984741 2881489 2940643 2918629 2874377 2868606 2864903 2923060 2837892 2762306 2785278
6048 2785278 2869567 2823414 2756035 2790184 2763596 2689505 2722240 2765944 2796132 2744711 2665815
6037 2665815 2602020 2676486 2675166 2552217 2561019 2738794 2841178 2788910 2647683 2471107 2448854
6026 2448854 2397915 2501397 2442905 2468909 2529767 2591996 2620269 2467738 2554556 2562134 2575953
6015 2575953 2706966 2686585 2710236 2679883 2792606 2629498 2477429 2612692 2576603 2394349
6005B394349M5174L1213p7890j09369P2778J24743p6768J81456Q179j57845j46706
5994B289314M9893R3137Q5683P5109P3562R0822l9938o0103k7752J39751R8819
5983B868297J0300J30649k8071j28335K24441R530n3622J6917K1901J1888j09076
5972B974819r1130K6348q1404L0737J7300R6282j21004j06737J02847K9551J8991
5961B896600J7034j00318J86208J37023k3263j6294k5770N3796n5067M4335o7459
5950C046825j54643R1712l2105r463k1410L3985J12070M4683j39342q4869N3272
5939B940715K9751P7882J9950P1328R8079j13806n6967r3515j48266Q884m1077
5928B792958J37077m2896p9157K0678m7373n0916n8935O4813K0957m9314p493
$$ plain form
6005 2394349 2439523 2470736 2392846 2283477 2356255 2480998 2404230 2585686 2593865 2436020 2289314
5994 2289314 2339207 2432344 2518027 2593136 2666698 2757520 2717582 2657479 2629727 2769478 2868297
5983 2868297 2878597 3009246 2981175 2852840 3077281 3086811 3033189 3050106 3072007 3083895 2974819
5972 2974819 2883689 2910037 2828633 2859370 2876670 2972952 2851948 2745211 2848058 2877609 2896600
5961 2896600 2913634 2813316 2999524 3136547 3113284 3096990 3071220 3125016 3069949 3114284 3046825
5950 3046825 2892182 2983894 2951789 2942326 2920916 2954901 3066971 3111654 2972312 2887443 2940715
5939 2940715 2970466 3048348 3068298 3139626 3237705 3123899 3066932 2973417 2825151 2834035 2792958
5928 2792958 2930035 2887139 2807982 2828660 2781287 2730371 2671436 2736249 2757206 2707892 2700399
5917B700399J7186N1080J41614m5460r668R7127O817q1132r2696L6941Q3989Q3765
5905B989962q2151j27544J26533J16863o8329O9768l6468L3887J17449L4559k19170
5894B955359k0678P7470J6599l5189K1337O9253M2177l9083J13021j36824L7129
5883C100571R1806N7045K1793j5218K4158o3051J96522q6952r2342P1424P6961
5872C382717l8470L27692K01220o5113K5888O2267o6150q9707K1130j7793J28546
5861C872227M2861k8604r9275J44573J18811p6676l5443J19881R5423j05438J23447
5850D171787K36596k1715Q1781J30745Q8972j9737P4609K44935O728J17761j8133
5839E094329n8987K29807R1910J30140J65887K30066J07042J69389K9393K24178
$$ plain form
5917 2700399 2717585 2768665 2910279 2864819 2855151 2952278 2959095 2877963 2785267 2822208 2906197 2989962
5905 2989962 2907811 2780267 2906800 3023663 2955334 3025102 2988634 3022521 3139970 3174529 2955359
5894 2955359 2934681 3012151 3028750 2993561 3014898 3084151 3126328 3087245 3200266 3063442 3100571
5883 3100571 3192377 3249422 3271215 3255997 3280155 3217104 3413626 3326674 3234332 3305756 3382717
5872 3382717 3344247 3671939 3873159 3808046 3833934 3896201 3830051 3740344 3761474 3743681 3872227
5861 3872227 3915088 3886484 3787209 3931782 4050593 3973917 3938474 4058355 4153778 4048340 4171787
5850 4171787 4408383 4386668 4468449 4599194 4688166 4668429 4743038 4987973 4994701 5112462 5094329
5839 5094329 5035342 5265149 5357059 5487199 5653086 5883152 5990194 6159583 6188976 6413154
5829F413154Q8691N6800K07366J39691K70349K46951K48234L13770L08695K18185
5819H511886K99397L57732M20750N45941N17592N09130N43758N98547O88173P69155
5809A3762061Q56335R41025Q72614R15460J029971J051147R80527J176867J073187
5800B2659194J123547J243693J621657J698841J752501K290860K436099K757578
5792C7583970K991298L601704M282835N439756O892588Q841784J0711020J2476693
5784I2821648J3194579J0007754L109368m350386r184568q991494o379155l303266
5776H6924480q20965J580864L942648N932901N924636L271462k95026k477795
5768A03983205j102496K188325N473562Q209218R798227Q143875L385239k467834
$$ plain form
5829 6413154 6501845 6558645 6766011 6905702 7176051 7423002 7671236 7985006 8293701 8511886
5819 8511886 8811283 9169015 9589765 10135706 10653298 11162428 11706186 12304733 12992906 13762061
5809 13762061 14618396 15559421 16432035 17347495 18377466 19428613 20409140 21586007 22659194
5800 22659194 23782741 25026434 26648091 28346932 30099433 32390293 34826392 37583970
5792 37583970 40575268 44176972 48459807 53899563 60792151 69633935 80344955 92821648
5784 92821648 106016227 116023981 119133349 114782963 105598395 96606901 90227746 86924480
5776 86924480 86103515 87684379 91627027 97559928 103484564 106756026 106461000 103983205
5768 103983205 102880709 105069034 110542596 118751814 128550041 136693916 140079155 137611321
5760A37611321o069419o630970m788146k508897l03835L12675j958661n413004
5752A10251064p467198o621250m407467k050090k26420K124939M569604O891439
5744A03064621Q021028N402981o43070o872357j0175735r373104o920510n095946
5736G7407908m522409m651398m650368l832887k627797j901255j733343j836644
5728E1651807k202333k308635k187545k263207k039765j765136j795521j436282
5720C5653383j187040j087114p65442o29104o50819p59999o17701m12212l38905
5711B9205047k03299k39923k21253k62709k08099k8188p0922J48084L19521N22086
5701B8960345Q68280P69586O27829K29306j57126l65259l90744o72724n23536
$$ plain form
5760 137611321 131541902 124910932 120122786 117613889 117310054 117622729 115664068 110251064
5752 110251064 102783866 96162616 91755149 89705059 89478639 91603578 96173182 103064621
5744 103064621 111085649 116488630 115845560 108973203 98797468 89424364 82503854 77407908
5736 77407908 72885499 68234101 63583733 59750846 57123049 55221794 53488451 51651807
5728 51651807 49449474 47140839 44953294 42690087 40650322 38885186 37089665 35653383
5720 35653383 34466343 33379229 32613787 31984683 31333864 30573865 29956164 29543952 29205047
5711 29205047 29001748 28761825 28540572 28277863 28069764 28041576 27970654 28118738 28438259 28960345
5701 28960345 29828625 30598211 31226040 31455346 31298220 30932961 30542217 29869493 29345957
5692B9345957l37154j24539n0155r2283q2111k49429m56731m21162l01058j35139
5682B7096196L8857L63092L95042M55011J70491j42753k39259j14224L3131M27928
5672B8483512O51239P00369O37171N85251R42394J115070J837453K259736K618406
5663C9830601K403452J852823J207069P88261N85873K31641q57643k226766l141435
5654D0673876l205706k539025j809850j418555j068797q41447l53504k79181R5455
5645B9253266M11408N13537P44164Q30718R60808R53335O41048P30173O85830
5636C5724287J396500J679117J184029M96573k19874m18710p10904j284506k073107
5627C5773405k294463k109636j903996j525259j250266j187459j077915p62865
$$ plain form
5692 29345957 29008803 28884264 28834109 28741826 28659715 28410286 27953555 27532393 27231335 27096196
5682 27096196 27135053 27498145 27893187 28348198 28518689 28375936 28136677 28022453 28055584 28483512
5672 28483512 29134751 29835120 30472291 31057542 31999936 33115006 34952459 37212195 39830601
5663 39830601 42234053 44086876 45293945 46082206 46668079 46899720 46042077 43815311 40673876
5654 40673876 37468170 34929145 33119295 31700740 30631943 29790496 29436992 29157811 29253266
5645 29253266 29664674 30178211 30922375 31753093 32713901 33667236 34308284 35038457 35724287
5636 35724287 37120787 38799904 39983933 40480506 40260632 39841922 39131018 37846512 35773405
5627 35773405 33478942 31369306 29465310 27940051 26689785 25502326 24424411 23661546
5619B3661546o77449l85495j79163K4360L4272K43989J74182k27546l81540l28706
5609B1958450j87986L217j92403n84183q20160p92788n81340n02719o44057m89967
5599A7166064m17652l97011m11621k58189k45124j41858j19985j83294l97585
5590A4593745k51930l27163l59827l06284k89371l65140k55892j68101j58415
5581A2111622j42098k60417k53376j90166j56137q6834j41008j73033p1996j85531
5571A0451026j59334j50569R6835L8439q1887p7019j21330l49711k73422j14591
5561I258437r159j87116j87332r8122j06010j27390q9574j94394M156r8152p9936
5550H085408j14143M1312r5591k11211j68590j62901k29544o0255m0604m1332
$$ plain form
5619 23661546 22984097 22598602 22419439 22443799 22478071 22722060 22896242 22668696 22287156 21958450
5609 21958450 21770464 21773681 21581278 20997095 20176935 19384147 18802807 18300088 17656031 17166064
5599 17166064 16748412 16351401 15939780 15681591 15436467 15294609 15174624 14991330 14593745
5590 14593745 14341815 14014652 13654825 13348541 13059170 12694030 12438138 12270037 12111622
5581 12111622 11969524 11709107 11455731 11265565 11109428 11022594 10881586 10708553 10636557 10451026
5571 10451026 10291692 10141123 10237958 10276397 10194510 10117491 9996161 9646450 9373028 9258437
5561 9258437 9249278 9062162 8874830 8776708 8670698 8543308 8453734 8259340 8263496 8165344 8085408
5550 8085408 7971265 8012577 7916986 7705775 7537185 7374284 7144740 7084485 7043881 7002549
5540G002549O688j20732k57814j31285l5702p954j43123o7290r7311j28524q6954
5529E932548R90q9179r1687j87750l4312r0535l5567k6438j6461j38143O0645
5518E284111M5393P1841r0596k0659j01598R1553j39339j9332J4324p6416j40129
5507D919153p863R1657n5806J0611r6524o4476M8743m0437N4016O0294n4080m8758
5495D816530n5670n8004M0786j44j3159J24154Q5689J83103p2257k00444j53845
5484D696739J06401j14961o4012j31805M6472N1430J07317l3663m7801J6440j42474
5473D490083j19971J11172N3926M5264N1634j14984O7899K0253L7238L886J46701
5462D793101J87051L0572L28844K75758K16464n3641M6533n4980j33414j64359
$$ plain form
5540 7002549 7009237 6888505 6630691 6499406 6463704 6455750 6312627 6245337 6148026 6019502 5932548
5529 5932548 5933538 5844359 5752672 5564922 5530610 5440075 5404508 5378070 5361609 5223466 5284111
5518 5284111 5329504 5401345 5310749 5290090 5188492 5280045 5140706 5121374 5135698 5059282 4919153
5507 4919153 4911290 5002947 4947141 4957752 4861228 4796752 4845495 4805058 4859074 4919368 4865288 4816530
5495 4816530 4760860 4702856 4743642 4743498 4730339 4854493 4940182 5123285 5051028 4850584 4696739
5484 4696739 4803140 4688179 4624167 4492362 4538834 4590264 4697581 4663918 4616117 4632557 4490083
5473 4490083 4370112 4481284 4535210 4580474 4632108 4517124 4585023 4605276 4642514 4646400 4793101
5462 4793101 4980152 5010724 5339568 5615326 5831790 5778149 5824682 5769702 5636288 5471929
5452E471929k33497k63364M3751J11710m7258j71308j1110Q0577l9100r4794L9827
5441D887363J29599J99488R6484J4671L2960J9261K5224K73817J7645r2229P3635
5430E677918K23996J22560K54304K62848M04821O2276J5343j97787m25236l68239
5420F032804k55200k77512k39428j76205o7833j79935j34234j87468j22730J20892
5410D513151k5847j5128J6537q6018J7100P6560r7744K0257j5454r0111o8187
5399D245116j96458j33182L2464K6117l382j39357P4652q6356j047N266l9864
5388C783969L8356j44668l5701m097p276P3732O9703p8620N081J23924M0895o9519
5376C795779j47150P4700N1069O7448j185o5721J40512J44207R1574J3988L6467
$$ plain form
5452 5471929 5238432 4975068 5018819 5130529 5083271 4911963 4900853 4981430 4942330 4847536 4887363
5441 4887363 5016962 5216450 5312934 5327605 5360565 5379826 5405050 5678867 5696512 5604283 5677918
5430 5677918 5901914 6024474 6278778 6541626 6946447 7008723 7024066 6826279 6401043 6032804
5420 6032804 5777604 5500092 5260664 5084459 5016626 4836691 4702457 4514989 4392259 4513151
5410 4513151 4487304 4472176 4488713 4402695 4419795 4496355 4398611 4418868 4403414 4313303 4245116
5399 4245116 4048658 3915476 3947940 3974057 3970675 3831318 3905970 3819614 3818567 3823833 3783969
5388 3783969 3822325 3677657 3641956 3637859 3630583 3704315 3774018 3695398 3700479 3824403 3865298 3795779
5376 3795779 3648629 3723329 3774398 3841846 3840661 3774940 3915452 4059659 4151233 4165221 4201688
5365D201688o5139M7098J36914J1635R893k9429R9438K07935K15862L4345K62771
5354E133011L49306M93883M47311L81434L63821K08017j63946k67869l23750j84199
5344F437019k96068j38020j73095k20260k3105K5335J22549Q4976n3601J081P4688
5333E841499N4075J16977K34315J85924L61064J33276Q1838J79977M37892O40031
5323H266868P10923Q96261J258516J415568J486654J253745K39397n54390r73507
5314A4000035j155407j028858p90632o63929o14716n17788n60470m61107j97287
5305H009841j93597j44900k10618k91613N631Q4142J50265J67426R0488K9572
5295G696637J43461J85933K96944N35313N75140P57108J009533J318810J706223
$$ plain form
5365 4201688 4136549 4183647 4320561 4332196 4342089 4312660 4412098 4620033 4835895 4870240 5133011
5354 5133011 5482317 5976200 6423511 6804945 7168766 7376783 7212837 6944968 6621218 6437019
5344 6437019 6140951 6002931 5829836 5609576 5586471 5611806 5734355 5819331 5765730 5766811 5841499
5333 5841499 5895574 6012551 6246866 6432790 6793854 6927130 7008968 7188945 7626837 8266868
5323 8266868 8977791 9874052 11132568 12548136 14034790 15288535 15527932 14973542 14000035
5314 14000035 12844628 11815770 11025138 10361209 9746493 9228705 8668235 8207128 8009841
5305 8009841 7816244 7671344 7460726 7169113 7174744 7258886 7409151 7576577 7667065 7696637
5295 7696637 7840098 8026031 8322975 8858288 9433428 10190536 11200069 12518879 14225102
5286A4225102J322036O10936l01233r29458j156509j119024j006690q48774q42776
5277I953610n21909m44662m49919m53950l94974l58083m14348k68055j19461K5902
5267F554151j04273j08201j37945j57361Q3610J29572J03678J77369J24284K45638
5257F910522K85376K83862L22162N71415M39291k2117k36318m93239l21411l65668
5247G373875m04926k48002k96303j83761J80269k9454j49296J10442J45360N3757
5237F551961p9619j7378l4346k0680j27485k43129j05479j07234r5920P4110k00646
5226E594155q204j42182j02457K1890L4102j3924p836n9557O1695J25222J37915
5215E640819K09218J34264J49779J20644L6135Q9031J68941J96735N8665L37607
$$ plain form
5286 14225102 15547138 16158074 15856841 14927383 13770874 12651850 11645160 10796386 9953610
5277 9953610 9431701 8987039 8537120 8083170 7688196 7330113 6915765 6647710 6528249 6554151
5267 6554151 6449878 6341677 6203732 6046371 6129981 6259553 6363231 6540600 6664884 6910522
5257 6910522 7195898 7479760 7801922 8373337 8812628 8790511 8554193 8060954 7739543 7373875
5247 7373875 6968949 6720947 6424644 6240883 6421152 6391698 6242402 6352844 6498204 6551961
5237 6551961 6472342 6454964 6420618 6399938 6272453 6029324 5923845 5816611 5720691 5794801 5594155
5226 5594155 5585951 5443769 5341312 5363202 5397304 5383380 5375544 5315987 5377682 5502904 5640819
5215 5640819 5850037 5984301 6134080 6254724 6290859 6379890 6548831 6745566 6804231 7141838
5205G141838l5390K8649K96916L5941J3420m5865k07449p6811m6880p5075r2219
5194F937075J34288r4516N9941n8338M7926k9540j588j3149J94772N6115M1415
5183G274401J86202K17703N0954J72975K42133K78902K69746N16572K42904J43138
5173I595630J82516K63484L40524M02446J59669L13098J79238J28834J49910J98398
5163A1913747K07936L37180K28698L22214L72545N14757N12925O56383N53702
5154A5620087P92206Q53059R54194J096873J198539J353811J285083J118782J194156
5145B5466790J240232J465481J842479K063073K361802K487420K567794K998076
5137D2493147L583584L989526M675944M952123N080368O011241P519945Q950929
$$ plain form
5205 7141838 7106448 7135097 7432013 7467954 7481374 7435509 7228060 7151249 7104369 7029294 6937075
5194 6937075 7071363 6976847 7036788 6978450 7026376 6996836 6995248 6982099 7176871 7232986 7274401
5183 7274401 7460603 7678306 7729260 7902235 8144368 8423270 8693016 9209588 9452492 9595630
5173 9595630 9778146 10041630 10382154 10784600 10944269 11257367 11436605 11565439 11715349 11913747
5163 11913747 12121683 12458863 12687561 13009775 13382320 13897077 14410002 15066385 15620087
5154 15620087 16412293 17265352 18219546 19316419 20514958 21868769 23153852 24272634 25466790
5145 25466790 26707022 28172503 30014982 32078055 34439857 36927277 39495071 42493147
5137 42493147 46076731 50066257 54742201 59694324 64774692 70785933 78305878 87256807
5129H7256807J0727872J3884873J6493883J1180882K250366o626251q032944l119962
5121A24015526P59945L338214N547435P979333J2033214J7649846K5878121L7213300
5113B34414934M9806490O4443617P1420951L3992960j9248557o7809046p5429827
5106B91591522n2993237l8233941k8232429k2065968j6973398j4017601j0614258
5099A08460690r111763p288233o845862n770637n539031m702883m035207l120239
5091F2046835l257745k946180k714163k133598k166982j717129j630844j306168
5083D4174026j413253j068075j086215r02081p47848n00642n62973k95351l85081
5074C7212507j73690j64551P0444J43056M41904M02204M49939L82095M23802K34459
$$ plain form
5129 87256807 97984679 111869552 128363435 139544317 141794683 135168432 127135488 124015526
5121 124015526 124775471 128113685 133661120 141640453 153673667 171323513 197201634 234414934
5113 234414934 284221424 348665041 420085992 454078952 434830395 367021349 291591522
5106 291591522 238598285 200364344 172131915 150065947 133092549 119074948 108460690
5099 108460690 99348927 92060694 85214832 79444195 73905164 69202281 65167074 62046835
5091 62046835 58789090 55842910 53128747 50995149 48828167 47111038 45480194 44174026
5083 44174026 42760773 41692698 40606483 39704402 38956554 38455912 37892939 37597588 37212507
5074 37212507 37038817 36874266 36944710 37087766 37529670 37931874 38381813 38763908 39187710 39422169
5064C9422169K58578J56411O10689O87261J069732J492692P15320m96604j299223
5055D2617025j159812m10952n28302m76717n17188m21019m13452m43362l22440
5046C7923781k15869l66860o30933p19156o20833p03138p24924p38811n47893
5037C2655364n67999k03860N0326M75585M38578N59227M77855J34669l75709j219478
5027C2424558j801466j744588j609510j596315j448048j173420r59216p86026
5019B1305969m94776o25104n60518l38470k49699k52672j41554l42458j75033
5010A8125685k45877k51653m9853J55833K31374J46406M14142N23914N89190P35511
5000B0374672O89680L18340K43414J19950m04819o36176o87475p59517m70088
$$ plain form
5064 39422169 39680747 39837158 40447847 41135108 42204840 43697532 44412852 43916248 42617025
5055 42617025 41457213 41046261 40517959 40041242 39524054 39103035 38689583 38246221 37923781
5046 37923781 37707912 37341052 36710119 35990963 35370130 34666992 33942068 33203257 32655364
5037 32655364 32087365 31883505 31933831 32409416 32847994 33407221 33885076 34019745 33644036 32424558
5027 32424558 30623092 28878504 27268994 25672679 24224631 23051211 22091995 21305969
5019 21305969 20811193 20186089 19625571 19287101 19037402 18784730 18643176 18300718 18125685
5010 18125685 17879808 17628155 17578302 17734135 17965509 18111915 18526057 19049971 19639161 20374672
5000 20374672 21064352 21382692 21626106 21746056 21341237 20705061 20017586 19258069 18787981
4991A8787981l70138k41223K410J414J48291J28903K19399N92246O03019Q11468
4981B0683770J360506J898679K533242L648622M670352O050150N138801O69429
4973D6653551l742773o620779n570875m012570l080155k283030j653366j558286
4965A8131717j118136q84557p41701o86314n62614o75271o01775j63650j90220
4956A2507479l24201j76168l72786j43148j53857k17484j79627j74721k12019
4947A0553468j99094l06251j74700j78128p0639m7939P6567P7599j01893k85825
4937I343165l1793N8586j8249N1986o6792J9634J44024K28133J79769J35399J62838
4926A0206700J60740K03769L11285N07781N02186L42969J87671j42566m9922J12644
$$ plain form
4991 18787981 18417843 18176620 18179030 18180444 18328735 18457638 18677037 19269283 19872302 20683770
4981 20683770 22044276 23942955 26476197 30124819 34795171 40845321 45984122 46653551
4973 46653551 42910778 36289999 30719124 26706554 23626399 21343369 19690003 18131717
4965 18131717 17013581 16129024 15387323 14701009 14138395 13463124 12861349 12697699 12507479
4956 12507479 12183278 12007110 11634324 11491176 11337319 11119835 10940208 10765487 10553468
4947 10553468 10354374 10048123 9873423 9695295 9624656 9576717 9653284 9730883 9628990 9343165
4937 9343165 9311372 9369958 9351709 9403695 9336903 9356537 9500561 9728694 9908463 10043862 10206700
4926 10206700 10367440 10571209 10882494 11390275 11892461 12235430 12423101 12280535 12230613 12343257
4916A2343257J29967J05265K6667J24734K50960K44339J95342K11975L94106O15253
4906A4641865O16218N26172M89203M89831P08730J194576J603387K470389L142494
4897B5882865M044580M557578K738722j94817k901643l312210l223559l176709
4889B4414807l089022k255206j758834j493888j097968r56833p85839o08683m85857
4880A1882677n57208m18128m11774n30888k67916k43043l37352j48560j75108
4871H792700j61411j68684j76463k11495j6364n5455n0818o9182j21513Q4435
4861G845750j20012o629j27738j05489j458m3849K6795J13125l5584j57531k19978
4850G167402j69569j56382k33470j34398j41738K7587j23583k13077J52230J9641
$$ plain form
4916 12343257 12473224 12578489 12605156 12729890 12980850 13225189 13420531 13632506 14026612 14641865
4906 14641865 15258083 15784255 16273458 16763289 17472019 18666595 20269982 22740371 25882865
4897 25882865 29927445 34485023 37223745 37028928 34127285 30815075 27591516 24414807
4889 24414807 21325785 19070579 17311745 15817857 14719889 13763056 12977217 12368534 11882677
4880 11882677 11325469 10907341 10495567 9964679 9696763 9453720 9116368 8967808 8792700
4871 8792700 8631289 8462605 8286142 8074647 8058283 8002828 7952010 7882828 7761315 7845750
4861 7845750 7725738 7719109 7591371 7485882 7484424 7440575 7467370 7580495 7544911 7387380 7167402
4850 7167402 6997833 6841451 6607981 6473583 6331845 6359432 6235849 6022772 6175002 6194643
4840F194643o5969j16169j10014K0750N0147J31796n7698o6299p0027O3045o1191
4829E913014l0640J21363O3937J2254N6743J80850J24659L5360O9589J29904J89170
4818F866203M8357p2097o5897j7161o1054K3104K4188L8967K17765J98809J35095
4807G336279k0597J58927K60440L64462K32465K83827M03855O18663P64585P66876
4797A1169782M89948L45229M7820j28492j72910m84283p55152o45489n80839m50459
4787H835155o19644l45114k10678m40281j14477k26877k70448q6748r4314p4663
4777F351911l0846r7636r562o0359q1045j46080O7113Q0292J0954K3618R5959
4766F204319M4427J8518m2801p1973j10362J9828r460q2762j01229J90611k3791
$$ plain form
4840 6194643 6128674 6012505 5902491 5923241 5973388 6105184 6047486 5981187 5911160 5974205 5913014
4829 5913014 5882374 6003737 6067674 6079928 6136671 6317521 6442180 6477540 6547129 6677033 6866203
4818 6866203 6914560 6842463 6776566 6759405 6698351 6721455 6745643 6784610 7002375 7201184 7336279
4807 7336279 7315682 7474609 7735049 8099511 8331976 8615803 9019658 9638321 10402906 11169782
4797 11169782 11659730 12004959 12052779 11924287 11751377 11267094 10511942 9866453 9285614 8835155
4787 8835155 8215511 7870397 7659719 7219438 7104961 6878084 6607636 6520888 6426574 6351911
4777 6351911 6321065 6223429 6213867 6153508 6072463 5926383 5993496 6073788 6084742 6108360 6204319
4766 6204319 6248746 6267264 6224463 6152490 6042128 6061956 6052496 5969734 5868505 6059116 6035325
4755F035325p9229K26162K1103o0172J19354J20430j12364L8407R1733k42158
4745F158591q5531o208j9743p6556l9506L3874p1707j58165j6785K4169j45575
4734E596858p7501k7986O149j42187K6548l039K5153L2555l5476j66795j3827
4723E220452k7607P2845p9962R080M7112Q6053K80752j51986l181J27014K8237
4712E608809j00325j19293j43299k6659L2900o1641l4603J41699J79299J50970
4702E627857J08146N1463J37483o1611j1344J16137l808M7993J16894P6172K08463
4691F413845J66114L03952L13728J33091K18352K05513L94079L28740L32425K70625
4681I080464M24775L33936L48077N90823N13260O28335N24074O02835P79787P11312
$$ plain form
4755 6035325 5956096 6182258 6203361 6143189 6262543 6382973 6270609 6309016 6400749 6158591
4745 6158591 6073060 6066852 6047109 5970553 5931047 5964921 5893214 5735049 5718264 5742433 5596858
4734 5596858 5519357 5491371 5497520 5355333 5381881 5378842 5403995 5436550 5401074 5234279 5220452
4723 5220452 5192845 5265690 5185728 5194808 5241920 5327973 5608725 5456739 5453558 5580572 5608809
4712 5608809 5508484 5389191 5245892 5219233 5252133 5190492 5155889 5297588 5476887 5627857
4702 5627857 5736003 5787466 5924949 5863338 5851994 5968131 5964323 6012316 6129210 6205382 6413845
4691 6413845 6579959 6883911 7197639 7330730 7549082 7754595 8148674 8477414 8809839 9080464
4681 9080464 9505239 9839175 10187252 10778075 11291335 11919670 12443744 13046579 13826366 14537678
4671A4537678P28431R68647J172807J666551K002657K600605L441360L788554
4663C0907290L825198L355488J575695q34262l098668m463489m079994l415888
4655B3771370k589036k098512j733493j375524j025297q26335q50777o70535o03147
4646A1998714o42984n41015n42813l67044m47783l39476l07494l84854k29793
4637H195458j27722q5755q6058j44512k60147J4092j13175o4512q8596j27678
4627G111395M2369o0n555M8164J11673k7614k3434M0J74624L17282J90888M8190
4615G987962J33699J1730k429n2709j83498j51845j1210j87510k15924k59046
4605G069220k11749k06531j01510k507j96479k02745r1981l4692l7932p3528j34642
$$ plain form
4671 14537678 15266109 16234756 17407563 19074114 21076771 23677376 27118736 30907290
4663 30907290 34732488 38087976 39663671 38829409 35730741 31267252 27187258 23771370
4655 23771370 21182334 19083822 17350329 15974805 14949508 14123173 13272396 12601861 11998714
4646 11998714 11355730 10814715 10271902 9904858 9457075 9117599 8810105 8425251 8195458
4637 8195458 8067736 7981981 7895923 7751411 7491264 7505356 7392181 7327669 7239073 7111395
4627 7111395 7153764 7153704 7148149 7196313 7307986 7280372 7256938 7256978 7431602 7748884 7939772 7987962
4615 7987962 8121661 8133391 8130962 8078253 7894755 7742910 7731700 7544190 7328266 7069220
4605 7069220 6857471 6650940 6549430 6546923 6350444 6147699 6055718 6021026 5983094 5909566 5774924
4594E774924J13220j19299n8726m835p570K620j45051j7513P2850L397k1677J7709
4582E610049j6841J0633n8225l7330p7457j60904J01892r6804O8300J23482J2808
4571E479603m175k3086m9007r1823o6462J18760r5495l7615p4355j18182j32609
4560D905554M4863L7631J8617K6954j55563j8755l5649r7337k5228K7180j31533
4549D596734j3712J2562l249L4560q6795j56865j86173O1940R4531m7161j13961
4538D192411m4915o2160j06640m019r7253p2431P350K488L9963J5412j23791J14370
4526C860785p0068m0595J2635K8660J01885m4657n8324m7079O7191q9359p2353
4515C648721J32385j95710o8529R2942n6133L7440j01820m6466J43795m568q3570
$$ plain form
4594 5774924 5888144 5768845 5710119 5705284 5697714 5700334 5555283 5537770 5610620 5614017 5592340 5610049
4582 5610049 5593208 5603841 5545616 5508286 5430829 5269925 5371817 5275013 5343313 5466795 5479603
4571 5479603 5475428 5452342 5403335 5311512 5245050 5363810 5268315 5230700 5156345 5038163 4905554
4560 4905554 4950417 4988048 5006665 5033619 4878056 4859301 4823652 4726315 4701087 4728267 4596734
4549 4596734 4583022 4595584 4592335 4626895 4540100 4383235 4197062 4259002 4353533 4306372 4192411
4538 4192411 4147496 4085336 3978696 3974677 3877424 3804993 3812343 3814831 3854794 3870206 3746415 3860785
4526 3860785 3790717 3750122 3762757 3791417 3893302 3848645 3790321 3743242 3810433 3721074 3648721
4515 3648721 3781106 3585396 3516867 3609809 3553676 3591116 3489296 3442830 3586625 3582057 3498487
4504C498487P8440N4001o20j56026p5171J4477P7251j16540j22765Q5183O891
4493C343608j07104l0762P25J09889J1108n5288R0882j7266K6843p6787j36203
4482C159645j7680J69736m3238j43029k4551p9175j3236K9486J37823R1162l8420
4471C228523j4636J89875J07673m9893M3529j65088r2024m4473J22080J16666
4461C442232o8852k52349P5078O1821k0407o2284j0781J01820o8662J2062N5306
4450C264984o585R3311O3623L2320j23889n9257j980k2081R8341M6740p3069r5707
4438C216751o1661o8550m1708n5049Q8661l0380K15842J01132j19695J27213J2684
4427C385240J7978j4616j13575J41607k5057M383n7072J4023J44351k3711K1656
$$ plain form
4504 3498487 3576927 3630928 3630308 3474282 3399111 3413588 3490839 3374299 3251534 3336717 3343608
4493 3343608 3236504 3205742 3206467 3316356 3327464 3272176 3363058 3345792 3372635 3295848 3159645
4482 3159645 3141965 3311701 3268463 3125434 3100883 3021708 3008472 3037958 3175781 3266943 3228523
4471 3228523 3213887 3403762 3511435 3461542 3505071 3339983 3247959 3203486 3325566 3442232
4461 3442232 3373380 3121031 3196109 3257930 3237523 3175239 3164458 3266278 3197616 3209678 3264984
4450 3264984 3258399 3351710 3415333 3447653 3323764 3264507 3262527 3240446 3338787 3385527 3312458 3216751
4438 3216751 3155090 3086540 3044832 2989783 3078444 3048064 3263906 3365038 3245343 3372556 3385240
4427 3385240 3403218 3388602 3275027 3416634 3391577 3395960 3338888 3352911 3497262 3473551 3495207
4416C495207J6042K0523l180k6598P135q0374L3681J12928L7481J32782L0334
4405C775961M5361J06248R4692j1227j19898M6797J03447j11229p8724N8515J77399
4394D087342O8101Q50k5221R5324K126o6498P6523K2228J11016R4893N2431K3421
4382D542536P3266R2211k93024k6747r8979j98277l1460j2658j12070k645J2210
4371C944363O7849q9866j66417J35465J15784O9051m781J6140Q0052M665j14089
4360D058216J4160P3528P2487j35485P9655J8299q6356m5941k8441k6742J7495
4349D010875j06360M3898J0303o042l8807Q2108K03201L6912k8597N7371R9234
4338D364096l319L6472R2007J64610Q8590J32270J03046J86333N7810j91026m5748
$$ plain form
4416 3495207 3511249 3531772 3528592 3501994 3509129 3428755 3462436 3575364 3612845 3745627 3775961
4405 3775961 3821322 3927570 4022262 4011035 3891137 3937934 4041381 3930152 3851428 3909943 4087342
4394 4087342 4155443 4156293 4131072 4226396 4228522 4162024 4238547 4260775 4371791 4466684 4519115 4542536
4382 4542536 4615802 4708013 4414989 4388242 4289263 4090986 4059526 4046868 3934798 3932153 3944363
4371 3944363 4012212 3922346 3755929 3891394 4007178 4076229 4071448 4087588 4167640 4172305 4058216
4360 4058216 4072376 4145904 4218391 4082906 4162561 4180860 4094504 4048563 4020122 3993380 4010875
4349 4010875 3904515 3948413 3958716 3952674 3913867 3995975 4199176 4236088 4207491 4264862 4364096
4338 4364096 4360777 4397249 4489256 4653866 4742456 4874726 4977772 5164105 5221915 5030889 4985141
4327D985141m0038P2434j23705q1702j66984k7778P685n9851q3866P672j15368
4316D373640j42311K3273Q0553J17415n8344j42759l3621K8104J02795R6011m0361
4305D404395l0580k86661j11843L2297J20785R8095p4281j24132o0798m8088j63079
4294C756110p7828K4552m9466k3258j12144n7072m150k9278j12630j32923R1564
4283C273477J14636r2680m2499l4717p449Q4517n8290l0319p5118k2297j37343
4272B971918O1085J12413j25490P3142k6768q4939l0905q7237j33669J42267J25878
4261B997695J7159m2936k7676n3693L1535m0844P7960N1090j08139k5815r8895
4250B777441q0592J17870j2575q4365K1290J15442o365r732p0065k15850p9630
$$ plain form
4327 4985141 4945103 5017537 4893832 4812130 4645146 4617368 4625053 4565202 4481336 4489008 4373640
4316 4373640 4231329 4254602 4335155 4452570 4394226 4251467 4217846 4245950 4348745 4444756 4404395
4305 4404395 4373815 4087154 3975311 4007608 4128393 4226488 4152207 4028075 3967277 3919189 3756110
4294 3756110 3678282 3702834 3653368 3630110 3517966 3460894 3456744 3427466 3314836 3181913 3273477
4283 3273477 3388113 3295433 3252934 3218217 3210768 3295285 3236995 3206676 3131558 3109261 2971918
4272 2971918 3033003 3145416 3019926 3093068 3066300 2981361 2950456 2863219 2729550 2871817 2997695
4261 2997695 3014854 2971918 2944242 2890549 2922084 2881240 2959200 3010290 2902151 2876336 2777441
4250 2777441 2696849 2814719 2802144 2717779 2739069 2854511 2848146 2838414 2768349 2552499 2472869
4239B472869J02607K09846M512q8582o1809L4223J02347l2059o0270J24832J9395
4228B827911j7691j0366R5565o020m8326k2862Q8283J90529J54623J54264Q1266
4217C487176q2346l8301j03881k03038p1179q8662J23046J45403j33036q2204
4207B952978p3512Q7941o1598j25674N3408j32522J03472R735j85903J23867j3527
4196B738665q7825O6201N7710q197L1151J3410P6088j3775n0937M9243J9961R8730
4184B990425K6464J8050j52319p4690O1913K0069J22936n4657r448O9495j56398
4173B861840O7328R7406o3215j11631L7157j19365j9719J22336M1o3122r505Q929
4161B808480N9282j1624O3711l6628M6549J09901q7260l3101J55363J5303n9497
$$ plain form
4239 2472869 2575476 2785322 2789834 2701252 2639443 2673666 2776013 2743954 2683684 2808516 2827911
4228 2827911 2810220 2799854 2895419 2889399 2841073 2818211 2906494 3097023 3251646 3405910 3487176
4217 3487176 3404830 3366529 3262648 3059610 2988431 2899769 3022815 3168218 3035182 2952978
4207 2952978 2879466 2967407 2905809 2780135 2833543 2701021 2804493 2814228 2628325 2752192 2738665
4196 2738665 2650840 2717041 2774751 2766554 2797705 2811115 2887203 2873428 2822491 2871734 2891695 2990425
4184 2990425 3016889 3034939 2882620 2807930 2869843 2889912 3012848 2958191 2948743 3018238 2861840
4173 2861840 2929168 3026574 2963359 2851728 2888885 2769520 2749801 2872137 2872178 2809056 2799551 2808480
4161 2808480 2867762 2856138 2919849 2883221 2929770 3039671 2952411 2919310 3074673 3089976 3030479
4150C030479N030l1201k6880p1726J33280P8765l4561l464k852p6751n49M3881
4138C043451j26325p2376N6911L1987K7459O1335r7910k002m8269j20697Q8351
4127B841915R2157l5851n9936K0241j09618M1922O9397J21616L3331O9354J0821
4116C095349p3532l964m2347L9345J34006q7806K0624o1003J1819N195N33q2118
4104B956101m1375J22592k2715J11932K5523m8359j379j6918o4937O1015k3810
4093C057670L1304j10725Q8560Q4524l576J08687R1588m7464j7228k6572K5503
4082C282271J48586P2358J2485k000p4975L6616J18890j15239J15761M8105J00168
4071C743026L2049J19113K7372r0571L6789J11908R4222O2665j55672P3498J14683
$$ plain form
4150 3030479 3035509 3004308 2977428 2905702 3038982 3117747 3083186 3079722 3076870 3000119 2999570 3043451
4138 3043451 2917126 2844750 2901661 2933648 2961107 3022442 2924532 2922530 2874261 2753564 2841915
4127 2841915 2934072 2898221 2838285 2858526 2748908 2790830 2860227 2981843 3015174 3084528 3095349
4116 3095349 3021817 3017853 2975506 3014851 3148857 3061051 3081675 3020672 3032491 3037686 3038219 2956101
4104 2956101 2914726 3037318 3014603 3126535 3152058 3103699 3102320 3085402 3020465 3081480 3057670
4093 3057670 3088974 2978249 3066809 3151333 3147757 3256444 3348032 3300568 3283340 3256768 3282271
4082 3282271 3430857 3503215 3515700 3513700 3438725 3475341 3594231 3478992 3594753 3642858 3743026
4071 3743026 3775075 3894188 3921560 3830989 3867778 3979686 4073908 4136573 3980901 4054399 4169082
4060D169082q791J54990J1355j255J45603l417L4224R4383J92372J41697K18765
4049E149008J28666M3493J4903K13540K93508J83036L44166K76367K40872M11241
4039G298800J67438l76r4461o0187M1133L8221r5334Q3035K57634K93835K88013
4028H217751K80774L27508J59254K18454J0680J74032J31540J8242J66588L7080
4018I741903j742K32178J26691J80738O02502O18310P98491Q90795M52015J62782
4008A3804663n55385q02240n19754k05530k04115j15939K7658k7948N1790K60842
3998A1714042J03477J52117J03539j6124j19686N6798n9926k04765j11236m9202
3988A1569034j36899j35544m6040L11766J70899K11781J95125K47878Q3514j1276
$$ plain form
4060 4169082 4160291 4315281 4326636 4325381 4470984 4467567 4501791 4596174 4788546 4930243 5149008
4049 5149008 5277674 5321167 5336070 5549610 5843118 6026154 6370320 6646687 6887559 7298800
4039 7298800 7466238 7465862 7371401 7311214 7352347 7390568 7295234 7378269 7635903 7929738 8217751
4028 8217751 8498525 8826033 8985287 9203741 9214421 9388453 9519993 9538235 9704823 9741903
4018 9741903 9740161 9972339 10099030 10279768 10882270 11500580 12299071 13189866 13641881 13804663
4008 13804663 13249278 12447038 11927284 11721754 11517639 11401700 11429358 11401410 11453200 11714042
3998 11714042 11817519 11969636 12073175 12057051 11937365 11994163 11934237 11729472 11618236 11569034
3988 11569034 11432135 11296591 11250551 11562317 11733216 11944997 12140122 12388000 12471514 12460238
3978A2460238n4805k74315l08358j60738J2075L9432j31950j33825n112n7041
3968A1385601k1803j14029M289Q811k6693j96450J44117j05801j16201L4382k48493
3957A0747730j53927L4397j22147N2611n2493j52340o2240j58588j03241L824
3947A0033586r1520k01324j36062p9318j10597k33267r4538n9634j31933o5822
3937H829571j50565l5429J42990j41783k63885j67878n4851q084j65270j00190
3927G884626j76797o9998n858j23051q8868j93848N1632o1363m1402O8119j05722
3916G137470j52652M0808n9198k02606J02205J06944j56519k41343K0960l7317
3906F558752j27193m8533j26549J2709j44364r0807n729l0132O361J9282N6151
$$ plain form
3978 12460238 12405433 12131118 11822760 11662022 11674097 11713529 11581579 11447754 11442642 11385601
3968 11385601 11363798 11249769 11254058 11262869 11236176 11039726 11183843 11078042 10961841 10996223 10747730
3957 10747730 10593803 10628200 10506053 10558664 10506171 10353831 10291591 10133003 10029762 10033586
3947 10033586 9942066 9740742 9604680 9525362 9414765 9181498 9086960 9027326 8895393 8829571
3937 8829571 8679006 8643577 8786567 8644784 8380899 8213021 8158170 8150086 7984816 7884626
3927 7884626 7707829 7637831 7631973 7508922 7420054 7226206 7277838 7216475 7175073 7243192 7137470
3916 7137470 6984818 7025626 6966428 6763822 6866027 6972971 6816452 6575109 6596069 6558752
3906 6558752 6431559 6383026 6256477 6269186 6124822 6034015 6028286 5998154 6004515 6023797 6079948
3895F079948m2894r2883k1908q5984j21167Q9124o5865M4329L9570m2325K7942
3884E807887o7630n8740o1448l3970o4910j50809J07108l3110Q3478N357o7527
3873E465686p4224p480K234N1446o5200k7490L9857l271k6939r7776j7630p4570
3861E164643R125M2170K6447J11474l0763R090p5289p2988R9907j9715j25461
3850E138640N8664J51900o1387j11118J23125J27574q2783j20197p2647K1339
3840E173110L4253J8574L8625n688n8664K0830J99465Q6484j7650k0631k6773
3829E441935l4517j0026J0458Q6791J67855R9692q3982j8127P6221l3396M7131
3818E750035k1406l4709m8068J77913R2210j28855J02869j3119j35886J71440
$$ plain form
3895 6079948 6037054 5944171 5922263 5836279 5715112 5804236 5738371 5782700 5822270 5779945 5807887
3884 5807887 5740257 5681517 5620069 5586099 5521189 5370380 5477488 5444378 5527856 5533213 5465686
3873 5465686 5391462 5383982 5386216 5437662 5372462 5344972 5384829 5381558 5354619 5256843 5239213 5164643
3861 5164643 5173768 5215938 5242385 5353859 5323096 5332186 5256897 5183909 5283816 5264101 5138640
3850 5138640 5197304 5349204 5287817 5176699 5299824 5427398 5344615 5224418 5151771 5173110
3840 5173110 5207363 5225937 5264562 5258874 5200210 5221040 5420505 5506989 5489339 5468708 5441935
3829 5441935 5407418 5397392 5407850 5494641 5662496 5762188 5678206 5660079 5736300 5702904 5750035
3818 5750035 5728629 5693920 5645852 5823765 5915975 5787120 5889989 5876870 5740984 5912424
3808E912424K2622J24110P2807O0342J34498J13510J30076J28328P0307O7746
3798F836770J16209N3704K0514M0002q1373K1254N6890L9612n4783j22254K9177
3787F955722N3483P6148J55637K31710J58431O7792L8822J4846K14203J86846
3777H153640J69878K08774J38404K0737K23673Q8237J2833J76384P1494R8407
3767I362461q8056J08148k8805k70089j7251N6149j3208k7116q577J15742K0181
3756I209579O8137J03550j48204Q0919R8742P7020K00548J31024K29329K55277
3746A0305921K10481J53567R8239K61259Q4204q6090R645J29875O1293m4710R1258
3735A1274942k1673o1003p4783j43607p9980r6020k32356N457r6283r8531N7060
$$ plain form
3808 5912424 5935046 6059156 6131963 6192305 6326803 6440313 6570389 6698717 6769024 6836770
3798 6836770 6952979 7006683 7027197 7067199 6985826 7007080 7063970 7103582 7048799 6926545 6955722
3787 6955722 7009205 7085353 7240990 7472700 7631131 7698923 7737745 7752591 7966794 8153640
3777 8153640 8323518 8532292 8670696 8691433 8915106 9003343 9016176 9192560 9264054 9362461
3767 9362461 9274405 9382553 9353748 9083659 9066408 9122557 9109349 9082233 9073656 9189398 9209579
3756 9209579 9277716 9381266 9233062 9313981 9412723 9489743 9690291 9821315 10050644 10305921
3746 10305921 10516402 10669969 10768208 11029467 11113671 11027581 11037226 11167101 11228394 11183684 11274942
3735 11274942 11253269 11192266 11117483 10973876 10893896 10797876 10565520 10570977 10474694 10376163 10433223
3724A0433223k59801o0226n2918o8425K4096k0824q4981N5000L8344p619K96902
3713A0292771J17233k2731Q2004J47936P8375J68174Q087Q7955n0753l63617j05424
3702A0440010j47684k21477j18240j56814k69314j92508j47926M7950j45045j97255
3692H891697j71743j43357q2537r8511M7628j17150p2753Q6298m4152J64279O1956
3681H521655O4135J10872m7936j3380M6669j4400r4851q8546J2699o074k45562
3670H245281M2118n6303q0141O6289N9216J7104o0195p3341L5990J50697j6514
3659H330201k694O7454P0630Q0844J95015J94204k1843L20214L91987L78924L56707
3648A0361643P4099k33656k57152k99859k00955K1400M2793L6804q413n1430R9647
$$ plain form
3724 10433223 10173422 10113196 10060278 9991853 10015949 9995125 9910144 9965144 10003488 9995869 10292771
3713 10292771 10410004 10387273 10469277 10617213 10695588 10863762 10871849 10959804 10909051 10545434 10440010
3702 10440010 10292326 10070849 9952609 9795795 9526481 9333973 9186047 9233997 9088952 8891697
3692 8891697 8719954 8576597 8494060 8395549 8443177 8326027 8253274 8339572 8295420 8459699 8521655
3681 8521655 8585790 8696662 8648726 8635346 8682015 8667615 8572764 8484218 8496917 8490843 8245281
3670 8245281 8287399 8231096 8150955 8217244 8276460 8293564 8233369 8160028 8196018 8346715 8330201
3659 8330201 8327507 8394961 8465591 8546435 8741450 8935654 8913811 9234025 9626012 10004936 10361643
3648 10361643 10435742 10202086 9944934 9645075 9444120 9465520 9508313 9545117 9536704 9485274 9584921
3637I584921O5821K56865J35849J82397J23119J54310K63890R4624J07203J80456
3627A1149455L506L0673P0744L2226N8023J18721K60494M54750O96926Q01953
3617A3677471P58936J39947l93137q49192o14147k17879j03593o8450j57150j79575
3607A1993231j9433k8104P7746Q784P6825P9198Q7671J79923J72443Q6592J14461
3596A2829337J18323J3750L9486K1747j29386q0653o8391J98864J73207J85276
3586A3301560L46964L82469K63329j84565m02002m22200L9339j36190l028K9822
3576A3215498J65989J11785j41357M8443Q6909j3908P0422L03878K73710Q3390
3566A4204759m589L1741Q5585K72433K03012p5855J03829O7057r9222q2394k9500
$$ plain form
3637 9584921 9650742 9907607 10043456 10225853 10348972 10503282 10767172 10861796 10968999 11149455
3627 11149455 11152961 11183634 11254378 11286604 11344627 11463348 11723842 12178592 12875518 13677471
3617 13677471 14436407 14576354 14183217 13334025 12719878 12501999 12398406 12329956 12172806 11993231
3607 11993231 11973798 11945694 12023440 12032224 12109049 12188247 12275918 12455841 12628284 12714876 12829337
3596 12829337 12947660 12961410 13000896 13022643 12893257 12812604 12744213 12943077 13116284 13301560
3586 13301560 13648524 14030993 14294322 14109757 13707755 13285555 13324894 13188704 13185676 13215498
3576 13215498 13381487 13493272 13351915 13400358 13487267 13473359 13543781 13847659 14121369 14204759
3566 14204759 14200170 14231911 14317496 14589929 14792941 14717086 14820915 14887972 14788750 14706356 14676856
3555A4676856j14952j22343o5361n059K6775p6627L2554p3806L8656K18853J71486
3544A4707032J27590K08609R0140K31492K28692J72611K84065K28812K25006J53744
3534A6657793J30494J15538J62663L24001K81328R7292K19517K5787J41976J76177
3524A8332566j3547J1802r2271J27074k0358N0413J64917J32145K11979N4719
3514A8959439R8911J57951K25069K51115J69184J79454K79047L31019K96546J88696
3504B1136431K38243L04569j5525K17792P4449K09415K51078O0083l1154o1648
3494B2383733J2121M6740m4818J89318J56357K19533K18309J93024J57032K94394
3484B3825743L24841L74890K94988M52403M20236L64669K53372K96607M21070
$$ plain form
3555 14676856 14561904 14439561 14374200 14369141 14395916 14319289 14351843 14278037 14316693 14535546 14707032
3544 14707032 14834622 15043231 15133371 15364863 15593555 15766166 16050231 16279043 16504049 16657793
3534 16657793 16788287 16903825 17066488 17390489 17671817 17769109 17988626 18014413 18156389 18332566
3524 18332566 18319019 18330821 18238550 18365624 18345266 18395679 18560596 18692741 18904720 18959439
3514 18959439 19058350 19216301 19441370 19692485 19861669 20041123 20320170 20651189 20947735 21136431
3504 21136431 21374674 21679243 21663718 21881510 21955959 22165374 22416452 22476535 22445381 22383733
3494 22383733 22395854 22442594 22397776 22587094 22743451 22962984 23181293 23374317 23531349 23825743
3484 23825743 24150584 24525474 24820462 25272865 25693101 26057770 26311142 26607749 27028819
3475B7028819L72555M03027N89159P62421O47578R26536Q42690Q28642Q38809
3466C3240236N77730L75962M92603L58577O57371Q20906O53778J59306o13296
3457C6723173j305859j416544j217541j235283j136587j275930j223430j049747
3449B6862252o57503n86029n15190o00761n08654m26841l11564j6614k26092M7431
3439B3060435J67956L60489N26312P71599O85858P37116O50696J035093J402048
3430B9397602K113060K729022K892502K193574M70005j345385k227785k297661
3422C3924934k036635k049351k245583k035254j535296j217243q66412q84494
3414B1054666p63248o63951n86356m51236l40453l16657k80535k03283o4788J4223
$$ plain form
3475 27028819 27401374 27804401 28393560 29155981 29803559 30730095 31572785 32401427 33240236
3466 33240236 33817966 34193928 34686531 35045108 35702479 36523385 37177163 37336469 36723173
3457 36723173 35417314 34000770 32783229 31547946 30411359 29135429 27911999 26862252
3449 26862252 26204749 25618720 25103530 24502769 23994115 23567274 23255710 23239096 23013004 23060435
3439 23060435 23228391 23588880 24115192 24886791 25572649 26309765 26960461 27995554 29397602
3430 29397602 31510662 34239684 37132186 39325760 39795765 38450380 36222595 33924934
3422 33924934 31888299 29838948 27593365 25558111 24022815 22805572 21939160 21054666
3414 21054666 20291418 19627467 19041111 18589875 18249422 17932765 17652230 17448947 17384159 17398382
3404A7398382K44750J09309K43401J95442L47813N83956Q31812J192187J261098
3395B2408150R53564L21719m79655j201083j339483j164553j053788j061373j051498
3386A6332000p25663o76318o35174m09195m76524l97733l40722l41267l83810
3377A1945594l24813k80184k02139j17767j15384n2120p2956j22547j45426j81186
3367A0331072q8720j38048n1331k28821p4768j30260j56083j90014j2638k59170
3357I001219m3333m5422p4580J0122j78019n7749j58132j38512J35842k23156
3347H228280j33797k6384L5190j78764r6002o4497l437L4182q5422l2258R5114
3336G772205r9499o9785j81725o4781O576q6057j22974P564q9290k21382p2860
$$ plain form
3404 17398382 17643132 17752441 17995842 18191284 18539097 19123053 19954865 21147052 22408150
3395 22408150 23361714 23683433 23203778 22002695 20663212 19498659 18444871 17383498 16332000
3386 16332000 15606337 14930019 14294845 13885650 13409126 13011393 12670671 12329404 11945594
3377 11945594 11620781 11340597 11138458 11020691 10905307 10853187 10780231 10657684 10512258 10331072
3367 10331072 10242352 10104304 10052973 9824152 9749384 9619124 9463041 9273027 9260389 9001219
3357 9001219 8957886 8912464 8837884 8848006 8669987 8612238 8454106 8315594 8451436 8228280
3347 8228280 8094483 8068099 8103289 7924525 7828523 7764026 7760589 7794771 7709349 7677091 7772205
3336 7772205 7672706 7602921 7421196 7356415 7362991 7276934 7153960 7161524 7072234 6850852 6777992
3325F777992N5620j9588q8271N7374p055n7313l7704j12482k925l10m4132q7430
3313F433776l6198O2927N944o5437j32056J7710J9256M8934o2791j51186n859
3302F135020r5769j10218j1769N7237K7261m5380j042j16189j29042O8007J41122
3291E919238j37540K9046p2174L9618r5550N3305j18488k2332o5380n6939Q8133
3280E560937K0498k3069p6061j826L4056L431j39712P5166M2061j10603L8186
3269E423064J4897K737R881o4603K08950L205j60780K846K136J15890l4184o8994
3257E455045k6439M9721k3051n4098N5111o2874k4938Q9401l1196J10435P5784
3246E612901m3303J11895J2164N6900P8402j33163O1993o9990M1325L5991N9556
$$ plain form
3325 6777992 6833612 6814024 6725753 6783127 6776072 6718759 6681055 6568573 6565648 6565338 6521206 6433776
3313 6433776 6397578 6460505 6466449 6401012 6268956 6286666 6305922 6354856 6292065 6140879 6135020
3302 6135020 6039251 5929033 5917264 5974501 6001762 5956382 5955340 5839151 5710109 5778116 5919238
3291 5919238 5781698 5810744 5738570 5778188 5682638 5735943 5617455 5595123 5529743 5472804 5560937
3280 5560937 5581435 5558366 5482305 5480479 5514535 5517966 5378254 5453420 5495481 5384878 5423064
3269 5423064 5437961 5440698 5450579 5385976 5594926 5598131 5437351 5440197 5442333 5558223 5524039 5455045
3257 5455045 5428606 5478327 5455276 5401178 5456289 5393415 5368477 5457878 5426682 5537117 5612901
3246 5612901 5569598 5681493 5693657 5750557 5828959 5695796 5757789 5687799 5729124 5765115 5824671
3235E824671J08418K790J71588K12342J43429l2336N7057L10830K34455J47809
3225G181053L4987P0132J81085J96466J79721K49752J26001K44480L63107M68743
3215I295527M97488N74655M27386L91502N51010M47317O50351N06413O04570M04416
3205A4350635K31298j28441l48733m09374m79865m14912l68325k07538l4211m1072
3195A2149462L2770K40088L04887J94694K52910K29847Q5146J61375K05765R6918
3185A3953862L46444N23352N80472P19560P43812P84163O73302N85323Q04364
3176A9714654Q78029R17792J126044N71465J70064k67481p30480p64851q51042
3167B0764194p73521p10026m73511k67641j46004O7625K22142K48718J55963K40042
$$ plain form
3235 5824671 5933089 5935879 6107467 6319809 6463238 6430902 6487959 6798789 7033244 7181053
3225 7181053 7216040 7286172 7467257 7663723 7843444 8093196 8219197 8463677 8826784 9295527
3215 9295527 9793015 10367670 10795056 11186558 11737568 12184885 12835236 13341649 13946219 14350635
3205 14350635 14581933 14453492 14104759 13695385 13215520 12800608 12432283 12224745 12190534 12149462
3195 12149462 12182232 12422320 12727207 12921901 13174811 13404658 13489804 13651179 13856944 13953862
3185 13953862 14300306 14823658 15404130 16123690 16867502 17651665 18324967 18910290 19714654
3176 19714654 20592683 21510475 22636519 23207984 23378048 23110567 22380087 21615236 20764194
3167 20764194 19990673 19280647 18807136 18539495 18393491 18461116 18683258 18931976 19087939 19327981
3157A9327981L11638J98129j52791k21216R19P1521j9839J11041J58182J22092
3147A9907657J07748J33266K91235J36261L69034L15015K54844J33753R3018o6242
3137B1675589K26j30676j98829l09316l42461j94832j30758K11487J81952J22671
3127B0885053M63938J62823o7135l77846n30218o52495o58597m85520p26881l42255
3117A7670867l46876j55546j61870m11406m46926n6198j56371j07449m4287J29413
3107A5913351l7526K0825K31639M2153k5631M2507N0799n7254Q9482j48122j40692
3096A5981531k51066k75326j54604k19182n58257m19779l58656k67409l48207
3087A3129045m54865j51260l25464j91857p6046j35353j60608l2318p5753j40898
$$ plain form
3157 19327981 19639619 19837748 19684957 19463741 19464660 19536181 19516342 19627383 19785565 19907657
3147 19907657 20015405 20148671 20439906 20576167 20945201 21260216 21515060 21648813 21741831 21675589
3137 21675589 21675815 21545139 21346310 21036994 20694533 20499701 20368943 20580430 20762382 20885053
3127 20885053 21348991 21511814 21444679 21066833 20536615 19884120 19225523 18740003 18013122 17670867
3117 17670867 17323991 17168445 17006575 16595169 16148243 16092045 15935674 15828225 15783938 15913351
3107 15913351 15875825 15896650 16128289 16170442 16144811 16187318 16238117 16180863 16270345 16122223 15981531
3096 15981531 15730465 15455139 15300535 15081353 14523096 14103317 13744661 13477252 13129045
3087 13129045 12674180 12522920 12197456 12005599 11929553 11794200 11633592 11601274 11525521 11384623
3077A1384623k09565r7867m9368j65740j08471k00809j18770j23166k05956k22569
3067I882342l13022k29399j27676j26747o8247k28298k52996o1937m7927j83869
3057H242224p4185j70599j35179N5651j61887l6510o7862q6643j51057j12888
3047G301065j09128k7636K7787p5242k15497j60130M4474q5263q5636j61057k9612
3036F424125L0891M3080j49141j36876r2763j11111j08914j4063J6238k4651o6899
3025E809916j62329j70191k5885j11194J6743O2515j72294r4615m7913l6608l16
3014E067829j40363j37761L7727o2293n6556o9918m040n1620j1577j44147j55866
3003D271415O8206m2952r3910K1611j95478p6742M3748j01952j1215N486Q036
$$ plain form
3077 11384623 11175058 11077191 11027823 10862083 10753612 10552803 10434033 10310867 10104911 9882342
3067 9882342 9569320 9339921 9212245 9085498 9017251 8788953 8535957 8474020 8426093 8242224
3057 8242224 8168039 7997440 7862261 7917912 7756025 7719515 7651653 7565010 7413953 7301065
3047 7301065 7191937 7164301 7192088 7116846 6901349 6741219 6785693 6700430 6614794 6453737 6424125
3036 6424125 6455016 6498096 6348955 6212079 6119316 6008205 5899291 5885228 5901466 5876815 5809916
3025 5809916 5647587 5477396 5451511 5340317 5357060 5419575 5247281 5152666 5104753 5068145 5067829
3014 5067829 4927466 4789705 4827432 4765139 4708583 4638665 4634625 4583005 4571428 4427281 4271415
3003 4271415 4339621 4296669 4202759 4224370 4028892 3952150 3995898 3893946 3882731 3888217 3896253
2992C896253n9564j05135J6836n8787m3401l9318n2903r5587K6788m8430j22178
2981C314574l1831j96211l9546k3950Q7835l9197p1839k2924M0750L9827l8302
2970C019186j51068L3139K5464p825m9567j35436m2425l5445M0556q3854n3406
2959B559319q0685j2394l212L8944j20811j5462k4522q8597P9768J9052j17948
2948B233452J3696J2114p4915q1222j2190K0784P0626M0193r2602p863M7877j09075
2936B060875j12916k6702q2881n8474m0149J41978J19395m2256l0518n3209N1732
2925A926875j10143J2783O6858j19364k9934m9602l8034M6772p2867o6767J11795
2914A678372p7073o8398r4323J31397m0583p8631k6987k8592K08750k9232j31924
$$ plain form
2992 3896253 3836689 3731554 3748390 3689603 3646202 3606884 3553981 3458394 3485182 3436752 3314574
2981 3314574 3282743 3086532 3046986 3023036 3110871 3071674 2999835 2976911 3017661 3057488 3019186
2970 3019186 2868118 2901257 2926721 2918896 2869329 2733893 2691468 2656023 2696579 2612725 2559319
2959 2559319 2478634 2466240 2463028 2501972 2381161 2365699 2341177 2252580 2332348 2351400 2233452
2948 2233452 2247148 2259262 2184347 2103125 2090935 2111719 2182345 2222538 2129936 2122073 2169950 2060875
2936 2060875 1947959 1921257 1838376 1779902 1739753 1881731 2001126 1958870 1928352 1875143 1926875
2925 1926875 1816732 1829515 1896373 1777009 1747075 1697473 1659439 1706211 1633344 1566577 1678372
2914 1678372 1601299 1532901 1438578 1569975 1529392 1450761 1423774 1395182 1603932 1574700 1442776
2903A442776Q1410j719r7202O560k1237L7689M4838q5804O4079J67881j41438
2892A497833p4859k8083j6002j46382N6494K3687j30308Q9302J14616j24393q0475
2881A181430Q8041O3849p9171R790r998j9429M8547K5984j2096j31499Q6385q7245
2869A164588j8165J04795m8036L8229J01896j6458j29401j01063R8657J058M0594
2858A236694l3338j6228M0305L8498O3519r5978p6802r9650m0815k1765O7481
2847A061921j7616j20332R1362P6360P9488r4429j50662O5673L4964j08882P7199
2836I95046O668l7346J12156n1134j10237q202R6284n0193o9127n7105j74630
2825F52180J5350J01017q3768M6854J51412j01170k3548m8946Q7705o3852M4704
$$ plain form
2903 1442776 1524186 1522467 1425265 1431825 1410588 1448277 1493115 1407311 1471390 1639271 1497833
2892 1497833 1422974 1394891 1378889 1232507 1289001 1312688 1182380 1271682 1386298 1261905 1181430
2881 1181430 1269471 1333320 1254149 1263939 1253941 1234512 1283059 1309043 1296947 1165448 1251833 1164588
2869 1164588 1146423 1251218 1203182 1241411 1343307 1326849 1197448 1096385 1195042 1196100 1236694
2858 1236694 1203356 1187128 1227433 1265931 1329450 1233472 1156670 1057020 1016205 994440 1061921
2847 1061921 1044305 923973 1015335 1091695 1171183 1076754 926092 991765 1026729 917847 995046
2836 995046 1001714 964368 1076524 1025390 915153 906951 1003235 953042 883915 826810 652180
2825 652180 667530 768547 684779 731633 883045 781875 758327 709381 797086 733234 777938
2814G77938M4047r6093n4276n190J06438l0450j16193M0399k3410R4415M0636
2803G78261m5519P288r5825n7996N6727o4309M0700j7990J3469M8099j57782O4660
2791E69783J30790j6969k9014M9036n9861r1741l4202L4406N0183k39m4975J22056
2779F79253J02483K2303j71537j46879L6607J23779j12576J1778O6891m9832m4427
2768E17843m9960J61852K9272l6184l7149k36024J26841N2675J22926j32570o4563
2757D54959q2432l9051J70978J1379m133Q8754k6648M6844j6535n513n372j61047
2745D32183n0569M6223M4935k3996m6048m022N2218P0846p6773r0191j2170k7654
2733C14982J00616J54958j44710n0854J04110q1247J10920m5759k7450R4627k821
$$ plain form
2814 777938 821985 725892 671616 666426 772864 742414 626221 666620 643210 737625 778261
2803 778261 732742 740030 644205 586209 642936 578627 619327 601337 614806 662905 505123 569783
2791 569783 700573 683604 654590 703626 643765 552024 517822 552228 602411 602172 557197 679253
2779 679253 781736 804039 632502 485623 522230 646009 533433 545211 612102 562270 517843
2768 517843 467883 629735 659007 622823 585674 349650 476491 529166 652092 519522 454959
2757 454959 372527 333476 504454 515833 511700 600454 573806 620650 604115 598602 593230 432183
2745 432183 381614 427837 472772 448776 402728 398706 450924 521770 444997 354806 342636 314982
2733 314982 415598 570556 425846 374992 479102 397855 508775 463016 435566 530193 527372
2722E27372j16458o8811r788k6258K6787J94581R753j00960J47748J367p9558
2711E05775l4374j42590n5278q072R1530P2488N0421L8299r2388j56797n926q753
2699B54335J83146Q0647k41282Q5271J17531j33675j3688L9297m7292r2553o1152
2688A70585L9113J43590q6821n5569K7397M0845n4552j2849m9776J19239n5393
2677B25809j04943P9423L6820j13727O7467J5352m7503O397J74064K52526q2001
2666E09684m9930j36825m1191m9388N8818m6202P3033n8667j35322L6497M7208
2655B07715L0067j25067l7154J58052k1634K3345J27793M0503q4947p3923J5560
2644B60310O9204r2921m0228L5563R0640K4617M8442j75890n7001J13261q0551
$$ plain form
2722 527372 410914 342103 332315 306057 332844 527425 537178 436218 583966 585333 505775
2711 505775 471401 328811 273533 265461 356991 429479 479900 518199 425811 269014 263088 254335
2699 254335 437481 518128 276846 362117 479648 345973 332285 371582 324290 231737 170585
2688 170585 209698 353288 266467 210898 238295 279140 224588 211739 161963 281202 225809
2677 225809 120866 200289 237109 123382 190849 206201 158698 165095 339159 591685 509684
2666 509684 459754 322929 281738 232350 291168 244966 317999 259332 124010 160507 207715
2655 207715 237782 112715 75561 233613 211979 235324 363117 403620 318673 244750 260310
2644 260310 329514 236593 196365 231928 322568 347185 395627 219737 162736 275997 195446
2633A95446J5961p9927m9526j2919J06845P485O9239K0509j7165M9043N3092L2273
2621C90356p1891j12272K0857l4923L8694r1445M4920K7943J468o4298j505J34798
2609B82702l735J15452j19916o8567P5402R789l637P2709n884P8828k1070j24785
2597B87288J4664M0935R2240J08522J11867R8883r3299k30582r9187J8621k7388
2586C22564J31697j27446j82829J8235L5513P0174M7927j47154J4638J19784p5808
2575B27295K5738L0663m2849j53628Q5871o690J71693o2424l3406o7405j6536
2564A58322j3502K4002M6631J29058q4230j09295l3230K6781R9024j52207k9113
2553F2241k7772O3616n1048J51190M0567n7289r9791K1350J43868M1509j39347
$$ plain form
2633 195446 211407 131480 81954 69035 175880 183365 252604 273113 255948 304991 358083 390356
2621 390356 318465 206193 227050 192127 230821 139376 184296 212239 213707 149409 147904 282702
2609 282702 278967 394419 274503 205936 281338 291127 287490 360199 354315 433143 412073 287288
2597 287288 301952 342887 435127 543649 655516 754399 661100 430518 331331 349952 322564
2586 322564 454261 326815 143986 162221 197734 267908 315835 168681 183319 303103 227295
2575 227295 253033 283696 240847 87219 173090 166400 338093 275669 242263 174858 158322
2564 158322 144820 168822 215453 344511 260281 150986 117756 144537 243561 91354 62241
2553 62241 34469 98085 47037 198227 238794 181505 81714 103064 246932 288441 149094
2542A49094L6105o1696m7990N2723R0253k884j7015M2247l3485o3118o5671J45363
2530B23926J8575j22941j00887p7518J05760J58444o7633n7155R9588J24561r7022
2519B07698r2302L1394j13116l168P5483Q9046l639P5250q0983O4305o7242M3751
2507B26477j2531j70381M6428J08354j66956k0125R1253r3831L8284Q7615o539
2496A28048l4281J01739N5660m830M6171p1467j55195J5957L5305K45473j42739
2485B19841j30774N405l7179J41617K4333K4485Q1386m7999j61855M6183j02142
2474F3301N0056J30107q9187l1562l8015R522l1422J5187j7397Q2178M694l4870
2462A12592k2231j6344k5679R3998m3254L2474J27704L1824j35149m4640Q2848
$$ plain form
2542 149094 185199 123503 75513 128236 218489 215605 198590 240837 207352 144234 78563 223926
2530 223926 242501 119560 18673 -58845 46915 205359 137726 80571 180159 304720 207698
2519 207698 115396 146790 33674 30506 105989 195035 191396 266646 185663 249968 182726 226477
2507 226477 213946 43565 89993 198347 31391 11266 102519 8688 46972 134587 128048
2496 128048 93767 195506 251166 246336 292507 221040 65845 81802 117107 362580 219841
2485 219841 89067 94472 57293 198910 223243 247728 329114 281115 119260 165443 63301
2474 63301 113357 243464 154277 122715 84700 94222 62800 77987 60590 142768 147462 112592
2462 112592 90361 74017 48338 142336 99082 131556 259260 291084 155935 111295 194143
2451A94143P3305N0795j53124o4097M7725R8848k1410j20773j4664O6536O0543
2440B17827J35046J0105Q1339p4919j91393L813K6924J03659L2975m4984L8764
2429C39156j07911m0516J45667j55960J47399m3298q2048O1669N6719o8465m4831
2418B07581j01444J53527K00772r7244j2726J76257L248j76181k2560K2473j3424
2407C40279L0841J28763J6816K0221j30283l8214M4462O3194n3444M9547j54513
2396C17669Q488J33169o1559J18208J30306j412K7491O1287k8811j94612J14834
2385F25058J26717j03800J64471M4288L1831q006L8956K0250M7307j18500j56
2374H68416P5141L6571J11479j8313P4035K7500M4173K05170J59975R9391J97916
$$ plain form
2451 194143 267448 318243 165119 101022 148747 247595 226185 105412 90748 157284 217827
2440 217827 352873 362978 444317 369398 178005 181818 208742 312401 345376 300392 339156
2429 339156 231245 190729 336396 180436 327835 284537 202489 264158 320877 252412 207581
2418 207581 106137 259664 460436 363192 350466 526723 529971 353790 331230 353703 340279
2407 340279 371120 499883 516699 536920 406637 368423 412885 476079 422635 472182 317669
2396 317669 326157 459326 397767 515975 646281 644869 672360 733647 704836 510224 625058
2385 625058 751775 647975 812446 856734 888565 880559 919515 939765 987072 868572 868416
2374 868416 943557 980128 1091607 1073294 1147329 1174829 1219002 1424172 1584147 1683538 1881454
2363A881454P0412J71574K23602J33536J50482J36542N4878K96502L34678K59328
2353C712988K38329M24000M27656N05605N61431M99656L42021L52074K93753O68761
2343H026274O93305R07092O92324O96012M60367M92091Q61360J069463J232594
2334A5130882J719429K254416L160848M366539O103053P627814J0828362J1097779
2326F2289122L605639m906548j2090960j0550107o628600m864143l875873l135309
2318A9843221k373799j705900j205013j014235r15717q23290o64510n35075q00786
2309I804896p28157o56653p36322m84184m81499n04583l45832k15337l10508j67505
2299E174316j67869k83593l34560k46660m0882j26552l05417j63069p2713j06079
$$ plain form
2363 1881454 1951866 2123440 2347042 2480578 2631060 2767602 2822480 3118982 3453660 3712988
2353 3712988 3951317 4375317 4802973 5308578 5870009 6369665 6711686 7063760 7357513 8026274
2343 8026274 8719579 9626671 10318995 11015007 11475374 11967465 12828825 13898288 15130882
2334 15130882 16850311 19104727 22265575 26632114 32735167 40362981 51191343 62289122
2326 62289122 65894761 60988213 48897253 38347146 31718546 26854403 22978530 19843221
2318 19843221 17469422 15763522 14558509 13544274 12628557 11805267 11140757 10605682 9804896
2309 9804896 9076739 8420086 7683764 7199580 6718081 6213498 5867666 5652329 5341821 5174316
2299 5174316 5006447 4722854 4388294 4141634 4100752 3974200 3668783 3505714 3433001 3326922
2289C326922p4642j60816r9606j86280j01743J07319k41775p9198j966o1754k03047
2278B223414K3103j17514q0573k04064n2081j12626j21569O6518R0399j8556n2819
2267A643632k91644R0781P4181p1278m1284N1752N6062r0458K3385j2910j51501
2256A280718j13521N1203O3607j48156K8605P515k1917K3139r9954p1165K1664
2245A021738n6232k2513M680J075k7826N8585J09866k06910L0954m6069K0193
2234H87541o6506J0852K9134N9712j24636j4290k308N6937l9508k6225j67162
2223F03541k4980k6297k5709K29149N0166j22271k28225m0068J77312q5105k026
2212E05487J01132O6945p074k07679P5860n5165M4111P0226j44820p9568O9585
$$ plain form
2289 3326922 3252280 3091464 2991858 2805578 2703835 2811154 2569379 2490181 2488215 2426461 2223414
2278 2223414 2246517 2129003 2048430 1844366 1792285 1679659 1558090 1624608 1715007 1696451 1643632
2267 1643632 1351988 1442769 1516950 1445672 1404388 1456140 1512202 1421744 1445129 1432219 1280718
2256 1280718 1167197 1218400 1282007 1133851 1162456 1169971 1148054 1171193 1071239 1000074 1021738
2245 1021738 965506 942993 947673 948748 920922 979507 1089373 882463 913417 867348 887541
2234 887541 821035 831887 861021 920733 796097 781807 779499 836436 796928 770703 603541
2223 603541 578561 552264 526555 755704 805870 683599 455374 415306 592618 507513 505487
2212 505487 606619 673564 666490 458811 534671 479506 523617 593843 449023 369455 439040
2201D39040p128L703n2806l7679Q1100J29190N8006k2392n4j86785j05061J66109
2189D65243O8257q0757n8823K4891M2078Q0582m4276l4446k5072j2488r0431p5567
2177B59191J05048J00776o6601o5757l9769R1121O3324J07292M4429j62026L8900
2166D75928r0388l9090L7127m9917m6785Q1145j24597k2216L3211K013r4224n8733
2154A03474M8784J34800M4950m6359r7712O5694m7272K499o4334p2898J69277
2143B40903r6660l5688J1977M4013O0666j3371q4540J13861N5170m4570j22669
2132A29092J0165J05082k9009L6485M0850K4695q3859n1508j69947K48238J10868
$$ plain form
2201 439040 431912 435615 382809 345130 426230 555420 613426 591034 590980 404195 299134 465243
2189 465243 533500 452743 393920 418811 460889 541471 497195 462749 437677 425189 334758 259191
2177 259191 364239 465015 398414 332657 292888 384009 447333 554625 599054 437028 475928
2166 475928 385540 346450 383577 333660 286875 368020 243423 221207 254418 256431 162207 103474
2154 103474 152258 287058 332008 285649 187937 253631 206359 208858 144524 71626 240903
2143 240903 144243 108555 120532 164545 225211 211840 127300 241161 296331 251761 129092
2132 129092 139257 244339 215330 251815 292665 317360 233501 181993 12046 260284 371152
$$ [...]
##END NTUPLES=NMR SPECTRUM
##END=
