##TITLE=1H_DE-80H_X3
 200.13MHz, d2o
 8 sc
 
 19ns.26.2.2025
##JCAMPDX= 6.0         $$ Bruker NMR JCAMP-DX V2.0
##DATA TYPE= NMR SPECTRUM
##DATA CLASS= NTUPLES
##ORIGIN= UXNMR, Bruker Analytische Messtechnik GmbH
##OWNER= pz
$$ XWIN-NMR		Version 3.5
$$ Wed Jun 18 14:51:13 2025 Russian Standard Time (UT+4h)  Yarkov@DPX200
##.OBSERVE FREQUENCY= 200.1313
##.OBSERVE NUCLEUS= ^1H
##.ACQUISITION MODE= SIMULTANEOUS
##.ACQUISITION SCHEME= undefined
##.AVERAGES= 8
##.DIGITISER RES= 18
##SPECTROMETER/DATA SYSTEM= spect
##.PULSE SEQUENCE= zg30
##.SOLVENT NAME= DMSO
##.SHIFT REFERENCE= (INTERNAL, DMSO, 0, 15.4626)
##AUDIT TRAIL= $$ (NUMBER, WHEN, WHO, WHERE, WHAT)
$$ ##TITLE= Audit trail, XWIN-NMR		Version 3.5
$$ ##JCAMPDX= 5.01
$$ ##ORIGIN= Bruker BioSpin GmbH
$$ ##OWNER= Yarkov
$$ C:/Bruker/XWIN-NMR/data/yarkov2/nmr/H-C/1/pdata/1/auditp.txt
$$ ##AUDIT TRAIL=  $$ (NUMBER, WHEN, WHO, WHERE, WHAT)
(   1,<2025-06-18 14:49:24.64 +0400>,<Yarkov>,<DPX200>,
      <created by zg, POWCHK disabled, PULCHK disabled
       configuration hash MD5:
       00 E9 B6 7A A2 85 ED C7 34 08 36 98 17 FE 4E 26
       data hash MD5: 16K
       8B 1E B3 CA A3 20 CC D7 F4 F2 BF D4 94 4A 9A BD>)
(   2,<2025-06-18 14:49:55.32 +0400>,<Yarkov>,<DPX200>,
      <Start of raw data processing
       efp BC_mod = 2 LB = 0.25 FT_mod = 6 PKNL = 1 PHC0 = -1717.525 PHC1 = 7.966575 SI = 16K 
       data hash MD5: 16K
       D5 B7 5E B0 2B 84 10 78 E4 C1 0A B6 6A 53 80 50>)
(   3,<2025-06-18 14:50:15.14 +0400>,<Yarkov>,<DPX200>,
      <pk PHC0 = 8.785253 PHC1 = -4.8 
       data hash MD5: 16K
       6A 8A CF 72 EB B8 04 A8 7B 8F 6B 2D D9 A9 E3 E0>)
(   4,<2025-06-18 14:50:18.50 +0400>,<Yarkov>,<DPX200>,
      <abs ABSG = 5 
       data hash MD5: 16K
       AC FB 6D CE 2C D4 BB D0 8C 9F FF C6 0A 45 42 EE>)
$$ ##END=
$$ 
$$ hash MD5
$$ B8 A8 59 6D 7A 40 76 E6 5C 4E 85 86 C7 1E 12 BB
##$RELAX= 
##$RELAX= 
##$RELAX= 
##$RELAX= 
##$RELAX= 
##$RELAX= 
$$ Bruker specific parameters
$$ --------------------------
##$DU= <C:/Bruker/XWIN-NMR>
##$EXPNO= 1
##$NAME= <H-C>
##$PROCNO= 1
##$TYPE= <nmr>
##$USER= <yarkov2>
##$AMP= (0..31)
100 100 100 100 100 100 100 100 100 100 100 100 100 100 100 100 100 100 
100 100 100 100 100 100 100 100 100 100 100 100 100 100 
##$AQSEQ= 0
##$AQ_mod= 1
##$AUNM= <au_zg>
##$AUTOPOS= <>
##$BF1= 200.13
##$BF2= 200.13
##$BF3= 200.13
##$BF4= 200.13
##$BF5= 200.13
##$BF6= 200.13
##$BF7= 200.13
##$BF8= 200.13
##$BYTORDA= 1
##$CFDGTYP= 0
##$CFRGTYP= 5
##$CHEMSTR= <none>
##$CNST= (0..31)
1 1 145 1 1 1 1 1 1 1 1 1 1 1 1 1 1 1 1 1 1 1 1 1 1 1 1 1 1 1 1 1 
##$CPDPRG= <>
##$CPDPRG1= <>
##$CPDPRG2= <>
##$CPDPRG3= <>
##$CPDPRG4= <mlev>
##$CPDPRG5= <mlev>
##$CPDPRG6= <mlev>
##$CPDPRG7= <mlev>
##$CPDPRG8= <mlev>
##$CPDPRGB= <>
##$CPDPRGT= <>
##$D= (0..31)
0 0.7 0 0 0 0 0 0 0 0 0 0.03 0 0 0 0 0 0 0 0 0 0 0 0 0 0 0 0 0 0 0 0 
##$DATE= 1750243764
##$DBL= (0..7)
120 120 120 120 120 120 120 120 
##$DBP= (0..7)
150 150 150 150 150 150 150 150 
##$DBP07= 0
##$DBPNAM0= <>
##$DBPNAM1= <>
##$DBPNAM2= <>
$$ [...]
##$SUBNAM3= <"">
##$SUBNAM4= <"">
##$SUBNAM5= <"">
##$SUBNAM6= <"">
##$SUBNAM7= <"">
##$SUBNAM8= <"">
##$SUBNAM9= <"">
##$SW= 18.0517328524113
##$SWIBOX= (0..15)
0 0 2 0 0 0 0 0 0 0 0 0 0 0 0 0 
##$SW_h= 3612.71676300578
##$TD= 16384
##$TD0= 1
##$TE= 0
##$TE2= 300
##$TE3= 300
##$TEG= 300
##$TL= (0..7)
0 120 120 120 120 120 120 120 
##$TP= (0..7)
150 150 150 150 150 150 150 150 
##$TP07= 0
##$TPNAME0= <>
##$TPNAME1= <>
##$TPNAME2= <>
##$TPNAME3= <>
##$TPNAME4= <>
##$TPNAME5= <>
##$TPNAME6= <>
##$TPNAME7= <>
##$TPOAL= (0..7)
0.5 0.5 0.5 0.5 0.5 0.5 0.5 0.5 
##$TPOFFS= (0..7)
0 0 0 0 0 0 0 0 
##$TUNHIN= 0
##$TUNHOUT= 0
##$TUNXOUT= 0
##$USERA1= <user>
##$USERA2= <user>
##$USERA3= <user>
##$USERA4= <user>
##$USERA5= <user>
##$V9= 5
##$VALIST= <valist>
##$VCLIST= <CCCCCCCCCCCCCCC>
##$VD= 0
##$VDLIST= <DDDDDDDDDDDDDDD>
##$VPLIST= <PPPPPPPPPPPPPPP>
##$VTLIST= <TTTTTTTTTTTTTTT>
##$WBST= 1024
##$WBSW= 4
##$XGAIN= (0..3)
0 0 0 0 
##$XL= 0
##$YL= 0
##$YMAX_a= 96017
##$YMIN_a= -66987
##$ZGOPTNS= <>
##$ZL1= 120
##$ZL2= 120
##$ZL3= 120
##$ZL4= 120
##$ABSF1= 15.5056
##$ABSF2= -2.546249
##$ABSG= 5
##$ABSL= 3
##$ALPHA= 0
##$AQORDER= 0
##$ASSFAC= 0
##$ASSFACI= 0
##$ASSFACX= 0
##$ASSWID= 0
##$AUNMP= <proc_1d>
##$AZFE= 0.1
##$AZFW= 0.1
##$BCFW= 0
##$BC_mod= 2
##$BYTORDP= 0
##$COROFFS= 0
##$CY= -3
##$DATMOD= 1
##$DC= 0
##$DFILT= <>
##$DTYPP= 0
##$F1P= 0
##$F2P= 0
##$FCOR= 1
##$FTSIZE= 16384
##$FT_mod= 6
##$GAMMA= 0
##$GB= 0
##$INTBC= 1
##$INTSCL= 3.241238e-09
##$ISEN= 128
##$LB= 0.25
##$LEV0= 0
##$LPBIN= 0
##$MAXI= 10000
##$MC2= 0
##$MEAN= 0
##$ME_mod= 0
##$MI= 1.114404
##$NCOEF= 0
##$NC_proc= -10
##$NLEV= 6
##$NOISF1= 3.799351
##$NOISF2= 2.8
##$NSP= 0
##$NTH_PI= 0
##$NZP= 0
##$OFFSET= 15.46263
##$PC= 1
##$PHC0= -1708.74
##$PHC1= 3.166575
##$PH_mod= 1
##$PKNL= yes
##$PPARMOD= 0
##$PSCAL= 0
##$PSIGN= 0
##$REVERSE= no
##$SF= 200.130011823653
##$SI= 16384
##$SIGF1= 3
##$SIGF2= 2
##$SINO= 0.751879
##$SIOLD= 32768
##$SREGLST= <19F.Aceton>
##$SSB= 0
##$STSI= 16384
##$STSR= 0
##$SW_p= 3612.71676300578
##$SYMM= 0
##$S_DEV= 0
##$TDeff= 16384
##$TDoff= 0
##$TI= <>
##$TILT= no
##$TM1= 0
##$TM2= 0
##$TOPLEV= 0
##$USERP1= <user>
##$USERP2= <user>
##$USERP3= <user>
##$USERP4= <user>
##$USERP5= <user>
##$WDW= 1
##$XDIM= 16384
##$YMAX_p= 418029520
##$YMIN_p= -1454530
$$ End of Bruker specific parameters
$$ ---------------------------------
##NTUPLES= NMR SPECTRUM
##VAR_NAME=  FREQUENCY,     SPECTRUM/REAL,   SPECTRUM/IMAG
##SYMBOL=    X,             R,               I
##VAR_TYPE=  INDEPENDENT,   DEPENDENT,       DEPENDENT
##VAR_FORM=  AFFN,          ASDF,            ASDF
##VAR_DIM=   16384,         16384,           16384
##UNITS=     HZ,            ARBITRARY UNITS, ARBITRARY UNITS
##FACTOR=    0.220516191357247, 1,           1
##FIRST=     3094.53637914245, 0,            0
##LAST=      -518.180383863333, 0,           0
##MIN=       -518.180383863333, -1454530,    0
##MAX=       3094.53637914245, 418029520,    0
$$ Real data points
##PAGE= N=1
##DATA TABLE= (X++(R..R)), XYDATA
$$ [...]
7280C2931471l18616M51188L24313k40670k76012k88880Q6498M9132q3343n27268
$$ 32931471 32612855 33064043 33388356 33147686 32871674 32582794 32669292 32718424 32635081 32107813
7270C2107813K14053R364N22880n12107k98735L86543l9933m19124k14563o50068
$$ 32107813 32321866 32331230 32854110 32342003 32043268 32429811 32389878 31970754 31756191 31106123
7260C1106123l48107K27860L21304K50898l10005j44377p35484l55031L03263
$$ 31106123 30758016 30985876 31307180 31558078 31248073 31103696 30368212 30013181 30316444
7251C0316444N44555L09293k46835q86759m8164l61286l0154P45335j85674Q6365
$$ 30316444 30860999 31170292 30923457 30036698 29988534 29627248 29597094 30342429 30156755 30243120
7241C0243120P03533r8346L73691p148L522O48513p8150J31704k39658q8509L58112
$$ 30243120 30946653 30848307 31221998 31214850 31218372 31866885 31788735 31920439 31680781 31592272 31950384
7230C1950384J04060O8680L96241R560K09991P25432Q39251m33975K9494L74428
$$ 31950384 32054444 32123124 32519365 32528925 32738916 33464348 34303599 33869624 33899118 34273546
7220C4273546K68797N40912o1577J064467R55893P17152Q20847q4460M80084L38596
$$ 34273546 34542343 35083255 35021678 36086145 37042038 37759190 38580037 38495577 38975661 39314257
7210C9314257P97642J117664Q05594R41983J120888J154142J133474J276355J301925
$$ 39314257 40111899 41229563 42035157 42977140 44098028 45252170 46385644 47661999 48963924
7201D8963924K539135K521468K768381K569507L312744L541487M125339M099709
$$ 48963924 51503059 54024527 56792908 59362415 62675159 66216646 70341985 74441694
7193G4441694L905105N242424M780408M381547M063166L340466K392021N77016
$$ 74441694 78346799 83589223 88369631 92751178 96814344 100154810 102546831 103123847
7185A03123847k519194m611753n440123o292813n828527n214145n042490m559378
$$ 103123847 100604653 95992900 90552777 84259964 78431437 73217292 68174802 63615424
7177F3615424l549505k556467k146702k222214k167152j559603j726974j701636
$$ 63615424 60065919 57509452 55362750 53140536 50973384 49413781 47686807 45985171
7169D5985171j453951j331453j941002j318771j172648j363931j233829j253880
$$ 45985171 44531220 43199767 41258765 39939994 38767346 37403415 36169586 34915706
7161C4915706p63229l73169p37426j015643p81262q89152r83910k71576q89978
$$ 34915706 34152477 33779308 33041882 32026239 31244977 30355825 29371915 29100339 28210361
7152B8210361r92824r7236o56678J3711J98441l45156j001670o94224l9325l26100
$$ 28210361 27217537 27120301 26463623 26477334 26675775 26330619 25328949 24634725 24595400 24269300
7142B4269300l48826n48699m93993m47947o67710r3416J27214l72902j036225
$$ 24269300 23920474 23371775 22877782 22429835 21762125 21668709 21795923 21423021 20386796
7133B0386796l1130k0849n60658k77566p44947r4661k55002m43128k08667m6083
$$ 20386796 20355666 20334817 19774159 19496593 18751646 18656985 18401983 17958855 17750188 17704105
7123A7704105q778o19091J08329p13998k14319j65791q5628R0568k43093k96638
$$ 17704105 17695327 17076236 17184565 16470567 16256248 16090457 16004829 16095397 15852304 15555666
7113A5555666m39917k75240l65106J24947j89915k48193o911m19517k93915J18284
$$ 15555666 15115749 14840509 14475403 14600350 14410435 14162242 14155331 13735814 13441899 13560183
7103A3560183K3449L69688l37066l16753q764m50723j78124L2302r1125o9962
$$ 13560183 13583632 13953320 13616254 13299501 13290737 12840014 12661890 12694192 12603067 12533105
7093A2533105L96789k61696p23174r3532l48292J27852J39102l48248l64551m16693
$$ 12533105 12929894 12668198 11945024 11851492 11503200 11631052 11770154 11421906 11057355 10640662
7083A0640662R9688k4232n0061k92251K55140K34135o12099l57858k5560n20459
$$ 10640662 10740350 10716118 10666057 10373806 10628946 10863081 10250982 9893124 9867564 9347105
7073I347105k65935J87867K92136K29611M7273n730n83140o0243l75897J37436
$$ 9347105 9081170 9269037 9561173 9790784 9838057 9832327 9249187 9188944 8813047 8950483
7063H950483m53698j19381J48426J29893P4453J24982k57683K46997k35018o29552
$$ 8950483 8496785 8377404 8525830 8655723 8730176 8855158 8597475 8844472 8609454 7979902
7053G979902L19597o00514Q84757L51085m40589k37428J29108q0197n73769K10639
$$ 7979902 8299499 7698985 8583742 8934827 8494238 8256810 8385918 8305721 7731952 7942591
7043G942591l81559M57104J78369L11089m26720o54828L49994K89375n52787p42488
$$ 7942591 7561032 8018136 8196505 8507594 8080874 7426046 7776040 8065415 7512628 6770140
7033F770140N29991J11714M37531K0474k73292l0210l5721K27964m60615k4141
$$ 6770140 7300131 7411845 7849376 7869850 7596558 7566348 7530627 7758591 7297976 7273835
7023G273835l33505j31418L19457K56322L39554j33363P28069J90144k55985k56980
$$ 7273835 6940330 6808912 7128369 7384691 7724245 7590882 8318951 8509095 8253110 7996130
7013G996130l71980k51387K72139k62395q37419O9155L04957K17308j16274J08328
$$ 7996130 7624150 7372763 7644902 7382507 6545088 6614243 6919200 7136508 7020234 7128562
7003G128562o64818m55900J65307l41761J1420J41608P4539k97119M92409O5758
$$ 7128562 6463744 6007844 6173151 5831390 5842810 5984418 6058957 5761838 6254247 6320005
6993F320005n90662J97995N34209j83352n19433l62023J04795L25968N14320M18404
$$ 6320005 5729343 5927338 6461547 6278195 5758762 5396739 5501534 5827502 6341822 6760226
6983F760226m64881k71363P8126k31217j11709l04120K7515j53166O32177k8995
$$ 6760226 6295345 6023982 6102108 5870891 5759182 5455062 5482577 5329411 5961588 5932593
6973E932593n0939J04053Q2920J9859j26140j16620n65541J36659n87838j80705
$$ 5932593 5881654 5985707 6068627 6088486 5962346 5845726 5280185 5416844 4829006 4648301
6963D648301P55332O7028n92989O39286J8225k4706j59846l06150R6226J39537
$$ 4648301 5403633 5470661 4877672 5516958 5535183 5510477 5350631 5044481 5140707 5280244
6953E280244M55088p2425j14425r9522J30456P50634K9682n87014N36773j66089
$$ 5280244 5735332 5662907 5548482 5448960 5579416 6330050 6359732 5772718 6309491 6143402
6943F143402k97388q5775k86789q5800l09238J168J64938J75799M39836j32002
$$ 6143402 5846014 5760239 5473450 5387650 5078412 5079580 5244518 5420317 5860153 5728151
6933E728151o1437J17598J26283J95779R8996o40701O8249M12497j80457J46043
$$ 5728151 5666714 5784312 5910595 6106374 6205370 5564669 5632918 6045415 5864958 6011001
6923F011001K74779k5848j48390n55995L28497O5627J57226J62008l27041O97768
$$ 6011001 6285780 6259932 6111542 5555547 5884044 5949671 6106897 6268905 5941864 6639632
6913F639632K21748J3732l05716K37277L84246K58750j94547o01687j84451M06773
$$ 6639632 6861380 6875112 6569396 6806673 7190919 7449669 7255122 6653435 6468984 6875757
6903F875757K26786L81961M7801K74160l22048m72923M0610J67595m19899J18342
$$ 6875757 7102543 7484504 7532305 7806465 7484417 7011494 7052104 7219699 6799800 6918142
6893F918142l8738m99888l88526L92581M52926k34347N35398j39008n43196n4539
$$ 6918142 6879404 6379516 5990990 6383571 6836497 6602150 7137548 6998540 6455344 6400805
6883F400805K02021l85207J6232m30554R6638o0024J09847N48737J80419r6902
$$ 6400805 6602826 6217619 6233851 5803297 5899935 5839911 5949758 6498495 6678914 6582012
6873F582012o9768j38750j94617K59440k82393k43608k32345K57535j98515J35585
$$ 6582012 6512244 6373494 6178877 6438317 6155924 5912316 5679971 5937506 5738991 5874576
6863E874576k06879o6026j08759O7126M15719k21744j09512r0333p9467k26639
$$ 5874576 5667697 5601671 5492912 5560038 5975757 5754013 5644501 5554168 5474701 5248062
6853E248062k86504K30462m3107N8287k96291l6731O14897K48381k99633m59585
$$ 5248062 4961558 5192020 5148913 5207200 4910909 4874178 5489075 5737456 5437823 4978238
6843D978238J29947j79956K0439j47406L71532L27028o57971N0830L26810L70867
$$ 4978238 5108185 4928229 4948668 4801262 5172794 5499822 4841851 4892681 5219491 5590358
6833E590358l61423p9729m22142l75640O0123j35387l99636L76258J227440K88024
$$ 5590358 5228935 5149206 4727064 4351424 4411547 4276160 3876524 4252782 5480222 5768246
6823E768246j12540k43358k61012K8832m96699m44608L31833l24900O08960K27126
$$ 5768246 5655706 5412348 5151336 5180168 4683469 4238861 4570694 4245794 4854754 5081880
6813E081880k97981n72529K52773M25198n97646k2143j92802j72663P19466j90729
$$ 5081880 4783899 4211370 4464143 4889341 4291695 4269552 4076750 3904087 4623553 4432824
6803D432824j90844L58833J99252o0493L75070K7492N6992K67968l19872n58624
$$ 4432824 4241980 4600813 4800065 4739572 5114642 5142134 5199126 5467094 5147222 4588598
6793D588598K79880K29345j07996m5428K7342J27473k39146l29086l44028J88391
$$ 4588598 4868478 5097823 4989827 4944399 4971741 5099214 4860068 4530982 4186954 4375345
6783D375345L05073m56895L99736L41718R148K19093l1435K94251o03669l13018
$$ 4375345 4680418 4223523 4623259 4964977 4974125 5193218 5161783 5456034 4852365 4539347
6773D539347N51737J09955m58707J06938k71596O9252J60276K55560p8287K41994
$$ 4539347 5091084 5201039 4742332 4849270 4577674 4646926 4807202 5062762 4984475 5226469
6763E226469k27811m13028j45916J00153O49346J19710j90104M0229n5235m75102
$$ 5226469 4998658 4585630 4439714 4539867 5189213 5308923 5118819 5159048 5103813 4628711
6753D628711K48362J23479Q1113j17658L14457M29265l26847k62825m35624l08458
$$ 4628711 4877073 5000552 5081665 4964007 5278464 5707729 5380882 5118057 4682433 4373975
6743D373975J012004M9818m36792k74141J27699N11080K05171l59726K3598J2331
$$ 4373975 5385979 5435797 4999005 4724864 4852563 5363643 5568814 5209088 5232686 5245017
6733E245017N18024p3628p77537N19411J9491M5113M53724L1288J21709p1698
$$ 5245017 5763041 5689413 4911876 5431287 5450778 5495891 5949615 5980903 6102612 6030914
6723F030914n27136K4235K32719r1957j2240M48092M00808k38573l57452M0171
$$ 6030914 5503778 5528013 5760732 5668775 5656535 6104627 6505435 6266862 5909410 5949581
6713E949581l34752j24591M57813n56421K2653L54930k53149L11926R0180J63858
$$ 5949581 5614829 5490238 5948051 5391630 5414283 5769213 5516064 5827990 5918170 6082028
6703F082028k1888o8185o8516j49476n00032J51314O35207K30209m37468P1318
$$ 6082028 6060140 5991955 5923439 5773963 5273931 5425245 6060452 6290661 5853193 5924511
6693E924511Q0577N92769p7792n53426J36596J70025m57632r9962J35556l19887
$$ 5924511 6005088 6597857 6520065 5966639 6103235 6273260 5815628 5715666 5851222 5531335
6683E531335L44041N11775k33078J3289J92273J42249k13129l83832J23705L48149
$$ 5531335 5875376 6387151 6154073 6167362 6359635 6501884 6288755 5904923 6028628 6376777
6673F376777J47525M797M00319o55184L42964M12429j37105l56972L20676J4580
$$ 6376777 6524302 6529099 6929418 6274234 6617198 7029627 6892522 6535550 6856226 6870806
6663F870806r3675k5976l11674K66956M6456N41834J02618j25064q4618K95385
$$ 6870806 6777131 6751155 6439481 6706437 6752893 7294727 7397345 7272281 7187663 7483048
6653G483048J86283o2992K6815o11890J20992j07450J11318J75661K44726N9469
$$ 7483048 7669331 7606339 7633154 7021264 7142256 7034806 7146124 7321785 7566511 7625980
6643G625980K13120N77694k00065j88414j43561q5929J21936M72473M39032j43120
$$ 7625980 7839100 8416794 8216729 8028315 7884754 7798825 7920761 8393234 8832266 8689146
6633H689146N3288l86189m97259K08288L27862J97296K60200O12922L42525l90579
$$ 8689146 8742434 8356245 7858986 8067274 8395136 8592432 8852632 9465554 9808079 9417500
6623I417500j92395J07242K50652R0379l23251K91787J17335j03042l4579Q69403
$$ 9417500 9225105 9332347 9582999 9673378 9350127 9641914 9759249 9656207 9621628 10491031
6613A0491031m6861J47492J0998j82347J15247O61930p0684j09557j3753M56588
$$ 10491031 10444170 10591662 10602660 10420313 10535560 11197490 11126806 11017249 11003496 11460084
6603A1460084R31034Q39812j2178L33967K62229N60068J37134L09212M04949J5116
$$ 11460084 12391118 13230930 13218752 13552719 13814948 14375016 14512150 14821362 15226311 15241427
6593A5241427l55781J39182J021581M76951J49157m20154M59543K13294M17161
$$ 15241427 14885646 15024828 16046409 16523360 16672517 16252363 16711906 16925200 17342361
6584A7342361N1559M88199J24996O42620K39284L28912O11023L14183M30257J249327
$$ 17342361 17393920 17882119 18007115 18649735 18889019 19217931 19828954 20143137 20573394 21822721
6574B1822721O45505J85210L9280O55170P47212J291522J272054R50073M90110
$$ 21822721 22468226 22653436 22692716 23347886 24095098 25386620 26658674 27608747 28098857
6565B8098857J146833J449617O86913R94467Q31366L77092J07034M55435j67649
$$ 28098857 29245690 30695307 31382220 32376687 33208053 33585145 33692179 34147614 33979965
6556C3979965J32362M230o34423M17966L76088O68477K49044l22302m0034P23616
$$ 33979965 34112327 34116557 33482134 33900100 34276188 34944665 35193709 34871407 34831373 35554989
6546C5554989K46274n33465L09208n28424l81721P12987j18856k72497K65910
$$ 35554989 35801263 35267798 35577006 35048582 34666861 35379848 35260992 34988495 35254405
6537C5254405K68028r24842j223365n12756l88670k0293k5148n10498j053460
$$ 35254405 35522433 34597591 33374226 32861470 32472800 32452507 32427359 31916861 30863401
6528C0863401q61110m49398n12292m14253k11524r05318j015343k67031k81970
$$ 30863401 30002291 29552893 29040601 28626348 28414824 27509506 26494163 26227132 25945162
6519B5945162j215199k28356k41227j08778j182194o01850m50801J91822j80511
$$ 25945162 24729963 24501607 24260380 24151602 22969408 22367558 21916757 22108579 21928068
6510B1928068n15761k58814p39437K59231o58217p05379p2021k60406k88685k88308
$$ 21928068 21412307 21153493 20414056 20673287 20015070 19309691 19237670 18977264 18688579 18400271
6500A8400271k11816n08274l35414K55604n57170M9062j51325J19161k35960m71265
$$ 18400271 18188455 17680181 17344767 17600371 17043201 17092263 16940938 17060099 16824139 16352874
6490A6352874m40185l75117J16243M03043K81914j31495l17871l79784j20668
$$ 16352874 15912689 15537572 15653815 16056858 16338772 16207277 15889406 15509622 15388954
6481A5388954j03238j45259J0285j97882l50354j01469j94458j01637m8432P0134
$$ 15388954 15285716 15140457 15150742 14952860 14602506 14501037 14306579 14204942 14156510 14226644
6471A4226644q0314j54162L28654p2821k97881N6582M84270L14844o04312M4053
$$ 14226644 14146330 13992168 14320822 14248001 13950120 14006702 14490972 14805816 14201504 14245557
6461A4245557K94499K74115l67962m72263K84643O7169j15941k48155L6088k29099
$$ 14245557 14540056 14814171 14446209 13973946 14258589 14325758 14209817 13961662 13997750 13768651
6451A3768651N06893R067p9349m84372J43670K59129j04326N12514m41370j79690
$$ 13768651 14275544 14284611 14205262 13720890 13864560 14123689 14019363 14531877 14090507 13910817
6441A3910817Q5892k73813R9797O98174k73666O9194J30559N65894J1573L7506
$$ 13910817 13996709 13722896 13822693 14520867 14247201 14316395 14446954 15012848 15024421 15061927
6431A5061927k65507p05933K84922O20843o04693J61656J038K32196q086m70359
$$ 15061927 14796420 14090487 14375409 14996252 14391559 14553215 14554253 14786449 14778363 14308004
6421A4308004l79696J25102M54043l73287O1556P18974k09232k85337p9361J15531
$$ 14308004 13928308 14053410 14507453 14134166 14195722 14914696 14705464 14420127 14340766 14456297
6411A4456297M09031P85030K59799p41072m34057K42384L57201q8130j64057J5663
$$ 14456297 14865328 15650358 15910157 15169085 14735028 14977412 15334613 15246483 15082426 15098089
6401A5098089J29783j13304j29823m18492O36312L21806j92162O8609K72899j97155
$$ 15098089 15227872 15114568 14984745 14566253 15202565 15524371 15332209 15400818 15673717 15476562
6391A5476562M82041j13870J73434l25757n11965l52778j06077K70175N39949
$$ 15476562 15958603 15844733 16018167 15692410 15180445 14827667 14721590 14991765 15531714
6382A5531714O58541L19380r6515J27481j3310O2780N24209K4597L48143l24061
$$ 15531714 16190255 16509635 16413120 16540601 16527291 16590071 17114280 17138877 17487020 17162959
6372A7162959m01273j86051O61090k46375O59044L2829k23586k49291M20258R14439
$$ 17162959 16761686 16575635 17236725 16990350 17649394 17682223 17458637 17209346 17629604 18544043
6362A8544043l50773K56050k55562q8811Q0573k08605n5606N20916O41385J4786
$$ 18544043 18193270 18449320 18193758 18104947 18185520 17976915 17921309 18442225 19083610 19098396
6352A9098396o43202J32083K66844K61223L43585M25715m0632M53547K16021O5625
$$ 19098396 18455194 18587277 18854121 19115344 19458929 19884644 19844012 20297559 20513580 20579205
6342B0579205n15142Q475M0203k7686K59074P20484L03011l21658M23589M40703
$$ 20579205 20064063 20072538 20112741 20085055 20344129 21064613 21367624 21045966 21469555 21910258
6332B1910258M02588Q6240k87203L4799J38773J31756Q2667P43327j18468k93178
$$ 21910258 22312846 22399086 22111883 22146682 22285455 22417211 22499878 23243205 23124737 22831559
6322B2831559K14559M88772j88345J95740J53944J07315l49211j83683M30340
$$ 22831559 23046118 23534890 23346545 23542285 23696229 23803544 23454333 23270650 23700990
6313B3700990Q4751M55092R0206R4043O4641r2408N62179J073742R4313K98851
$$ 23700990 23785741 24240833 24331039 24425082 24489723 24397315 24959494 26033236 26127549 26426400
6303B6426400m94681P46401k79862N92060L61895p5655O66491J2021O22260n2547
$$ 26426400 25931719 26678120 26398258 26990318 27352213 27276558 27943049 27955070 28577330 28524783
6293B8524783K14096n22245J42337M49789k02968K90431K89665L45500Q58401
$$ 28524783 28738879 28216634 28358971 28808760 28605792 28896223 29185888 29531388 30389789
6284C0389789r2849k76187P04564L1051M65687L56354K40975Q5528L02552K50068
$$ 30389789 30296940 30020753 30725317 30756368 31222055 31578409 31819384 31904912 32207464 32457532
6274C2457532K61791L27170O60335m4367j03791J002484M48332k40193N50321
$$ 32457532 32719323 33046493 33706828 33662461 33558670 34561154 35009486 34769293 35319614
6265C5319614K91848J08780l02092L62610R09302K42589j19575N4402J55007P08920
$$ 35319614 35611462 35720242 35418150 35780760 36690062 36932651 36813076 36867478 37022485 37731405
6255C7731405P20731m50421k66820N37476N43638L31413J38011K2083K9274K72830
$$ 37731405 38452136 38001715 37734895 38272371 38816009 39147422 39285433 39307516 39336790 39609620
6245C9609620L35824J99532J70392L49758L06936q2100K9152N76090M42056L2353
$$ 39609620 39945444 40144976 40315368 40665126 40972062 40889962 40919114 41495204 41937260 41969613
6235D1969613L38789k52889K39493L58205K99788m291l20112k82915J089007K47142
$$ 41969613 42308402 42055513 42295006 42653211 42952999 42948708 42628596 42345681 43434688 43681830
6225D3681830l63201j93567j05054J82661P27052j31640N11464N45716j46055
$$ 43681830 43318629 43125062 43020008 43202669 43929721 43798081 44309545 44855261 44709206
6216D4709206M56255O5274P6568Q0555L38899J48825m434m32818L58622j1475
$$ 44709206 45165461 45230735 45307303 45387858 45726757 45875582 45871148 45438330 45796952 45785477
6206D5785477K08667k86419K85109O60243p6827o2404J64726O086P02668J21350
$$ 45785477 45994144 45707725 45992834 46653077 46576250 46513846 46678572 46684658 47387326 47508676
6196D7508676k58754M22924L11036L56845J15007J26703L14160J35769N03048
$$ 47508676 47249922 47672846 47983882 48340727 48455734 48582437 48896597 49032366 49535414
6187D9535414L45690J42250n2887N08167N00500J12290J15787J77677j549O1518
$$ 49535414 49881104 50023354 49970467 50478634 50979134 51091424 51207211 51384888 51383339 51444857
6177E1444857M77492m667R00592N11169J160054O01267M39964M81724J153641
$$ 51444857 51922349 51917682 52818274 53329443 54489497 55090764 55530728 56012452 57166093
6168E7166093J242157L86182J472831J236416J149334J457447Q90446l1995m55078
$$ 57166093 58408250 58794432 60267263 61503679 62653013 64110460 65000906 64968911 64513833
6159F4513833l95929p13093m01761j54822l56263p30563L80545K57118m8559O18298
$$ 64513833 64117904 63404811 63003050 62848228 62491965 61761402 62141947 62399065 62350506 62968804
6149F2968804J32867J218838J393188J040370J366147Q15191J779386J542159
$$ 62968804 63101671 64320509 65713697 66754067 68120214 68935405 70714791 72256950
6141G2256950J810840K030409K365157K420310K105728J361363O93442O02519
$$ 72256950 74067790 76098199 78463356 80883666 82989394 84350757 85044199 85646718
6133H5646718j094856j729680j939309j841496k879022k728930j771438j335635
$$ 85646718 84551862 82822182 80882873 79041377 76162355 73433425 71661987 70326352
6125G0326352p02687o66859n81996p32127j7060k63097J66942O48029N35416Q82306
$$ 70326352 69623665 68956806 68374810 67642683 67625623 67362526 67529468 68177497 68712913 69595219
6115F9595219J86990J22232R69090Q51079O08286L06645j83207r6858n04889p18700
$$ 69595219 69782209 69904441 70873531 71724610 72332896 72639541 72456334 72359476 71854587 71135887
6105G1135887j259793j084174j868992j698894j030072n87563q81320j187886
$$ 71135887 69876094 68791920 66922928 65224034 64193962 63606399 62725079 61537193
6097F1537193j082307r39869m73955j164145p04443o42298o68262k58560n57859
$$ 61537193 60454886 59515017 59041062 57876917 57172474 56530176 55861914 55603354 55045495
6088E5045495p14614k40935l14593o28913k05793l09908p63196m2162l2742k65294
$$ 55045495 54330881 54089946 53775353 53146440 52940647 52630739 51867543 51825381 51792639 51527345
6078E1527345p32028m66084J93555n70182o08681j48756J80771o3684m09832j51498
$$ 51527345 50795317 50329233 50522788 49952606 49343925 49195169 49375940 49312256 48902424 48750926
6068D8750926n27157j046170l38700L00534l35049m9556l41288p73378k81637
$$ 48750926 48223769 47177599 46838899 47139433 46804384 46754828 46413540 45640162 45358525
6059D5358525o74011l06032j20787l97669l99200m49616o47839J60674j03206
$$ 45358525 44684514 44378482 44257695 43860026 43460826 43011210 42363371 42524045 42420839
6050D2420839k41119k52194m62592j02647j95572k41295l89763r7265q39542k38373
$$ 42420839 42179720 41927526 41464934 41362287 41166715 40925420 40535657 40438392 39598850 39360477
6040C9360477p4042l20389j33920o34681j058792l25187l46067j35813J00740
$$ 39360477 39286435 38966046 38832126 38197445 37138653 36813466 36467399 36331586 36432326
6031C6432326k55344O5468q75121j44956J43706j72408p20492l85315l03416m03644
$$ 36432326 36176982 36242450 35367329 35222373 35366079 35193671 34473179 34087864 33784448 33380804
6021C3380804L75456L59200n51367o03368O721q04158l26588o6058J57515K6322
$$ 33380804 33756260 34115460 33564093 32960725 32967446 32163288 31836700 31770642 31928157 31954479
6011C1954479J52462n23135k13566p8088n16476L24560n26955P5651m70684j35263
$$ 31954479 32106941 31583806 31370240 31292152 30775676 31100236 30573281 30648932 30178248 30042985
6001C0042985l61557J2711j94433j36824k82739m60294q80945K17168k07711P0739
$$ 30042985 29681428 29694139 29499706 29362882 29080143 28619849 27738904 27956072 27748361 27819100
5991B7819100j83244o03055o576L68075O2617m14967O41928l16404J18984m16278
$$ 27819100 27635856 27032801 27026225 27394300 27456917 27041950 27683878 27367474 27486458 27070180
5981B7070180o20147k07540M25304o901j68817k80902n62653k9399J91599L44999
$$ 27070180 26450033 26242493 26667797 26660896 26492079 26211177 25648524 25619125 25810724 26155723
5971B6155723k51183o84262k30039q3252J44465L85943l87790j43967M66597j11677
$$ 26155723 25904540 25220278 24990239 24906987 25051452 25437395 25049605 24905638 25372235 25260558
5961B5260558p48374m16814L88260J49729l24067j19427L1665L07101J24353j20978
$$ 25260558 24512184 24095370 24483630 24633359 24309292 24189865 24221530 24528631 24652984 24532006
5951B4532006m98195p57796O0897P7018R15454n45323m80899k5579p37126O3409
$$ 24532006 24033811 23276015 23336912 23413930 24329384 23784061 23303162 23277583 22540457 22603866
5941B2603866j15112m86013r7160K40717J79576p66701M20373K52830K24859p70566
$$ 22603866 22488754 22002741 21905581 22146298 22325874 21559173 21979546 22232376 22457235 21686669
5931B1686669l6378N13821k72708k53809J50860K37436l45159r9733k61982L48560
$$ 21686669 21650291 22164112 21891404 21637595 21788455 22025891 21680732 21580999 21319017 21667577
5921B1667577R3395K17268k38590k60218j58558P77765k62385n87271M71388j58457
$$ 21667577 21760972 21978240 21739650 21479432 21320874 22098639 21836254 21248983 21720371 21561914
5911B1561914l16745Q3424L12642J6744m37757l58768L14863j655L71789j0278
$$ 21561914 21245169 21328593 21641235 21657979 21220222 20861454 21176317 21174662 21546451 21536173
5901B1536173j99447J33449m17959K34232K33695M5048L92265J08507J28711j46806
$$ 21536173 21336726 21470175 21052216 21286448 21520143 21565191 21957456 22065963 22194674 22047868
5891B2047868j7595j38720J89035k50785J02649p0925m54383j64885M95798L17252
$$ 22047868 22030273 21891553 22080588 21829803 21932452 21861527 21407144 21242259 21738057 22055309
5881B2055309j79742N10741j83412l28634K42879M97349J23378l24063n5876N44831
$$ 22055309 21875567 22386308 22202896 21874262 22117141 22614490 22737868 22413805 22357929 22902760
5871B2902760j14156L9237N12612k78895k22242n65636q4796J84316r6453L43702
$$ 22902760 22788604 22827841 23340453 23061558 22839316 22273680 22188884 22373200 22276747 22620449
5861B2620449P6218m01320P08471N9835J72851K46732l92715L8446Q5470q1730
$$ 22620449 22696667 22295347 23003818 23063653 23236504 23483236 23090521 23128967 23214437 23132707
5851B3132707K32442L04269j45361J58618O61006J86986n81355L73934M55445
$$ 23132707 23365149 23669418 23524057 23682675 24343681 24530667 23949312 24323246 24778691
5842B4778691N41600p4833J35519J28452J23717J55532K50494j99050l19405M50466
$$ 24778691 25320291 25245458 25380977 25509429 25633146 25788678 26039172 25840122 25520717 25971183
5832B5971183R7606M1426M85479K79542K05807M92480Q6973j44131K59907k33879
$$ 25971183 26068789 26110215 26595694 26875236 27081043 27573523 27660496 27516365 27776272 27542393
5822B7542393j24766Q632O28751N66656L13950n03521j36287M93275J84779l93050
$$ 27542393 27417627 27426259 28055010 28621666 28935616 28432095 28295808 28789083 28973862 28580812
5812B8580812O48233p2902L64743Q80154Q28450j99173N57685L98345k4848K12572
$$ 28580812 29229045 29156143 29520886 30401040 31229490 31030317 31588002 31986347 31961499 32174071
5802C2174071M08612M32987K19121L02996N67289K10161J51075N87252O63473
$$ 32174071 32582683 33015670 33234791 33537787 34105076 34315237 34466312 35053564 35717037
5793C5717037K40121j85925P86333N22855N26098J1006N02771R87179J54251k73420
$$ 35717037 35957158 35771233 36557566 37080421 37606519 37617525 38120296 39107475 39261726 38988306
5783C8988306J052444L26180N08436P12620O28051L76092L64678P01867J60205
$$ 38988306 40040750 40366930 40875366 41587986 42216037 42592129 42956807 43658674 43818879
5774D3818879P19512R18664J28089K08071O33103J083017P95380Q2414M82284
$$ 43818879 44538391 45457055 45585144 45793215 46426318 47509335 48304715 48387129 48869413
5765D8869413K54457J7846N33986Q48530J309605J261809O66912M91037Q53266
$$ 48869413 49123870 49141716 49675702 50524232 51833837 53095646 53762558 54253595 55106861
5756E5106861O82152N07063N70438J391238J378075J150592Q39396R32869J334676
$$ 55106861 55789013 56296076 56866514 58257752 59635827 60786419 61625815 62558684 63893360
5747F3893360J379254N77353J267014J599148P60392J286419K121038J318521
$$ 63893360 65272614 65849967 67116981 68716129 69476521 70762940 72883978 74202499
5739G4202499J078982J277183J581159J906641K258191J930391J919292K117219
$$ 74202499 75281481 76558664 78139823 80046464 82304655 84235046 86154338 88271557
5731H8271557K083747K203837K279763K207467L669005L773155M089105M350841
$$ 88271557 90355304 92559141 94838904 97046371 100715376 104488531 108577636 112928477
5723A12928477M613112N036087N941491O442021N881295N925747N760510M935858
$$ 112928477 117541589 122577676 128519167 134961188 140842483 146768230 152528740 157464598
5715A57464598M235699M167061M130097L202370K742928K616651J211693K54582
$$ 157464598 161700297 165867358 169997455 173199825 175942753 178559404 179771097 180025679
5707A80025679n5321l67724j130515j204331j318770j794014j180845n19568j240853
$$ 180025679 179970358 179602634 178472119 177267788 175949018 174155004 172974159 172454591 171213738
5698A71213738r84948K39997J210494J517754K256094L406561L198863L104290
$$ 171213738 170228790 170468787 171679281 173197035 175453129 178859690 182058553 185162843
5690A85162843L880763L608544K281683K94348j784539k313151l599832m892206
$$ 185162843 189043606 192652150 194933833 195228181 193443642 191130491 187530659 182638453
5682A82638453k744685j128109l5835P73585R66744K464515K868870K786846K745349
$$ 182638453 179893768 178765659 178729824 179503409 180470153 182934668 185803538 188590384 191335733
5673A91335733K117268K525032K405861J500156N70927J65513l91137j903122
$$ 191335733 193453001 195978033 198383894 199884050 200454977 200620490 200229353 198326231
5665A98326231j889579k784148k364175j884428k390227k425954k105480k831068
$$ 198326231 196436652 193652504 191288329 189403901 187013674 184587720 182482240 179651172
5657A79651172k741688k377267k506952l324663m587901n275636o145838m440133
$$ 179651172 176909484 174532217 172025265 168700602 164112701 158837065 152691227 148251094
5649A48251094m074581k521292k532715k708232k006631j819105j948722j988375
$$ 148251094 144176513 141655221 139122506 136414274 134407643 132588538 130639816 128651441
5641A28651441j777381j349772j547534j580203n44795p17365n88911p70913j075881
$$ 128651441 126874060 125524288 123976754 122396551 121851756 121134391 120545480 119774567 118698686
5632A18698686n95894o63050l01750j74541L05457m6236l97951J73146L37658
$$ 118698686 118102792 117439742 117137992 116963451 117268908 117222672 116824721 116997867 117335525
5623A17335525o26717q70506j228203j802950j783345j559426j393309j039866
$$ 117335525 116708808 115838302 114610099 112807149 111023804 109464378 108071069 107031203
5615A07031203j034036q09948m47738l34839p23334o02904q18209p12427j12575
$$ 107031203 105997167 105187219 104739481 104404642 103681308 103078404 102260195 101547768 101435193
5606A01435193j88559L717p64072o75657M59430o47286J692j87054l3112n0194
$$ 101435193 101246634 101250351 100486279 99810622 100270052 99622766 99624458 99437404 99404292 99354098
5596I9354098j99671j198038m81342m05490m17426q21982o58013k98220m74341
$$ 99354098 99154427 97956389 97475047 97069557 96652131 95830149 95172136 94873916 94399575
5587I4399575n7025p07023J19642K20292l7248K02192m88309n04884K26826N29359
$$ 94399575 94342550 93635527 93755169 93975461 93938213 94140405 93652096 93147212 93374038 93903397
5577I3903397K59713l68682J3082k5144K5799O85514M63759L7306N29878m76816
$$ 93903397 94163110 93794428 93807510 93782366 93808165 94493679 94957438 94994744 95524622 95047806
5567I5047806J28037M76557J91493J80719r1100o53863P20532L07864m65270L4741
$$ 95047806 95175843 95652400 95843893 96024612 95933512 95279649 96000181 96308045 95842775 95877516
5557I5877516N48753L33494J29980n7282L1073O19568n4669o8064J91080n7429
$$ 95877516 96426269 96759763 96889743 96832461 96863534 97483102 97428433 97360369 97551449 97494020
5547I7494020o61778m17584k01407l46086R025m09522l90070j98102l01651l71713
$$ 97494020 96832242 96414658 96213251 95867165 95876190 95466668 95076598 94878496 94576845 94205132
5537I4205132L30334j92046K15253K30930o6352o76331L62197P7654L22956K82345
$$ 94205132 94535466 94343420 94558673 94789603 94723251 94046920 94409117 94486771 94809727 95092072
5527I5092072j42104m15998r5262O6382k00139q15373p35746m36376j05039q24350
$$ 95092072 94949968 94533970 94438708 94505090 94304951 93489578 92753832 92317456 92212417 91388067
5517I1388067m53544n20876o46270r57657o64875j091666l45300O9134q64820
$$ 91388067 90934523 90413647 89767377 88809720 88144845 87053179 86707879 86777013 85912193
5508H5912193k95430o0247n92662n53712n46409l46191l09898j32523J42373p44618
$$ 85912193 85616763 85556516 84963854 84410142 83863733 83517542 83207644 83075121 83217494 82472876
5498H2472876J24071j94391o32787J38215k86648J00966k16379n81345J98989
$$ 82472876 82596947 82402556 81769769 81907984 81621336 81722302 81505923 80924578 81123567
5489H1123567p08950m44127K83267m65973p19340l52979k60229R4557m27016l84011
$$ 81123567 80414617 79970490 80253757 79787784 79068444 78715465 78455236 78549793 78122777 77738766
5479G7738766m55086K8927j77784J31048K85536j27872l31791k3406L36022K97075
$$ 77738766 77283680 77312607 77134823 77265871 77551407 77423535 77091744 77068338 77404360 77701435
5469G7701435R110M40806K97235M48879K2270P69955K61168J168707J150661M69290
$$ 77701435 77710545 78151351 78448586 78897465 78919735 79689690 79950858 81119565 82270226 82739516
5459H2739516M41913J225205J387885J377779L24200P24798J46394m74688Q7262
$$ 82739516 83181429 84406634 85794519 87172298 87496498 88221296 88367690 87893002 87980264
5450H7980264j01102J19733K1992j01355K28713n03470O11156N53538J549940
$$ 87980264 87879162 87998895 88020887 87919532 88148245 87644775 88255931 88809469 90359409
5441I0359409J241502J662041K666263K484225K703494K681020L772809K478279
$$ 90359409 91600911 93262952 95929215 98413440 101116934 103797954 107570763 110049042
5433A10049042J534461j80562n97810j925023l308917l441411l328075k592566
$$ 110049042 111583503 111402941 110805131 108880108 105571191 102129780 98801705 96209139
5425I6209139k442168k417141k122286j069010j291687j383767r59289m94342
$$ 96209139 93766971 91349830 89227544 88158534 86866847 85483080 84523791 84029449
5417H4029449q36400l97821K0544l30276j45959J56561K70920m21256m28293k67989
$$ 84029449 83193049 82795228 82815772 82485496 82339537 82496098 82767018 82345762 81917469 81649480
5407H1649480p61653j202733j259924k003512j878392j732487j745305j499113
$$ 81649480 80887827 79685094 78425170 76421658 74543266 72810779 71065474 69566361
5399F9566361r80825j800823j038881l90316n09436r48019j208899r07176k64055
$$ 69566361 68585536 66784713 65745832 65355516 64846080 63898061 62689162 61781986 61517931
5390F1517931r43613n94483j004262q39977o27163q31021q75437o02234l03299
$$ 61517931 60574318 59979835 58975573 58135596 57508433 56677412 55801975 55199741 54896442
5381E4896442n96803n46209n27305n70416l39958k09726n12481p72567m09127
$$ 54896442 54299639 53753430 53226125 52655709 52315751 52106025 51593544 50820977 50411850
5372E0411850j58448j9197j52578k6503n0885j66685l53541m18567q85674m4514
$$ 50411850 50253402 50234205 50081627 50055124 50004239 49837554 49484013 49065446 48179772 48135258
5362D8135258K76439q40079M65770n14479l40036M39578p60885j094348l89434
$$ 48135258 48411697 47571618 48037388 47522909 47182873 47622451 46861566 45767218 45377784
5353D5377784n5102o00194n06947l89096K6976O6429L0868l03265J3127l93117
$$ 45377784 45322682 44722488 44215541 43826445 43853421 43919850 43950718 43647453 43660580 43267463
5343D3267463J65127k49199j0480n0944p03630k61459M14687J93304j60945n46355
$$ 43267463 43432590 43183391 43172911 43121967 42418337 42156878 42571565 42764869 42603924 42057569
5333D2057569l34951r8304m61772R1325k10003M65025l05340j73681k84575j46991
$$ 42057569 41722618 41624314 41162542 41253867 41043864 41508889 41203549 41029868 40745293 40598302
5323D0598302q2362M21062j61617n30443j23400p2529J37211l3268P4229m384
$$ 40598302 40515940 40937002 40775385 40244942 40121542 40049013 40186224 40152956 40227185 40222801
5313D0222801j106534k81365O14992P2276R2825o83167k38349K21467p2113K67846
$$ 40222801 39116267 38834902 39449894 39522170 39614995 38931828 38693479 38914946 38842833 39110679
5303C9110679J8396n6418j07439n24606R708k7221k27876K92782j27923l86329
$$ 39110679 39129075 39072657 38965218 38440612 38450320 38423099 38195223 38488005 38360082 37973753
5293C7973753k1727P0984J26726q6950j62028m91799O5174N89851J00281l4647
$$ 37973753 37952026 38023010 38149736 38062786 37900758 37408959 37474133 38063984 38164265 38129618
5283C8129618j16360R451l95863m19786L41977k77254j40585K77001m73471K87297
$$ 38129618 38013258 38022709 37626846 37207060 37549037 37271783 37131198 37408199 36934728 37222025
5273C7222025J25849k69656M42673p08438m9074L2673L1121L45515p701n90037
$$ 37222025 37347874 37078218 37520891 36812453 36763379 36796052 36827173 37172688 37164987 36574950
5263C6574950p9855J64328L94832O7474o64592K60139K95336J90294j12937l61680
$$ 36574950 36495095 36659423 37054255 37121729 36457137 36717276 37012612 37202906 37089969 36728289
5253C6728289j08092q1898J5644n2861o7899O17655N73230K4725n14070J55417
$$ 36728289 36620197 36538299 36553943 36501082 36433183 37050838 37624068 37648793 37134723 37290140
5243C7290140j77595L02229k14624r4148m13257o56959M32351N36206N75477M84553
$$ 37290140 37112545 37414774 37200150 37106002 36692745 36035786 36468137 37004343 37579820 38064373
5233C8064373m04270L3720l43808L18110J26671n05355N1175J94961K97026n41370
$$ 38064373 37660103 37693823 37350015 37668125 37794796 37289441 37340616 37535577 37832603 37291233
5223C7291233l22071j87479K25835K86766Q3537n85991l46465M73687m05864p5471
$$ 37291233 36969162 36781683 37007518 37294284 37377821 36791830 36445365 36919052 36513188 36437717
5213C6437717K28110k76229K39969j72793M00357R87686J76446k9405n52737m71059
$$ 36437717 36665827 36389598 36629567 36456774 36857131 37844817 38021263 37991858 37439121 36968062
5203C6968062J77220M22278m6068k07439P1422L30593j02182m49478q1322J87721
$$ 36968062 37145282 37567560 37521492 37314053 37385475 37716068 37613886 37164408 37083086 37270807
5193C7270807j27676K05067L92746m19781j99933K35300L87072k07865N53658
$$ 37270807 37143131 37348198 37740944 37321163 37121230 37356530 37743602 37535737 38089395
5184C8089395N74131n05426j71573K70697n16020l14497L91630N10970m21410
$$ 38089395 38663526 38158100 37986527 38257224 37741204 37426707 37818337 38329307 37907897
5175C7907897k94330K68519N5m40556L41970k8849j50424N4967K55630K74273
$$ 37907897 37613567 37882086 37882141 37441585 37783555 37754706 37604282 37659249 37914879 38189152
5165C8189152m67997o24773M84513Q03637m06592p3744j85565j58469k93011k4903
$$ 38189152 37721155 37096382 37580895 38384532 37977940 37904196 37718631 37560162 37267151 37242248
5155C7242248P54704p555j29237m6325J61842j33324l17397K20731J4470M46107
$$ 37242248 37996952 37989397 37860160 37813835 37975677 37842353 37524956 37745687 37760157 38206264
5145C8206264R3330l20895J74658N23476O8254k42985L64549N290N1751K43316
$$ 38206264 38299594 37978699 38153357 38676833 38745087 38502102 38866651 38871941 38923692 39167008
5135C9167008K58782j82953j7555o9904l99711N95876L57270o8683k53046Q609
$$ 39167008 39425790 39242837 39225282 39155378 38755667 39351543 39708813 39640130 39387084 39395693
5125C9395693O18512j16098L55176N34763n48454j30526M11480K25531O48864
$$ 39395693 40014205 39898107 40253283 40788046 40239592 40109066 40520546 40746077 41394941
5116D1394941j45606j53280K69090O30307L28193k74918O28928L93730Q00999
$$ 41394941 41249335 41096055 41365145 41995452 42323645 42048727 42677655 43071385 43872384
5107D3872384k9969l40839j16103K0803k15104l20010J21961L48788O44799L60163
$$ 43872384 43842415 43501576 43385473 43406276 43191172 42871162 42993123 43341911 43986710 44346873
5097D4346873L1472k20198L30511L68041l21399L34365M49059M25920j24173M40990
$$ 44346873 44378345 44158147 44488658 44856699 44535300 44869665 45318724 45744644 45620471 46061461
5087D6061461N68759M68997J05502O33983J83983K43813L15219p1693O16897J061628
$$ 46061461 46630220 47099217 47204719 47838702 48022685 48266498 48581717 48510024 49126921 50188549
5077E0188549k67161J53844J375312j92226O3530L8210J38179M59031J20257O44181
$$ 50188549 49921388 50075232 51450544 51258318 51321848 51360058 51498237 51957268 52077525 52721706
5067E2721706R35846L63940L45734l7166J40501O57527O46560K03724K36371L0964
$$ 52721706 53657552 54021492 54367226 54330060 54470561 55128088 55774648 55978372 56214743 56245707
5057E6245707N04347M92964J07702P73344P40572O67281K04338L9431J346703
$$ 56245707 56750054 57243018 57350720 58124064 58864636 59531917 59736255 59775686 61122389
5048F1122389R79192O26422M63117R28947J208996O32530P62992L03514R53372
$$ 61122389 62101581 62728003 63191120 64120067 65329063 65961593 66724585 67028099 67981471
5039F7981471N65658K07375M69904J63014J469696J545503P98828j08311N07843
$$ 67981471 68547129 68754504 69224408 69387422 70857118 72402621 73201449 73093138 73600981
5030G3600981J490219J214102K36670o3194Q18640J089537L79448L84025L92691
$$ 73600981 75091200 76305302 76541972 76478778 77297418 78386955 78766403 79150428 79543119
5021G9543119M05181M27147K52867l9646L67471K05867N26129L68476r724L32474
$$ 79543119 79948300 80375447 80628314 80588668 80956139 81162006 81688135 82056611 82046887 82379361
5011H2379361J9382M61531j75064M26880L03498M63074Q49422j17916O49068J052828
$$ 82379361 82398743 82860274 82685210 83112090 83415588 83878662 84728084 84610168 85259236 86312064
5001H6312064R92591M96332N96069k2281J94921O00361M61707L97763j44482O4455
$$ 86312064 87304655 87800987 88397056 88374775 88569696 89170057 89631764 90029527 89885045 89949500
4991H9949500j71912p4631N05910L32364k06363J54312K56680M45169L44488J8341
$$ 89949500 89777588 89702957 90208867 90541231 90334868 90489180 90745860 91191029 91535517 91553858
4981I1553858O47274R24852J17433O28631J59840M59978O00475k83382J86545
$$ 91553858 92201132 93125984 93243417 93872048 94031888 94491866 95092341 94808959 94995504
4972I4995504Q8518p14O39264M14890K89751L96382p6659k30313K77267M66138
$$ 94995504 95084022 95083308 95722572 96137462 96427213 96823595 96746936 96516623 96793890 97260028
4962I7260028K47901k67453O87496P95151P8515L0223M18696L60975L90173J223500
$$ 97260028 97507929 97240476 97927972 98723123 98801638 98831861 99250557 99611532 100001705 101225205
4952A01225205K49476L5683M72040P14723o850r7275J391404P07579P46573J076637
$$ 101225205 101474681 101510364 101982404 102697127 102690277 102593002 103984406 104691985 105438558 106515195
4942A06515195O51965L10367j60234O5909j18011N53920L33159J117783M53289
$$ 106515195 107167160 107477527 107317293 107383202 107265191 107819111 108152270 109270053 109723342
4933A09723342L65982O87192j08788M89246K83182M68645J197750P44019L373
$$ 109723342 110089324 110776516 110667728 111156974 111440156 111908801 113106551 113850570 113853943
4924A13853943N06272Q45080P03539N14388R90934N37098R39953J301783J299790
$$ 113853943 114360215 115205295 115908834 116423222 117414156 117951254 118891207 120192990 121492780
4915A21492780J210173P66981R61225J277533J226969J524532J471060J348945
$$ 121492780 122702953 123469934 124431159 125708692 126935661 128460193 129931253 131280198
4907A31280198Q35901J403784J824868R11640R13466J843285J668610J310200
$$ 131280198 132116099 133519883 135344751 136256391 137169857 139013142 140681752 141991952
4899A41991952J536218J543903J588903J465161J469000J765292J233837K071319
$$ 141991952 143528170 145072073 146660976 148126137 149595137 151360429 152594266 154665585
4891A54665585K684633K018970K877038L016280K731225K967494L656698L776033
$$ 154665585 157350218 159369188 162246226 165262506 167993731 170961225 174617923 178393956
4883A78393956M167555M709209N333854N734147O057488O279171P456585Q573439
$$ 178393956 182561511 187270720 192604574 198338721 204396209 210675380 218131965 226705404
4875B26705404R127690R429480R584437J0808659J1085559J2020900J1466122
$$ 226705404 235833094 245262574 254847011 265655670 276741229 288762129 300228251
4868C00228251J0293740R407233O993666M502457K589515m63829l719212n835058
$$ 300228251 310521991 319929224 326922890 331425347 334014862 333551033 329831821 323996763
4860C23996763o802441q254268r551514r436762r690923r933123r699889q610924
$$ 323996763 317194322 308940054 299388540 289951778 280260855 270327732 260627843 252016919
4852B52016919q567717q555911p258332o309165n933046n429665n160400m689463
$$ 252016919 243449202 234893291 227634959 221325794 215392748 209963083 204802683 200113220
4844B00113220m917584m636004l863816l228644l834689l248862k734722k371607
$$ 200113220 195195636 190559632 186695816 183467172 179632483 176383621 173648899 171277292
4836A71277292k428052k567243k441964j973320k872590k480375j865908j569568
$$ 171277292 168849240 166281997 163840033 161866713 158994123 156513748 154647840 153078272
4828A53078272k014544k283225k039345j845027j593254j803835j614848r54308
$$ 153078272 151063728 148780503 146741158 144896131 143302877 141499042 139884194 138929886
4820A38929886j186102j467121j370042j089019r61279j254838j258778j363488
$$ 138929886 137743784 136276663 134906621 133817602 132856323 131601485 130342707 128979219
4812A28979219r61950q29078o70081p06781j225733j135685r31875p61337j030190
$$ 128979219 128017269 127188191 126518110 125811329 124585596 123449911 122518036 121756699 120726509
4803A20726509j075761j466569j183172r24043j198961k94525n39496q92299j002528
$$ 120726509 119650748 118184179 117001007 116076964 114878003 114583478 114043982 113151683 112149155
4794A12149155n88920j023889p82855j225185m37582o86036j72172l84887k21892
$$ 112149155 111560235 110536346 109753491 108528306 108090724 107404688 107232516 106847629 106625737
4785A06625737l47328j96936k56311j407758o11062R6615q7254k39820o43416
$$ 106625737 106278409 106081473 105825162 104417404 103806342 103902957 103815703 103575883 102932467
4776A02932467R3467p05647m10853l97029l92923J42631j2245m95216K5005q9983
$$ 102932467 103025934 102320287 101909434 101512405 101119482 101262113 101249868 100754652 100779657 100689674
4766A00689674J7332L20410n76965m1505K52571K00112m54707K37575m33860j45779
$$ 100689674 100707006 101027416 100450451 100408946 100661517 100861629 100406922 100644497 100210637 100064858
4756A00064858j05653n4088L4329K07795l72802m1354N54015K67941J11778N38472
$$ 100064858 99959205 99905117 99939446 100147241 99774439 99733085 100287100 100555041 100666819 101205291
4746A01205291K48004j23223L33094Q93207M43780P93520R95508J080101N13165
$$ 101205291 101453295 101330072 101663166 102556373 103000153 103793673 104789181 105869282 106382447
4737A06382447K83240J010469N00718J019763P94339O42580M43037O01181M42474
$$ 106382447 106665687 107676156 108176874 109196637 109990976 110633556 111076593 111677774 112120248
4728A12120248K86359J045222O99653P56789J123317O72367P54788P76043M75963
$$ 112120248 112406607 113451829 114151482 114908271 116031588 116703955 117458743 118234786 118710749
4719A18710749L77305Q67516O57979M56264l8099L78412J246015j32966O39964
$$ 118710749 119088054 119955570 120613549 121069813 121031714 121410126 122656141 122523175 123163139
4710A23163139J154991Q63515Q15254J403655J900946J394612J717137J875965
$$ 123163139 124318130 125181645 125996899 127400554 129301500 130696112 132413249 134289214
4702A34289214J934879K108743J398013J992242J456639J585658Q96105J168807
$$ 134289214 136224093 138332836 139730849 141723091 143179730 144765388 145661493 146830300
4694A46830300J181995O55625K57312m7517L93403p29861P11025M79731Q8743
$$ 146830300 148012295 148667920 148925232 148877715 149271118 148541257 149252282 149732013 149820756
4685A49820756K02397O84832P79665J780998J626950Q21580J535231K495253K407021
$$ 149820756 150023153 150707985 151487650 153268648 154895598 155717178 157252409 159747662 162154683
4676A62154683K732880K809533L233801K723405K870236K666206K565944K027358
$$ 162154683 164887563 167697096 170930897 173654302 176524538 179190744 181756688 183784046
4668A83784046J463902J257381J287426J550367J091832J510961K569671K617861
$$ 183784046 185247948 186505329 187792755 189343122 190434954 191945915 194515586 197133447
4660A97133447J896231L593224N163791N407697N833828O268630Q043344Q774953
$$ 197133447 199029678 202622902 207786693 213194390 219028218 225296848 233340192 242115145
4652B42115145J0249745J2039933J4128829J6520709J8362998K0848923K1832694
$$ 242115145 252364890 264404823 278533652 295054361 313417359 334266282 356098976
4645C56098976K1310854J9082366J4029148N751040k224280p165874j3027538
$$ 356098976 377409830 396492196 410521344 416272384 414048104 406882230 393854692
4638C93854692j7607740j7663179j6479808j4511825j1862628r721008q072624
$$ 393854692 376246952 358583773 342103965 327592140 315729512 306008504 297935880
4631B97935880n265211n001094l536048l309320l064615k226618k617507l622966
$$ 297935880 292670669 287669575 284133527 280824207 277759592 275532974 272915467 269292501
4623B69292501l095452l044865l325810l330850l899913m439713l981831l190110
$$ 269292501 266197049 263152184 259826374 256495524 252595611 248155898 244174067 240983957
4615B40983957k917627l334814k833989k006693k476873k614965j533437j782646
$$ 240983957 238066330 234731516 231897527 229890834 227413961 224798996 223265559 221482913
4607B21482913j668282j207982k20737r63356j039342n20197j077218j102994
$$ 221482913 219814631 218606649 218385912 217422556 216383214 215863017 214785799 213682805
4599B13682805o92235r97932j062137r73301j397037k358806k618459j985245
$$ 213682805 212990570 211992638 210930501 209957200 208560163 206201357 203582898 201597653
4591B01597653k325097k486668k247999k063186k604408j524335j560137j199769
$$ 201597653 199272556 196785888 194537889 192474703 189870295 188345960 186785823 185586054
4583A85586054j769110q23137r46626j093305j314533j595084k276723j940385
$$ 185586054 183816944 182993807 182047181 180953876 179639343 178044259 175767536 173827151
4575A73827151j210999k035995j926268l016651k480372k854026l226280k677534
$$ 173827151 172616152 170580157 168653889 165637238 163156866 160302840 157076560 154399026
4567A54399026l344942l422494k112214k333650k422949k147693j951542j614065
$$ 154399026 151054084 147631590 145519376 143185726 140762777 138615084 136663542 135049477
4559A35049477j369957j163647j688639j282016j357720j158459j435506r34222
$$ 135049477 133679520 132515873 130827234 129545218 128187498 127029039 125593533 124659311
4551A24659311p34435j257325j279257j216545j287195j238112r47190j364422
$$ 124659311 123924876 122667551 121388294 120171749 118884554 117646442 116699252 115334830
4543A15334830q78064j590810j866657j183906j276572j671361j886486j400557
$$ 115334830 114456766 112865956 110999299 109815393 108538821 106867460 104980974 103580417
4535A03580417j323969j233617p31354n26756q15590j68100m61034o90088l71002
$$ 103580417 102256448 101022831 100291477 99764721 98949131 98781031 98319997 97629909 97258907
4526I7258907m18727p67275o97625l36777j8142l37987q07299j281946p47995
$$ 97258907 96840180 96072905 95375280 95038503 95020361 94682374 93875075 92593129 91845134
4517I1845134q50099n22778q72855j767922j165646o56471o33368q18385o51997
$$ 91845134 90995035 90472257 89599402 87831480 86665834 86009363 85375995 84557610 83905613
4508H3905613n30410n03433j11886m45206m03546o28719R3284Q367l60371m86942
$$ 83905613 83375203 82871770 82759884 82314678 81911132 81282413 81375697 81384064 81023693 80536751
4498H0536751o14485j54410n63477o76697J03472N82256J42490l84632j85914
$$ 80536751 79922266 79767856 79204379 78527682 78631154 79213410 79355900 78971268 78785354
4489G8785354n53553j166124K76806N37958K71413p38353r64348n12330K52138
$$ 78785354 78231801 77065677 77342483 77880441 78151854 77413501 76449153 75936823 76188961
4480G6188961K52264n2085j36977j97052o3634j14004r31159n37533K16560J03171
$$ 76188961 76441225 76389140 76252163 76055111 75991477 75877473 74946314 74408781 74625341 74728512
4470G4728512k56408j00460J65118k08862o64850n70114j53962o6877p54064j70960
$$ 74728512 74472104 74371644 74536762 74327900 73663050 73092936 72938974 72872097 72118033 71947073
4460G1947073L99137J67154m41442m22102m54128k45429K23670K3077k79529o15945
$$ 71947073 72346210 72513364 72071922 71649820 71195692 70950263 71173933 71197010 70917481 70301536
4450G0301536K10812r59515k29695J65321K15240J09247l67051k60529j59344
$$ 70301536 70512348 69552833 69323138 69488459 69703699 69812946 69445895 69185366 69026022
4441F9026022Q5356p7904n01790L64149J99948m05376K14421L71451q01561l40647
$$ 69026022 69111378 69033474 68531684 68895833 69095781 68690405 68904826 69276277 68474716 68134069
4431F8134069N01741j944j01191L24426J05479n67253P81857l9274j01418P0635
$$ 68134069 68635810 68633866 68532675 68857101 68962580 68395327 69177184 69137910 69036492 69107127
4421F9107127j25311M10151J96726m16185O08233M21592k07449L50472M20605
$$ 69107127 68981816 69391967 69588693 69172508 69780741 70202333 69994884 70345356 70765961
4412G0765961P58654Q18690p7315M18043J218756J196162N66964O08310J123831
$$ 70765961 71524615 72343305 72265990 72684033 73902789 75098951 75665915 76274225 77398056
4403G7398056J569646J006896J177481O05409J74312m47402q48739o76680o250
$$ 77398056 78967702 79974598 81152079 81757488 81931800 81484398 80635659 79958979 79952729
4394G9952729n30l59106K45846J1945Q0677R08528Q30570L432q5721O25321k505
$$ 79952729 79952199 79593093 79838939 79850884 79931561 80840089 81670659 81674091 81588370 82213691 82211186
4383H2211186N879j29624N27860J00324M79364O16325k67119L30409k57708M50964
$$ 82211186 82217065 82087441 82615301 82715625 83194989 83811314 83544195 83874604 83616896 84067860
4373H4067860M23787N34485j62036M94669J17526O88785K72369L26147j21743
$$ 84067860 84491647 85026132 84864096 85358765 85476291 86165076 86437445 86763592 86641849
4364H6641849j94322r4844M00518M32789N67010O02690Q01163m24576j15373j01234
$$ 86641849 86447527 86352683 86753201 87185990 87753000 88355690 89156853 88732277 88616904 88515670
4354H8515670J0929P22293P20797R84624N09677J178118O48373M23097O54443
$$ 88515670 88526599 89248892 89969689 90954313 91463990 92642108 93290481 93713578 94368021
4345I4368021Q52453J082830J782345J402057J261947J619024J739671K171307
$$ 94368021 95220474 96303304 98085649 99487706 100749653 102368677 104108348 106279655
4337A06279655K393043J806120K936130L030745L872911M356172M388113O068665
$$ 106279655 108672698 110478818 113414948 116445693 120318604 124674776 129062889 135131554
4329A35131554P044371P427401Q975794R098011R241268R422747Q178891O683047
$$ 135131554 142175925 149603326 158579120 167677131 176918399 186341146 194520037 201203084
4321B01203084L605530j114464o077960j0260873j1226675r672515q903642p440788
$$ 201203084 204808614 203694150 197616190 187355317 176128642 166456127 157552485 150111697
4313A50111697o198156n472991m377618l881350l864711k733139k909887l500804
$$ 150111697 143913541 138440550 134062932 130181582 126316871 123583732 120673845 117173041
4305A17173041l146350l050220k881808l546026k841906k707765j845587j555874
$$ 117173041 114026691 110976471 108094663 104548637 101706731 98998966 97153379 95597505
4297I5597505j063102j281994j460446j650016j896976j323979j204462n53833
$$ 95597505 94534403 93252409 91791963 90141947 88244971 86920992 85716530 85162697
4289H5162697r15283r99174j301929p72013j018355j135560j169175r76097l61914
$$ 85162697 84247414 83248240 81946311 81174298 80155943 79020383 77851208 76875111 76513197
4280G6513197j177065o71656o04617o18511n30145o52458p10876p03996o7297
$$ 76513197 75336132 74664476 74059859 73441348 72911203 72258745 71547869 70843873 70776576
4271G0776576q73693n62571j43706j69403k22376o79733O4684J92765k40792m36055
$$ 70776576 69902883 69340312 69196606 69027203 68804827 68125094 68189778 68382543 68141751 67705696
4261F7705696p83881n79728j008989n13027n30332o46363o87323l70520J03631
$$ 67705696 66921815 66342087 65333098 64820071 64289739 63643376 62956053 62585533 62689164
4252F2689164j53918m37329n86603k42451n88637k86714m09916K89054l78151
$$ 62689164 62535246 62097917 61511314 61268863 60680226 60393512 59983596 60272650 59894499
4243E9894499n99480j20740K03486p458o31068J33769N47772J1877p16431L02855
$$ 59894499 59295019 59174279 59377765 59370307 58739239 58873008 59420780 59432657 58716226 59019081
4233E9019081k13203r09944r00128k45717m62902N04651O4092m35761k73879l19948
$$ 59019081 58805878 57895934 56995806 56750089 56287187 56791838 56855930 56420169 56146290 55826342
4223E5826342q6227q60651L85407m36514o28964N8747R7729n188p92286l77103
$$ 55826342 55740115 54879464 55264871 54828357 54199393 54258140 54355869 54350681 53558395 53181292
4213E3181292O05700J8567n03429K12316n10184n32682m57741o84077p80912J40410
$$ 53181292 53786992 53805559 53302130 53514446 53004262 52471580 52013839 51329762 50548850 50689260
4203E0689260m58678m56723N6128J16858q64232k32312J46983j76583j25605j11285
$$ 50689260 50230582 49773859 49829987 49946845 49082613 48850301 48997284 48820701 48695096 48583811
4193D8583811K09868J93449l56262p00536L1353L26502k65489m26977N00763J7893
$$ 48583811 48793679 48987128 48630866 47930330 47961683 48288185 48022696 47595719 48096482 48114375
4183D8114375k90710J12477l49813R5815j23735n60123l35191n32067J71330p16886
$$ 48114375 47823665 47936142 47586329 47682144 47558409 46998286 46663095 46131028 46302358 45585472
4173D5585472o21500k64038K97031l88637k11668o32253p06430l33893M24915
$$ 45585472 44963972 44699934 44996965 44608328 44396660 43764407 43057977 42724084 43148999
4164D3148999m00010j24451k09003J49106J48152p25934M1976j7701l29775o09604
$$ 43148999 42748989 42624538 42415535 42564641 42712793 41986859 42028835 42011134 41681359 41071755
4154D1071755n12081j67317K3871K93180J20774k73705j17529l83038o01310l86815
$$ 41071755 40559674 40392357 40416228 40709408 40830182 40556477 40438948 40055910 39454600 39067785
4144C9067785L505j55697J103m58284p35593o65380o76867O787P7916K1939j55767
$$ 39067785 39071290 38915593 38916696 38458412 37722819 37057439 36380572 36387359 36465275 36487214 36331447
4133C6331447k47574j57804j59243p87377q242J58070j45331k55272m27321J55279
$$ 36331447 36083873 35926069 35766826 34979449 34971207 35129277 34983946 34728674 34301353 34456632
4123C4456632M78711l97918k96700O46777m68923m26596l05232K36039J65232
$$ 34456632 34935343 34537425 34240725 34887502 34418579 33991983 33686751 33922790 34088022
4114C4088022l87647j54928N41563o15489K19276r1258m62432J52032l70883j91284
$$ 34088022 33700375 33545447 34087010 33471521 33690797 33599539 33137107 33289139 32918256 32726972
4104C2726972k78978k64096k94460M89914J04904o23403J27526j58574j271301
$$ 32726972 32447994 32183898 31889438 32379352 32484256 31860853 31988379 31829805 30558504
4095C0558504K75161j29810m535M9254o82060k91316K86333O3576m28922j055039
$$ 30558504 30833665 30703855 30699320 30748574 30066514 29775198 30061531 30125107 29696185 28641146
4085B8641146q5636j13974J51627n14855n82045K97106l47834K76588j35500j74298
$$ 28641146 28555510 28441536 28593163 28078308 27496263 27793369 27445535 27722123 27586623 27412325
4075B7412325L9324j39173o39612l18881k80009l6058m88817k00469o49472j90530
$$ 27412325 27451649 27312476 26672864 26353983 26073974 26037916 25549099 25348630 24699158 24508628
4065B4508628j90274l76348L7700j09196k73019M75437j93295k11676J29665o18332
$$ 24508628 24318354 23942006 23979706 23870510 23597491 24072928 23879633 23667957 23797622 23179290
4055B3179290J19087L37600n42888J56971k04128L5831m3894p64152K08952N3018
$$ 23179290 23298377 23635977 23093089 23250060 23045932 23081763 23037869 22273717 22482669 22535687
4045B2535687m87154J38204l1883l75098K24244k80158k36568j70042P1764K0999
$$ 22535687 22048533 22186737 22154854 21779756 22004000 21723842 21487274 21317232 21388996 21409995
4035B1409995m67339j42358k15777n67199o4448j81907K57610K35093j87672j7946
$$ 21409995 20942656 20800298 20584521 20017322 19952874 19770967 20028577 20263670 20075998 20058052
4025B0058052j60705j82102J81007j6884m96028j2954Q9193J56837k41616k41598
$$ 20058052 19897347 19715245 19896252 19879368 19383340 19370386 19459579 19616416 19374800 19133202
4015A9133202m37000K49597m03218M11055N49428m29621l58866J57157q5574k2951
$$ 19133202 18696202 18945799 18542581 18953636 19503064 19073443 18714577 18871734 18786160 18763209
4005A8763209m90458n36938M814l20999J12477K08458Q0910J34835N63469k48032
$$ 18763209 18272751 17735813 17740627 17419628 17532105 17740563 17821473 17956308 18519777 18271745
3995A8271745R3108k94845l18191K5988j53007k4808p77601L27417O77649n88894
$$ 18271745 18364853 18070008 17751817 17777805 17624798 17599990 16822389 17149806 17827455 17238561
3985A7238561k5529J13037J49318o84396K90460R4620k93047m02690j00386J98867
$$ 17238561 17213032 17326069 17475387 16790991 17081451 17176071 16883024 16480334 16379948 16578815
3975A6578815k81972m80251K40758J76719l00463L67940j5435m07777M07552l9372
$$ 16578815 16296843 15816592 16057350 16234069 15933606 16301546 16286111 15878334 16285886 16246514
3965A6246514l27973Q15O05835O23531l04837n4393l30659k21877o17138P644
$$ 16246514 15918541 15919356 16525191 17148722 16843885 16789492 16458833 16236956 15619818 15627462
3955A5627462O47041n27783l44772O03083l63872j49476P4447m65454J245898
$$ 15627462 16274503 15746720 15401948 16005031 15641159 15491683 15566130 15100676 16346574
3946A6346574M35754j57130l51493o38847M73605l75189k89766K20643m61146
$$ 16346574 16782328 16625198 16273705 15634858 16108463 15733274 15443508 15664151 15203005
3937A5203005J55087L13504J56760m21236O0418P6340k38003p1090m121M34327
$$ 15203005 15358092 15671596 15828356 15407120 15467538 15543878 15305875 15234785 15230664 15664991
3927A5664991j0142J61166L3097o03895J2067l58001j92228L46631N77511r4256
$$ 15664991 15654849 15816015 15849112 15245217 15257284 14899283 14707055 15053686 15631197 15536941
3917A5536941k7443l9264M29481r1637l84357j80574m2338K73279n15049l69979
$$ 15536941 15509498 15470234 15899715 15808078 15423721 15243147 15200809 15474088 14959039 14589060
3907A4589060J06335J65491L54122J83018p66942q1778L11263J01855J53218O3494
$$ 14589060 14695395 14860886 15215008 15398026 14631084 14549306 14860569 14962424 15115642 15179136
3897A5179136P1928J78541j68181k03391P1335J56014n21132m78771J98947O93740
$$ 15179136 15251064 15429605 15261424 15058033 15129368 15285382 14764250 14285479 14484426 15178166
3887A5178166M71422N4831m82441k48268M76790j16829q04825P27621l2424n9880
$$ 15178166 15649588 15704419 15221978 14973710 15450500 15333671 14528846 15256467 15224043 15164163
3877A5164163K71459m48509O0569L86978J95160k69660J68333K59043j94703j16795
$$ 15164163 15435622 14987113 15047682 15434660 15629820 15360160 15528493 15787536 15592833 15476038
3867A5476038n07841M90627P9656m17904O6141j61900R6718M01536j85932k32461
$$ 15476038 14968197 15458824 15538480 15120576 15186717 15024817 15121535 15523071 15337139 15104678
3857A5104678j06711J69354K95071k2126K7474l71654P6663L62152k25721N72508
$$ 15104678 14997967 15167321 15462392 15440266 15467740 15096086 15172749 15534901 15309180 15881688
3847A5881688J6956L68896L45704m43276K79764M32847n7944m0799p8619M9915
$$ 15881688 15898644 16267540 16613244 16169968 16449732 16882579 16824635 16783836 16705217 16755132
3837A6755132M4576l73068j20552l00546J74349K75693p1428l33455J81280M89564
$$ 16755132 16799708 16426640 16306088 16005542 16179891 16455584 16384156 16050701 16231981 16721545
3827A6721545p4608J5676J45546o969L58298m58852M59181N14244J15131L89317
$$ 16721545 16646937 16662613 16808159 16801190 17159488 16700636 17159817 17674061 17789192 18178509
3817A8178509k3418j66472J32806K99980j90178L83174k62207l17755M78010M49718
$$ 18178509 18155091 17988619 18121425 18421405 18231227 18614401 18352194 18034439 18512449 18962167
3807A8962167L52871l32937p3865L68429K03091n641O81636M59280n9946J35005
$$ 18962167 19315038 18982101 18908236 19276665 19479756 19474115 20155751 20615031 20555085 20690090
3797B0690090j74740k12841K47910J75733K18506O05021M55794K63637k21168
$$ 20690090 20515350 20302509 20550419 20726152 20944658 21549679 22005473 22269110 22047942
3788B2047942Q4091L6931P8930m8381k27903n62086N4973O17325l11971j07813
$$ 22047942 22132033 22168964 22247894 22199513 21971610 21409524 21464497 22081822 21769851 21662038
3778B1662038K56349M4025j84483j84772J49184N17581m0054O9223R4506O2745
$$ 21662038 21918387 21962412 21777929 21593157 21742341 22259922 22219868 22289091 22383597 22446342
3768B2446342P0719j09535J19656J2922k83852O13130L62741p1351j20137L99808
$$ 22446342 22517061 22407526 22527182 22540104 22256252 22869382 23232123 23160772 23040635 23440443
3758B3440443M13474k79669j55396q13872J88581M16967k06487m0305n0269J84211
$$ 23440443 23853917 23574248 23418852 22604980 22793561 23210528 23004041 22963736 22913467 23097678
3748B3097678j11127O8567N60388n2248K9692K03094J08946m80826k13108K9600
$$ 23097678 22986551 23055118 23615506 23563258 23592950 23796044 23904990 23424164 23211056 23240656
3738B3240656j44640j20692L41253P2069r2615n16575P1766J55101m28184K12408
$$ 23240656 23096016 22975324 23316577 23388646 23296031 22779456 22851222 23006323 22578139 22790547
3728B2790547K93866K14232O7953n27052K05834K57062k35711K26665p5589J456
$$ 22790547 23084413 23298645 23366598 22839546 23045380 23302442 23066731 23293396 23217807 23219263
3718B3219263m82273N80113r8006K57958j14119o29715k0980N50485M68348l50991
$$ 23219263 22736990 23317103 23219097 23477055 23362936 22733221 22712241 23262726 23731074 23380083
3708B3380083l12402l74904k09028J11144L54399M2686m77218L06793p2228k96480
$$ 23380083 23067681 22692777 22483749 22594893 22949292 22991978 22514760 22821553 22749325 22452845
3698B2452845n1289J10446m0704m68367K37273l14171R7284N62782n72297l86969
$$ 22452845 22401556 22512002 22471298 22002931 22240204 21926033 22023317 22586099 22013802 21626833
3688B1626833L39493M04688J40102q4650j55457J2738p5535j76989k10754N7520
$$ 21626833 21966326 22371014 22511116 22426466 22271009 22283747 22208212 22031223 21820469 21877989
3678B1877989J55348M15442J64327o24263m00914L51379L24998j64424k37486
$$ 21877989 22033337 22448779 22613106 21988843 21587929 21939308 22264306 22099882 21862396
3669B1862396k04486N8184O12710M97848j24897k76529L12767l28070m39993N14446
$$ 21862396 21657910 21716094 22328804 22826652 22701755 22425226 22737993 22409923 21969930 22484376
3659B2484376l06952k04331N60572n5208K23769j19576j20435o1301J73205N8438
$$ 22484376 22177424 21973093 22533665 22478457 22702226 22582650 22462215 22400914 22574119 22632557
3649B2632557J59041R14593K14146n20539J47115O05762j42603l00299K79630
$$ 22632557 22791598 23706191 23920337 23399798 23546913 24152675 24010072 23709773 23989403
3640B3989403N60466l91600k7754n4166K66209J82614N01337k31452M16389M56869
$$ 23989403 24549869 24158269 24130515 24076349 24342558 24525172 25026509 24795057 25211446 25668315
3630B5668315n338k69365J48407L41731l47624k7908K18447J20651K20653M90058
$$ 25668315 25662977 25393612 25542019 25883750 25536126 25508218 25726665 25847316 26067969 26558027
3620B6558027l60649j32693P74492Q83894k46048k93816N86273J88272r9085k47826
$$ 26558027 26197378 26064685 26839177 27723071 27477023 27183207 27769480 27957752 27858667 27610841
3610B7610841j97754r5141Q73974K90834R57357J39371j76590j92807O61679k31409
$$ 27610841 27413087 27317946 28191920 28482754 29440111 29579482 29402892 29210085 29871764 29640355
3600B9640355m95143P13243j58261L02788J54136j47894N25984P83864n5859P00800
$$ 29640355 29145212 29858455 29700194 30002982 30157118 30009224 30535208 31319072 31263213 31964013
3590C1964013K21711L2161k57694K6346K29920j25797O93239K74739L8221O02235
$$ 31964013 32185724 32217885 31960191 31986537 32216457 32090660 32783899 33058638 33096859 33699094
3580C3699094K85940J17022L18791P85771L26806K76428q8971N23215N49290j45386
$$ 33699094 33985034 34102056 34420847 35206618 35533424 35809852 35720881 36244096 36793386 36648000
3570C6648000J25521M43612M13988J71154l01918N93095M73656J95373P8686L98991
$$ 36648000 36773521 37217133 37631121 37802275 37500357 38093452 38567108 38762481 38841167 39240158
3560C9240158O37317K58107O24336M3422j77837J74794L34576O75353L23945L86150
$$ 39240158 39877475 40135582 40759918 40803340 40625503 40800297 41134873 41810226 42134171 42520321
3550D2520321R4730l5144R22110Q3848j49892J003640M25832M4227N5353L56657
$$ 42520321 42615051 42579907 43502017 43585865 43435973 44439613 44865445 44909672 44965025 45321682
3540D5321682M78885M46551O67513P06585M18612M53373k53452m29287Q80401
$$ 45321682 45800567 46247118 46914631 47621216 48039828 48493201 48239749 47810462 48690863
3531D8690863O70414M17949L69035L94625k26075L50296M63362O52494O31419
$$ 48690863 49361277 49779226 50148261 50542886 50316811 50667107 51130469 51782963 52414382
3522E2414382M93884O49810L10327j29747J86016R58919O16784O25812O87982
$$ 52414382 52908266 53558076 53868403 53738656 53924672 54883591 55500375 56126187 56814169
3513E6814169P16399N15133J078793M30597M40095J247511N46519J282804M52138
$$ 56814169 57530568 58045701 59124494 59555091 59995186 61242697 61789216 63072020 63524158
3504F3524158J299653J496400J355291J871632K134728J769282J992219K593237
$$ 63524158 64823811 66320211 67675502 69547134 71681862 73451144 75443363 78036600
3496G8036600K097861K927292K850406K411232L339800L116742L278935L068560
$$ 78036600 80134461 83061753 85912159 88323391 91663191 94779933 98058868 101127428
3488A01127428K145291K415121J819126J358565R44728J91035L17138K22046N36418
$$ 101127428 103272719 105687840 107506966 108865531 109810259 110001294 110318432 110540478 111076896
3479A11076896o54018k18182P15215K39371J008705n3583J387257J693382J143318
$$ 111076896 110422878 110204696 110919911 111159282 112167987 112114404 113501661 115195043 116338361
3470A16338361J521850J668442p84678k378117m630570o778481o402621m077960
$$ 116338361 117860211 119528653 118743975 116365858 111735288 104956807 98554186 94476226
3462I4476226m439454m890907m871165l780312l229834l213595k300302k344639
$$ 94476226 90036772 85145865 80274700 76494388 73264554 70050959 67750657 65406018
3454F5406018k365318j432538j742750j880351j032100o12355q95511J18884P59219
$$ 65406018 63040700 61608162 59865412 57985061 56952961 56340606 55445095 55563979 56323198
3445E6323198K26257P96625J204294K190343K463097L156374K496676L351805
$$ 56323198 56549455 57346080 58550374 60740717 63203814 66360188 68856864 72208669
3437G2208669K717283N00925k368358p181070q465933o428276m035882k652095
$$ 72208669 74925952 75426877 73058519 65877449 57411516 50983240 46947358 44295263
3429D4295263k607362j586933j171080q27867j141248q89285p65832j050668m68468
$$ 44295263 41687901 40100968 38929888 38102021 36960773 36071488 35305656 34254988 33786520
3420C3786520q25404p17515K17251K48750n7048k53058m79949K69957P27575J131532
$$ 33786520 32961116 32243601 32460852 32709602 32652554 32399496 31919547 32189504 32917079 34048611
3410C4048611J381178J025254J423704J293168J546635R26237K89217j585598
$$ 34048611 35429789 36455043 37878747 39171915 40718550 41644787 41934004 40348406
3402D0348406l383293m038367l183259j745120j254338o16945q10697p48444q72249
$$ 40348406 36965113 32926746 29743487 27998367 26744029 26127084 25316387 24567943 23695694
3393B3695694n41724l18386l1029o89896n53748m64448o12644J97797m32261m84603
$$ 23695694 23153970 22835584 22804555 22114659 21560911 21096463 20483819 20681616 20249355 19764752
3383A9764752k59758j55441q11149m83006K6744P1803l50168O33376o3463q90988
$$ 19764752 19504994 19349553 18538404 18055398 18082142 18153945 17803777 18437153 18373690 17482702
3373A7482702J05324j18395k37143p35557l50700M66413k33574K2679J08335q8167
$$ 17482702 17588026 17469631 17232488 16496931 16146231 16612644 16379070 16401749 16510084 16421917
3363A6421917l21148k69474j81249k8920O5271m75272o73042J28970j90395l33404
$$ 16421917 16100769 15831295 15650046 15621126 15686397 15211125 14538083 14667053 14476658 14143254
3353A4143254j33674n13538K81855J58699K2323L4213k44519K64047o00998K12688
$$ 14143254 14009580 13496042 13777897 13936596 13958919 13993132 13748613 14012660 13411662 13624350
3343A3624350k88663p86675j6552K27191P4958L37531k21280m09734Q5432L38523
$$ 13624350 13335687 12549012 12532460 12759651 12834609 13172140 12950860 12541126 12626558 12965081
3333A2965081J43479O7967J41637p19977j594K4673l0380L2292j98314J97542
$$ 12965081 13108560 13176527 13318164 12598187 12596593 12621266 12590886 12623178 12424864 12622406
3323A2622406O45061o90988m27946K55163l9594p0237l98206j74254L84044j16195
$$ 12622406 13267467 12576479 12148533 12403696 12364102 12293865 11895659 11721405 12105449 11989254
3313A1989254J12269m38924l86233M05342K08008o5018m22126J64311O96060M16251
$$ 11989254 12101523 11662599 11276366 11681708 11889716 11824698 11402572 11566883 12262943 12679194
3303A2679194n69698r60475N21301k54247J669J8586O5734M09j97570m23614J83730
$$ 12679194 12109496 11149021 11670322 11416075 11417744 11436330 11502064 11502473 11304903 10881289 11065019
3292A1065019J72643m6180J95698j14502m54788L3024N22871L23487Q2194m62539
$$ 11065019 11237662 11191482 11387180 11272678 10817890 10850914 11373785 11697272 11779466 11316927
3282A1316927L75391L29490r06733k31818K41744L10856N35635o7324n06317l5364
$$ 11316927 11692318 12021808 11115075 10883257 11125001 11435857 11971492 11904168 11397851 11362487
3272A1362487J61478j13367L26511M59433j63811L30653l22038N28986n3263o25140
$$ 11362487 11523965 11410598 11737109 12196542 12032731 12363384 12041346 12570332 12517069 11891929
3262A1891929L7024j9453k9584O8002M52565n30124p0131J44575L99044j73645
$$ 11891929 11928953 11909500 11879916 11947918 12400483 11870359 11800228 11944803 12343847 12170202
3252A2170202M91663k1298l7125N07149J39673L23151j03577k5061M6129O6624
$$ 12170202 12661865 12640567 12603442 13110591 13250264 13573415 13469838 13444777 13490906 13557530
3242A3557530L97807N69545J53930L66936k02298L63921K39349O3860K28804n44673
$$ 13557530 13955337 14524882 14678812 15045748 14843450 15207371 15446720 15510580 15739384 15194711
3232A5194711J26479o9144N90876k3824J7328N21719J04039R06986j24034l76076
$$ 15194711 15321190 15252046 15842922 15819098 15836426 16358145 16462184 17369170 17245136 16869060
3222A6869060N50464M87915M41045M45889m7484l40340N8804Q80714M61345M16018
$$ 16869060 17419524 17907439 18348484 18794373 18746889 18406549 18465353 19346067 19807412 20223430
3212B0223430N71777j3977J41924p4196O17235J72625L07517Q01083L28629L05955
$$ 20223430 20795207 20781230 20923154 20848958 21466193 21638818 21946335 22747418 23076047 23382002
3202B3382002Q4192P41292R87073K89320M35836J152396R80518K52189L16879
$$ 23382002 23466194 24207486 25194559 25483879 25919715 27072111 28052629 28304818 28621697
3193B8621697R21001Q54840M30891L98373Q95853R17929J25960M98827K71256
$$ 28621697 29542698 30397538 30828429 31226802 32122655 33040584 33166544 33665371 33936627
3184C3936627M24064J43059Q51086L47585Q02114K41869P2946R98608O13395Q64838
$$ 33936627 34360691 34503750 35354836 35702421 36504535 36746404 36819350 37817958 38431353 39296191
3174C9296191M35421J79298P31738Q22970K56046J42359M15156J509768Q18612
$$ 39296191 39731612 39910910 40642648 41465618 41721664 41864023 42279179 43788947 44607559
3165D4607559J048093M84064P23072J657646J382699M88834o6808l02720O0641
$$ 44607559 45655652 46139716 46862788 48520434 49903133 50391967 50325159 50022439 50083080
3156E0083080J05148Q2778J97053k08962Q61928L76239K04039J39517M704J81083
$$ 50083080 50188228 50271006 50468059 50259097 51121025 51497264 51701303 51840820 51845524 52026607
3146E2026607l96274k45545k77114n58242k30351m48294o59591j002801m03607
$$ 52026607 51630333 51384788 51107674 50549432 50319081 49870787 49211196 48208395 47804788
3137D7804788l67784q37001l73232Q1311L08747M16896N76328m17360m95024n7180
$$ 47804788 47437004 46600003 46226771 46308082 46616829 47033725 47610053 47192693 46697669 46640489
3127D6640489o69856m23230j82904j069555p66862n58126o67970n75198j078140
$$ 46640489 45970633 45547403 45364499 44294944 43528082 42969956 42301986 41726788 40648648
3118D0648648k58729j115881n80886l56225m10743j062721q34565k33857o19394
$$ 40648648 40389919 39274038 38693152 38336927 37926184 36863463 36028898 35795041 35175647
3109C5175647j103635m72485n02638m95685p40670j095643l40058p13138l32795
$$ 35175647 34072012 33599527 33096889 32601204 31860534 30764891 30424833 29711695 29378900
3100B9378900q96924o24457j5780p7258m72747j210342m69255r26220l94958k29399
$$ 29378900 28481976 27857519 27841739 27764481 27291734 26081392 25612137 24685917 24290959 24061560
3090B4061560p48435n72262j141223o0346q77537l17541l04990n2856l51988p75308
$$ 24061560 23313125 22740863 21599640 21539294 20661757 20344216 20039226 19986370 19634382 18859074
3080A8859074q67479n72995k81913n6441j33703K40502m85098r7007l5766q67688
$$ 18859074 17991595 17418600 17136687 17080246 16946543 17187045 16701947 16604940 16569174 15701486
3070A5701486n01997N9509m5400k10012q06985j11290j4973n78930N46417M6392
$$ 15701486 15199489 15258998 15213598 15003586 14196601 14085311 14070338 13491408 14037825 14084217
3060A4084217m41822m01285j84996k94586q69599q35976j45912l3831l20069o5918
$$ 14084217 13642395 13241110 13056114 12761528 11891929 11055953 10910041 10876210 10556141 10490223
3050A0490223Q5976P19392o71108n65812l30758j88313J44130j82033k9512l156
$$ 10490223 10576199 11295591 10624483 10058671 9727913 9539600 9683730 9501697 9472185 9469029
3040I469029K80568q25300J02568q2949k25324k87070P3422K75850p54675J36154
$$ 9469029 9749597 8924297 9026865 8943916 8718592 8431522 8504944 8780794 8026119 8162273
3030H162273L88786n58484o18157j86920J60399n4474k73912J27023M23506p1536
$$ 8162273 8551059 7992575 7374418 7187498 7347897 7293423 7019511 7146534 7570040 7498504
3020G498504k68920n16277o1782M68241K43578O9869l47831o82827k60292N74548
$$ 7498504 7229584 6713307 6651525 7119766 7363344 7433213 7085382 6402555 6142263 6716811
3010F716811O297m88481o0045N0271j67040k36702k81252j24007j79781M29850
$$ 6716811 6723108 6234627 6174582 6224853 6057813 5821111 5539859 5415852 5236071 5665921
3000E665921j0120m50668N56391O51074n79938J18486r7468o97920p2788j47098
$$ 5665921 5655801 5205133 5761524 6412598 5832660 5951146 5853678 5155758 5082970 4935872
2990D935872k08048J43470L93396k5183M12560K2655j23536J43285j00339J2519
$$ 4935872 4727824 4871294 5264690 5239507 5652067 5674722 5551186 5694471 5594132 5606651
2980E606651m85445l86592j78527l32774k04224K5200L57262J83674j48281k67672
$$ 5606651 5121206 4734614 4556087 4223313 4019089 4044289 4401551 4585225 4436944 4169272
2970D169272k86018l60651K11741J09031M89036P52448J0331q14587l26715k51580
$$ 4169272 3883254 3522603 3734344 3843375 4332411 5084859 5095190 4280603 3953888 3702308
2960C702308K18804k74828j78216K81861K29668k87596o37888O06849L55706k08739
$$ 3702308 3921112 3646284 3468068 3749929 3979597 3692001 3054113 3660962 4016668 3807929
2950C807929R0495k6900m46799M34993k70212o77343L36546M14806L79791j35552
$$ 3807929 3898424 3871524 3424725 3859718 3589506 2912163 3248709 3663515 4043306 3907754
2940C907754l51808l15282k43537l75931M76636L58164l85683j38872j92503k97370
$$ 3907754 3555946 3240664 2997127 2621196 3097832 3455996 3070313 2931441 2738938 2441568
2930B441568l5617M00145M31562j85862M99075k05327l61291J76073j6221l23001
$$ 2441568 2405951 2806096 3237658 3051796 3550871 3345544 2984253 3160326 3144105 2821104
2920B821104K70011n23788K73450k18521m40861N22765q5229J62146k81745p2148
$$ 2821104 3091115 2567327 2840777 2622256 2181395 2704160 2618931 2781077 2499332 2427184
2910B427184L19791k06335L35184M33279M9281r4331m31813p66842k74504K38866
$$ 2427184 2746975 2540640 2875824 3309103 3358384 3264053 2832240 2065398 1790894 2029760
2900B029760N36539K56220k7424L2789J32258K48878n72836j64234j27896j94708
$$ 2029760 2566299 2822519 2795095 2827884 2960142 3209020 2636184 2471950 2344054 2149346
2890B149346L78143L76705j20916L00058j86649k3352l30068m66116J39942K39665
$$ 2149346 2527489 2904194 2783278 3083336 2896687 2873335 2543267 2077151 2217093 2456758
2880B456758k11244N5892l320J99226j94182N25118L19622m8096P3863L8579m79582
$$ 2456758 2245514 2301406 2298086 2497312 2303130 2828248 3147870 3099774 3173637 3212216 2732634
2869B732634o76874k17371k75328L60707k47168J81257K50996K25597l6033l30242
$$ 2732634 2055760 1838389 1563061 1923768 1676600 1857857 2108853 2334450 2298417 1968175
2859A968175L088L55961J84167o1403J19184p59530j22652J90131j91229J35448
$$ 1968175 1971263 2327224 2511391 2449988 2569172 1809642 1686990 1877121 1685892 1821340
2849A821340R9283Q3157j16321k12808l87197K65553R20982o22354K47384N30990
$$ 1821340 1920623 2003780 1887459 1674651 1287454 1553007 2473989 1851635 2099019 2630009
2839B630009J08468j20074l61555j65410L1648k99647l91972L10588K44907j18510
$$ 2630009 2738477 2618403 2256848 2091438 2123086 1823439 1431467 1742055 1986962 1868452
2829A868452k18271k35620K86481J10656k35729P7612L4823J39552l364m02984
$$ 1868452 1650181 1414561 1701042 1811698 1575969 1653581 1688404 1827956 1824592 1421608
2819A421608J94849L6001l05366l5165M71794J7018m68604J57577K25423J64895
$$ 1421608 1616457 1652458 1347092 1311927 1783721 1800739 1332135 1489712 1715135 1880030
2809A880030k02683J74002N28330m78203r7446N24K39008N17272o14950n20782
$$ 1880030 1677347 1851349 2379679 1901476 1804030 1804554 2043562 2560834 1945884 1425102
2799A425102j89536L19544J16903j00670j31890m18784J43144K84639n9150l3834
$$ 1425102 1235566 1555110 1672013 1571343 1439453 1020669 1163813 1448452 1389302 1355468
2789A355468L13838o09850n64285J25306O87664k45565r9453R7166k12255J1797
$$ 1355468 1669306 1059456 495171 620477 1308141 1062576 963123 1060289 848034 859831
2779H59831M34033o1774N9341K60646k77007P7634q0295l90367p0375K45707M35141
$$ 859831 1293864 1232090 1291431 1552077 1275070 1352704 1272409 882042 811667 1057374 1492515
2768A492515K8941m17111j82539l09767J59956K6809R53484R5514k10649r1759
$$ 1492515 1521456 1104345 921806 612039 771995 798804 1752288 1847802 1637153 1545394
2758A545394k17341j29341p3740J30854J99479m06990J88011l63196K80863N90676
$$ 1545394 1328053 1198712 1124972 1255826 1455305 1048315 1236326 873130 1153993 1744669
2748A744669k75311m81772j9410Q2398N02869N1178L2589j90766m39612J13658
$$ 1744669 1469358 987586 968176 1050574 1553443 1604621 1637210 1446444 1006832 1120490
2738A120490k2977l71924K80963m99731p9555M83391p6950K9618l42579l3262
$$ 1120490 1097513 725589 1006552 506821 427266 910657 833707 863325 520746 487484
2728D87484K34134O51436J45504p80231M29533O31063R1604m12601P8846N9663
$$ 487484 721618 1373054 1518558 738327 1167860 1798923 1890527 1477926 1556772 1616435
2718A616435n10527K66975l17627n38689M6372O30968Q33122m61687m37332K62485
$$ 1616435 1105908 1372883 1055256 516567 562939 1193907 2027029 1565342 1128010 1390495
2708A390495o421R6932l28554k32124l77732L46806O32299o30259l69779R9967
$$ 1390495 1384074 1481006 1152452 920328 542596 889402 1521701 891442 521663 621630
2698F21630J30096M00948k89562K66277K43902K23677K19933M60248o27230l48157
$$ 621630 751726 1152674 863112 1129389 1373291 1596968 1816901 2277149 1649919 1301762
2688A301762m02206M79923M38975k0218k84148k43526J01563l26079N24424l81776
$$ 1301762 899556 1379479 1818454 1798236 1514088 1270562 1372125 1046046 1570470 1188694
2678A188694k0902K54551K07513j54801L34864j64351p67824k40275N33367j83825
$$ 1188694 1167792 1422343 1629856 1475055 1809919 1645568 877744 637469 1170836 987011
2668I87011j74016p3389k41584L29463J41996j3103J18660j71381o1401L85631
$$ 987011 812995 739606 498022 827485 969481 956378 1075038 903657 842256 1227887
2658A227887k69954l81510K23037K13198K7863L47081o96759M1158J73508r906
$$ 1227887 957933 576423 799460 1012658 1040521 1387602 690843 732001 905509 895603
2648H95603j97629L47394J28974J5149K07842o11525K22067j92490R7103J88244
$$ 895603 697974 1045368 1174342 1189491 1397333 785808 1007875 815385 912488 1100732
2638A100732n9523o1190K15583K45915k96788j34842j24643K07991L07516K07248
$$ 1100732 1041209 980019 1195602 1441517 1144729 1009887 885244 1093235 1400751 1607999
2628A607999k9611M0543n14754K4239m60256K82856R03341l19228k13599K60601
$$ 1607999 1578388 1618931 1104177 1128416 668160 951016 1854357 1535129 1321530 1582131
2618A582131N8852K51671j77952J78106Q9120r1990o29797q1194J7493k00479
$$ 1582131 1640983 1892654 1714702 1892808 1981928 1889938 1260141 1178947 1196440 995961
2608I95961m6903N7257J80429k59111K86155K4813j00933l91572j01302K32845
$$ 995961 949058 1006315 1186744 927633 1213788 1238601 1137668 746096 644794 877639
2598H77639j29767l39198O42066L10414m93874M8180J10196k18487l3489P2110
$$ 877639 747872 408674 1050740 1361154 867280 915460 1025656 807169 773680 845790
2588H45790n90243j26580J17883O5643N02232J094573r78318j16629M35674p09760
$$ 845790 255547 128967 246850 312493 814725 1909298 930980 814351 1250025 540265
2578E40265L70731M44414n80102L1556J46632J94894O60586p30313M10207K86636
$$ 540265 910996 1355410 775308 806864 953496 1148390 1808976 1078663 1488870 1775506
2568A775506k60574p69537o8231J02538P17160m57996k03495M04761j61067N7163
$$ 1775506 1514932 745395 677164 779702 1496862 1038866 835371 1240132 1079065 1136228
2558A136228m76663k15351q8907j75238K58713J046149O15125j13476J93250k39635
$$ 1136228 659565 444214 355307 180069 438782 1484931 2100056 1986580 2179830 1940195
2548A940195k77952l56837k70015J48768K38683K2580l13767l90734N80513O07249
$$ 1940195 1662243 1305406 1035391 1184159 1422842 1445422 1131655 740921 1321434 1928683
2538A928683L15180O0464n49923m13084K13013j43414J64631O6794m69598m6774
$$ 1928683 2243863 2304327 1754404 1341320 1554333 1410919 1575550 1642344 1172746 1125972
2528A125972k15438j33490M26875M11545K20941J15147m53083N63225J82577k51566
$$ 1125972 910534 777044 1203919 1615464 1836405 1951552 1498469 2061694 2244271 1992705
2518A992705m44465p7681k18085j16218J56151r135M6455K73775L53283o45272
$$ 1992705 1548240 1470559 1252474 1136256 1292407 1283272 1329727 1603502 1956785 1311513
2508A311513j18555J76307J72995J91467j99462m93636R8318N31345j94349j76129
$$ 1311513 1192958 1369265 1542260 1733727 1534265 1040629 1138947 1670292 1475943 1299814
2498A299814K09444n8978l65085K67402p4722K05404l0621L47721K8269m98742
$$ 1299814 1509258 1450280 1085195 1352597 1277875 1483279 1452658 1800379 1828648 1329906
2488A329906M23286L91924o03139L75197O01526R411j29578m28649K99851l17210
$$ 1329906 1753192 2145116 1541977 1917174 2518700 2528111 2398533 1969884 2269735 1952525
2478A952525K15536L04899R9293n2825m4609K29710K14580o00400k08035l78125
$$ 1952525 2168061 2472960 2572253 2519428 2474819 2704529 2919109 2318709 2110674 1732549
2468A732549p158P7087L49297j51849L46044K55678J8358k07121M72217l06627
$$ 1732549 1725391 1802478 2151775 1999926 2345970 2601648 2620006 2412885 2885102 2578475
2458B578475J78477K29841n38249P10626m36015m9470N3041O0803n42505j68901
$$ 2578475 2756952 2986793 2448544 3159170 2723155 2673685 2726726 2787529 2245024 2076123
2448B076123j49466N87526j94619N41806R80153m96849K56388m08347J7603n2739
$$ 2076123 1926657 2514183 2319564 2861370 3841523 3344674 3601062 3192715 3210318 3157579
2438C157579J62939M74359o7423N914R9554O74358n7216K30102l3233K5094K08024
$$ 3157579 3320518 3794877 3727454 3733368 3832922 4507280 4450064 4680166 4646933 4672027 4880051
2427D880051j99037j27952N09602J78081J89089k4770J66248Q9989j32131k29625
$$ 4880051 4681014 4553062 5062664 5240745 5429834 5405064 5571312 5661301 5529170 5299545
2417E299545l8979n9368k8483K8899N64285J34802N962O61363J29662O45008J51853
$$ 5299545 5260566 5201198 5172715 5201614 5765899 5900701 5906663 6568026 6697688 7342696 7494549
2406G494549l26923K4602N00029l5723k75832j28233K55772M83955K33327P04646
$$ 7494549 7167626 7192228 7692257 7656534 7380702 7252469 7508241 7992196 8225523 8930169
2396H930169P36927R3406K18466k7591K48281Q05415K46507N7384K75620K37264
$$ 8930169 9667096 9760502 9978968 9951377 10199658 11005073 11251580 11308964 11584584 11821848
2386A1821848N09176M61080M57586p0914J91880Q98697O43952N64676M89114N56519
$$ 11821848 12331024 12792104 13249690 13178776 13370656 14269353 14913305 15477981 15967095 16523614
2376A6523614O35549O45507J138180j15509N70877J245534P96698J263636K558653
$$ 16523614 17159163 17804670 18942850 18827341 19398218 20643752 21440450 22704086 25262739
2367B5262739J726471K064017K802148K505437K324094K367861L698319M877458
$$ 25262739 26989210 29053227 31855375 34360812 36684906 39052767 42751086 47628544
2359D7628544N689365O366663P561152J0442153J3194791J6455269K0497867K4442155
$$ 47628544 53317909 59684572 67245724 77687877 90882668 107337937 127835804 152277959
2351A52277959K7041833K0333635L548734l4059082m1218099k6790297j9047227
$$ 152277959 179319792 199653427 203202161 169143079 127924980 101134683 82087456
2344H2087456j1406589q833576o827071n433238l740257l215512k039677j851612
$$ 82087456 70680867 61847291 55020220 49586982 45846725 42631213 40591536 38739924
2336C8739924j490049k105330k329465k273454k231580k229410j905420j532526
$$ 38739924 37249875 35144545 32815080 30541626 28310046 26080636 24175216 22642690
2328B2642690j874658r75727l00723m69667r82384r91735l55380j181129m49940
$$ 22642690 20768032 19792305 19491582 19021915 18039531 17047796 16692416 15511287 15061347
2319A5061347o29263K56326o60483n78482o03509N387o46455p91261m00579l0381
$$ 15061347 14432084 14688410 14027927 13449445 12845936 12851323 12204868 11413607 11013028 10982647
2309A0982647k12017l26787p17131m05174l90353k33832l25251l79682m98200
$$ 10982647 10770630 10443843 9726712 9321538 8931185 8697353 8372102 7992420 7494220
2300G494220j41832L56742l74184m71628J15868M35528l81989n30901k42348M0594
$$ 7494220 7352388 7709130 7334946 6863318 6979186 7414714 7032725 6501824 6259476 6300070
2290F300070n35123m63352J68498K16531l71594k56570J14951n8118o94851j81453
$$ 6300070 5764947 5301595 5470093 5686624 5315030 5058460 5173411 5115293 4420442 4238989
2280D238989m00233M1180M88693j38635m09415k67091N34041Q416j06617l20699
$$ 4238989 3838756 3879936 4368629 4229994 3820579 3553488 4087529 4095945 3989328 3668629
2270C668629j34139K05703l18116l8300K96394n52568L88952j24549o6432r8995
$$ 3668629 3534490 3740193 3422077 3383777 3680171 3127603 3516555 3392006 3325574 3226579
2260C226579j10396k19333q21441L35792R08219J83349k68850k02632k2866l96082
$$ 3226579 3116183 2896850 2075409 2411201 3319420 3502769 3233919 3031287 3008421 2612339
2250B612339j58439J78110n35738J51468N36006j06158P0511K88322l03737m59323
$$ 2612339 2453900 2632010 2096272 2247740 2783746 2677588 2748099 3036421 2732684 2273361
2240B273361r5258L54261j66386m49643L83662l00476k76724O05899j60413j10059
$$ 2273361 2178103 2532364 2365978 1916335 2299997 1999521 1722797 2328696 2168283 2058224
2230B058224K07689m45236j95864L86863L67345l80262k09564K67291N9406M5681
$$ 2058224 2265913 1820677 1624813 2011676 2379021 1998759 1789195 2056486 2115892 2161573
2220B161573k40945m16642J58709o74734m28307M98946n09022O11087o7887J19941
$$ 2161573 1920628 1503986 1662695 987961 559654 1058600 549578 1160665 1092778 1212719
2210A212719N33901k67096L32872j70332R1108j99911q76907M78862k09383N04779
$$ 1212719 1746620 1479524 1812396 1642064 1733172 1533261 656354 1135216 925833 1430612
2200A430612l44317m16052k23771L51666r66L0795M70900P9119j27245J1689l28178
$$ 1430612 1086295 670243 446472 798138 797172 827967 1298867 1377986 1250741 1262430 934252
2189I34252k77111N71219O9580k17453k89899K1541R5305J35012j87748J09793
$$ 934252 657141 1228360 1297940 1080487 790588 812129 907434 1042446 854698 964491
2179I64491P16519N38174p7473l65533o18235o54466j76337L48805M02406k14720
$$ 964491 1681010 2219184 2141711 1776178 1157943 503477 327140 675945 1078351 863631
2169H63631l09371q2204K96400J33558m14764j3508Q68782l41740j04705j82039
$$ 863631 554260 472056 768456 902014 487250 473742 1342524 1000784 896079 714040
2159G14040J023107K80427p05968k13421l19302J5227K56540J94577k01578L26281
$$ 714040 1737147 2017574 1311606 1098185 778883 794110 1050650 1245227 1043649 1369930
2149A369930l4868m01477p08036J8304L80919M91904l52777N6687k7289M00730
$$ 1369930 1335062 933585 225549 243853 624772 1116676 763899 820586 793297 1194027
2139A194027l75323l67185O3608l71073K85186P4759k62548q026o955J85159J94077
$$ 1194027 818704 451519 515127 144054 429240 503999 241451 233425 226470 411629 605706
2128F05706L6632m63985K99882N9577l20530P8874k09565O03718k58618L34581
$$ 605706 642338 178353 478235 537812 217282 296156 86591 690309 431691 766272
2118G66272l7651K38428J40746n98382k14169O8006K38550k14944J20315k18963
$$ 766272 728621 967049 1107795 509413 295244 363250 601800 386856 507171 288208
2108B88208J97244o8866p3962L76333R1252l28954L40699l3148o39601L43458
$$ 288208 485452 416586 342624 718957 810209 481255 821954 788806 149205 492663
2098D92663k68307l56548L45370O23134j31879k15318q2666M17682N70419N49688
$$ 492663 224356 -132192 213178 836312 704433 489115 406449 824131 1394550 1944238
2088A944238k21153m71078O6227o8097K76403j46974k84855l27504O71272j60116
$$ 1944238 1723085 1252007 1318234 1250137 1526540 1379566 1094711 767207 1438479 1278363
2078A278363o16286n9896J71973K042j64311k32488K14457J02683P6852j3845
$$ 1278363 662077 602181 774154 776196 611885 379397 593854 696537 773389 759544
2068G59544J31500m68604j60469R5711N30978m2300J46535l46732l30096K44106
$$ 759544 891044 422440 261971 357682 888660 846360 992895 646163 316067 560173
2058E60173M32201j60817j85794J1990j14493R9322Q0325o20986K36599O1320
$$ 560173 992374 831557 645763 657753 543260 642582 722907 101921 338520 399840
2048C99840m55044o8145O26492J28533k78437p26595R7478K35936l00778K90483
$$ 399840 -55204 -123349 503143 631676 353239 -373356 -275878 -39942 -340720 -50237
2038e0237m54687N14501m08841K36427J018458k14491m06617l31467j97577N6449
$$ -50237 -504924 9577 -399264 -162837 855621 641130 234513 -96954 -294531 -238082
2028b38082j42449P34366K35260m08932k85025L03508n91175K00523J88712n7529
$$ -238082 -380531 353835 589095 180163 -104862 198646 -392529 -192006 -3294 -60823
2018f0823k53167k02052J11094J84829k13654O8957P42735N0681R1353j87914
$$ -60823 -313990 -516042 -404948 -220119 -433773 -364816 377919 428600 519953 332039
2008C32039j79334j57981J03884N57278j3367L7407p00529m06442L12732M25928
$$ 332039 152705 -5276 98608 655886 642519 679926 -20603 -427045 -114313 311615
1998C11615k85650J09552J09166M35688m31264k35691L80608L07081m94028R0184
$$ 311615 25965 135517 244683 680371 249107 13416 394024 701105 207077 297261
1988B97261k96419L51874J04732l3919l85420K53506K04153p71026k82138q5255
$$ 297261 842 352716 457448 423529 38109 291615 495768 -275258 -557396 -642651
1978f42651M87520o8094L67250M49349J85426j62104n74343L07262p743o4813
$$ -642651 -155131 -223225 144025 593374 778800 616696 42353 349615 341872 277059
1968B77059j50497l25131O33295q8701j19916j82583j46076K0352K57032l73029
$$ 277059 126562 -198569 434726 346025 226109 43526 -102550 -82198 174834 -198195
1958a98195M68610k61505m30489l3537J24540L75048r9544j81033l1694M87674
$$ -198195 270415 8910 -421579 -455116 -330576 44472 -55072 -236105 -267799 219875
1948B19875N65793m48215J81730K66176k46048O3110K59292m51836j00847q12967
$$ 219875 785668 337453 519183 785359 539311 602421 861713 409877 309030 -503937
1938e03937J18029j97381R0624L72079l63512J0165O4002K47498J87447J8149
$$ -503937 -385908 -583289 -492665 -120586 -484098 -473933 -409931 -162433 25014 43163
1928D3163L32753j85024k31909Q1584l65696n22219N17100j037r5607N17935m56502
$$ 43163 375916 190892 -41017 40567 -325129 -847348 -330248 -331285 -426892 91043 -365459
$$ [...]
##END NTUPLES=NMR SPECTRUM
##END=
