##TITLE=1H_DE-80H_X3
 200.13MHz, d2o
 8 sc
 
 19ns.26.2.2025
##JCAMPDX= 6.0         $$ Bruker NMR JCAMP-DX V2.0
##DATA TYPE= NMR SPECTRUM
##DATA CLASS= NTUPLES
##ORIGIN= UXNMR, Bruker Analytische Messtechnik GmbH
##OWNER= pz
$$ XWIN-NMR		Version 3.5
$$ Wed Jun 18 14:17:49 2025 Russian Standard Time (UT+4h)  Yarkov@DPX200
##.OBSERVE FREQUENCY= 200.1313
##.OBSERVE NUCLEUS= ^1H
##.ACQUISITION MODE= SIMULTANEOUS
##.ACQUISITION SCHEME= undefined
##.AVERAGES= 8
##.DIGITISER RES= 18
##SPECTROMETER/DATA SYSTEM= spect
##.PULSE SEQUENCE= zg30
##.SOLVENT NAME= CDCl3
##.SHIFT REFERENCE= (INTERNAL, CDCl3, 0, 15.4725)
##AUDIT TRAIL= $$ (NUMBER, WHEN, WHO, WHERE, WHAT)
$$ ##TITLE= Audit trail, XWIN-NMR		Version 3.5
$$ ##JCAMPDX= 5.01
$$ ##ORIGIN= Bruker BioSpin GmbH
$$ ##OWNER= Yarkov
$$ C:/Bruker/XWIN-NMR/data/yarkov2/nmr/H-C/1/pdata/1/auditp.txt
$$ ##AUDIT TRAIL=  $$ (NUMBER, WHEN, WHO, WHERE, WHAT)
(   1,<2025-06-18 14:15:45.92 +0400>,<Yarkov>,<DPX200>,
      <created by zg, POWCHK disabled, PULCHK disabled
       configuration hash MD5:
       00 E9 B6 7A A2 85 ED C7 34 08 36 98 17 FE 4E 26
       data hash MD5: 16K
       8F 18 16 DD B3 DF 2F 75 99 CE 62 6C 60 E7 D1 F7>)
(   2,<2025-06-18 14:16:28.75 +0400>,<Yarkov>,<DPX200>,
      <Start of raw data processing
       efp BC_mod = 2 LB = 0.25 FT_mod = 6 PKNL = 1 PHC0 = -1709.234 PHC1 = -1.633423 SI = 16K 
       data hash MD5: 16K
       4A 09 46 B9 6A 4A BC 5E 20 9B 08 98 AB A9 35 53>)
(   3,<2025-06-18 14:16:52.75 +0400>,<Yarkov>,<DPX200>,
      <abs ABSG = 5 
       data hash MD5: 16K
       8E A5 D6 E1 37 2D 21 5B 91 8E B0 0C 32 CC DE A8>)
(   4,<2025-06-18 14:16:58.46 +0400>,<Yarkov>,<DPX200>,
      <pk PHC0 = 11.2178 PHC1 = 0.3999993 
       data hash MD5: 16K
       0C 8A E9 7B 71 70 AC AC 61 66 92 F3 E2 59 FB 2F>)
(   5,<2025-06-18 14:17:04.78 +0400>,<Yarkov>,<DPX200>,
      <abs ABSG = 5 
       data hash MD5: 16K
       72 D5 30 96 9C A3 39 12 31 78 4A 08 28 CD 53 F7>)
$$ ##END=
$$ 
$$ hash MD5
$$ C2 12 FC 9E 10 71 20 4E 57 8C 5B 5E 1C 91 D8 E1
##$RELAX= 
##$RELAX= 
##$RELAX= 
##$RELAX= 
##$RELAX= 
##$RELAX= 
$$ Bruker specific parameters
$$ --------------------------
##$DU= <C:/Bruker/XWIN-NMR>
##$EXPNO= 1
##$NAME= <H-C>
##$PROCNO= 1
##$TYPE= <nmr>
##$USER= <yarkov2>
##$AMP= (0..31)
100 100 100 100 100 100 100 100 100 100 100 100 100 100 100 100 100 100 
100 100 100 100 100 100 100 100 100 100 100 100 100 100 
##$AQSEQ= 0
##$AQ_mod= 1
##$AUNM= <au_zg>
##$AUTOPOS= <>
##$BF1= 200.13
##$BF2= 200.13
##$BF3= 200.13
##$BF4= 200.13
##$BF5= 200.13
##$BF6= 200.13
##$BF7= 200.13
##$BF8= 200.13
##$BYTORDA= 1
##$CFDGTYP= 0
##$CFRGTYP= 5
##$CHEMSTR= <none>
##$CNST= (0..31)
1 1 145 1 1 1 1 1 1 1 1 1 1 1 1 1 1 1 1 1 1 1 1 1 1 1 1 1 1 1 1 1 
##$CPDPRG= <>
##$CPDPRG1= <>
##$CPDPRG2= <>
##$CPDPRG3= <>
##$CPDPRG4= <mlev>
##$CPDPRG5= <mlev>
##$CPDPRG6= <mlev>
##$CPDPRG7= <mlev>
##$CPDPRG8= <mlev>
##$CPDPRGB= <>
##$CPDPRGT= <>
##$D= (0..31)
0 0.7 0 0 0 0 0 0 0 0 0 0.03 0 0 0 0 0 0 0 0 0 0 0 0 0 0 0 0 0 0 0 0 
$$ [...]
##$SUBNAM3= <"">
##$SUBNAM4= <"">
##$SUBNAM5= <"">
##$SUBNAM6= <"">
##$SUBNAM7= <"">
##$SUBNAM8= <"">
##$SUBNAM9= <"">
##$SW= 18.0517328524113
##$SWIBOX= (0..15)
0 0 2 0 0 0 0 0 0 0 0 0 0 0 0 0 
##$SW_h= 3612.71676300578
##$TD= 16384
##$TD0= 1
##$TE= 0
##$TE2= 300
##$TE3= 300
##$TEG= 300
##$TL= (0..7)
0 120 120 120 120 120 120 120 
##$TP= (0..7)
150 150 150 150 150 150 150 150 
##$TP07= 0
##$TPNAME0= <>
##$TPNAME1= <>
##$TPNAME2= <>
##$TPNAME3= <>
##$TPNAME4= <>
##$TPNAME5= <>
##$TPNAME6= <>
##$TPNAME7= <>
##$TPOAL= (0..7)
0.5 0.5 0.5 0.5 0.5 0.5 0.5 0.5 
##$TPOFFS= (0..7)
0 0 0 0 0 0 0 0 
##$TUNHIN= 0
##$TUNHOUT= 0
##$TUNXOUT= 0
##$USERA1= <user>
##$USERA2= <user>
##$USERA3= <user>
##$USERA4= <user>
##$USERA5= <user>
##$V9= 5
##$VALIST= <valist>
##$VCLIST= <CCCCCCCCCCCCCCC>
##$VD= 0
##$VDLIST= <DDDDDDDDDDDDDDD>
##$VPLIST= <PPPPPPPPPPPPPPP>
##$VTLIST= <TTTTTTTTTTTTTTT>
##$WBST= 1024
##$WBSW= 4
##$XGAIN= (0..3)
0 0 0 0 
##$XL= 0
##$YL= 0
##$YMAX_a= 36401
##$YMIN_a= -21905
##$ZGOPTNS= <>
##$ZL1= 120
##$ZL2= 120
##$ZL3= 120
##$ZL4= 120
##$ABSF1= 15.51992
##$ABSF2= -2.531929
##$ABSG= 5
##$ABSL= 3
##$ALPHA= 0
##$AQORDER= 0
##$ASSFAC= 0
##$ASSFACI= 0
##$ASSFACX= 0
##$ASSWID= 0
##$AUNMP= <proc_1d>
##$AZFE= 0.1
##$AZFW= 0.1
##$BCFW= 0
##$BC_mod= 2
##$BYTORDP= 0
##$COROFFS= 0
##$CY= -3
##$DATMOD= 1
##$DC= 0
##$DFILT= <>
##$DTYPP= 0
##$F1P= 0
##$F2P= 0
##$FCOR= 1
##$FTSIZE= 16384
##$FT_mod= 6
##$GAMMA= 0
##$GB= 0
##$INTBC= 1
##$INTSCL= 3.241238e-09
##$ISEN= 128
##$LB= 0.25
##$LEV0= 0
##$LPBIN= 0
##$MAXI= 10000
##$MC2= 0
##$MEAN= 0
##$ME_mod= 0
##$MI= 1.114404
##$NCOEF= 0
##$NC_proc= -11
##$NLEV= 6
##$NOISF1= 3.799351
##$NOISF2= 2.8
##$NSP= 0
##$NTH_PI= 0
##$NZP= 0
##$OFFSET= 15.47254
##$PC= 1
##$PHC0= -1698.016
##$PHC1= -1.233424
##$PH_mod= 1
##$PKNL= yes
##$PPARMOD= 0
##$PSCAL= 0
##$PSIGN= 0
##$REVERSE= no
##$SF= 200.130009838679
##$SI= 16384
##$SIGF1= 3
##$SIGF2= 2
##$SINO= 0.751879
##$SIOLD= 32768
##$SREGLST= <19F.Aceton>
##$SSB= 0
##$STSI= 16384
##$STSR= 0
##$SW_p= 3612.71676300578
##$SYMM= 0
##$S_DEV= 0
##$TDeff= 16384
##$TDoff= 0
##$TI= <>
##$TILT= no
##$TM1= 0
##$TM2= 0
##$TOPLEV= 0
##$USERP1= <user>
##$USERP2= <user>
##$USERP3= <user>
##$USERP4= <user>
##$USERP5= <user>
##$WDW= 1
##$XDIM= 16384
##$YMAX_p= 396149681
##$YMIN_p= -7900180
$$ End of Bruker specific parameters
$$ ---------------------------------
##NTUPLES= NMR SPECTRUM
##VAR_NAME=  FREQUENCY,     SPECTRUM/REAL,   SPECTRUM/IMAG
##SYMBOL=    X,             R,               I
##VAR_TYPE=  INDEPENDENT,   DEPENDENT,       DEPENDENT
##VAR_FORM=  AFFN,          ASDF,            ASDF
##VAR_DIM=   16384,         16384,           16384
##UNITS=     HZ,            ARBITRARY UNITS, ARBITRARY UNITS
##FACTOR=    0.220516191357247, 1,           1
##FIRST=     3096.51956276326, 0,            0
##LAST=      -516.197200242522, 0,           0
##MIN=       -516.197200242522, -7900180,    0
##MAX=       3096.51956276326, 396149681,    0
$$ Real data points
##PAGE= N=1
##DATA TABLE= (X++(R..R)), XYDATA
$$ [...]
13806 -165181 -798462 -303557 -221194 -267766 -846943 -285334 -103574 -109977 -471025 943546
13796 943546 1994044 345005 -140617 -1233554 -725997 -1645238 -1637540 -407380 100992
13787 100992 -19422 149542 122427 263510 490953 894155 56556 -736366 36409 -326657
13777 -326657 -1321294 -326186 3712 -642697 -716741 563773 316101 1074369 542238 438756
13767 438756 -201717 -1075193 89771 86456 205783 843481 -27377 50126 639936 67731
13757 67731 414689 -490947 -792895 -581876 -685456 -960308 -229593 -832241 -789719 265098
13747 265098 97155 -1152991 -1438163 -733889 -1378024 -2046143 -1294510 -333264 -1445994
13738 -1445994 -886601 -885848 -1021113 -592052 -486732 -1595 -564628 -884761 -590064 -596022
13728 -596022 -591176 -565662 -50124 916792 817696 1362371 740030 379359 205756 -369451
13718 -369451 -530936 -116204 121608 332331 118130 -462068 -13370 212769 859215 181906
13708 181906 -151154 -667017 -90961 -108126 -483686 -461548 -30946 3997 457463 -68669
13698 -68669 -534121 692943 -580445 -968342 -35549 171441 54104 97072 426166 1687719
13688 1687719 1658434 578658 456213 -612606 18837 411735 -1205581 -1058476 -547414
13679 -547414 458344 557316 962633 -13179 31126 799391 641635 377054 301434 145638
13669 145638 -208922 -89914 -125477 89814 -718762 -651812 -639191 -558679 -123917 556513
13659 556513 1256156 1153484 751505 -135492 83473 -755114 -1518136 -535939 -284686 -526307
13649 -526307 -576011 127156 51335 -910730 -1034571 -23593 -530017 843841 771207 96183
13639 96183 897427 371014 574695 446851 516567 -126328 -663390 -253786 849538 236557
13629 236557 -727857 -588956 -721400 84618 -50718 -375525 375522 764247 1081692 1036938
13619 1036938 -479344 -306899 -251670 -1284749 -866114 -1088095 -523303 -617569 859205
13610 859205 838789 461196 -40951 544108 592778 -329301 -31473 92390 270033 -1475187
13600 -1475187 -1525174 -983696 -3853 731625 178467 -26510 -69235 1523234 832725 -42279
13590 -42279 62522 402770 41459 -252025 -506470 -1286888 -901885 -1079226 -750221 -740865
13580 -740865 239835 1676047 1128804 651705 -172575 376654 813355 287757 351991 -34062
13570 -34062 421883 769030 -977548 -1310339 -877786 -541323 -4772 425114 1350474 -546643
13560 -546643 -192713 398127 725267 53789 -79047 525671 906422 1020861 786135 973396
13550 973396 758559 -720751 -733060 253071 209781 715730 96556 626767 991236 498319
13540 498319 512728 -219705 775894 572157 300505 739235 1148547 1373421 509318 -127148
13530 -127148 -134207 673456 664577 -472328 -602657 -66578 -147782 -28999 9574 -156266
13520 -156266 952108 1360365 -1388 -947956 -457245 959141 2269171 1711227 1093322
13511 1093322 1036895 908337 712711 235033 94744 -151843 774010 769759 845030 874546
13501 874546 832216 1153785 547580 813570 526180 608297 955073 793891 691367 940048
13491 940048 865001 317638 506378 1110956 1132607 729205 -211986 -419296 -195193 -533954
13481 -533954 -453147 -424019 51108 -247656 -564622 699517 39350 -177339 171320 431472
13471 431472 92817 184487 1258932 967008 1492820 1500927 2133828 1711415 2115000 1814821
13461 1814821 1538632 2059760 548271 -639598 278949 655829 879675 130754 -643078
13452 -643078 -1055814 -1571153 -1271525 645967 362986 387030 527775 957371 691336 943858
13442 943858 1192645 562553 823069 121581 311954 148807 22645 -765502 -485576 -634988
13432 -634988 575261 787155 -590014 -72127 402519 -371386 -11322 632108 508646
13423 508646 1482040 1147490 328417 -840642 -1403613 45394 634740 104586 -498240
13414 -498240 -80541 -922403 -222912 651560 727487 769990 469650 623705 -444913 -845840
13404 -845840 -776876 95415 -185343 -23336 35300 -576797 -533841 -1205668 -1458461 -429504
13394 -429504 405309 488857 634636 331400 -420896 -329036 -805348 -557920 -194407 950063
13384 950063 595125 495433 1792717 1502965 1892461 994671 483139 285713 72339 263094
13374 263094 1892122 1842788 677774 304835 673198 412098 -39500 -864510 -533815
13365 -533815 -458521 -71451 -1405630 -644694 191518 228086 -438967 -564992 157385 662332
13355 662332 788541 -116556 768023 -184828 -649390 -1404801 -1298569 -879259 -1216197 -1261003
13345 -1261003 296564 -12659 -350432 1080278 466544 42912 -374061 -833016 230354
13336 230354 326221 219507 -364643 -845005 304429 -472813 -1006119 -761303 -398503 511713
13326 511713 -497248 170202 681302 382278 48937 -199865 288845 173096 -355397
13317 -355397 -1251798 -965828 -629572 -938391 -221656 -3327 -51107 379137 -722489 -454902
13307 -454902 238993 -517511 480432 311789 -283655 153419 426935 437426 118445 293181
13297 293181 480185 1416314 1528564 1216195 1076608 568177 -437854 -1156229 221790
13288 221790 369309 81199 -297781 -333327 -45747 -174282 8105 835024 922338 495686
13278 495686 -683340 -741811 668879 336969 -263613 -289164 -269180 773622 760479 780672
13268 780672 1283104 804641 1226395 911519 13457 1203360 1034657 923136 571221
13259 571221 238997 46790 209283 168902 -544434 -199206 708454 624340 134418 603408
13249 603408 888343 605328 454514 -21013 -569793 362572 232947 238618 -287863 1213189
13239 1213189 711868 907635 716938 172818 1063688 712810 108574 129494 3459 40
13229 40 452406 433027 -802779 -416524 80306 -363043 505417 1071671 577822 -1147450
13219 -1147450 -245387 -120064 83643 965506 526037 815290 154919 -459773 -49115
13210 -49115 -111543 69456 62679 242261 -121959 222201 429706 1060925 1947611 1462615
13200 1462615 1087041 -202231 -45748 1035245 341739 512148 1105053 375563 -220876
13191 -220876 -830232 -669797 194198 -59272 -1014490 -598529 -555682 2725 -16675 60327
13181 60327 -11698 59567 1074210 603868 -1115339 -349204 122697 851828 593929 670890
13171 670890 975244 884621 548145 -1591252 -555238 616220 473117 130599 -716254
13162 -716254 -297556 -127365 -523333 -903867 -1670760 -439121 49243 332588 1435776
13153 1435776 1426970 175294 -386237 -221534 97891 324798 814588 -504533 -1021622
13144 -1021622 -985719 609037 2006777 -147499 -762983 158986 716786 1265977 532137
13135 532137 1486664 1559093 815709 291481 -131294 1105574 722372 -548887 189843
13126 189843 -220577 -98688 129105 1165995 1118510 795118 -319138 662786 555072
13117 555072 331367 378690 -268202 660243 191824 1037695 408181 -33738 97683 793486
13107 793486 547908 293271 -146210 -20054 -313226 796661 976725 730114 -374971
13098 -374971 -1073046 -667496 -553353 177940 624336 1286976 1211240 1494147 1472824 552427
13088 552427 725804 642174 -348400 -45427 -1106041 -645535 -185379 807197 828666 -626830
13078 -626830 -711738 378775 960959 163085 500109 91112 336183 49628 1009631 1487794
13068 1487794 1223933 83873 -402298 -1646551 -1797066 210004 20977 277912 1591309
13059 1591309 1965738 1780602 883812 -38050 985105 596437 -472042 27935 342456
13050 342456 566664 -62163 407540 9534 846078 801198 -197449 1457276 943456 412578
13040 412578 660551 813666 -339799 -845757 118389 3509 -1282 -294421 -885122 -779074
13030 -779074 -467870 -119941 12493 -496595 18109 1129286 934257 715996 1359876
13021 1359876 504288 -879427 -394360 547366 799333 710944 -502222 -674544 -291417
13012 -291417 -399958 -203082 -500486 165579 953661 1107423 477317 579253 753964 715690
13002 715690 161230 -176468 -220963 -444035 13151 -946611 -1720569 -1229723 -1010233 -522090
12992 -522090 -149508 -575783 -481799 236163 1071597 1027359 -234614 -560346 -209487 59151
12982 59151 -98452 38284 -769433 -1249729 -1391883 -415716 470622 1745017 2145924 1609928
12972 1609928 617629 460407 509940 463724 673196 142624 629792 893703 625924 605557
12962 605557 -125626 500793 708237 54572 -285505 -269896 227452 55503 333858 -59301
12952 -59301 48994 298906 1678698 486420 -1108153 605622 -42310 -608971 -273872
12943 -273872 -768700 -1048758 -813888 -93890 262106 597089 -220538 665319 1047844 730159
12933 730159 -15266 436997 2115300 1094940 11104 -265949 -899665 -769590 148743
12924 148743 478781 283799 95851 985067 815352 181446 -970708 -2030873 -894607
12915 -894607 -232124 -835716 -408372 598083 626430 -309164 -458431 -214405 -131767 1325818
12905 1325818 1577011 996386 815480 1394265 683460 -167835 -251514 -414908 -722502 -480708
12895 -480708 -193199 782955 548207 904993 644219 352514 993848 669490 1332494 548143
12885 548143 -437353 -379021 400065 -602376 183674 402895 262246 579376 885941 545285
12875 545285 288728 -413326 -1085113 100004 517443 401821 1823441 1220808 631242
12866 631242 494975 -757657 693297 661226 579689 134841 15008 187945 1128427 336575
12856 336575 362453 893194 -300211 -23990 77972 -524496 5148 644905 -123596 -761130
12846 -761130 62409 177438 -324247 984663 922971 340894 701413 491675 132008 689785
12836 689785 829747 359180 -283244 1003021 1044368 -112582 -125031 193542 18950 929211
12826 929211 1612018 882316 -65131 329440 -129919 -1061844 12013 -443538 -219712
12817 -219712 1149773 2264025 1571455 2140636 1586310 1335265 788579 300445 1753076
12808 1753076 1966665 212451 -1819026 -1451423 -285583 1122247 612650 79997 1147880
12799 1147880 1284500 -646866 -585235 502190 1028799 560187 176167 -297436 -294382 1304092
12789 1304092 1686120 1356259 1499183 248846 242079 275552 -77400 -66322 -196527 -124334
12779 -124334 -372056 1033329 1512555 1033958 883202 341021 124188 -472008 -641943
12770 -641943 -597323 -1064117 -436148 124982 877667 653032 427697 845561 1070604 629076
12760 629076 1073675 2084390 1538137 575999 730433 166514 918245 1017279 664355 384618
12750 384618 1175284 1845886 1562998 1108475 -539299 -417885 283719 616181 397295
12741 397295 -311677 -165983 -344832 76556 139393 629760 858177 145442 333707 901777
12731 901777 581837 539900 1214181 599402 131675 562224 764714 1254096 872314 -137257
12721 -137257 392986 542732 1037005 810172 1341470 930015 739725 484068 1315758 995032
12711 995032 181944 370846 322314 743040 164799 -1093817 -475726 251017 227020 -733632
12701 -733632 -694551 -171860 -671625 244391 -68720 -199510 -120188 135807 95262 -22870
12691 -22870 1010400 -394030 -421780 -635517 -96213 781732 1210594 1028232 78376 -320225
12681 -320225 411283 1185400 1534085 609034 733574 284697 94179 636344 93711 -246961
12671 -246961 -1364234 -976832 31807 39346 247519 794695 59928 152950 -507797 503748
12661 503748 721755 -170051 -138726 57099 -114932 338700 -91977 -1432497 -7155
12652 -7155 960707 512097 -240259 454953 637161 -233345 609469 -339183 -269532 617747
12642 617747 712173 113971 714696 1026998 846152 -508238 -500179 -1003179 -500471 -337248
12632 -337248 342616 -97365 634467 283016 -330288 -508986 -789838 -567053 -627777 6729
12622 6729 -553234 -363079 -164206 579265 1139113 -40909 -983274 -1819740 -1248230 -933915
12612 -933915 -145405 532283 415645 -378426 156988 542219 -432453 -23717 -355433 606502
12602 606502 -67928 402309 679498 1251007 194495 155988 460101 -408242 -287293 -642499
12592 -642499 46928 716886 -603326 -657740 -562654 -58229 780217 608207 51044 531092
12582 531092 1224010 556144 92571 869640 475363 820390 720022 526530 793802 1150892
12572 1150892 343167 1336131 1623180 1262563 1447035 1949608 1155856 121406 -311340
12563 -311340 -849480 -586846 -858212 195917 -427015 -585119 322268 -184609 323611
12554 323611 763524 -279806 -230622 582316 747299 365841 -323114 7454 139588 -172483
12544 -172483 233861 816117 630155 683915 286421 412899 -136476 -785977 592747 1226009
12534 1226009 448348 535080 288555 983875 557054 -1380347 -37801 -51851 -224538
12525 -224538 -607646 43826 407087 -240537 482025 -147652 -887867 -306429 -97095 -555623
12515 -555623 -438221 410383 197963 214903 1130071 982562 751762 499644 -335515 -1201559
12505 -1201559 -1657096 -829466 -688075 -240394 -641097 -805155 -882134 -355528 -587583 318709
12495 318709 348116 -511236 458678 1130759 1021094 400773 67294 -232029 -317405 -389093
12485 -389093 723412 1445996 979774 496171 485954 344289 206492 241578 -141937 29707
12475 29707 -138325 182240 -270301 -626804 -173295 -688340 -28290 256510 1198299 434803
12465 434803 41451 47961 -900225 -6866 369287 413534 -8902 995604 388807 -62316
12455 -62316 841299 607807 424124 1111022 1108095 -164510 368966 1894844 1237522 983955
12445 983955 186875 -314068 920940 863729 465253 142862 -668463 -124266 -173283 328621
12435 328621 757798 738886 605276 663865 560401 435405 -53201 -489250 -132049 833956
12425 833956 1361415 -761217 -902523 18311 819387 998277 1360185 -139567 -442416
12416 -442416 640330 365571 -242468 202107 -38073 -540379 -171537 -416806 180239
12407 180239 -768594 -588571 664149 281651 785253 759848 687908 473859 1078605 1731349
12397 1731349 1740948 226582 781888 2047965 1510696 267677 276975 447301 669458 792710
12387 792710 778058 418462 -236378 276686 463113 939879 -321802 -350393 -517607 -1126847
12377 -1126847 -313314 456736 507925 -680074 601377 968608 887904 1326194 1198288
12368 1198288 858348 880954 546066 484838 661491 -95733 -190479 -838945 -422677 -201664
12358 -201664 -551647 -158174 776758 668486 561444 846513 884749 1271394 551330 503675
12348 503675 17120 -146750 -41810 -12889 55147 884292 982417 -454991 337708 560564
12338 560564 93144 -219631 59682 68836 112601 140253 1039762 237162 -294231 369769
12328 369769 640246 658174 -53146 258276 845394 784678 672896 974312 325922 640727
12318 640727 554722 -444960 323480 -360469 -588918 -1189855 -259730 -583226 -715162 -224187
12308 -224187 -609993 342503 424682 107600 -201115 1428094 506475 -150443 359721 1207266
12298 1207266 1160563 20532 708657 1027770 1883370 901358 454738 58366 720257
12289 720257 1417319 1584158 1540678 896918 415743 163143 363046 -274557 -742926 -296260
12279 -296260 620629 373251 1058041 1151801 424332 -110221 -1187132 -1688737 150917
12270 150917 624587 504991 182502 416374 -156767 898122 1236904 1117343 949823
12261 949823 1243885 350011 -431654 602378 -528450 -380258 -828466 -627487 6083
12252 6083 960679 1563320 218460 1172285 790811 1298071 1562286 1793796 1833481 295009
12242 295009 -836279 -386103 1005395 1050338 1074514 1217486 134557 -731409 -192753
12233 -192753 -52249 631169 450183 37930 183688 1359925 780464 211345 235802 270210
12223 270210 99314 320627 371985 354892 913355 771373 -18588 -426879 -286937 -471084
12213 -471084 316189 555750 140092 794759 420757 -153528 452372 1355174 484859 727473
12203 727473 -149915 291686 732756 319226 -224795 162271 -128858 804762 1206435 -117372
12193 -117372 -964624 296506 377559 -173636 -566803 -103567 233469 -347559 878525
12184 878525 749788 122112 400103 259967 -204460 85405 329726 872556 231792 -182425
12174 -182425 -375185 -687114 -737832 -321418 135180 815138 -176134 -459788 -192229 15897
12164 15897 491630 482589 901987 186000 -90907 860451 785951 57390 783429 1764862
12154 1764862 1315540 181586 197524 830150 -176312 616559 -694527 -498502 230160
12145 230160 -638019 -155104 988857 500371 487883 477662 1579156 1566019 661692 857807
12135 857807 1252789 1204358 1267957 316880 -448274 -397708 -357962 -574036 -394155 299311
12125 299311 454040 -15243 914883 230829 772671 1173953 659390 1172143 612062 546913
12115 546913 -176932 227287 1853156 1192729 1770886 1707210 -199393 -27361 -21049 943169
12105 943169 1061995 906804 761212 292290 1157587 1522735 429783 287119 1489858
12096 1489858 1973474 1308206 687706 752955 431107 -1373958 -341169 -421201 -2931
12087 -2931 543369 353932 -333658 99162 214778 474248 626757 338959 1013903 577285
12077 577285 967763 926364 1623915 2461130 1040046 373532 370589 1336726 1580697 733104
12067 733104 212214 -265537 -488510 -367982 -297873 -113607 -371625 586611 1525250 624736
12057 624736 390850 946114 944241 302680 201396 316741 1551846 1759370 583576 1023734
12047 1023734 493978 382414 -601469 -161958 54410 5482 423177 1779576 1875438 1686272
12037 1686272 1986702 2219811 826286 213938 1608230 742037 273244 -154541 597365
12028 597365 615783 -349930 -668222 767813 -263783 110695 804317 357975 475551
12019 475551 560170 1338315 1422916 133895 625086 589215 -1037324 -1314441 793683 2157916
12009 2157916 764747 -53004 356191 1199333 1011384 662107 1029297 751037 256083
12000 256083 -152111 173504 -13112 310850 -41644 53516 744493 1097425 1744532 647111
11990 647111 455256 1355926 303363 814109 1695424 -208585 -557316 485961 513687
11981 513687 412295 1062611 1387278 1238211 85221 121798 855238 1007473 332904 -319473
11971 -319473 34296 -226449 65513 631939 61787 911499 588629 180169 805449 808960
11961 808960 235210 194743 698024 1369395 1804586 1468430 729942 891049 1593561 1824787
11951 1824787 1621438 790565 691688 935994 717614 1242974 1505486 1440276 747082 507310
11941 507310 1100380 1353012 1081295 13611 357290 641238 649171 1613052 2023150 775504
11931 775504 1285090 1809690 1985375 2107312 1312747 2733351 3358134 2192923 1845961
11922 1845961 1406828 2168898 1334605 1413880 1148014 1077011 734930 1338912 2230596 1849335
11912 1849335 1246268 871596 1469138 1290585 1251578 737558 862176 976319 899467 728448
11902 728448 -278991 479807 268862 185212 213471 60292 748363 1544939 936931 1095818
11892 1095818 2420191 1882964 2873560 2758901 1974931 1679960 1276774 460388 964131
11883 964131 1500836 1765351 1625920 1665305 2224881 2549204 1703421 1569133 561842 2560322
11873 2560322 2913717 2110547 2359135 2232869 2697243 3877650 4581558 4339408 3835506
11864 3835506 2310205 2902738 2848208 1505576 705207 1700580 2055660 3529389 4561303
11855 4561303 3913280 2669928 1733111 2790139 3020641 2553807 2274800 2799749 3410677
11846 3410677 3508087 2429312 1433420 1903837 2491631 1204117 1345346 2150334 1505146
11837 1505146 1633669 1776373 1819948 1216749 1085715 828370 205208 43840 839799 1298866
11827 1298866 3023004 3386127 2302489 1636254 1975427 1276676 2301302 2606225 2572118
11818 2572118 2171600 2130601 1849927 2427573 2043431 2227935 1823010 1148785 1335077 1948628
11808 1948628 2406308 2817799 2351028 903801 2316062 1997992 1749905 1802824 1839477
11799 1839477 1028229 1819782 2069777 1505879 1584720 1559273 1451078 2735587 1983297 2616847
11789 2616847 2206239 1015276 544240 1474220 1731807 2075339 1776787 1323716 2244042
11780 2244042 3008516 3135991 2776254 1501244 1707021 2867655 2450463 1918939 1526482
11771 1526482 2022076 2626024 2680441 3558779 2530432 826717 796727 885553 836937 1758902
11761 1758902 1750809 955164 1080834 819072 1858059 2334998 1971434 1191368 1185248 2110842
11751 2110842 1953800 866859 1546726 2623145 2481434 2357901 2190115 2620470 2643293
11742 2643293 1856085 2090458 2045254 2108601 1913271 2464239 2605597 2899913 3474575 3811123
11732 3811123 2269453 1646728 2904311 3858352 3915589 4394691 3648819 3021532 4355503
11723 4355503 4643770 2919440 2053799 2703521 2595547 2147812 1961233 2197778 1711345
11714 1711345 1660137 1772133 2612005 3760309 3092591 1980292 954230 -280097 597942
11705 597942 645884 1190462 764432 375053 911888 691389 1300354 1372798 1669701 1893344
11695 1893344 1099089 1252027 1749809 2298895 900176 1213789 1495588 1144818 1446868
11686 1446868 1960317 1644869 851427 1819599 1721421 1883957 1954779 1553942 1356086 1584222
11676 1584222 418452 827654 958096 196440 518545 868652 611900 1752832 1937130
11667 1937130 583419 -103427 240042 645674 1811599 3431113 2269733 1320197 950992
11658 950992 -171714 921045 148170 702139 927117 -98945 15065 1192508 2014887
11649 2014887 2163257 687108 397801 634420 28294 1051371 330317 -755685 532440
11640 532440 140809 248952 1346747 485287 809328 1044749 578662 1109081 1076285 1263745
11630 1263745 1278356 1479009 977401 1866769 1475400 1223612 338830 -403588 -454297 470945
11620 470945 2163914 1776268 1018527 151426 990133 1315774 169092 454165 806196
11611 806196 -214255 905107 906749 25291 593476 925820 826108 846100 711689 1012410
11601 1012410 978217 1985141 1177396 414235 1061179 773176 793452 1509793 1194857 1315782
11591 1315782 298675 619096 -93608 -533967 578890 718229 -29734 1461316 1744051
11582 1744051 1184771 367314 88831 926852 812545 -109032 -765613 -1463953 -610827
11573 -610827 -259991 -32236 -318281 698406 821197 572610 684371 304242 1078453
11564 1078453 2103906 1901557 1666659 1032726 1561053 1953857 1790131 1554094 2195126
11555 2195126 1732391 591412 953584 1749581 1424887 805166 1613251 1359348 2116625
11546 2116625 1669286 1836140 1367832 -340901 92679 366133 727105 1093004 1543593
11537 1543593 1488798 1232316 551332 552790 890871 68587 943712 684842 292625 1220289
11527 1220289 827610 487766 84454 -412721 -354722 -164330 808269 1892156 1604277
11518 1604277 1184922 972901 1214218 1747497 398475 517546 65832 102463 -26339
11509 -26339 797551 89109 699571 91681 -488684 -952422 -56569 190579 685811 1227047
11499 1227047 1657397 685308 42243 740505 261374 -738181 -692723 -1180272 -913350 92397
11489 92397 -348311 333994 726589 750554 -348926 -231693 154462 621163 -140820 187755
11479 187755 300774 -1252690 -758373 -842336 220772 464838 585580 2011114 712792
11470 712792 685281 426403 -270364 116870 16725 -419992 617904 1186345 87625
11461 87625 431088 675913 760940 -441113 571476 816162 -246953 -55121 482135
11452 482135 639534 315335 285024 1704364 1693760 -134681 -870771 -493253 -350704 -133685
11442 -133685 303981 771587 465215 851039 589821 -123628 -218430 -778234 -874905 -1875697
11432 -1875697 -1022271 -46549 -316549 -103342 686209 1697534 1540229 943647 -45600
11423 -45600 971420 688198 245354 708620 854518 1489267 1650845 1581030 570034 2111091
11413 2111091 1678027 1401305 1387456 1015252 146382 1026375 -156957 820110 967417
11404 967417 131748 386647 -250127 -305933 381566 442521 860402 471169 -520186 -278726
11394 -278726 -209374 -600367 -674584 -284805 218025 1510186 1357906 862889 313675 324368
11384 324368 1400645 1153135 324547 -310893 -454045 1069950 345008 -247068 731020
11375 731020 224780 1594600 1893478 1052514 715389 98586 685199 1318548 229921
11366 229921 -28215 65731 -129748 -386781 362647 950737 725723 783560 777557 1337811
11356 1337811 576407 525346 378061 -160339 622984 -58536 792504 846958 1260404 2235179
11346 2235179 2704853 1132413 -128711 1003009 913021 -1191169 -1147758 969952 402393
11337 402393 -670666 -628669 -677873 -563004 -1014732 -238029 7872 -621644 344695 649893
11327 649893 542835 -521037 -867708 -1251973 83227 652612 844742 320301 606698
11318 606698 1085606 818477 739148 724390 922025 145971 -376134 609159 613421 401928
11308 401928 -46398 274753 -1294877 -908120 -494266 -1015155 861749 347793 99949
11299 99949 686459 904604 -309237 -304105 -13213 -200754 45181 186465 -605310 -450000
11289 -450000 361758 -282824 -67421 591776 1565531 1068135 238935 82117 1445583
11280 1445583 1619601 318237 -55985 886232 44179 157340 139223 -73644 43943
11271 43943 235493 -1205134 -1235856 1130900 1991246 -28545 -68666 -658412 -412127 905382
11261 905382 611130 -387955 -1144313 -749446 -381181 -1091577 -2397382 -823322 -817192 -2069163
11251 -2069163 -1144702 -863914 -654927 745885 1419474 1000175 -725519 -1227926 -1284705
11242 -1284705 -1194276 -1299425 -1449645 -1799665 -959338 -426052 -909434 -667093 611415
11233 611415 980168 923802 232235 629201 80689 -623739 -1241880 -381741 -408764 -848545
11223 -848545 -815823 -1468881 -1918022 -529003 106715 -480216 -485713 -897331 -502834 -358762
11213 -358762 -1129389 -2280833 -2351467 -1879085 -1309815 -403418 -980057 -1277614 -1164480 -1769507
11203 -1769507 -1831459 -1280460 -1019530 -1265717 -1379021 -347822 113088 48645 -951227 -17786
11193 -17786 437630 -54892 72025 -746411 -312942 -960755 -1086566 -866126 -861679 -1584460
11183 -1584460 -635689 77633 380814 471792 -534156 -1451863 -1402778 -933404 -193037 -1049329
11173 -1049329 92266 72611 -384291 -653945 112166 1166337 -62371 -354522 233426
11164 233426 -853167 -1604632 -1687692 -670152 -624769 -131843 204102 -336080 624927 -379464
11154 -379464 -149235 -689101 -1442145 -2011631 -1902644 -1825173 -2003392 -1423149 -1122415 -1388858
11144 -1388858 -204226 -802570 -1277075 -937784 -276314 -77918 -142069 -294666 -234031 -434498
11134 -434498 437276 -387094 -1260679 -727336 -367008 -798313 -743012 -1025335 -289566 -844108
11124 -844108 -1541941 -1676933 -1222872 -926631 -472562 221882 -626445 -915702 -1373644 -1272947
11114 -1272947 -1266037 -1828295 -985738 -471378 -234922 -1149376 -1143791 -304686 -753595 -1501046
11104 -1501046 -1481391 -654544 204814 -690760 -359404 -134805 307255 1030377 -1220968
11095 -1220968 -1482873 -1345665 -722324 -533155 -391637 -444958 454895 -1186056 -2002212
11086 -2002212 -901137 -868091 -1099615 -1269900 -1596387 -1992844 -1850417 -496113 -62687
11077 -62687 -800110 294290 193432 -1272179 -1295634 -1385329 -596439 -828415 -496867 -951993
11067 -951993 -1591398 -1035237 -1072965 -1310570 -479736 -184089 310073 -378688 -549657 383019
11057 383019 861807 772209 1087927 1110673 1074404 1195041 -643575 -936377 -1002903 -1363270
11047 -1363270 485514 -393840 -503737 -118842 -329736 -745220 -780087 -231766 -842578
11038 -842578 -501232 -258651 -938244 -964551 -214069 -260086 -715310 -658116 -673038 -1374969
11028 -1374969 -86806 -78487 -678214 -857869 159567 582526 -445095 -1470526 -2031728
11019 -2031728 -584131 -1213921 -1421353 611759 1575264 15247 -287081 -956798 -419382
11010 -419382 -559947 -260914 -1542758 -1646766 15052 -610998 239209 -122254 -1655429
11001 -1655429 -1543399 -787130 -832217 -1196406 -1121944 -1375633 -315456 252083 -409672 -356175
10991 -356175 -810748 -567200 -468344 -758236 -1149488 -1978530 -912445 -1065723 -1814600 -1123746
10981 -1123746 -1943371 -540068 -823874 -1792479 -1626427 -608836 -295508 -256032 -318925
10972 -318925 508640 -349849 -581763 -95773 -330976 -1327041 -804397 812361 66361
10963 66361 -1268950 -924983 -660915 -144054 104956 440194 -440325 -990571 -746541 -943218
10953 -943218 -256013 -1365896 -1148907 -271040 -1771022 -945695 178710 -281841 105882
10944 105882 -806292 -1062013 -703016 -1451185 -281613 -396904 -285362 264118 -708839
10935 -708839 -1253900 -782212 -785842 -327619 671148 51574 -550949 -626190 -979897 -1397664
10925 -1397664 -858511 -732651 -1273724 -575617 364384 711148 -96177 -101372 -932595 -2387907
10915 -2387907 -2729298 -2268703 -2307037 -2020145 -1725336 -1611540 -1729597 -1629238 -1806930 -1148502
10905 -1148502 -924897 -1040099 -436236 -732552 -540775 -1435243 -1497187 -1271597 -999636 -483695
10895 -483695 -1379639 -1043540 -728720 -384321 -1264192 -1403804 -1081623 -456396 367641 -727498
10885 -727498 -2562030 -2303579 -2126044 -1921616 -248429 -46287 -463923 -1618307 -856664
10876 -856664 -1545599 -1291463 -1659470 -1640923 -1037994 -594652 -1631401 -2088381 -1795118 -1065058
10866 -1065058 -414122 -485470 -1616840 -1838825 -1552479 -1193271 -1367289 -506510 -725675
10857 -725675 -1624239 -1816341 -1557658 -1741338 -1108261 -609508 -1862555 -1111703 -1153023 -1081474
10847 -1081474 -722194 -1279766 -890086 -1089881 -1240917 -642675 -1210935 -1091917 -831837
10838 -831837 -1867085 -1229660 -1233137 -668087 -533605 -877725 -866118 -1008001 -1118593 -1363829
10828 -1363829 -783745 -339090 -382416 8585 -128588 -721348 -1286540 -665178 -323103 -94890
10818 -94890 506963 -393924 -455917 -530210 -214198 -249151 -377502 -662584 -560589 -1247684
10808 -1247684 -2019462 -2235427 -1811842 -1791073 -1846208 -1529307 -2248194 -1846086 -2009332 -1534100
10798 -1534100 -1107928 -1538780 -1703006 -963548 -739730 -496242 -259316 -51583 -135824 -1315898
10788 -1315898 77172 -677632 -105575 -74024 -876337 -641040 -1218116 -1238690 -1558923 -1776440
10778 -1776440 -963520 -702523 -1074719 -323834 -1136947 -1834306 -1914016 -1053151 -882151 -226719
10768 -226719 50889 -618631 -1413286 -1617329 -1926686 -2199881 -1703771 -1845288 -2378482 -1996322
10758 -1996322 -1409858 -2099277 -2036387 -1799254 -1192035 -2499138 -1585360 -1161909 -152022
10749 -152022 -581596 -1115148 -1642648 -2053101 -1462213 -2244772 -2103425 -2064934 -2210370 -1720353
10739 -1720353 -170478 -968275 -1475294 362935 343162 -767760 -888608 -787402 -668150
10730 -668150 -977221 -938483 -494312 -804319 266520 489396 -273748 -1414313 -2260663
10721 -2260663 -1951754 -1095473 -924281 -385960 -1190592 -1469018 -726772 -848386 -1013646
10712 -1013646 -1570831 -1274303 -1071589 -1571541 -2047190 -1913865 -1232989 -688198 -922465
10703 -922465 -1151594 -1696212 -1272126 -1305979 -1400864 -1032744 11341 -158566 -875156 -910371
10693 -910371 -1169131 -1253188 -1919233 -1336452 -997333 -857714 -318956 -1723262 -2589538 -1478217
10683 -1478217 -1533697 -1022683 -1470259 -1508481 -1714326 -1520448 -884620 -820317 -937340 -388625
10673 -388625 -1405850 -1715086 -464623 -704885 -1278613 -1680125 -1909016 -779026 -1524341
10664 -1524341 -1843445 -2019248 -1958976 -1439646 -2251878 -1844171 -2709588 -2666370 -1909282 -1637828
10654 -1637828 -1304123 -801536 -1040079 -748630 -1453540 -1440233 -1525350 -1857372 -2245454 -1730020
10644 -1730020 -2623373 -1935649 -1109868 -1051627 -636331 233850 -241824 459494 -929660
10635 -929660 -848488 -526756 -1935421 -1360685 -1365703 -1587232 -879962 -979598 -345282 -197411
10625 -197411 424362 -175710 -710383 -1788662 -1623829 -1158987 -1805912 -1420557 -261356
10616 -261356 234006 -80241 -472094 -1206842 -1178413 -2136285 -1424356 -1843410 -2543906 -2795773
10606 -2795773 -1331111 -2131927 -1918451 -1178803 -2151063 -1145187 -1476919 -2921114 -2557109
10597 -2557109 -377057 -872770 -1509717 -1758375 -1231851 -123590 -565808 -1415905 -2562833
10588 -2562833 -2368089 -2403349 -1581862 -1369416 -1239618 -1648572 -1746936 -2699758 -2867395 -1959091
10578 -1959091 -2956344 -3229421 -1576221 -741805 -404898 -1893141 -2310653 -2995325 -2152706
10569 -2152706 -1474349 -1471484 -1639319 -958349 -1808226 -1644032 -426048 -304495 165692 -155294
10559 -155294 -902936 -1142112 -1544638 -1915832 -708585 202005 -1043602 -1004478 -768394
10550 -768394 -1678718 -1824868 -2831295 -1522502 -2620761 -3384787 -2422684 -560219 -1579431
10541 -1579431 -983099 -730443 -406662 -1324546 -2237706 -1278374 -2036249 -1824541 -2253715
10532 -2253715 -1721694 -764412 408783 607516 -482431 -628908 -1438472 -1730592 -1889338
10523 -1889338 -2404224 -2222944 -2141143 -1676099 -1469867 -1201138 -1602585 -2101967 -1163614 -70902
10513 -70902 -1756773 -1917333 -1265287 -2235721 -1714942 -1945313 -1793204 -1995144 -2497959 -2056681
10503 -2056681 -2520911 -2404381 -2052541 -2175935 -2135152 -2066321 -1970635 -2767941 -2250282 -2219175
10493 -2219175 -2395390 -1070647 -1090666 -1461005 -1724305 -1468794 -2297334 -2127508 -2129709 -2002695
10483 -2002695 -1741339 -1183654 -742519 -81146 -1338790 -2689778 -2598188 -2326570 -1783593
10474 -1783593 -1738281 -1721367 -728147 -2192853 -2154319 -1748286 -1214585 -1063069 -2078299 -2506459
10464 -2506459 -2450967 -2421169 -2275861 -2402127 -2168828 -757100 -589675 -1917495 -2723241
10455 -2723241 -2858822 -2186147 -1784469 -2531723 -2225411 -2242469 -898222 -1489504 -1762756
10446 -1762756 -1334277 -1957165 -1953726 -1705427 -1771287 -884050 -1140497 -1776923 -2124463 -589585
10436 -589585 -664343 -1424276 -1350814 -1845638 -2737593 -3574504 -3707932 -2569158 -2023548 -1436899
10426 -1436899 -1728914 -1382312 -1074534 -940821 -1218329 -773745 -599162 -1817613 -2043323
10417 -2043323 -2277527 -1123732 -1125178 -1498345 -3028188 -2180408 -1444105 -1711797 -2348812
10408 -2348812 -1973693 -1086473 -847689 -475676 -1779460 -1577120 -1543278 -1476830 -2111752 -1482512
10398 -1482512 -2098195 -2756127 -2877969 -2187005 -1308783 -1260050 -1830811 -1315499 -662489 -80036
10388 -80036 -764580 -2291775 -2661037 -2289216 -2010851 -273139 405819 -1492717 -2657697
10379 -2657697 -2468279 -2188750 -2364524 -1726410 -2366470 -2934966 -3176856 -2220630 -1854541
10370 -1854541 -2923744 -1505988 -773230 -1533738 -1366456 -898694 -1340893 -2383706 -1484024
10361 -1484024 -2771093 -3114540 -2238395 -1424164 -1194451 -1261518 -1140251 -973358 -2358600
10352 -2358600 -1863049 -1942634 -1349505 -972976 -1642731 -1268059 -755166 -1284659 -1380642 -334375
10342 -334375 -616847 -914601 -1515184 -2267944 -2568867 -2031095 -1997460 -2507052 -1772425 -1569441
10332 -1569441 -2043050 -1986278 -1624531 -1940561 -2530622 -1682346 -1699496 -1931533 -1642466 -734848
10322 -734848 -1087912 -947790 -370112 -1151455 -2933935 -2578720 -1366391 -1090078 -1656768
10313 -1656768 -1796432 -1546550 -1780949 -1016748 -1214115 -2013914 -1633390 -519580 -451380
10304 -451380 -1683397 -2312625 -1646540 -2487818 -923068 -793755 -1782377 -858989 -716469
10295 -716469 -881640 -662345 -1654895 -1844351 -975180 -890593 -471695 -575604 -604960 -169584
10285 -169584 -255328 -1113230 -1379920 -653258 -970486 -889430 -464852 -971600 -1889418 -2443628
10275 -2443628 -1323170 -1012850 -1038112 -737237 -1215612 -1668173 -1311103 -749235 -115764
10266 -115764 -1368960 -2805608 -1368582 122419 -1035995 -717326 -1209419 -799884 -340922
10257 -340922 -389540 -715657 -1288055 -983151 -1030297 -1928490 -2511274 -1726722 -1640023 -786279
10247 -786279 -187591 -1005608 -1080827 -1116073 -590148 -792776 -1274848 -1369315 -1041431 -983409
10237 -983409 -1192715 -1705514 -2148535 -1889483 -955357 144336 -1041281 -1270337 -2177749
10228 -2177749 -2282465 -1152995 -1245586 -2269019 -2255457 -1393326 -826004 -1962073 -2153530
10219 -2153530 -2686058 -2758604 -2006487 -1674148 -2330859 -2311857 -579684 -1401270 -939002 -373349
10209 -373349 -1262288 -2419287 -1042006 32648 -552289 -1137058 -1461274 -916106 -1495336
10200 -1495336 -806168 -705975 -969768 -535403 -28549 -37032 -354500 -1098165 -1544841 -976310
10190 -976310 -450691 -162294 -889163 -1705235 -2788034 -2703675 -2223145 -1746674 -564838
10181 -564838 -985383 -1592676 -1177102 -1920092 -1577187 -1450941 -1158053 -1125599 -624332 -778336
10171 -778336 -993698 -738086 -1124389 -1135668 -994559 -992035 -1255354 -1549180 -2535328 -2284051
10161 -2284051 -1999471 -1317497 -1105945 -979600 -1585591 -1617773 -1231644 -1204079 -2252999 -2061150
10151 -2061150 -1151883 202164 219617 -726584 -1774998 -1603375 -312838 -1186431 -1372207
10142 -1372207 -6291 -277922 -617653 -1122494 -1286589 -1173641 -1662331 -1453784 -652350
10133 -652350 -38907 -433528 -1140161 -565556 -1356015 -1290566 -1158771 -1486422 -850060 -1080321
10123 -1080321 -1640893 -1519313 -964885 -406223 -809749 -1706981 -1757979 -2587716 -2086583 -1378376
10113 -1378376 -833238 -1092505 -665981 -2397242 -2631855 -2019122 -1705713 -1244478 -399976
10104 -399976 -51293 520251 -1565747 -2001272 -1257642 -939911 -1742357 -2020269 -1078062
10095 -1078062 -456567 -785854 -394968 -1078483 -1054269 -1373347 -1882086 -1364960 -982041 -23871
10085 -23871 -1010214 -1084143 -837047 -1111372 -1443094 -1403274 -239558 -78213 -1001330 243211
10075 243211 415701 114138 176497 -469184 -1214168 -1328654 -1393820 -84568 -579487 418306
10065 418306 -111150 -1464350 -437723 -724096 -841347 -390386 -678966 -1158378 -989531
10056 -989531 -804713 -1194049 -1687423 -2213106 -1162631 -964227 -1743088 -1202525 -1458832
10047 -1458832 -750000 -353349 -1125227 -1923072 -1939243 -1609226 -1096571 -1048726 -1244380 -719058
10037 -719058 -1273678 -661890 -324811 -559833 -917239 -958847 -794161 -54836 -1296018 -927092
10027 -927092 69577 632854 457343 -172037 370503 -43299 102111 -675434 -1235608 -682685
10017 -682685 563149 -122050 -691413 488826 219203 685274 1070000 389926 -739950
10008 -739950 -235635 -720827 305461 384932 183219 -260719 -438532 -1161076 -1398824 -157185
9998 -157185 -194118 5255 616732 -149594 -675042 -692775 -1753497 -681894 -405792 -1060642
9988 -1060642 -1141337 -2196013 -2658283 -1066864 -1192594 -570709 38002 -660313 -1061071
9979 -1061071 -499420 -34981 -634869 -1052439 -162492 -714900 -890969 -1402013 -1897604 -1841012
9969 -1841012 -415137 31858 -664465 -884544 -2405540 -2333951 -1258855 -380983 -451833
9960 -451833 199517 33244 -1688608 -1401513 -1249605 -397986 -753612 -1390591 -494969 -225998
9950 -225998 -910854 276171 175099 -834996 -1257447 -1302245 -1071509 -1194544 -519062 -417673
9940 -417673 -348524 -938133 -742427 -1101662 -1313827 -1289423 -2268165 -1626733 -499379 -419729
9930 -419729 6660 -298516 -722951 -538916 -1465416 -439890 -1424259 -1477304 -1057593 -799847
9920 -799847 -768154 -604693 -970182 -1618167 -1096738 -1684094 -2949440 -2393646 -1587562 -2361393
9910 -2361393 -2616419 -2764157 -1396771 -1142263 -1879390 -717373 203793 9638 331308
9901 331308 -360331 -69310 411557 766325 1131719 773958 706997 -123829 -1135531 -901089
9891 -901089 -1387628 -582983 326205 311250 -563851 -612967 -642773 -751148 -1042774 -1451068
9881 -1451068 -698604 376237 -481674 -1141030 -357059 299469 -268639 -422656 774072
9872 774072 733516 304052 11321 -117728 -86789 -161812 -205079 61640 -171558 -330197
9862 -330197 -502808 549607 519301 -614865 -1015569 -805044 -351308 -808571 -155083 345375
9852 345375 210998 1048445 -174966 -754633 -330101 -558600 -956742 -1055375 82909 -263243
9842 -263243 -1507401 -270942 128681 -106991 -488257 -1296669 -570566 -176487 -792107
9833 -792107 -416499 -796994 -157952 -89732 -366284 -189182 -461548 -679790 -413862 33202
9823 33202 418068 -471413 -340429 386060 196070 205094 -485107 -176665 227227 -350697
9813 -350697 164118 -98137 -78438 664022 7979 451535 684128 1374058 351871 -110940
9803 -110940 -709563 1340616 647246 1174271 386964 -173645 228194 99442 -81764 -588949
9793 -588949 -407989 102458 497224 1032212 641006 147359 -37598 -357095 135827 57045
9783 57045 798500 1553764 1321106 2552968 2332662 756219 266074 485991 768885 687833
9773 687833 660007 357202 516457 18851 -543492 -661514 199351 381973 1066869 864370
9763 864370 1562916 1764691 1676555 1774507 1350223 294917 1089046 1034959 587033 444994
9753 444994 1149284 1214022 2146129 1820688 1106138 1387561 1344772 1708714 1728565 1273071
9743 1273071 1509655 1320118 1948337 2546803 2219263 2093309 2381209 3212277 2175388
9734 2175388 2194553 2431726 1960931 2529225 2284206 1613947 2333909 3504126 2389840
9725 2389840 2561878 2234903 2896474 3756177 2672240 1807461 1389935 2242026 2549300
9716 2549300 3572702 3215588 3712628 4086838 3253466 3602959 3906293 3986213 4413490 5827585
9706 5827585 5741946 4559544 4028219 4088609 3884418 4893615 5320802 4788560 4367421 4677372
9696 4677372 5358619 4044445 4076737 3921413 3741288 4165235 5358642 4547675 4472589 4202861
9686 4202861 3990068 4729676 5109944 5272148 4750464 4265938 3463422 2890254 2538087 1921788
9676 1921788 3398292 3306326 2359235 3115246 2301030 2633190 2906055 1844041 1613232
9667 1613232 2650497 2690009 2774113 2421894 1813056 1855382 2565282 2807562 2610556 2263208
9657 2263208 1190607 645290 2180707 2840498 2177853 2260908 1708049 1605520 1167705
9648 1167705 1865658 1842252 662528 2275558 3601079 2945099 2589276 2861339 2573465
9639 2573465 3057983 2104088 1427232 1674651 2466041 2199706 2641123 2950178 1828774
9630 1828774 2396430 1725944 2854209 3223879 2545924 2730506 2526110 3605959 3787325
9621 3787325 3303508 3171314 2338908 1931867 2322622 3215731 2867722 2500502 2059160 2536015
9611 2536015 2425264 2231183 1236710 1375347 2885952 3564960 4029417 3721652 3519212
9602 3519212 4269727 4588948 3649191 2577944 1944654 3641509 3690326 2855446 2936619 2202809
9592 2202809 2133178 2380130 2618858 2219353 2128819 1663111 804583 1674853 2696247 2644050
9582 2644050 2577427 2827967 2520879 3049972 3068392 3174802 3119281 2901405 3510634 4032963
9572 4032963 2792972 3354804 4068688 3578142 3108646 2023425 2797531 2142606 2625525
9563 2625525 2507701 2522706 2969768 2466364 3191747 3954691 3735360 3902342 3950702 3930865
9553 3930865 3994003 3829186 3928011 3229877 3125029 3126347 2943912 3032743 2624653 3970983
9543 3970983 4697909 3087014 2949819 3990574 3325462 3005851 2984183 2724555 2590324
9534 2590324 2399948 2375172 2081740 2152535 2130503 1706240 1936911 2830420 3877590 4041440
9524 4041440 2829512 1945793 2189677 3133358 2830898 2504387 1716073 1392044 2048083
9515 2048083 2742290 2220265 2929511 2843169 2992188 3156641 3705187 3070918 2408478 3331272
9505 3331272 3757897 4196360 3648047 3291665 2172037 2258014 2889897 3176061 3503159 2881475
9495 2881475 3030363 3693818 4755747 4322265 3656617 4101572 4316977 3327684 3551196
9486 3551196 4356698 4835963 4568100 3965585 3230852 3505637 4711579 4822272 5093661
9477 5093661 4862821 4544032 4448088 4963113 5119099 4663835 5607417 6471377 4841399 3771577
9467 3771577 4113866 4748000 4719574 3893583 4732797 4678631 4877860 4533649 3539851 3498525
9457 3498525 2215197 3446287 4337808 5077625 4269287 4040810 3946233 3650813 3652019 3368055
9447 3368055 4292766 4609714 3546849 3713767 3975212 4546693 4396164 4476475 4349005 4221677
9437 4221677 5532063 5172825 4794320 4881755 4331510 3913601 4058568 4525110 5083549 5305230
9427 5305230 6132128 5225116 4869135 3826836 3033393 4194860 4914913 5549371 5476819
9418 5476819 6172147 6001670 5511518 5358369 5691054 6296767 5916928 5449590 5676130 6086285
9408 6086285 6196526 6481900 6405447 6020820 5970401 5871003 6591793 6098034 5073647 5572168
9398 5572168 6296501 6306832 7849987 7970298 7576151 7354364 6277081 6078471 6494108
9389 6494108 7150720 6799988 5946362 6381879 6350260 5771044 6941196 6964733 6654630 6819304
9379 6819304 6711220 6749774 6736826 7286071 7233707 7426696 8221734 7923147 8062996 7357375
9369 7357375 7839991 6570175 7108427 7735099 7481682 7266185 8173316 8092403 7830291 7421618
9359 7421618 8137744 8840305 7493712 7465100 8882341 9632501 8314048 7112365 8114711
9350 8114711 9528126 9613366 9421594 9208273 9419024 10328566 9153275 9162546 9493891 8837693
9340 8837693 9277935 10007074 10594803 10018685 9834262 11192257 12413711 11679683 10989965
9331 10989965 11321048 11195843 11573897 12024534 11502355 11801182 11272049 11431538 11390161 12074151
9321 12074151 11355032 11202398 12231187 12865522 12554337 11734981 11126602 11364371 11411713
9312 11411713 12084704 11666683 11711216 12313852 12622744 12736990 12861868 11905746 11867719 12274050
9302 12274050 12295520 13543025 12702988 12273523 12484191 12555462 12053329 12448569 12840516 13955620
9292 13955620 13329881 12665184 12031596 12055940 13483541 13506133 12996960 12481900 12534337 11342379
9282 11342379 11730453 11367804 11634405 11814598 11769222 11475976 12238081 11137317 11907366
9273 11907366 12968588 11558541 11694440 12077312 11357795 12224552 11354532 11195576 12103920
9264 12103920 12234539 11797341 11832506 10981514 11039048 11881416 12971960 12399658 11281533
9255 11281533 11762662 11956597 13343690 13065762 12638019 12394711 12656204 12543774 12066464
9246 12066464 12093034 13448196 13433966 13524642 12990083 13521729 13649581 13673512 13079881 13540957
9236 13540957 13626673 14021760 14275819 12932792 12788812 13991384 14202342 14080454 14093798
9227 14093798 13572550 14427834 15535935 14962417 15984331 15372763 15271957 15685917 16340922
9218 16340922 15569132 15833354 16739283 17228566 16343760 16193877 16438342 15830351 16815897
9209 16815897 17185481 17601787 18555967 19189085 20044121 19936012 18681943 19025777 19740502
9200 19740502 20234194 20188673 19389121 19381488 19724329 19869120 19595590 20489442 21184572 20595603
9190 20595603 20242482 20974757 22454050 21921061 20720441 21254868 21245624 20794566 21862304
9181 21862304 22388143 22767920 23179687 22490753 22699673 23114195 23138450 23202383 23616216 24496002
9171 24496002 23873167 24530452 25026651 24930000 24606057 23904645 25404448 24075914 24105205
9162 24105205 25525958 25352055 25538300 24351624 23749577 23649448 24004949 23323937 23983355
9153 23983355 24138572 24811460 23960577 23458401 23592895 24875188 25040399 24564935 24701054
9144 24701054 24804089 25846445 26784297 26030095 26859122 27206174 27542146 28806372 28833991
9135 28833991 28038527 27755653 27358250 28171307 28531822 27968166 28035344 28070443 28809987 28895580
9125 28895580 28696148 28600787 29228081 29397652 28733068 29079940 28608016 29111083 28408425 28700617
9115 28700617 29213221 29268631 31604848 33567469 33853368 33013647 33339072 33109421 33148279
9106 33148279 34589415 33669907 31868595 33753585 33841635 33958291 35473804 35980696 36432854
9097 36432854 37179495 36542260 35469090 35832920 36826004 37020174 38405354 39699563 41340561
9088 41340561 41081357 41378679 41124151 41442283 42859633 43771898 44973798 45843714 46595091
9079 46595091 48405439 47871664 48170361 49938887 50476312 50525085 50123396 49815098 50124946
9070 50124946 51349111 51475419 51223839 51505959 51643601 51720106 51103037 50971893 52764973
9061 52764973 53242203 53605086 54287429 53942828 53089494 54076557 53893802 54961373 55234134
9052 55234134 56324719 57187304 57761749 57386843 56811922 57193546 57295339 57512082 57067106
9043 57067106 57269578 57711347 57793518 57594101 58718319 57793145 57923302 58604229 57125869
9034 57125869 55541046 55943653 55214384 54728483 55289724 54619825 54481624 52879711 52228937
9025 52228937 52903185 53321569 53246486 52165680 52011198 52119992 51333169 51129105 51469106
9016 51469106 50610076 50372817 50981558 50396873 50624439 51861634 50883141 50930615 50071780
9007 50071780 51794021 51382348 50901482 51498193 50794157 51849687 51007829 51022657 51227576
8998 51227576 50514543 50706358 52592678 53985674 54711884 54594126 55603838 55925196 57683018
8989 57683018 58349665 57945838 57693382 58985790 59012970 58898998 60752775 61742237 63224401
8980 63224401 63069916 63536367 64739069 65905687 66861461 67698575 69011125 69460554 70090670
8971 70090670 72665206 74677258 74629553 75725578 77654830 79697733 81777607 83841761
8963 83841761 87038795 89182782 90914144 93441683 95465607 98136877 101613226 105387422
8955 105387422 109554103 114374375 119147175 124974572 133059362 140712646 147787600 154795640
8947 154795640 161713562 167256460 167946583 166781442 167158054 168091790 172339702 176904743
8939 176904743 181945093 187546543 192035013 195818012 201657964 209477874 221178938 236801571
8931 236801571 257155666 280098109 302224959 322989591 342232311 344960455 344428967
8924 344428967 351718318 356107006 368793217 396149681 376436765 321260963 279535731
8917 279535731 245134838 223628297 207463917 192406197 177716532 166918360 155750650
8910 155750650 147117530 140177604 133487880 127059887 123506201 118458303 114810825 111060151
8902 111060151 107975379 105587437 103540562 101376436 98786569 96642240 95106492 93745402
8894 93745402 92444442 91349049 91605070 89974183 89110702 88129931 87311324 86154235 85967755
8885 85967755 85054559 83918621 84877031 83645862 83437961 82192609 82149537 83661874 83265009
8876 83265009 82414481 82811473 83514794 82757292 83310732 84883618 84858356 84236314 83489778
8867 83489778 82670915 82621968 82104745 82945945 83342342 82534266 81615810 81420434 81053026 80360998
8857 80360998 80717587 80972437 80353642 80550679 82137373 82405160 82076916 81455967 82242918
8848 82242918 83254326 83640266 83491278 83468797 84641206 84859876 84228500 83956773 84576354
8839 84576354 85139510 84809821 84530920 83825946 84770587 83889480 83923427 84457545 84928185 84777457
8829 84777457 84146611 84063573 85804355 85201103 84869312 86140228 87480719 88636886 88737533
8820 88737533 89152931 90296225 90999021 90589136 90310687 91656581 92944196 94102093 94083012
8811 94083012 93238563 93246186 92164805 92063745 92224759 93274495 93630851 92634880 93210402
8802 93210402 94237493 92726925 91722774 92507159 93497613 94627783 94869708 95474198 96262101
8793 96262101 96372664 96433749 96988214 96244630 96894279 98058113 98024376 97932961 97798589 98078168
8783 98078168 98309313 99505920 99689505 98755344 98663801 98451059 98405819 97108082 96580967
8774 96580967 96991149 96201310 95894991 95404460 94302034 93391085 92818917 92515329 91960647
8765 91960647 92069537 91823044 91375471 91120679 90819013 90486237 89326381 89495845 89009011
8756 89009011 87806863 87153558 86687956 87037603 85749658 85248252 84900410 84135439 83319245
8747 83319245 83522447 83440597 83090600 81718372 79786137 79680913 78657406 76909592 75802122
8738 75802122 76145059 75453688 74981629 74046148 73352487 71459856 70597280 69731728 69686634
8729 69686634 69319353 68554717 66324018 64959331 65513570 64921288 63908610 63455927 62767109
8720 62767109 62514500 62631704 61154696 59742863 59530374 59155332 58931667 58076899 56577831
8711 56577831 56681847 55351488 55101016 55337080 54034565 53159003 53166218 52624418 51001057
8702 51001057 50351448 50551067 50228158 49291364 49232266 48273783 48162557 47842781 47302310 48191449
8692 48191449 47685166 46844686 46089080 45188624 44705026 45398252 44750361 43808517 44285929
8683 44285929 44593347 44544494 43642946 44014946 42827099 42398759 42578706 40928921 40739089
8674 40739089 41528400 42028566 41072409 41177329 40768754 39989371 40324676 40044950 39698015
8665 39698015 39768640 39640325 39630317 39047980 38959733 39145923 39795093 38778816 38253549 38188901
8655 38188901 39093556 39049883 37914928 37139238 36716041 37051251 36479238 35922281 35690310
8646 35690310 35718085 35316960 34490892 35155164 35200173 35379263 35367427 35281303 35645789 34352785
8636 34352785 33610022 34945664 34414321 33307678 33381619 33361752 34627699 33856753 33868747
8627 33868747 34247721 33404527 33035182 31813960 30746026 31293873 31985792 32020734 30460883
8618 30460883 30158705 29423403 28690847 29184860 28706143 28811456 28517266 28530819 29065343 28534804
8608 28534804 27013879 26910998 27208728 27201795 27015400 27646319 27009643 26236977 27590607
8599 27590607 27498900 26686540 26242125 26522919 26770826 26327365 25794356 25196532 25062402 25598709
8589 25598709 25815785 25085255 24376941 24460475 24389496 25097132 24628289 24859924 24406811 24007087
8579 24007087 23453872 24516849 23375676 23956394 23375919 26071034 23248352 18803112 21260703
8570 21260703 21234534 22594860 21802531 20974554 21579152 22503190 22720954 22408792 22720140
8561 22720140 23153506 23598003 22387648 20802374 20428024 20064516 21315340 21870618 21763905
8552 21763905 20673825 21244507 21908902 21821970 20744470 20242940 19104705 19360806 19683354
8543 19683354 20811425 20810810 19533600 19883749 20658828 21053725 20374485 20165106 20064866 19187854
8533 19187854 20001671 20076720 19151359 19560038 20502110 20804275 21468058 21025444 20994984 19333398
8523 19333398 18126378 18512012 18803180 18554056 17616805 17065994 18195681 19509917 19371959
8514 19371959 18854522 18609904 18849026 18737174 18998753 17729964 17906835 18141099 17674821
8505 17674821 18495249 18511851 17792902 17274369 17783698 18515527 18474489 17008018 16966582 16533292
8495 16533292 17344649 17683400 17006045 16809523 15846523 17316676 16721376 16668345 16761272 15373960
8485 15373960 15640940 15355756 15448738 15721021 15747354 15666106 15246585 15569084 16215722 16896218
8475 16896218 14995083 14632467 15859879 15899239 16239115 15599519 14705299 14983262 15651897
8466 15651897 15333230 15303843 15547154 15463736 15035648 14003639 14337371 15665454 15292600
8457 15292600 14435156 15058368 15248879 14426724 14351463 15939542 15447881 15629011 14910546
8448 14910546 13804547 13841060 14026784 14360846 13850317 13651278 12928788 13581074 13796477
8439 13796477 13038532 13417351 14336443 15352427 13433831 11542587 10944211 11233967 11155899
8430 11155899 11289942 11475134 11478659 11135051 10850422 11290168 11964138 11998316 11676186 10882500
8420 10882500 10593678 10917764 11183515 10657457 10383577 10598510 11182363 10640548 9069505
8411 9069505 9826341 10361361 9885324 10739671 10757603 10463723 9426382 10163798 9241708 8612935
8401 8612935 8603420 7845339 8688252 9378378 9335911 9033550 7801415 8361091 8024748 7765546
8391 7765546 8218872 7638478 8770299 8555285 8743567 8174744 8170825 7933582 7633883 7610344
8381 7610344 8316444 7719397 7144599 5812335 6052598 6683635 7205994 7704221 7541376
8372 7541376 6474255 5199829 5285274 6387894 6270927 5658676 5685505 6881290 7985179
8363 7985179 6662715 6701363 8197819 7691263 6349492 6622775 7708390 7648203 7311595
8354 7311595 7129343 6517323 6569068 5855007 5394679 5330454 4936119 4778703 5589072 5692657
8344 5692657 4632651 4633291 5295293 6413207 6191448 5903266 6641497 6164857 5509092 6054479
8334 6054479 6493978 6236911 5271640 6187761 6490175 6407980 5840002 5080996 4157604 3445010
8324 3445010 4251118 4749065 4346359 4970684 3878067 4397427 5054900 4197037 4086503
8315 4086503 5301111 4692736 3176135 3271615 3121701 3655669 3765766 3382822 3094092
8306 3094092 3554820 2992375 3320390 3077681 2941386 3369762 3397471 3403391 3142905 3310904
8296 3310904 3912019 3325898 3378761 3289301 4080918 5119252 4267077 4177931 4644160 4543720
8286 4543720 4993673 3661995 2960513 3753597 3890236 3136954 3038313 2422734 2227675 3458949
8276 3458949 3160242 3319558 3212085 3361732 2527499 2855478 2992455 2352514 2068998 3172503
8266 3172503 2941410 1589624 1774853 1370734 809512 1384161 2269744 3349311 3292608
8257 3292608 3034693 3161151 2080412 2077315 2168503 2153094 1600062 2242643 1985963 3274569
8247 3274569 3651652 3917062 3416880 2742620 3808597 4925726 4242002 3028237 1676733
8238 1676733 1668763 3422607 3328707 3439003 3623278 3140414 2729404 3113199 2682485 2682127
8228 2682127 3062759 2317988 2024471 2499477 2816232 1734861 1443502 1947686 2508722
8219 2508722 2541740 2241856 2040986 3000134 3701245 2508939 1775289 1749897 1781816 1473313
8209 1473313 1450779 2233251 1560452 1800259 631261 1377023 1632042 1971149 1076386 1352772
8199 1352772 1882606 1765599 2112483 1046603 2149180 2498643 3703714 -1874793 -1618769
8190 -1618769 -3543 2559708 1185934 1249941 2519249 998867 321621 541905 715640
8181 715640 522235 1778716 1866751 2941871 2227177 3008917 1683391 1317790 867450
8172 867450 909443 880039 81411 805864 1510617 2115190 1615842 921923 1894881 2200246
8162 2200246 2264812 2127144 1531933 449172 339955 851189 2571704 2621628 1583665
8153 1583665 1641786 2424922 1529807 1849915 1137931 1540310 1994172 1625063 1700534 1160951
8143 1160951 1649190 932593 539428 2200689 2260685 1641632 2793796 1916942 1951599 1469838
8133 1469838 492407 490158 384947 1239777 1131135 945415 1577603 1092750 1530812 2332491
8123 2332491 1130760 135220 1197374 1593166 1579774 176359 -1260591 -1107910 536199
8114 536199 198508 17273 516532 431900 1200364 1144555 -381844 -65650 658256 223451
8104 223451 829044 1733537 1480267 382830 -597683 -308698 -1047829 -987054 459643 797884
8094 797884 1105115 798279 -48312 716372 -294424 90722 831384 1267599 897376 26096
8084 26096 -131080 -597498 -1343715 -265804 -192529 53251 -52835 527506 409898 -494714
8074 -494714 -133316 206039 909849 349213 471242 -266152 540279 1052323 223118 -20715
8064 -20715 267513 256200 846759 118747 -30400 444562 515790 -283564 240209 -28064
8054 -28064 247438 -330501 -845557 -44547 264143 -1042157 -139461 209115 -477747 1112665
8044 1112665 1454121 1100761 545326 -112669 -681729 128391 -732638 -1044868 -353895 -1374865
8034 -1374865 -1699219 -1007699 -1807783 -775165 -302985 -227218 46097 410569 1412330
8025 1412330 763785 491284 961027 846447 1047493 903378 649365 960159 137577 390526
8015 390526 358097 1141049 296731 30371 657130 -225104 -592827 -975198 -312631 -98560
8005 -98560 764317 1154560 1173580 -602892 -222595 684998 599210 837958 281997 -110481
7995 -110481 277493 2182272 1771112 1347416 360549 -26641 -344780 -669455 -1063359 -260559
7985 -260559 618212 1075852 594346 715976 1148565 -582440 -1169240 65455 844511
7976 844511 397097 17186 -555961 -1586535 -1403207 -525158 -322351 -424147 -605885 -410621
7966 -410621 -154372 223770 787139 160861 -358626 -911652 2006 399378 253469 -69116
7956 -69116 -885660 -849566 310312 867051 513286 -525787 -461252 21775 930122 1366091
7946 1366091 783352 -131628 -1137930 -383243 -776934 -424306 262902 -302628 184124
7937 184124 706699 44281 228860 -270565 -605303 -1020047 -373295 -251563 148177 430289
7927 430289 388085 -161540 -977277 -1456219 -1116100 -621993 -953581 -802366 -863427 -541076
7917 -541076 -144900 -419455 -349437 -126673 -1444716 -1452647 -433175 -1130350 -690565 -413244
7907 -413244 -132307 146063 259460 -248840 -1375429 -1303999 -270063 -1858945 -2556216
7898 -2556216 -2752316 -2255412 -1013565 -226156 567068 -550903 -582940 -541615 -1922612
7889 -1922612 -1292547 -1492372 -1389055 -1144557 -637075 -52586 -467441 -986522 -2198438
7880 -2198438 -1616839 -1178728 -53028 322287 204557 -1220652 -692144 -221200 -1665635
7871 -1665635 -349845 64904 224206 1074436 929137 -274085 -605913 -161026 -526648
7862 -526648 -368747 -733829 -1694334 -726177 -581475 -1770360 -1754774 -957807 -1720769 -2107892
7852 -2107892 -2524017 -1650829 -792435 -1098241 -438755 -837141 -995874 -857806 -179095 -1070434
7842 -1070434 -719424 -960099 -821711 -862987 -1653809 -1253902 -1042620 -485373 95547 -328320
7832 -328320 -1109853 -897718 -658729 -1305824 -1485813 -1982646 -1473519 -1246132 -2290687 -2287222
7822 -2287222 -1653061 -1262349 -2289419 -380972 -692155 -985577 -1981704 -2002791 -1859226
7813 -1859226 -3161483 -7900180 -7454318 -1046928 -555304 244497 -663468 -396966 14251
7804 14251 -217620 322368 533798 1665566 2061207 720802 -19356 -598491 -71476 -447652
7794 -447652 -17789 869672 619858 -337 -521320 -1149203 -904071 -481933 -129879 -188276
7784 -188276 -917691 172985 341152 1123529 2225775 1090890 1156479 1906352 2091969
7775 2091969 691096 1096356 656463 -182482 -945841 -1179027 -512229 -368631 -792281
7766 -792281 -237416 -92697 6717 758888 636186 1139745 2525016 2649487 2009615 640157
7756 640157 122035 1326414 708714 1201738 1570319 1178426 1097535 1274804 1111289 643834
7746 643834 420998 1241170 911325 917788 367803 804918 1206545 294430 -229686 883877
7736 883877 997898 958234 476943 1363229 1208758 1356810 2026279 1305806 2230065 1998115
7726 1998115 1169370 1633560 1552668 831490 562485 623602 1074307 2399213 2202408 1390119
7716 1390119 1325585 627373 536851 681011 1064864 810914 1823616 2138178 2166087 1709005
7706 1709005 1132110 1350368 793318 999494 2063203 2621618 1374117 1244317 2631481
7697 2631481 1316599 1093411 2052015 1996634 2069569 1925791 1212095 1246139 2532957 1974020
7687 1974020 1700915 1753864 2729895 2688291 2756765 3391214 3923629 3443138 2360500 2444970
7677 2444970 1024632 1633993 1464781 1183918 1916464 2358135 2911049 2279402 1247702
7668 1247702 1723157 3620628 3240455 1877844 2134078 1480905 1378309 945557 716931
7659 716931 1176081 930632 917500 2042228 2122781 1169221 1096451 1660864 1448412 2176295
7649 2176295 1872114 1048878 1244210 1119936 1672875 2190903 2150009 1768889 1226447 490222
7639 490222 1418685 1911575 1173903 550738 627413 560836 349640 1151044 1422963 928084
7629 928084 1267868 1615545 1557103 1378341 1312797 473155 711365 288339 176926 746387
7619 746387 1104083 959467 1181744 1713753 1141367 -101448 530941 955632 1672697 1291337
7609 1291337 1443721 597589 -487945 1996925 2350012 1564918 760741 594429 1681820
7600 1681820 763920 826804 1319963 987920 494509 553961 1737630 1586222 1771600 1233600
7590 1233600 2405337 2748677 1460559 1593153 2142787 1545098 1075795 368794 327754
7581 327754 -1253053 -168340 826040 671848 345609 -671672 -1365781 -761460 249641
7572 249641 387867 470977 445690 774528 909055 527085 23591 1161250 1378451 896753
7562 896753 841083 61721 -163479 655964 653374 1108843 1123307 1206553 1304398 657273 835689
7551 835689 1136753 502862 245107 -81292 -361540 -331943 1128419 1415040 1001588 -8803
7541 -8803 356416 179901 -654827 185770 1279430 653948 899543 754796 434240 812466
7531 812466 1809965 2128627 1799457 1653585 1819050 1342694 687894 698221 -638892 19600
7521 19600 252639 621573 651979 1524079 1859596 1510771 2152853 1052591 843579 1355849
7511 1355849 1064127 1556081 472424 833569 1239311 1097911 1804532 1381965 949169
7502 949169 2045158 2118488 2204520 2295659 1720116 1379606 1604983 1196261 1644129 941453
7492 941453 2138393 1770449 2093037 1923974 1877423 1714264 1128035 1619372 1135303 1157183
7482 1157183 1240636 1681627 1782513 2462532 1687311 803549 -392606 161537 783403 1303567
7472 1303567 2754646 2392124 730621 1397996 827042 1325889 1571270 1272278 1575480
7463 1575480 1382700 2160191 1526716 1790744 3027455 3657361 3349099 2384426 2840121
7454 2840121 2910114 2490291 3397094 3689517 3043094 2584870 3419774 3066886 2621410 3156092
7444 3156092 2796430 3110566 2984950 3104098 3964123 5340081 4153552 3414904 3842078
7435 3842078 4093176 4351043 4633183 4342261 4278090 4533045 4883011 5010841 4660288 5106348
7425 5106348 5566709 5413580 6558159 7166566 6128260 5996830 5624396 5951742 5709478
7416 5709478 5149155 6001748 4759429 4430135 5236250 6554422 7126378 6802484 6271363
7407 6271363 6927922 6587757 6779573 6999693 6953373 7322081 7148797 6345926 6777495 7046530
7397 7046530 7113594 7092020 7297100 6518713 6673163 7432781 7881253 8781826 8068873 8242884
7387 8242884 7909084 9500523 9302837 9140070 9270991 9365412 10240299 9939875 9024006 9703399
7377 9703399 10036162 10853734 10618919 9379681 9074661 9404653 9553277 9350613 9825016
7368 9825016 10482082 10705403 10486387 9380710 9223044 9522651 9654938 9605690 10757660
7359 10757660 11228178 11748140 12165247 10884156 10596417 10958890 11523415 12248342 12347074
7350 12347074 11781192 11431566 13022799 13354287 12720484 12481220 12672151 12657403 13012715
7341 13012715 12926888 12779589 12497720 13050144 13486573 14127956 14785292 14175485 14434026 14092511
7331 14092511 14603030 14840980 14174483 13626951 13913832 14993889 14012575 13730260 14213069
7322 14213069 14906701 16123384 16228501 16050752 15877049 15211224 14543700 15058406 14358541
7313 14358541 14786485 14180786 13986114 13681665 13316312 14460964 14825108 15355265 15080323
7304 15080323 15438641 15483753 14194538 13538676 14151042 14471850 13612163 14780319 14611496
7295 14611496 14455212 14843047 14871923 14690355 15034733 15620108 16496821 15603663 14254731
7286 14254731 14203268 13684070 14234534 14803637 15795873 16134145 15414683 15298195 15341718 14817974
7276 14817974 13911304 14740443 13744727 14038060 13934544 14071999 12958548 11484578 12935325
7267 12935325 14097203 13766613 13408804 13948459 12658006 12860214 13923878 12968969 13233245
7258 13233245 13297046 12222928 13092097 13392568 14248452 13720456 14139507 13504891 13879526
7249 13879526 13131212 12186498 12618843 12714208 12828913 14029231 13804239 13525175 14404197
7240 14404197 14912561 14975046 15491046 14264857 14545674 15493759 15688601 15301535 15785314
7231 15785314 16092027 15998080 15861272 14783003 14950578 13919369 14285990 13826915 12924772
7222 12924772 12739962 13121998 13684418 13365696 12466043 12383308 12851800 13518269 12612626 11661445
7212 11661445 11956083 13003093 14066759 13524674 13530077 13239605 13462613 14121851 14318032
7203 14318032 16044588 15577831 14800944 14417428 14583589 14835909 14799730 15364704 14746006
7194 14746006 14832759 15111733 13559650 13248319 12994992 12777718 12553976 12566064 12133190 11916991
7184 11916991 11646641 10723942 9865350 9770563 9770928 9496468 8910976 8507717 7891585 8351502
7174 8351502 8177514 7884032 7799622 6868670 7270835 7135061 6820788 6960375 6064889 4426662
7164 4426662 5208001 5385112 4441732 4384859 4464400 4911602 5011095 5592159 6475367 6172211
7154 6172211 4689939 6071142 6478809 6085053 5240744 4562841 5055487 5137987 4648650
7145 4648650 4585811 5267987 4615291 2892102 2950016 2863413 2560423 2357866 1753841 1181918
7135 1181918 1486780 2501732 2321405 2086041 2101966 1218560 1575500 1682123 1636089 3471241
7125 3471241 3238748 3121536 1824025 1668151 3099503 2207099 1500905 2753981 3553618
7116 3553618 3167320 964951 834814 1339637 1539542 2008889 1938378 1666544 2268123 2061821
7106 2061821 1663736 2607151 2674144 1557161 866050 1387318 2320188 2605820 1466667
7097 1466667 1328709 2267253 1115954 361385 -454365 194453 592967 762570 -51366
7088 -51366 81383 456742 626548 -272840 -188945 -540372 -1294983 -785596 13081 1008834
7078 1008834 306406 -55950 -86633 672847 1179745 -191280 -622072 -528906 -317219 410559
7068 410559 815115 299535 997865 574964 -992784 -1183239 -689154 -853928 -972794 -571909
7058 -571909 -692090 139355 1540559 1239111 -1000070 -473669 98770 51243 604856 644334
7048 644334 1115214 1658214 -206337 -182776 -267102 -873147 -1505756 229607 -345718 -616245
7038 -616245 -991618 -1354449 -402093 -581290 -259319 -4512 255900 -134019 575948 53213
7028 53213 -798834 162895 33482 -670415 -715496 -79076 -220669 -449754 -687012 -45059
7018 -45059 -27514 -191043 -86836 -764225 -528849 -548206 173947 126206 -173230 -221194 -593600
7007 -593600 -946675 -720511 -936931 -1355802 -2399315 -1590713 -1263410 -707586 75431 371502
6997 371502 -310478 -1542824 -1012198 -1050876 -901447 -850387 -903942 -1238374 -1817307 -1262448
6987 -1262448 -1226456 -2683608 -1292302 -506107 -1462984 -1054164 -1613619 -1841933 -174707
6978 -174707 353834 -852738 -1403817 -1323674 -1586593 -1464773 -1384312 101940 -431758 -767421
6968 -767421 -836265 -1935237 -1585610 -1171217 -360423 200207 606170 -462716 -1383106 -1521524
6958 -1521524 -1975977 -1130906 -1327242 -1177243 -965335 -897688 -1345960 -828596 -809296 -301859
6948 -301859 -519729 -1302190 -760222 -311131 -205833 -178061 740857 -353837 -366175 -257413
6938 -257413 -1465026 -937825 -706332 -130003 514590 428700 221488 -8114 -62051 -196231
6928 -196231 -51101 465808 334606 177601 235355 -581869 -376360 9991 1156335 904840
6918 904840 744156 1192328 731144 637022 846211 1107241 609064 433923 1515950 1147740
6908 1147740 1919010 1200959 61432 -401191 358234 589835 730215 781639 13947 751596
6898 751596 712020 328592 539950 98013 -33899 -981928 -417169 239877 618719 921809
6888 921809 -798270 -1170856 -575371 -12574 849496 730339 -460914 -1759780 -1777427
6879 -1777427 -1550358 -895768 -890845 -205574 12576 -564599 -181922 -476862 -564794 -593678
6869 -593678 -1242365 -278595 -392584 -1123173 -664454 -263194 -500217 -39288 -144072 -930772
6859 -930772 -696004 -1497412 -1797118 -1167666 -1738959 -933715 -447333 -960272 140504 -542319
6849 -542319 -498645 -1148558 -259008 -298749 -1152023 -1686410 -1747710 -1564945 -753307 -997941
6839 -997941 -1931135 -3030970 -2565434 -1888091 -1779705 -975393 31435 -580771 -2024504
6830 -2024504 -1809161 -2295166 -2277280 -2355859 -2859072 -2531522 -2283285 -869764 -868156 -477478
6820 -477478 -1574564 -1873802 -2530374 -1677635 -1859640 -2940577 -2366990 -2201486 -1675382
6811 -1675382 -3137407 -2289801 -2231436 -2306535 -1548267 -521727 -898521 -1257270 -976567 -604857
6801 -604857 -25338 -200989 -1566293 -1502809 -716498 -858660 -1024627 -561262 -381666 -469028
6791 -469028 -752896 -982451 -584957 -771547 -1825877 -2292207 -2187105 -610049 -1124934
6782 -1124934 -683669 -487990 -941656 -18426 -896077 -440483 -198970 -1130929 -760197 -1967628
6772 -1967628 -1587062 -117077 -645446 -1491269 -1889907 -1018330 -292218 706624 196850
6763 196850 -369786 2783 -1379910 -970911 42645 -1435625 -2725524 -2682791 -1547295
6754 -1547295 -1469060 -209401 517320 -27003 -989949 -483970 -350859 -1440423 -1596752
6745 -1596752 -1178491 -507685 -725744 -526915 -301747 -553612 -847564 -1611849 -967644 -670816
6735 -670816 -810225 -1182771 -946856 -855745 -931619 -972012 -543599 -377869 -661538 -274718
6725 -274718 -397853 -281254 139212 -920085 -1331086 -188527 -711075 -1312277 -1159495
6716 -1159495 -794610 -1348246 -1730221 -1059785 -502378 -1411569 -1496607 -799341 -445779 -710563
6706 -710563 -248307 236711 -478306 -636938 18592 693834 808762 770069 -470109 -751052
6696 -751052 -295715 278428 1611231 986765 1344753 1324647 971453 910320 597451 1261708
6686 1261708 1700472 1235730 821654 513572 800087 687363 904840 1082216 1111185 1540546
6676 1540546 1886523 1452789 1255710 1158745 872740 1839574 2378924 1979202 1095050 955114
6666 955114 1253955 1810946 786471 -35109 1303832 895941 727608 733488 27022 -509813
6656 -509813 248476 1352369 1620008 1989390 1779567 1741984 1789254 1620919 2769656 2780884
6646 2780884 3068240 2697840 2485716 2646259 3367846 2604219 2072581 2021288 2415883 3477759
6636 3477759 3266573 2858396 2802103 3384153 2956823 3884284 4153171 4911718 5784870 5972501
6626 5972501 5297738 7045394 6663582 7120191 7235343 7817787 7385099 7181685 7017825
6617 7017825 7326119 8915445 8753300 8354271 9586732 9763579 10439555 10783247 11602054
6608 11602054 12645275 13567414 13358883 14047274 15640664 15729715 17309363 17774611 18702826
6599 18702826 18864394 18278215 18967470 20677684 20261443 18909294 18983184 19547237 19017211
6590 19017211 19653004 19745588 19872370 19683281 19463097 19334820 20195133 20437673 21484949
6581 21484949 21684238 22533966 23247605 23864902 23949298 22558171 22993410 25080155 25045183
6572 25045183 24097926 23695151 23114383 23076126 23625613 22552202 21336863 21479532 21816097
6563 21816097 21488975 21496259 21219144 20890302 20528585 19280182 19434668 20668477 20798633
6554 20798633 20571376 21322956 20681370 21190647 21626347 21500833 21349555 21416398 20808019 19274514
6544 19274514 19033755 19278384 19747387 19360012 18732321 19693402 18389575 17044090 15932083
6535 15932083 15198075 14950013 13973205 13308939 13235641 12306822 11238471 11047274 9340040
6526 9340040 8492064 8987514 9327332 8291742 7099857 7019838 8188931 8517605 7272522
6517 7272522 6630021 6518111 6211303 5778987 5380683 4630042 5531994 5153084 4616324 4871015
6507 4871015 3612164 2548894 2884743 3897022 3390350 3388401 2919889 2833583 3808681 4939388
6497 4939388 4906800 4381635 3213022 3025801 2792067 2533798 3080379 2984107 3415339 3852979
6487 3852979 3926709 3527203 4419655 3474353 2528232 3621702 3475614 3499253 2785689 2707092
6477 2707092 2183774 1308001 1325094 1409084 1772965 2468030 2908832 2617623 3359345 2482252
6467 2482252 1793588 1924761 2828325 2197719 1569313 1567647 1784233 1673800 1859179 1286334
6457 1286334 1169086 1547249 1526167 1890043 1470975 1494094 2043157 1448176 1826148 2264433
6447 2264433 2374155 1811977 1243359 2729797 2435696 1888633 2110123 1540722 925356
6438 925356 1258194 1634660 1429880 1834117 2012130 2194359 1851206 2347129 1427364 702299
6428 702299 2512227 3324124 2697230 1272097 1834915 1971357 2151209 2708281 2210727
6419 2210727 2860151 2641725 2077583 1493385 1849040 1623967 973450 1161269 2035833 1548836
6409 1548836 2028651 3185384 2464013 2762243 2850968 2728047 2797268 2309869 1685716 2383285
6399 2383285 3286527 3866229 2823152 2499386 2456410 2718446 2910746 3441207 3802586 4317122
6389 4317122 3694230 3589345 3253738 2760379 2416712 2914651 1959916 2541865 3499150 3718885
6379 3718885 3626668 2974997 2693172 2460153 3313155 4990917 4594594 3711464 3559331 3560536
6369 3560536 4211640 5072279 4794336 4587039 3924330 3492599 3562769 3296855 3904389 3400223
6359 3400223 3097549 3666366 4254908 4058231 4274957 4343565 4400161 4904451 5076613 5537187
6349 5537187 5341553 5894893 5107485 6071282 6564518 7017415 8344383 8364813 8310204 6253109
6339 6253109 7433306 7931686 7276922 7020137 7152533 8624306 9508117 9673844 8460980
6330 8460980 8025114 10387004 10685413 10084063 10175884 11995928 11890603 12375129 12532112
6321 12532112 11080495 11930851 12386405 12222729 11297601 11319436 12161873 12368465 12808299
6312 12808299 13330030 14670341 14520358 15058077 14806764 14706861 14687517 16007922 15610346
6303 15610346 15835144 14593969 13837788 13296884 13374993 14848879 14640805 13723490 13019162
6294 13019162 12518298 11929280 12175918 12671941 13028580 13663017 13711925 13956255 14615732 15242813
6284 15242813 14721112 15167188 13953909 13322685 13364173 12892216 14056029 14124040 13618488
6275 13618488 12747128 12628477 12301694 12854602 12788739 13006553 12875909 12252582 11873356 12763725
6265 12763725 11993191 11979615 13033507 12721843 10964081 12477889 12357650 11767117 12053708
6256 12053708 12602346 11651913 11312735 12168675 13233274 13162207 12233931 13155669 13409194
6247 13409194 13824622 14219195 12982522 12878886 13678944 13641636 12854976 12615553 12990004
6238 12990004 12705247 12541575 13104702 13173274 12920248 12650844 12836016 12732636 13395465 13914000
6228 13914000 14805488 15136604 14463453 14520955 15330321 14920280 14394190 14930935 15115742 15000020
6218 15000020 15258033 15932722 15473765 14880690 14792539 15202242 15983090 15886554 15900945 15983641
6208 15983641 16644155 16782456 16178101 17307320 16953489 16420811 16913629 16199241 15603680
6199 15603680 15843269 17138633 17303089 17973431 18104814 16973085 17312015 17182365 17324078
6190 17324078 17454940 17665517 17352405 18180594 18709797 18490257 18635979 18760121 18440325
6181 18440325 18658005 18635804 19019145 18466829 18747212 18909090 18840609 19366866 19664745 19216867
6171 19216867 20220450 20445429 19903040 20519350 21880084 21633364 22059919 22187205 21359459
6162 21359459 22381987 23975002 24034828 22587536 22692062 22720538 23611831 23692789 22932995
6153 22932995 21976400 22259830 23130901 23752255 23366526 22823487 23089556 23087236 22215704 22402650
6143 22402650 24099481 24515610 24972934 25423651 25080943 25614518 26454165 24805620 25179034
6134 25179034 25199691 24924819 24401316 23825227 22816438 23723784 24744788 24437703 24142831
6125 24142831 23476986 23377791 22347875 20882733 20914842 22145494 22797356 21928311 21905241
6116 21905241 22454153 21794379 22313817 22936390 23269883 22815591 22798487 22721007 22841398 22224019
6106 22224019 22498793 22046150 21316970 22786833 23429521 22506063 22085736 21906374 22335840
6097 22335840 22275002 21530728 21597583 20981874 20583988 20342949 20088429 20621474 20442387 21038283
6087 21038283 21228080 20979524 21276702 21118923 20499408 22448131 22545000 22495657 23372021 22934713
6077 22934713 22791080 22556606 21337061 21660103 21626399 22250733 24211208 24648404 24272826
6068 24272826 23640900 23866681 24505195 24170793 24937429 25164516 25125084 25234227 25040639 24063015
6058 24063015 24398209 24694900 24421524 24048054 24142232 24042936 23713380 24163612 23317744 23591080
6048 23591080 23003881 24241113 24248913 24035646 23999680 24590741 25203023 26049765 26382766 26579741
6038 26579741 26810815 25809029 25738735 25494672 25180981 23675254 23367910 23206189 21365188
6029 21365188 21351993 20782732 20417961 19486498 18000459 17433440 17696800 17662014 18304161 19500773
6019 19500773 19196184 18915956 19101426 19214571 18020885 18036594 18447080 18003342 17741298
6010 17741298 18715578 19163399 17832429 17203215 18262524 18007759 16620541 16020648 14518945
6001 14518945 13635898 13974218 14833435 14417330 13335953 13010854 12853726 11953166 11510541
5992 11510541 12063891 13024979 12988387 11635952 12365477 13028317 12164947 11591264 11480043
5983 11480043 11908731 12013618 11359709 11395679 11251585 11207697 10885154 10630775 9779777 9697063
5973 9697063 10712681 10631125 10571777 10461723 10319826 10072621 9957806 9737823 10803694 10111436
5963 10111436 9037979 9070229 9458228 8953778 9473568 9483797 9580151 10167343 10266071 10023749
5953 10023749 9788562 10130550 10201266 10266191 10191569 9998477 9419780 8579805 9412786 9439298
5943 9439298 10096952 10021844 9998472 9966331 10370872 10402149 9607317 10095778 10020247 9528790
5933 9528790 9575737 9056879 7910409 9016752 9629676 10166032 9161700 9858235 9493373
5924 9493373 9090553 8936797 9800486 8706510 9239176 9823098 9890716 9763169 9606528 9847682
5914 9847682 9431946 9055558 9756340 10596581 10573617 10411641 9252330 9418624 10600687
5905 10600687 10889344 9932325 10511288 11269256 11630251 10806467 11342657 10574481 9136744
5896 9136744 9369952 9066819 9700205 10373470 10687475 10006107 9247513 10026988 10656513 10962748
5886 10962748 11646455 11575365 11015469 11588069 11764579 11256559 11552497 12226608 12591831 12565272
5876 12565272 12563316 12057863 11140567 11092965 11013611 11570342 12480759 13082883 13257012 13492110
5866 13492110 12643597 13558097 13484951 14014243 13848743 12598493 13179971 12996928 13345436
5857 13345436 13114288 13107572 13036600 12768847 13716696 14146383 14362224 14385508 14251879 15105129
5847 15105129 14419485 14991201 15394020 15594659 15617206 15045492 15157636 15285919 15727149 15655954
5837 15655954 15004054 15168984 14691032 14905103 15018312 15739615 16182943 16111277 15787651 15554081
5827 15554081 15669429 15611584 16237639 17218438 17389361 17103588 16970809 16198889 17480557
5818 17480557 18155753 17767879 17629614 17752102 19119547 19429283 19013012 19297673 19710854
5809 19710854 19885346 19953730 21038007 21792518 22754289 23626276 23639719 21971936 22715892
5800 22715892 23802657 24559810 24652137 24100294 24458542 25281290 25382807 25098700 25968916
5791 25968916 25904552 27145469 28343856 28914439 29027985 29052958 29958996 30504470 31159219
5782 31159219 30294287 29782395 31438321 32608719 32336434 32620861 33232621 33835000 35221000
5773 35221000 34931048 34184317 34201747 34071296 34872792 36573954 37522965 36399407 36255449
5764 36255449 36936271 37822714 37826132 39130551 39347753 39572168 39759661 39992637 40354417 39876918
5754 39876918 39970791 39831772 40740183 41295231 42053503 42810372 43318515 44118466 45681570
5745 45681570 46739844 45977595 46059429 47157204 47786924 48714583 49347442 49996147 50441498
5736 50441498 51189388 52742697 52083639 51784790 53193727 53230489 53345260 54541648 56130362
5727 56130362 57081345 58319545 59087622 59584097 60836642 62924895 63147804 64066510 66246396
5718 66246396 67177429 68299920 68861875 69064855 71605404 74459386 75852436 76224298 77985201
5709 77985201 80429111 83039995 84814209 87727368 88454930 91327653 95756314 96658748
5701 96658748 98247934 99774208 101986002 103453816 104683265 106577545 108051029 107758388
5693 107758388 107322611 109350287 111598623 112422074 113864516 113981316 113768572 113751662 112860085
5684 112860085 113189325 113923920 115934018 115910265 116518768 117804864 119283539 120140905 121065963
5675 121065963 121570002 122074914 121701485 121449002 120614148 119436553 118652410 116651407 113745954
5666 113745954 110683708 109265078 106342132 103372881 101126098 99596440 96743004 95332778
5658 95332778 93056179 91199247 89980161 88562990 86734704 85383425 84232065 83692259
5650 83692259 83071547 81762117 80412691 80048375 79034593 78070498 79098369 79124044 77966948
5641 77966948 77429831 77641636 76843361 75935956 75352378 74519090 74792169 74200142 73387927
5632 73387927 71584726 71524468 71177082 70452218 69989458 69848564 69237276 67996041 68109498
5623 68109498 68100959 67790800 67392653 67006255 66501981 67364277 65664183 65187083 66017163 65657685
5613 65657685 65479818 65767987 65842099 65477068 64187083 63672002 64518455 64941961 65317797
5604 65317797 65731663 65135001 65086856 64616031 65057105 65461100 65818087 65933840 65161290 65471263
5594 65471263 66501298 66266554 64966055 65260899 66345696 65869098 66437862 66399691 65584448
5585 65584448 65727825 65891307 66817465 66002150 65905766 66715131 65962242 66260463 66080024 65792697
5575 65792697 66630487 65804108 65883433 65197566 64375225 63800139 62702958 62308293 62421211
5566 62421211 64016865 64625050 63851058 63029318 63178294 64396297 65063111 65816034 66419078
5557 66419078 65553252 64941083 65408378 65115859 65499193 65302453 63993152 62164789 61797671
5548 61797671 60592508 60312397 59770450 58827380 58414557 57718139 56992062 56602468 56870051
5539 56870051 55600878 55135338 54104638 54330852 53982496 53226625 53988675 54075584 52824087
5530 52824087 53031804 53323683 52535161 52433833 52738607 52547578 51342615 50731663 51642102
5521 51642102 51749010 51323417 51519586 50133771 49753629 48683349 48015208 47821658 46881436
5512 46881436 46780288 46358006 46119053 44558721 43927678 43863419 43349535 42579942 42906385
5503 42906385 42453751 42640939 43946406 42652063 42270536 42826439 42959475 42200630 42516148
5494 42516148 42612413 42590854 42317639 42267748 41883975 41877138 42849028 43285161 43445365 42338020
5484 42338020 41565896 41316708 41254818 40992967 40026855 39937654 40479418 41278482 40776873 39647160
5474 39647160 40188101 40689316 40997811 41352093 41061848 40678779 41317645 41072281 41105659 40848072
5464 40848072 40976925 41676775 42948634 43854510 45155894 45191285 44254598 42418965 41926009
5455 41926009 41184379 39131432 37810267 37099205 36787996 36173353 36204657 36560600 36507439
5446 36507439 35819800 35231590 34395659 33778967 33988180 33544645 33412060 33157656 32842965
5437 32842965 33305931 32124598 31887045 33478632 34370298 34119803 32947416 32735678 33826796
5428 33826796 32435166 31901897 31386829 31086730 31756979 31198856 31268430 31110685 30979210
5419 30979210 30413869 30669973 31803069 31287251 30522176 29857939 30251082 30195762 30920657
5410 30920657 30666838 30296904 29961320 30132293 29210124 28291080 29925892 29739984 29676822
5401 29676822 30209702 30252121 29555235 28987916 28971701 28019736 28361828 29157666 28503292 27729430
5391 27729430 27781243 27608568 26830771 26717317 27147026 26924981 26896061 28180834 26787282
5382 26787282 26766361 26502815 25973064 25763007 25126617 24138879 24255688 24952751 24556382 25137437
5372 25137437 25810941 25523205 24691412 24878933 23589330 24595535 25278412 24704922 23291118
5363 23291118 22962940 23971744 23710974 24033842 23451974 23265593 23145041 23580248 24128570
5354 24128570 23276867 23801950 22542143 23845691 23345650 23000068 23682260 24177320 23808994
5345 23808994 22342507 22691074 22935269 22042103 21897949 23507787 23066830 23092948 23728605
5336 23728605 23348852 22587320 22681354 22221084 22204761 21707749 22044659 21927312 21410826 21878304
5326 21878304 22653521 22759655 21789453 21639119 21899765 22289633 23093804 22458862 21746761
5317 21746761 21959605 22392228 22509181 22563793 22425345 21467783 20234060 21625681 20941247
5308 20941247 21591302 22426137 22194542 21737052 22879657 22635590 22394424 21552816 21597423
5299 21597423 22012895 21942799 22619159 22773481 22627542 22308154 23422520 23379311 23007699 22429501
5289 22429501 22580711 22504638 21838097 21269294 21770149 21273714 20796172 21053307 21461400 21447447
5279 21447447 22155306 22166739 22152031 20642520 20546276 21333543 22313393 21051089 21267280 22011124
5269 22011124 22744048 22816372 22696869 21891088 21638634 22684723 21998064 21514025 21710778
5260 21710778 22174004 22195244 22765342 22265506 22139985 21632630 22510273 22057371 22391912 22497185
5250 22497185 21981282 22865528 21886424 22206197 22914237 22366374 22533694 23469229 23057977
5241 23057977 22923316 22341458 21984157 22551739 22182613 22261732 23410896 23500102 23094722 22507717
5231 22507717 23340276 22833204 22667924 23223113 22029625 22783368 23849833 24878001 23767689
5222 23767689 22789833 22950662 22520265 22940371 24410518 23937069 23795279 24820181 25200768
5213 25200768 23877342 24207794 23761524 22919915 23019949 23310979 23656656 24249547 24669180
5204 24669180 23460087 23525502 24661942 24380902 22769867 21514923 22306636 23872827 23786896
5195 23786896 23760807 24783680 24882350 24574034 24123719 24196766 24563829 25103929 24147010 24045747
5185 24045747 24669993 24214884 24283809 25143548 24919636 24981423 25807323 24875479 26324673 27381372
5175 27381372 27070349 26719478 26372562 26718241 26094212 26001766 26989154 27174771 27256747 26621893
5165 26621893 27121322 26859344 26151094 26725688 27292353 27758832 28754093 28733854 28481310 29506243
5155 29506243 29177235 28626006 29799555 30827047 30979863 31437778 31659717 32303685 32723063
5146 32723063 32480978 33918195 34278005 33948176 34228496 35962212 36291236 36222503 37740842
5137 37740842 38141254 37604838 38262693 39055942 39681270 39373340 40845217 40769682 41221683
5128 41221683 42076069 41722738 42489805 41891694 43747028 44291396 45841676 47945483 48447941
5119 48447941 48882809 50123967 51059627 51152149 51908567 53326927 54062425 51559697 47974509
5110 47974509 47046649 46758601 45938782 46352641 45641404 43496738 42877744 44309851 44635541
5101 44635541 44326170 43752025 43654186 43606590 43190091 43082221 43046179 43046516 43732418 44660744
5091 44660744 43926145 44791515 45602207 46546728 47840976 48019179 48259345 49801585 49635464
5082 49635464 48666669 49174187 49539079 50608773 51580844 51795667 51771446 51302900 51336856 52701340
5072 52701340 52952995 53135402 54627901 54101555 53446875 54894882 55484819 56511752 57407390
5063 57407390 57160533 57900797 58365654 59173777 58521023 59106646 58981061 59116135 60337558
5054 60337558 60554619 61998537 61870964 61504923 62545728 62651050 62785647 63215402 62153378
5045 62153378 62166121 62100865 62005636 62302307 63212038 63776752 63609285 63175374 61939819 62667777
5035 62667777 61431617 61325815 61824956 62471152 62241933 61781161 62431392 61542156 63280641
5026 63280641 61880079 61822415 62438228 63022381 62996596 63897521 63706614 62337792 63063163
5017 63063163 62761032 63826118 63926231 63210276 62917371 63110963 63421178 63445973 63418035 64164217
5007 64164217 65052635 65764802 64692286 64647640 64355929 64344780 65148947 67002647 68373098
4998 68373098 68828047 69567656 70546934 71136353 71257964 72668907 72752252 72508515 72949846
4989 72949846 74486498 75461818 75870050 76251257 76184156 76501971 77175875 78185179 78631788
4980 78631788 79876130 81504844 82033292 81994487 82752200 84170960 85535735 85854801 86244696
4971 86244696 86056462 86446909 87597366 87459831 89070245 88853452 89722578 90477085 90553640
4962 90553640 90311726 90106918 90667331 90652128 90359174 91050547 92657338 91351431 91481263
4953 91481263 91934909 92296653 92036899 92127262 92669650 92577838 92501511 93761538 93749215 93240180
4943 93240180 93648594 93337253 94840180 94830911 95893855 97142795 98041044 98986980 99482923
4934 99482923 100498250 101703825 102812873 103888488 104882774 105888163 106376080 107597650
4926 107597650 108211095 107457788 107557306 107828773 108119228 108069028 107434015 108165235 108145206 106257254
4916 106257254 105355545 106044361 106364465 106455698 105756356 105568139 104525169 104334154 104624384
4907 104624384 104287471 103201308 103383614 102633616 101815412 100856724 99748205 100362330 99005021
4898 99005021 98020021 98030373 99444279 99421468 98266570 98453966 99334839 99441423 97690111
4889 97690111 97767281 98485829 99224571 100979969 101091678 102447696 102318637 103915512 105389366
4880 105389366 106173390 107104291 108700808 111195158 112946221 115372323 117512905 119193655
4872 119193655 120433562 122371025 123709086 124076286 124717774 125465311 126471106 125904866 126008527
4863 126008527 124166159 123402229 122706232 123205011 122248349 120432730 119346308 118474906 117627975
4854 117627975 115542483 113747306 112973057 113193303 111526308 109911708 109136631 106954845
4846 106954845 105608539 104201807 102900588 102202517 101399294 100648384 97937966 94848616
4838 94848616 94080518 93019682 91826665 89772804 88629445 88657081 86707550 86450775 86061290
4829 86061290 84797183 82821437 82432516 82520281 82049143 81627809 79823542 79166907 79579102
4820 79579102 79122378 78291669 76900466 77132917 77255615 76239937 74288168 74805121 75230229
4811 75230229 75655836 74854562 75450271 73790333 73225047 74386183 75534207 75593846 73918165
4802 73918165 72570588 72431549 73218233 72550031 71924207 71539579 71536401 71472822 71039846 71119618
4792 71119618 70351736 70153735 69812982 69897741 70379469 70066314 69504272 68803661 69043169 68008374
4782 68008374 66415249 68118094 69596344 68825927 68934044 69605838 69716487 68675053 69316469
4773 69316469 69914193 70524558 71100825 69538103 68626423 68461315 67635974 68234467 69706189
4764 69706189 69819867 68901496 69972864 69177439 69405181 71115494 71482361 70696529 71282315
4755 71282315 71523309 71013159 71884683 71976847 72377720 72728851 72724307 73316786 72973760 72968508
4745 72968508 72921849 73357498 73674210 73031034 72325839 73389448 73735511 74545650 76257770
4736 76257770 75315936 74928158 74875918 75702973 76075828 75304779 76383800 77313063 77149142
4727 77149142 77884514 79282379 79475020 78650195 78492305 78841656 78909124 79344962 80014383
4718 80014383 80048329 80704905 81379588 81860513 81957518 81830156 82533286 83492246 84589294 85591161
4708 85591161 86670965 86919503 87330674 88170223 88566987 88925889 88985745 90138668 91303814
4699 91303814 92653010 95022056 95273856 97076918 98477106 99504416 101140222 103113038
4691 103113038 104480094 106343007 107832460 109946578 111760308 113821431 115935776 117879079
4683 117879079 120400868 123793288 126203493 127902924 130533598 131521378 133797639 135669814
4675 135669814 138901232 142306474 146740309 149121524 152391967 155467733 159308119 162751588
4667 162751588 165025373 168619821 171996856 175296973 177519668 180064904 181827790 183257953
4659 183257953 184996977 183910528 181846415 180115430 178087451 176683724 174992243 172607005
4651 172607005 169621171 166703980 164762068 163001305 161336734 159710137 158015716 156366431
4643 156366431 156549511 157258349 156802499 155023478 154614569 154477407 153297854 152281021 152380595
4634 152380595 152517922 151807476 152447862 151612466 151474444 150903725 150098504 150023176 149699980
4625 149699980 147542934 145577048 143642406 140257299 137263004 133599564 130735484 129066920
4617 129066920 125887495 122419328 120057845 118390986 116088777 112623394 110170274 107497760
4609 107497760 105344530 104500484 103721613 102284050 101431550 98991515 96927466 95497163
4601 95497163 93500376 91956998 90738974 90352868 89066898 87413351 87340656 87391705 86460517
4592 86460517 85581799 86293946 84897609 83859124 83828885 83869944 82356349 80987427 80483997
4583 80483997 79281448 79126684 78411406 79494769 78225230 78150139 77169585 76560682 76164678
4574 76164678 76191994 75562380 74982683 74559458 74472479 74609935 73708564 74447134 73868256 72758738
4564 72758738 71840255 71000501 70557163 69540690 68480035 67326071 65861168 65826912 65012876
4555 65012876 64932645 65196617 63765197 62525306 61697849 60832027 60355694 59598580 59773992
4546 59773992 59872851 59091038 58625985 58989664 58686083 57966677 58554074 56430803 55781916
4537 55781916 55246387 55096826 55911715 54066789 53268657 52857027 52270459 51877900 50980392
4528 50980392 51198151 49613787 48683140 49753600 48033134 47876232 47735262 47102403 46648070
4519 46648070 46336365 46328777 46942629 47052156 45673886 44624700 44699649 44693525 45277938 44855907
4509 44855907 43606609 43484357 43494706 43631285 44625862 44247731 43716504 43109457 43201608 43674688
4499 43674688 42803974 42863048 42723253 41512504 42205679 42962644 42272465 40558364 40285075
4490 40285075 39757217 38564073 39302337 40175090 40976585 40636628 39874729 39816369 39585912
4481 39585912 40104409 39870910 40186022 40385983 39592579 40113311 39561478 39413228 39619435
4472 39619435 39470393 39031524 39293924 39458754 39551737 39065135 38826337 39005218 38913751 39473854
4462 39473854 39623685 39657527 40371254 39922563 40078483 39656371 40147313 40178818 39738297 39404384
4452 39404384 39630113 40379405 39766749 39955252 40264588 40706458 40648883 40497247 41638532
4443 41638532 41679841 41733065 41526519 42454333 41938223 41991514 41757623 40833790 40757643 41620738
4433 41620738 41857466 42142609 43126034 42959955 43048700 43413533 43330010 43292467 43514079 43972296
4423 43972296 44957610 44966581 45614511 44987671 44277535 43925503 45146042 45384569 46037226 46646990
4413 46646990 46213439 46022617 47668649 48097139 47946203 48481763 48569019 49707279 50546507
4404 50546507 50973768 51208427 50805873 51370083 52273190 51546681 52751094 52959568 51760048
4395 51760048 51504530 51866049 51648937 51270072 50919789 50339276 50029576 50677657 50283059
4386 50283059 49156167 49563238 49011495 49057813 48575486 48520814 48885671 49345271 48624145 48494449
4376 48494449 49694865 49983970 48949037 49367848 50477572 50415682 51031599 51935695 50851881
4367 50851881 50395414 51016968 49877182 49875901 50246390 51107099 50398297 50117436 51139279
4358 51139279 51052868 51735194 50997359 50155469 50721723 51301909 51018108 50602593 50291186 50196030
4348 50196030 50570328 51658151 51418345 50807355 51366655 52645764 53722942 54057838 54494470
4339 54494470 55255939 55519276 56251580 56766608 57250010 57517153 57720880 57121486 57882031
4330 57882031 57316613 57275839 58222778 59023936 58839576 58765333 59741952 61293515 60534047 60550983
4320 60550983 62031616 62460767 64593842 65372869 67385970 67821423 67960401 67934350 67453742
4311 67453742 67296779 68607653 69238314 66229352 60956093 57692918 53633322 51352886
4303 51352886 49935516 48885557 46291982 44374409 44190819 43894427 42894100 41744492
4295 41744492 41515050 40507061 39900477 39818851 38934252 39040041 38560487 37422593 35941966
4286 35941966 34590500 34518146 35291328 34758178 34342543 34392337 33965252 33649321 33345241 32494431
4276 32494431 32155627 31404049 30755272 31459943 30702947 29868665 30528635 31048017 31504286
4267 31504286 31122334 30125559 29348179 28973652 28214176 28245717 28571423 28578574 28511460 28502408
4257 28502408 29428981 27724621 27554109 27873201 27637168 26829184 26300752 26933083 27519049
4248 27519049 27281857 26493549 26094382 25842680 27119648 28128035 27727871 26410220 25221362
4239 25221362 24890730 24884254 25061397 24475379 25471489 25496509 25396626 25291241 25146373 25384255
4229 25384255 25135419 25447193 25914763 24463485 24702098 24875079 24631422 25152462 25054468
4220 25054468 25598345 24869994 24520960 24603731 24392716 24093013 24752290 25367682 25029535 25041386
4210 25041386 23794193 22448329 22736298 22577234 21977256 22247939 22853697 23002956 23054516
4201 23054516 24034022 23686398 23485685 23434433 23270458 23375111 22998114 22977353 22866830 23047648
4191 23047648 23472410 22855746 22390937 21919922 22381029 23060391 22667880 22571848 22683667 22135167
4181 22135167 22289511 22745803 22237650 21849870 21707062 21175381 22097421 22088344 22115685 22328690
4171 22328690 22320747 22238458 21281999 22462700 23076121 21675757 21311370 21160913 20100955
4162 20100955 19808428 20107275 20972800 20567152 20406447 20444681 20609931 21631971 21026823
4153 21026823 19356484 19996610 20368080 20187726 21364731 21288292 19803701 17911771 18619057
4144 18619057 19271650 19683377 19496846 19057458 19438446 19409556 19438783 19173365 19231562 18356387
4134 18356387 17769587 17935039 18662083 17344551 17498676 18341822 18829239 18954534 18164833
4125 18164833 17881288 17578121 17322551 17866491 17876755 17629777 17096919 16708749 18337316
$$ [...]
##END NTUPLES=NMR SPECTRUM
##END=
