##TITLE=1H_DE-80H_X3
 200.13MHz, d2o
 8 sc
 
 19ns.26.2.2025
##JCAMPDX= 6.0         $$ Bruker NMR JCAMP-DX V2.0
##DATA TYPE= NMR SPECTRUM
##DATA CLASS= NTUPLES
##ORIGIN= UXNMR, Bruker Analytische Messtechnik GmbH
##OWNER= pz
$$ XWIN-NMR		Version 3.5
$$ Tue Jun 17 14:34:33 2025 Russian Standard Time (UT+4h)  Yarkov@DPX200
##.OBSERVE FREQUENCY= 200.1313
##.OBSERVE NUCLEUS= ^1H
##.ACQUISITION MODE= SIMULTANEOUS
##.ACQUISITION SCHEME= undefined
##.AVERAGES= 8
##.DIGITISER RES= 18
##SPECTROMETER/DATA SYSTEM= spect
##.PULSE SEQUENCE= zg30
##.SOLVENT NAME= CDCl3
##.SHIFT REFERENCE= (INTERNAL, CDCl3, 0, 15.4703)
##AUDIT TRAIL= $$ (NUMBER, WHEN, WHO, WHERE, WHAT)
$$ ##TITLE= Audit trail, XWIN-NMR		Version 3.5
$$ ##JCAMPDX= 5.01
$$ ##ORIGIN= Bruker BioSpin GmbH
$$ ##OWNER= Yarkov
$$ C:/Bruker/XWIN-NMR/data/yarkov2/nmr/H-C/1/pdata/1/auditp.txt
$$ ##AUDIT TRAIL=  $$ (NUMBER, WHEN, WHO, WHERE, WHAT)
(   1,<2025-06-17 14:33:30.57 +0400>,<Yarkov>,<DPX200>,
      <created by zg, POWCHK disabled, PULCHK disabled
       configuration hash MD5:
       00 E9 B6 7A A2 85 ED C7 34 08 36 98 17 FE 4E 26
       data hash MD5: 16K
       1D 40 64 95 59 62 76 83 3B 26 A1 6F DA BE 44 8A>)
(   2,<2025-06-17 14:33:44.12 +0400>,<Yarkov>,<DPX200>,
      <Start of raw data processing
       efp BC_mod = 2 LB = 0.25 FT_mod = 6 PKNL = 1 PHC0 = -1721.517 PHC1 = 19.96656 SI = 16K 
       data hash MD5: 16K
       FA 92 0F 84 57 87 D1 99 A1 CB CC F3 FC F3 CB B0>)
(   3,<2025-06-17 14:34:07.87 +0400>,<Yarkov>,<DPX200>,
      <pk PHC0 = -6.229292 PHC1 = 2.600005 
       data hash MD5: 16K
       13 4E 80 02 41 10 7A ED EE 33 3D 5A BD 75 02 54>)
(   4,<2025-06-17 14:34:11.15 +0400>,<Yarkov>,<DPX200>,
      <abs ABSG = 5 
       data hash MD5: 16K
       76 FE AC 37 29 1E 0C 21 E2 68 55 69 26 02 6D 0A>)
$$ ##END=
$$ 
$$ hash MD5
$$ F2 D0 B5 5B 2D 40 28 A2 D8 E1 62 F4 98 57 59 F0
##$RELAX= 
##$RELAX= 
##$RELAX= 
##$RELAX= 
##$RELAX= 
##$RELAX= 
$$ Bruker specific parameters
$$ --------------------------
##$DU= <C:/Bruker/XWIN-NMR>
##$EXPNO= 1
##$NAME= <H-C>
##$PROCNO= 1
##$TYPE= <nmr>
##$USER= <yarkov2>
##$AMP= (0..31)
100 100 100 100 100 100 100 100 100 100 100 100 100 100 100 100 100 100 
100 100 100 100 100 100 100 100 100 100 100 100 100 100 
##$AQSEQ= 0
##$AQ_mod= 1
##$AUNM= <au_zg>
##$AUTOPOS= <>
##$BF1= 200.13
##$BF2= 200.13
##$BF3= 200.13
##$BF4= 200.13
##$BF5= 200.13
##$BF6= 200.13
##$BF7= 200.13
##$BF8= 200.13
##$BYTORDA= 1
##$CFDGTYP= 0
##$CFRGTYP= 5
##$CHEMSTR= <none>
##$CNST= (0..31)
1 1 145 1 1 1 1 1 1 1 1 1 1 1 1 1 1 1 1 1 1 1 1 1 1 1 1 1 1 1 1 1 
##$CPDPRG= <>
##$CPDPRG1= <>
##$CPDPRG2= <>
##$CPDPRG3= <>
##$CPDPRG4= <mlev>
##$CPDPRG5= <mlev>
##$CPDPRG6= <mlev>
##$CPDPRG7= <mlev>
##$CPDPRG8= <mlev>
##$CPDPRGB= <>
##$CPDPRGT= <>
##$D= (0..31)
0 0.7 0 0 0 0 0 0 0 0 0 0.03 0 0 0 0 0 0 0 0 0 0 0 0 0 0 0 0 0 0 0 0 
##$DATE= 1750156410
##$DBL= (0..7)
120 120 120 120 120 120 120 120 
##$DBP= (0..7)
150 150 150 150 150 150 150 150 
##$DBP07= 0
##$DBPNAM0= <>
##$DBPNAM1= <>
$$ [...]
##$SUBNAM3= <"">
##$SUBNAM4= <"">
##$SUBNAM5= <"">
##$SUBNAM6= <"">
##$SUBNAM7= <"">
##$SUBNAM8= <"">
##$SUBNAM9= <"">
##$SW= 18.0517328524113
##$SWIBOX= (0..15)
0 0 2 0 0 0 0 0 0 0 0 0 0 0 0 0 
##$SW_h= 3612.71676300578
##$TD= 16384
##$TD0= 1
##$TE= 0
##$TE2= 300
##$TE3= 300
##$TEG= 300
##$TL= (0..7)
0 120 120 120 120 120 120 120 
##$TP= (0..7)
150 150 150 150 150 150 150 150 
##$TP07= 0
##$TPNAME0= <>
##$TPNAME1= <>
##$TPNAME2= <>
##$TPNAME3= <>
##$TPNAME4= <>
##$TPNAME5= <>
##$TPNAME6= <>
##$TPNAME7= <>
##$TPOAL= (0..7)
0.5 0.5 0.5 0.5 0.5 0.5 0.5 0.5 
##$TPOFFS= (0..7)
0 0 0 0 0 0 0 0 
##$TUNHIN= 0
##$TUNHOUT= 0
##$TUNXOUT= 0
##$USERA1= <user>
##$USERA2= <user>
##$USERA3= <user>
##$USERA4= <user>
##$USERA5= <user>
##$V9= 5
##$VALIST= <valist>
##$VCLIST= <CCCCCCCCCCCCCCC>
##$VD= 0
##$VDLIST= <DDDDDDDDDDDDDDD>
##$VPLIST= <PPPPPPPPPPPPPPP>
##$VTLIST= <TTTTTTTTTTTTTTT>
##$WBST= 1024
##$WBSW= 4
##$XGAIN= (0..3)
0 0 0 0 
##$XL= 0
##$YL= 0
##$YMAX_a= 21903
##$YMIN_a= -16089
##$ZGOPTNS= <>
##$ZL1= 120
##$ZL2= 120
##$ZL3= 120
##$ZL4= 120
##$ABSF1= 15.47034
##$ABSF2= -2.58151
##$ABSG= 5
##$ABSL= 3
##$ALPHA= 0
##$AQORDER= 0
##$ASSFAC= 0
##$ASSFACI= 0
##$ASSFACX= 0
##$ASSWID= 0
##$AUNMP= <proc_1d>
##$AZFE= 0.1
##$AZFW= 0.1
##$BCFW= 0
##$BC_mod= 2
##$BYTORDP= 0
##$COROFFS= 0
##$CY= -3
##$DATMOD= 1
##$DC= 0
##$DFILT= <>
##$DTYPP= 0
##$F1P= 0
##$F2P= 0
##$FCOR= 1
##$FTSIZE= 16384
##$FT_mod= 6
##$GAMMA= 0
##$GB= 0
##$INTBC= 1
##$INTSCL= 3.241238e-09
##$ISEN= 128
##$LB= 0.25
##$LEV0= 0
##$LPBIN= 0
##$MAXI= 10000
##$MC2= 0
##$MEAN= 0
##$ME_mod= 0
##$MI= 1.114404
##$NCOEF= 0
##$NC_proc= -11
##$NLEV= 6
##$NOISF1= 3.799351
##$NOISF2= 2.8
##$NSP= 0
##$NTH_PI= 0
##$NZP= 0
##$OFFSET= 15.47034
##$PC= 1
##$PHC0= -1727.746
##$PHC1= 22.56656
##$PH_mod= 1
##$PKNL= yes
##$PPARMOD= 0
##$PSCAL= 0
##$PSIGN= 0
##$REVERSE= no
##$SF= 200.130010279418
##$SI= 16384
##$SIGF1= 3
##$SIGF2= 2
##$SINO= 0.751879
##$SIOLD= 32768
##$SREGLST= <19F.Aceton>
##$SSB= 0
##$STSI= 16384
##$STSR= 0
##$SW_p= 3612.71676300578
##$SYMM= 0
##$S_DEV= 0
##$TDeff= 16384
##$TDoff= 0
##$TI= <>
##$TILT= no
##$TM1= 0
##$TM2= 0
##$TOPLEV= 0
##$USERP1= <user>
##$USERP2= <user>
##$USERP3= <user>
##$USERP4= <user>
##$USERP5= <user>
##$WDW= 1
##$XDIM= 16384
##$YMAX_p= 500616682
##$YMIN_p= -5001346
$$ End of Bruker specific parameters
$$ ---------------------------------
##NTUPLES= NMR SPECTRUM
##VAR_NAME=  FREQUENCY,     SPECTRUM/REAL,   SPECTRUM/IMAG
##SYMBOL=    X,             R,               I
##VAR_TYPE=  INDEPENDENT,   DEPENDENT,       DEPENDENT
##VAR_FORM=  AFFN,          ASDF,            ASDF
##VAR_DIM=   16384,         16384,           16384
##UNITS=     HZ,            ARBITRARY UNITS, ARBITRARY UNITS
##FACTOR=    0.220516191357247, 1,           1
##FIRST=     3096.07925821394, 0,            0
##LAST=      -516.63750479184, 0,            0
##MIN=       -516.63750479184, -5001346,     0
##MAX=       3096.07925821394, 500616682,    0
$$ Real data points
##PAGE= N=1
##DATA TABLE= (X++(R..R)), XYDATA
$$ [...]
5108A6289281N90164M94835j15457R0338J42913R8831P45899K97931r30366O81343
$$ 16289281 16879445 17374280 17258823 17349161 17492074 17590905 18336804 18634735 17704369 18385712
5098A8385712K36956m20292k9892j020070K84242M02224R94251O1087m25313P14789
$$ 18385712 18622668 18202376 18172484 17152414 17436656 17838880 18833131 18894218 18468905 19183694
5088A9183694L53225M13745J337352o82132L27764L74431J19304J293679N53951
$$ 19183694 19536919 19950664 21288016 20605884 20933648 21308079 21427383 22721062 23275013
5079B3275013q48849m64238O68885K21816J596751P55401q23863J73555J040906
$$ 23275013 22426164 21961926 22630811 22852627 24449378 25204779 24380916 24554471 25595377
5070B5595377M36505j35489n04237Q91681m65301m10621J84790N12438l71835
$$ 25595377 26031882 25896393 25392156 26283837 25818536 25407915 25592705 26105143 25733308
5061B5733308k31665O63442j8754q66905M51539r5644R96522J499886P40746p48786
$$ 25733308 25501643 26165085 26146331 25279426 25730965 25635321 26631843 28131729 28872475 28123689
5051B8123689K30631L23481p8934J003676R14215r45722l48320J195692N45996
$$ 28123689 28354320 28677801 28598867 29602543 30516758 29571036 29222716 30418408 30964404
5042C0964404m81816Q3145N1460J05703O0378R3204J386298J000805m68639J87830
$$ 30964404 30482588 30565733 30617193 30722896 30783274 30876478 32262776 33263581 32794942 32982772
5032C2982772m26941j41453P1100P92751K2264L81055J85224J743811J375976
$$ 32982772 32555831 32414378 32485478 33278229 33300493 33681548 33866772 35610583 36986559
5023C6986559j181612J64865N3564k26586p14317J60947K62567K106008n39257
$$ 36986559 35804947 35969812 36023376 35796790 35082473 35243420 35505987 37611995 37072738
5014C7072738j319120J220393M50191l98646K83040P72425O68003n30740m13086
$$ 37072738 35753618 36974011 37424202 37025556 37308596 38081021 38749024 38218284 37805198
5005C7805198M59535J460371N53359o65330L29845J213131P24657m46563j27663
$$ 37805198 38264733 39725104 40278463 39613133 39942978 41156109 41880766 41434203 41306540
4996D1306540J818019m14526L07462J644164l28511Q2180J061167J148248N95769
$$ 41306540 43124559 42710033 43017495 44661659 44333148 44415328 45476495 46624743 47220512
4987D7220512M84179L12045P09305N94446j158382K34510J434947P89584L69603
$$ 47220512 47704691 48016736 48726041 49320487 48162105 48396615 49831562 50621146 50990749
4978E0990749J45213J335688K22869Q28407J557109o27k10886L51416J278703
$$ 50990749 51135962 52471650 52694519 53522926 55080035 55079408 54868522 55219938 56498641
4969E6498641J107257m0639j023504j119333N50140l90016p0709K74810J022824
$$ 56498641 57605898 57565259 56541755 55422422 55972562 55582546 55511837 55786647 56809471
4960E6809471R77140k63167K90129O87694n74065R22426K45746q96100K56988
$$ 56809471 57786611 57523444 57813573 58501267 57927202 58849628 59095374 58199274 58456262
4951E8456262o29200J057801P35978o91049N4929J083870p2190m85302j02924
$$ 58456262 57827062 58884863 59620841 58929792 58984721 60068591 59996401 59511099 59408175
4942E9408175L9256J20392J242828N65397L53255M19417J464130J190027K073136
$$ 59408175 59447431 59567823 60810651 61376048 61729303 62148720 63612850 64802877 66876013
4933F6876013j5110K28553J120848K065051N21150J72568J577231J191880K71880
$$ 66876013 66860903 67089456 68210304 70275355 70796505 70969073 72546304 73738184 74010064
4924G4010064L64731K508147K58258j843140k66252O804o59123j279992m81397
$$ 74010064 74374795 76882942 77141200 75298060 75031808 75038612 74379489 73099497 72618100
4915G2618100l76178j077099p81512j599766r82866m99484l98135j914076m72133
$$ 72618100 72241922 71164823 70383311 68783545 67800679 67301195 66903060 64988984 64516851
4906F4516851N7069L6289M66771J043991Q95413N04363o47048N84861o23241n51620
$$ 64516851 64573920 64610209 65076980 66120971 67016384 67520747 66873699 67458560 66835319 66283699
4896F6283699r3414l27109M06755M89137R6895j25163p25093N10915K1550Q25572
$$ 66283699 66190285 65863176 66269931 66759068 66855963 66730800 66005707 66516622 66538172 67363744
4886F7363744O30718J686602k63393R06096J622117J374863J953714K255273J129578
$$ 67363744 67994462 69681064 69417671 70323767 71945884 73320747 75274461 77529734 78659312
4877G8659312J088763J475788K822296L610401K752300L599135K879262L391026
$$ 78659312 79748075 81223863 84046159 87656560 90408860 94007995 96887257 100278283
4869A00278283L836080K266065J976791K373752O12705L53225j261416p14060
$$ 100278283 104114363 106380428 108357219 110730971 111343676 111696901 110435485 109721425
4861A09721425j067691j202724j176678j35673J61376N29775J158043O41338n28535
$$ 109721425 108653734 107451010 106274332 106138659 106300035 106829810 107987853 108629191 108100656
4852A08100656K048689J780274K51623R31382o5878j572881r97835j408957j338543
$$ 108100656 110149345 111929619 112181242 113112624 113046746 111473865 110476030 109067073 107728530
4843A07728530k544755j972669l283089j874629j673755k789639l285263k288442
$$ 107728530 105183775 103211106 99928017 98053388 96379633 93589994 90304731 88016289
4835H8016289k116746j663126k036803k432276j715570j436008j715572k111683
$$ 88016289 85899543 84236417 82199614 79767338 78051768 76615760 74900188 72788505
4827G2788505j560172p92160j506407m58176p308q27413j109741p14161j697854
$$ 72788505 71228333 70436173 68929766 68471590 68464282 67636869 66527128 65812967 64115113
4818F4115113j375305m46107K2585m09853p90739r02656n22051q71822r47392
$$ 64115113 62739808 62293701 62316286 61906433 61115694 60213038 59690987 58819165 57871773
4809E7871773J07642n8975k00980j123378J23208k30633o46537r11101j16668
$$ 57871773 57979415 57920440 57719460 56596082 56719290 56488657 55842120 54931019 54814351
4800E4814351j594507j381000q5257p71128j29781K75246l93144l36912o30100
$$ 54814351 53219844 51838844 51753587 50982459 50852678 51127924 50734780 50397868 49767768
4791D9767768l29591o37935M43581j352745M92813K33174R7159K921l23414j327349
$$ 49767768 49438177 48800242 49243823 47891078 48383891 48617065 48714224 48717145 48393731 47066382
4781D7066382O48826n44307l20704R09k6155P9133n20566J51814k63326q34494
$$ 47066382 47715208 47170901 46850197 46851106 46824951 46904084 46383518 46535332 46272006 45437512
4771D5437512j75820Q86651R6924j002528p43459P49945k69977J37661j045043
$$ 45437512 45261692 46148343 46245267 45242739 44499280 45249225 44979248 45116909 44071866
4762D4071866L93365n08619P6214J160048j30792k71511N30568l68529L02734
$$ 44071866 44465231 43956612 44032826 45192874 45062082 44790571 45321139 44952610 45255344
4753D5255344j3098m30585j74808K71901O05502J003228k2509j816299Q33712
$$ 45255344 45242246 44811661 44636853 44908754 45514256 46517484 46494975 44678676 45512388
4744D5512388J203713o38042q00529O11732J95872q95780J267049J320028j15971
$$ 45512388 46716101 46078059 45277530 45889262 46085134 45189354 46456403 47776431 47660460
4735D7660460k77274R65378J41711J04012j43450j617587L45347L92473K55994
$$ 47660460 47383186 48348564 48490275 48594287 48450837 46833250 47178597 47571070 47827064
4726D7827064m72322J79405p59484M38319J592296J28114j059031L82807R52126
$$ 47827064 47354742 47534147 46774663 47212982 48805278 48933392 47874361 48257168 49209294
4717D9209294J478445J47501L51158P06882M84699J172208q2536o27290k85711
$$ 49209294 50687739 50835240 51186398 51893280 52377979 53550187 53467651 52840361 52554650
4708E2554650J138736j020789N65531J703565k1418Q05839K54602M13225L42440
$$ 52554650 53693386 52672597 53238128 54941693 54920275 55726114 55980716 56393941 56736381
4699E6736381m41950N95139Q51767l71779N75539R26988J069492M95228K18093
$$ 56736381 56294431 56889570 57741337 57369558 57945097 58872085 59941577 60436805 60654898
4690F0654898J156093j45432j75542J202415J469985J210088J841723J088436
$$ 60654898 61810991 61665559 61490017 62692432 64162417 65372505 67214228 68302664
4682F8302664J325119P25454R20031R78564R02666M94094J756607J795674K188221
$$ 68302664 69627783 70353237 71273268 72251832 73154498 73648592 75405199 77200873 79389094
4673G9389094K267003K432605L166292K602045K364103M010637M899414M376754
$$ 79389094 81656097 84088702 87254994 89857039 92221142 96231779 101131193 105507947
4665A05507947N597704M907697M210313M030434J717711j528264j305758j1627
$$ 105507947 111105651 116013348 120223661 124254095 125971806 124443542 123137784 123126157
4657A23126157J295517J312855J085954M456762K589409J283420j1165n44796
$$ 123126157 124421674 125734529 126820483 131277245 133866654 135150074 135138909 134594113
4649A34594113k237975k301778k141568j739765j4591J06548P16124R79159M29098
$$ 134594113 132356138 130054360 127912792 126173027 126158436 126264984 126981108 127960267 128389365
4640A28389365J516841J635496Q47806J873402K435832M134397K928030J840661
$$ 128389365 129906206 131541702 132389508 134262910 136698742 140833139 143761169 145601830
4632A45601830J130896J846550K420794J231824J033140J422536M80331k343898
$$ 145601830 146732726 148579276 151000070 152231894 153265034 154687570 155167901 152824003
4624A52824003k896291k663906l825491k417313l557228l854770m379979m355557
$$ 152824003 149927712 147263806 143438315 141021002 137463774 133609004 129229025 124873468
4616A24873468l243716k939535l188953k956810l274234k250744k124997k743826
$$ 124873468 121629752 118690217 115501264 112544454 109270220 107019476 104894479 102150653
4608A02150653j880118k111879k566081j845432j858029j095877j830246k201943
$$ 102150653 100270535 98158656 95592575 93747143 91889114 90793237 88962991 86761048
4600H6761048r61625j902294R25257q47907j980883j583272k737404l22542j396861
$$ 86761048 85799423 83897129 84822386 83974479 81993596 80410324 77672920 77350378 75953517
4591G5953517J18078j097956k53590r96343j250580P23582q81710j074389p04913
$$ 75953517 76071595 74973639 74720049 73723706 72473126 73196708 72314998 71240609 70535696
4582G0535696p60346q53869J17792j497875m74964Q2699n83658m60203n24673
$$ 70535696 69775350 68921481 69039273 67541398 67066434 67149133 66565475 66105272 65580599
4573F5580599N73347J6993j692648k001724j946651j63259m06035r87168j122730
$$ 65580599 66153946 66170939 64478291 62476567 60529916 60366657 59960622 58973454 57850724
4564E7850724k327370j701225p4725n11920m86112r72698o68108o62682j379803
$$ 57850724 55523354 53822129 53747404 53235484 52749372 51776674 51108566 50445884 49066081
4555D9066081k20592o13148p03603J07006n83111J12007n80119M4505l49120p3380
$$ 49066081 48845489 48232341 47528738 47635744 47052633 47164640 46584521 46629026 46279906 46206526
4545D6206526p76220o00782j215599J69459L57036r25762j185041J77048o37392
$$ 46206526 45430306 44829524 43613925 43783384 44140420 43214658 42029617 42206665 41569273
4536D1569273q48469M43678o06125N17122k24251K63946p23815k31350Q34218
$$ 41569273 40720804 41164482 40558357 41075479 40851228 41115174 40391359 40160009 40994227
4527D0994227q30365k178262l3352m79988j404726J51971J175403o16013J012586
$$ 40994227 40163862 37985600 37952248 37472260 36067534 36219505 37394908 36778895 37791481
4518C7791481k62624n57952j537853j108087p30195q45140J78898P71332O95066
$$ 37791481 37528857 36970905 35433052 34324965 33594770 32749630 32928528 33699860 34394926
4509C4394926o61567P82190J58251j806899n16054l6460O83303o3644j001487
$$ 34394926 33733359 34515549 34673800 32866901 32350847 32314387 32997690 32934046 31932559
4500C1932559k01677p11729n02101J109562J097612p63423l65654r76896N61039
$$ 31932559 31730882 31019153 30517052 31626614 32724226 31960803 31595149 30618253 31179292
4491C1179292R70602j187280L39981J734211n65664l38423Q7160N4751Q7380j091652
$$ 31179292 32149894 30962614 31302595 33036806 32471142 32132719 32219879 32274630 32362010 31270358
4481C1270358l27677K54212J72490j2294M61884Q58280L83694l06304n21081l55743
$$ 31270358 30942681 31196893 31369383 31357089 31818973 32677253 33060947 32754643 32233562 31877819
4471C1877819k87695P16852j72716M09825m7350M08275R85213j154473L79030
$$ 31877819 31590124 32306976 32134260 32544085 32496735 32905010 33890223 32735750 33114780
4462C3114780L82482j057841M18684n54550l80567j309j90783O86762J47784j750962
$$ 33114780 33497262 32439421 32858105 32303555 31922988 31921679 31730896 32417658 32565442 30814480
4452C0814480O20428Q48479k7885m48023o44810J356689O73504l28613k34219
$$ 30814480 31434908 32283387 32255502 31807479 31162669 32519358 33192862 32864249 32630030
4443C2630030m87147L77686P3374j24472N43810M22938L14248r31828m2075L85358
$$ 32630030 32142883 32520569 32593943 32469471 33013281 33436219 33750467 32818639 32776564 33161922
4433C3161922J367708M33609j407246l06117J219452J55050K73846j92618K73880
$$ 33161922 34529630 34963239 33555993 33249876 34469328 34624378 34898224 34705606 34979486
4424C4979486p30210R09536P76626o8017Q04530J133423N11632N77933j82248
$$ 34979486 34249276 35158812 35935438 35867421 36671951 37805374 38317006 38894939 38712691
4415C8712691m10024P31238P05352l7756J38369n90868Q18358J047371L58905
$$ 38712691 38302667 39033905 39739257 39701501 39839870 39249002 40067360 41114731 41473636
4406D1473636J713065R65759K68995L76362M85720p30692L42329q82946k30647
$$ 41473636 43186701 44152460 44421455 44797817 45283537 44552845 44895174 44012228 43781581
4397D3781581m64682k69140K30039P61206j12267o58430N72077N04266j34317
$$ 43781581 43316899 43047759 43277798 44039004 43926737 43268307 43840384 44344650 44210333
4388D4210333L03081R51450K67078j190422O3942M09982J729112J43698K65396
$$ 44210333 44513414 45464864 45731942 44541520 44605462 45015444 46744556 46888254 47153650
4379D7153650o9130J103904Q87428m8395K23894J253757J63939P90127J943249
$$ 47153650 47084520 48188424 49075852 49027457 49251351 50505108 50669047 51459174 53402423
4370E3402423k88837O79951R74932P9340O81987P27403N37964l91814K04454J035257
$$ 53402423 53113586 53793537 54768469 54847809 55529796 56257199 56795163 56403349 56607803 57643060
4360E7643060k212K46455J100355O26845J22256K36308k44461K89061Q5730J127592
$$ 57643060 57640848 57887303 58987658 59614503 59736759 59973067 59728606 60017667 60103397 61230989
4350F1230989Q73825J246485R2833O50730J080775Q76503J650475L51983O95706
$$ 61230989 62104814 63351299 63444132 64094862 65175637 66052140 67702615 68054598 68750304
4341F8750304J810519Q88856J047776P95354J949349R56575J269855K404691J305890
$$ 68750304 70560823 71449679 72497455 73292809 75242158 76198733 77468588 79873279 81179169
4332H1179169j72157j127885m49544m95221j475197j375396j2387o05849q48818
$$ 81179169 81007012 79879127 79429583 78934362 77459165 76083769 76071382 75465533 74616715
4323G4616715K90134m35536O81610J13503P46602R96520J396190K520437K759154
$$ 74616715 74906849 74471313 75152923 75266426 76013028 77009548 78405738 80926175 83685329
4314H3685329L165531K903143K410605p83401m475797n637917m658849k419104
$$ 83685329 86850860 89754003 92164608 91381207 86905410 81267493 76608644 74189540
4306G4189540j990671j429196j038445r36329n54591j151288j083578o1260j276601
$$ 74189540 72198869 70769673 69731228 68794899 68240308 67089020 66005442 65944182 64667581
4297F4667581p48561j300124r95362j026352o18730l61842m1134k95791k46174
$$ 64667581 63919020 62618896 61623534 60597182 59978452 59616610 59575476 59279685 59033511
4288E9033511J61102p74347j26394m15363j612901p36267m20345k35683k62997
$$ 59033511 59194613 58420266 58293872 57878509 56265608 55529341 55108996 54873313 54610316
4279E4610316k18935P0213k42269r45316r94230J70654o84767n75073L04574P17011
$$ 54610316 54391381 54461594 54219325 53274009 52279779 52450433 51765666 51190593 51495167 52212178
4269E2212178q09961m18912k413294n32461P90382L91514Q60197m21965j151337
$$ 52212178 51402217 50983305 48570011 48037550 48827932 49219446 50079643 49657678 48506341
4260D8506341p00164j013568O80158j274892p21761j240517J3953P14177j418001
$$ 48506341 47806177 46792609 47472767 46197875 45476114 44235597 44249550 44963727 43545726
4251D3545726P38933r09533p82689Q24167k71025m14734N09801m65854j105897
$$ 43545726 44284659 43375126 42592437 43416604 43145579 42730845 43240646 42774792 41668895
4242D1668895J36156J9555p37055p45747j240736o97503O15208l4391m39418j51262
$$ 41668895 41805051 41824606 41087551 40341804 39101068 38403565 39018773 38984382 38544964 38393702
4232C8393702L73286R82697j121045j90414P19422p58723j462467n07550R00281
$$ 38393702 38766988 39749685 38628640 38438226 39157648 38398925 36936458 36428908 37329189
4223C7329189k16503n27456m37320r79063l59212J057913m36057m26164o10870
$$ 37329189 37112686 36585230 36147910 35168847 34809635 35867548 35431491 35005327 34394457
4214C4394457o18726J62154n83582k95918l38859p27143n29170l28769N32309
$$ 34394457 33775731 33937885 33354303 33058385 32719526 31992383 31463213 31134444 31666753
4205C1666753l0309r23790L11478M34292j319841j239371M56464j92256k48945
$$ 31666753 31636444 30712654 31024132 31458424 30138583 28899212 29355676 29163420 28914475
4196B8914475M39733o86165M7973k0436p45408R38027k47426p23614j80808j169751
$$ 28914475 29354208 28668043 28716016 28695580 27950172 28888199 28640773 27917159 27736351 26566600
4186B6566600n73926J04815Q08544M47242j604715K56474N21759q90067k37659
$$ 26566600 25992674 26097489 26906033 27353275 25748560 26005034 26526793 25636726 25399067
4177B5399067q07443k6458J91853m69042j10441r21860j64599m61974K99665N75391
$$ 25399067 24591624 24565166 24757019 24287977 24177536 23255676 23091077 22629103 22928768 23504159
4167B3504159N74384M79625j71479p87089n275L93919j97478q45159J77145p1547
$$ 23504159 24078543 24558168 24386689 23599600 23594325 23988244 23790766 22945607 23122752 23051205
4157B3051205n99077m67842j030191J91389J374996n33113o27115r13112m94766
$$ 23051205 22452128 21984286 20954095 21145484 22520480 21987367 21360252 20447140 19952374
4148A9952374K60635k45126j30605l91573J28224P54043O70115j91150o67012
$$ 19952374 20213009 19967883 19837278 19445705 19573929 20327972 20998087 20806937 20139925
4139B0139925l29497j013648p93029n34044N664r46766k76472O27413M91038N86500
$$ 20139925 19810428 18796780 18003751 17469707 17475371 16528605 16252133 16879546 17370584 17957084
4129A7957084r0123r20466o13420k99300j015056O21435l8875L42423q34796M96371
$$ 17957084 17866961 16946495 16333075 16033775 15018719 15640154 15601279 15943702 15108906 15605277
4119A5605277Q60261j447816Q0883M9711j84205o28105n43907J064230l46136
$$ 15605277 16465538 15017722 15098605 15148316 14964111 14336006 13792099 14856329 14510193
4110A4510193N0982N900j24203l36070p0139L13805L46966p04441o75682J24491
$$ 14510193 14561175 14567075 14442872 14106802 14036663 14350468 14697434 13992993 13317311 13441802
4100A3441802m41607j09616n9407q69691L74248m40742N89005p94011M396Q20419
$$ 13441802 13000195 12890579 12831172 11961481 12335729 11894987 12483992 11689981 11694377 12514796
4090A2514796k04702J08019l69376l70315N16636k21232K87268O45666l31532
$$ 12514796 12310094 12418113 12048737 11678422 12195058 11973826 12261094 12906760 12575228
4081A2575228n62531j571794l65346J402582K53022K55924r84344o83936P96114
$$ 12575228 12012697 10440903 10075557 11478139 11731161 11987085 11002741 10318805 11114919
4072A1114919K55588N06769L88739o02067j208450J88531J24787O6435l43604
$$ 11114919 11370507 11877276 12266015 11663948 10455498 10644029 10768816 10835251 10491647
4063A0491647j52242m84608m68991k59033k69914n37410J26133k40587L78594
$$ 10491647 10339405 9854797 9385806 9126773 8856859 8319449 8445582 8204995 8583589
4054H583589J97806l82508k00934m87717o35630K365732P17735l53292p25529
$$ 8583589 8781395 8398887 8197953 7710236 7074606 9440338 10158073 9804781 9079252
4045I079252J489k73405j018290K27386j89225M84650M51180k53562L2666O14174
$$ 9079252 9080741 8807336 7789046 8016432 7827207 8311857 8763037 8509475 8542141 9156315
4035I156315q69245m04235K19430m98868p66458k70940J406199K9217j100467
$$ 9156315 8287070 7882835 8102265 7603397 6836939 6565999 7972198 8001415 6900948
4026F900948L33379L65420r9175o30779M22616N00410J29361m13211k46290m9818
$$ 6900948 7234327 7599747 7500572 6869793 7292409 7792819 7922180 7508969 7262679 7212861
4016G212861l04752J56719p02530p66392k52226M00977J132383P10770j48360
$$ 7212861 6908109 7064828 6362298 5595906 5343680 5744657 6877040 7587810 7439450
4007G439450j6852L42764J1429j510085j029702O82266O32828l80537n76407j281084
$$ 7439450 7422598 7765362 7776791 6266706 5237004 5919270 6552098 6171561 5595154 4314070
3997D314070L6029O45501m84580n15691J77571K96762n48815n1097J489719K50617
$$ 4314070 4350099 4995600 4511020 3995329 4172900 4469662 3920847 3869750 5359469 5610086
3987E610086n633J29845K51771o71749o09914M96543k05956m28620J050011M04637
$$ 5610086 5604453 5734298 5986069 5314320 4704406 5200949 4994993 4566373 5616384 6021021
3977F021021j17979j208177n87820l87405k4295j64488o02800J389926N03693
$$ 6021021 5903042 4694865 4107045 3719640 3695345 3530857 2928057 4317983 4821676
3968D821676L88255k80755n49104r71147r93067O24201L84150P26089j14250o36880
$$ 4821676 5209931 4929176 4380072 3408925 2415858 3040059 3424209 4150298 4036048 3399168
3958C399168l31174L11880J209208p68277O24454M7940J53021n28183n5754O568
$$ 3399168 3067994 3379874 4589082 3820805 4445259 4493199 4646220 4118037 4062283 4068851
3948D068851L6133L60741o25222q12691J32033P21064l05605m59196j30648j90
$$ 4068851 4104984 4465725 3840503 3027812 3159845 3880909 3575304 3116108 2985460 2985270
3938B985270N06326l37577o24510l13388l2464m40470J239640m79156l36452K07561
$$ 2985270 3491596 3154019 2529509 2216121 2183657 1743187 2982827 2503671 2167219 2374780
3928B374780o54401J160700M58600j74408N06992n71178j384530O39967J55621
$$ 2374780 1720379 2881079 3339679 3165271 3672263 3101085 1716555 2356522 2512143
3919B512143l05383R3350J50060K70949p81619J566765n21661r18792N96670r4396
$$ 2512143 2206760 2300110 2450170 2721119 1939500 3506265 2984604 2065812 2662482 2568086
3909B568086J96897q39374P57120N4366n22144K81133l76235M12077J553144j37063
$$ 2568086 2764983 1925609 2682729 2737095 2214951 2496084 2119849 2531926 4085070 3948007
3899C948007j217189o41946r6061j42731o15765M17630J439363m74593o52705
$$ 3948007 2730818 2088872 1992811 1850080 1234315 1651945 3091308 2616715 1964010
3890A964010J48400P61417J213249o50338k69700j92176l7524Q91836n53461R26958
$$ 1964010 2112410 2873827 4087076 3436738 3167038 2974862 2937338 3829174 3275713 4202671
3880D202671K98241q14087j82047p50383K02110o59191j80954J226261q6714L8625
$$ 4202671 4500912 3686825 3504778 2754395 2956505 2297314 2116360 3342621 3255907 3294532
3870C294532M97648j133731m60042N64980L2017L60906l07721j78573N27682j61255
$$ 3294532 3792180 2658449 2198407 2763387 2795404 3156310 2848589 2670016 3197698 3036443
3860C036443N31399N429r35723n86054o67520P26223N39929N4999J81977n71263
$$ 3036443 3567842 3573271 2637548 2051494 1383974 2110197 2650126 2705125 2887102 2315839
3850B315839k47547J128227K32520r34863m76185R639r206J054032m52586m60067
$$ 2315839 2068292 3196519 3429039 2494176 2017991 2027630 2018424 3072456 2619870 2159803
3840B159803K26341m02306k83841p14744j78110R40244M89678K44663p148j33018
$$ 2159803 2386144 1983838 1699997 985253 807143 1747387 2237065 2481728 2474580 2341562
3830B341562M24754r6777m56723k88077L73448Q6465l27409N28200p6203p22605
$$ 2341562 2766316 2669539 2212816 1924739 2298187 2384652 2057243 2585443 2509240 1786635
3820A786635k57804N82228Q74562j005400L40845M49556l10135p33799Q44081
$$ 1786635 1528831 2111059 2985621 1980221 2321066 2770622 2460487 1726688 2570769
3811B570769J464740k4914n28455j429928j364169J48510Q95284L47813Q18736
$$ 2570769 4035509 4010595 3482140 2052212 688043 836553 1731837 2079650 2898386
3802B898386L13759o13910M83648J299004o15582l79893k49414M45386J07870
$$ 2898386 3212145 2598235 3081883 4380887 3765305 3385412 3135998 3581384 3689254
3793C689254L91462n71363o5370m7223N3441J104097N29310l14872k68865n41466
$$ 3689254 4080716 3509353 3443983 3396760 3450201 4554298 5083608 4768736 4499871 3958405
3783C958405N06880M53459j30464r88207K85392p0628j245190P42831n54453L62969
$$ 3958405 4465285 4918744 4788280 3800073 4085465 4014837 2769647 3512478 2958025 3320994
3773C320994J257063J27680L2308j408061K60315N99921k20559L65053l30072
$$ 3320994 4578057 4705737 4738045 3329984 3590299 4190220 3969661 4334714 4004642
3764D004642l98137p40567K43419O12090Q55032l46012o14752K58509O52229l33954
$$ 4004642 3606505 2865938 3109357 3721447 4576479 4230467 3615715 3874224 4526453 4192499
3754D192499j042726J24431M08553K83244j08640p0337N50980j706142L86703
$$ 4192499 3149773 3274204 3682757 3966001 3857361 3787024 4338004 2631862 3018565
3745C018565J667315Q68831L93188j255783j50473J39445q29217R64795L81695
$$ 3018565 4685880 5554711 5947899 4692116 4541643 4681088 3851871 4816666 5198361
3736E198361l79522R3328m47732P70894j00796p20861R11694j92593j475625N00608
$$ 5198361 4818839 4912167 4464435 5235329 5134533 4413672 5325366 5132773 3657148 4157756
3726D157756J052319k76505l60601j401428J059615N20895n6184N08157j79087
$$ 4157756 5210075 4933570 4572969 3171541 4231156 4752051 4695867 5204024 5024937
3717E024937m94806J73257k91081Q08740K05110j314353N16499P36439m06813
$$ 5024937 4530131 4703388 4412307 5221047 5426157 4111804 4628303 5364742 4957929
3708D957929p89287o3671J71885J694046J341335j357784j679887R0163Q51642
$$ 4957929 4168642 4104971 4276856 5970902 7312237 5954453 4274566 4364729 5216371
3699E216371r41062M20415P38888p01092p28129R25062O17186j997264k20890
$$ 5216371 4275309 4695724 5434612 4733520 4005391 4930453 5547639 3550375 3329485
3690C329485o89443L4118Q20676L96042j38086N79318O14454j55743p20019m37975
$$ 3329485 2640042 2674160 3494836 3890878 3752792 4332110 4946564 4790821 4070802 3632827
3680C632827M39871L19014O74953L80137p06249O095q6611p37689q57675Q3304
$$ 3632827 4072698 4391712 5066665 5446802 4740553 4746648 4660037 3922348 3064673 3147977
3670C147977J79453N03316o85508P7459J195723P09066p8172M39077q89159j332830
$$ 3147977 3327430 3830746 3145238 3222697 4418420 5127486 5049314 5488391 4599232 3266402
3660C266402P70189j081750P33443j40192O09972j130637r97373J118615m69108
$$ 3266402 4036591 2954841 3688284 3548092 4158064 3027427 2030054 3148669 2679561
3651B679561L9979O32455R79775M21355j159886P67972Q66850j06422r48185m82852
$$ 2679561 2719540 3351995 4331770 4753125 3593239 4361211 5228061 5121639 4173454 3690602
3641C690602m48641J22642O11589J33238P28508M6159L75056m69581m28191p00179
$$ 3690602 3241961 3364603 3976192 4109430 4837938 4884097 5259153 4789572 4361381 3661202
3631C661202o43250L57944o9185m07916R7528o3588j52975M79141J89235J003434
$$ 3661202 3017952 3375896 3306711 2898795 2996323 2932735 2779760 3258901 3448136 4451570
3621D451570R97444o5310m19498l58763P02006j1996J41487J58572L72935J92979
$$ 4451570 5449014 5383704 4964206 4605443 5307449 5295453 5436940 5595512 5968447 6161426
3611F161426j327022J4050M70098J7104P86275j86135J25543l39109n00442n74942
$$ 6161426 4834404 4848454 5318552 5335656 6121931 5935796 6061339 5722230 5221788 4646846
3601D646846L74545K73871R9822O51282o52592L86387k1924J05957Q36918O4411
$$ 4646846 5021391 5295262 5395084 6046366 5393774 5780161 5758237 5864194 6701112 6765523
3591F765523J23603n40540N58644M27240m91641r39708P57844j91343K15752n53938
$$ 6765523 6889126 6348586 6907230 7334470 6842829 5903121 6660965 6469622 6685374 6131436
3581F131436k59033l76637K71650O26384J89107m23692M15123N68682P59998j84152
$$ 6131436 5872403 5495766 5767416 6393800 6582907 6159215 6574338 7143020 7903018 7718866
3571G718866o55128K64551K86678N43952N67863j229111o01892K71876J017391
$$ 7718866 7063738 7328289 7614967 8158919 8726782 7497671 6895779 7167655 8185046
3562H185046J189437l13121j194863q30189J107712l98072r0158N68419K38712
$$ 8185046 9374483 9061362 7866499 7036310 8144022 7745950 7655792 8224211 8462923
3553H462923M04192l75112j292443Q60366K03091K38594N73334N0463k85561K01081
$$ 8462923 8867115 8492003 7199560 8059926 8263017 8501611 9074945 9125408 8839847 9040928
3543I040928m98356P40924m56633q16695K91734r7543j23559Q1071l00441P17922
$$ 9040928 8542572 9283496 8826863 8010168 8301902 8204359 8080800 8161871 7861430 8579352
3533H579352P36591j178853N23289P23374o58686O00845M6698J34678j7643N84948
$$ 8579352 9315943 8137090 8660379 9383753 8725067 9325912 9372610 9507288 9489645 10074593
3523A0074593K34562K18166L79717M85496k80801j274237l38867j1072J45954
$$ 10074593 10309155 10527321 10907038 11392534 11111733 9837496 9498629 9487557 9633511
3514I633511N8728K11951m53711j50082Q75369j60922J59672N1025J04892N09423
$$ 9633511 9692239 9904190 9450479 9300397 10175766 10014844 10174516 10225541 10330433 10839856
3504A0839856N07291Q70293p85196n1572K3646o30106M12487J72043P73656o61962
$$ 10839856 11347147 12217440 11432244 11380672 11404318 10774212 11186699 11358742 12132398 11470436
3494A1470436l99094M46804M76275J420819R98276M89442O0566L12271l41997
$$ 11470436 11071342 11518146 11994421 13415240 14413516 14902958 14963524 15275795 14933798
3485A4933798M86778R59628K12141j38468M08764N10723J32858K026847J464947
$$ 14933798 15420576 16380204 16592345 16453877 16862641 17373364 17506222 19533069 20998016
3476B0998016J91294L27474N55910o19231m44411O32700J043699j678604j170255
$$ 20998016 21189310 21516784 22072694 21453463 21009052 21641752 22685451 21006847 19836592
3467A9836592J26610P50519P2335l05170n79465N89853N7886P2303n12l98755
$$ 19836592 19963202 20713721 20786056 20480886 19901421 20491274 20549160 20621463 20620951 20222196
3457B0222196r49421j188587R60779j136294j159959J3380k149095j734257M55147
$$ 20222196 19272775 18084188 19044967 17908673 16748714 16762094 14612999 12878742 13333889
3448A3333889j621678L76183m79858p60629q09728l94984l5555m93177p66118
$$ 13333889 11712211 12088394 11608536 10847907 10038179 9643195 9607640 9114463 8348345
3439H348345R7675l37697K63116p37610K63288j382066m35473L4967l99091O83763
$$ 8348345 8446020 8108323 8371439 7633829 7897117 6515051 6079578 6114545 5715454 6399217
3429F399217m55093K03946p30868j57785k7563l29067j350137o21134J804530
$$ 6399217 5944124 6148070 5417202 5259417 5231854 4902787 3552650 2931516 4736046
3420D736046M30271L66318j028007r09183M28060P98587k30508r16852P52839
$$ 4736046 5166317 5532635 4504628 3595445 4023505 4822092 4591584 3674732 4427571
3411D427571L1487q31442r03804J067986L68742n48796K82808J61884p96324p08944
$$ 4427571 4459058 3627616 2723812 3791798 4160540 3611744 3894552 4056436 3260112 2551168
3401B551168R66251q10686l59846K06755M95387R58517n82731M34893j848772
$$ 2551168 3517419 2706733 2346887 2553642 3049029 4007546 3424815 3859708 2010936
3392B010936o48279o76206Q07714R89606L72919M91701p30627P1259p25451J93849
$$ 2010936 1362657 686451 1494165 2483771 2856690 3348391 2617764 2689023 1963572 2157421
3382B157421R6574J09839M61476l70306p18214J63146m03665n07441J868809P50422
$$ 2157421 2253995 2363834 2825310 2455004 1736790 1899936 1496271 988830 2857639 3608061
3372C608061l06107p32114p12804j42335L58077k47059J756219l16680p4059L12151
$$ 3608061 3301954 2569840 1857036 1714701 2072778 1825719 3581938 3265258 3191199 3503350
3362C503350n26107L59484j897655j138222l93155k26799J59596P49760k28477
$$ 3503350 2977243 3336727 1439072 300850 -92305 -319104 -159508 590252 361775
3353C61775N01885l43185O90479R58860r86388P48303o55603j233418M93941n2427
$$ 361775 863660 520475 1210954 2169814 1183426 1931729 1276126 42708 536649 484222
3343D84222l86778l48956N70453j59323M79053K26397n58191M21291L54388R74510
$$ 484222 97444 -251512 318941 159618 638671 865068 306877 728168 1082556 2057066
3333B057066p31331m90910Q6196l2960R27301m40837R39113M0802m28567j106432
$$ 2057066 1325735 834825 921021 888061 1815362 1374525 2313638 2354440 1925873 819441
3323H19441k57504R4658k66271L91082M59993J7569j02482P618P060J321745q21021
$$ 819441 561937 656595 390324 781406 1241399 1258968 1156486 1164104 1171164 2492909 1671888
3312A671888j217019O60548k90337N25636O7836o4212J061466q45864j151375
$$ 1671888 454869 1115417 825080 1350716 1418552 1354340 2415806 1569942 418567
3303D18567R27364m4450j4055R20670q2376P73174r08957j50646N53310j232722
$$ 418567 1345931 1301481 1287426 2208096 2125720 2898894 1989937 1839291 2392601 1159879
3293A159879k73361L72617L91784M0516r20469O68798P5344K90380J36990j072447
$$ 1159879 886518 1259135 1650919 1691435 770966 1439764 1515108 1805488 1942478 870031
3283H70031q17604K03807J605691r29787j437416J173325K19226M47051L392q34248
$$ 870031 52427 256234 1861925 932138 -505278 668047 887273 1334324 1337716 503468
3273E03468J4305K296471J24986j280105Q87713r21886m65484m60097J146283
$$ 503468 517773 2814244 2939230 1659125 2546838 1624952 1159468 699371 1845654
3264A845654O34095r49708L1484n71989J264004q47267O52712R9792K72338j63339
$$ 1845654 2479749 1530041 1561525 989536 2253540 1406273 2058985 2158777 2431115 2267776
3254B267776j73756J528088q7876p57094j659065j042170L66552N66016M42976
$$ 2267776 2094020 3622108 3534232 2777138 1118073 75903 442455 1008471 1451447
3245A451447K28903J37932Q75170m85890n97162M22838n31680R3384L38423L52085
$$ 1451447 1680350 1818282 2693452 2207562 1610400 2033238 1501558 1594942 1933365 2285450
3235B285450J256194J21656J02516l99162j804684K02295J264301J60438N78704
$$ 2285450 3541644 3663300 3765816 3366654 1561970 1764265 3028566 3189004 3767708
3226C767708o58787M17228l13602q30741j59837L99222J23995j24619M77813J32071
$$ 3767708 3108921 3526149 3212547 2381806 2221969 2621191 2745186 2620567 3098380 3230451
3216C230451Q02028k59297J64395j04033j000151J148592p13572N82744R68322
$$ 3230451 4032479 3773182 3937577 3833544 2833393 3981985 3268413 3851157 4819479
3207D819479l60389m24282M12898J32038O10447n02402p96455Q03945M88537m1684
$$ 4819479 4459090 4034808 4447706 4579744 5190191 4687789 3891334 4695279 5183816 5142132
3197E142132q92005Q21270P31083o21255n9370N46190L07461M84129N87928o46143
$$ 5142132 4250127 5071397 5802480 5181225 5121855 5668045 5975506 6459635 7047563 6401420
3187F401420J422m04057J32035J113180N49421N98124k119041l0813M06226O70046
$$ 6401420 6402842 5998785 6130820 7244000 7793421 8391545 6272504 6241691 6647917 7317963
3177G317963R05524O21353j114862L4281P32288R4622L75944L29839J39593M76183
$$ 7317963 8223487 8844840 7729978 7764259 8496547 8591169 8967113 9296952 9436545 9912728
3167I912728o18417Q99079q36399l24226J223646n06322k79999N39579J212772
$$ 9912728 9294311 10193390 9356991 9032765 10256411 9750089 9470090 10009669 11222441
3158A1222441k56796Q09419j093141J025816m29852R51197n42160l29594O03872
$$ 11222441 10965645 11775064 10681923 11707739 11277887 12229084 11686924 11357330 11961202
3149A1961202L28006J2795o74603K27323P02467l56777L09423J99557n66542j78553
$$ 11961202 12289208 12302003 11627400 11854723 12557190 12200413 12509836 12709393 12142851 11964298
3139A1964298k43788l44795m91409M87169Q42147Q04566j97850L49115J76859
$$ 11964298 11720510 11375715 10884306 11371475 12213622 13018188 12820338 13169453 13346312
3130A3346312r28691k64230m79511k07356p3294J22750K31378j97741q21758m05604
$$ 13346312 12417621 12153391 11673880 11466524 11393230 11515980 11747358 11549617 10727859 10322255
3120A0322255m0075J55692j95053k31603J115681j255817j57340P17487q29533
$$ 10322255 10282180 10437872 10242819 10011216 11126897 9871080 9713740 10431227 9601694
3111I601694j054131O10410Q6677l03556o10787k9184J94492K93382j69932l7410
$$ 9601694 8547563 9157973 9244650 8941094 8330307 8301123 8495615 8788997 8619065 8581655
3101H581655q87377J365670j77354k27218j547217r17140K48715o95235M11800
$$ 8581655 7694278 9059948 8882594 8655376 7108159 6191019 6439734 5744499 6156299
3092F156299N06208J46147L0899r86751p639o2634r21677j82788M39748J038613
$$ 6156299 6662507 6808654 6839553 5852802 5845163 5782529 4860852 4678064 5117812 6156425
3082F156425n78218r12404m77773l57239K12679p87580k95452L27245n21989k89043
$$ 6156425 5578207 4665803 4188030 3830791 4043470 3255890 2960438 3287683 2765694 2476651
3072B476651K82807K47035q7604Q28374m58074O57930j107405j170850o073J349585
$$ 2476651 2759458 3006493 2918889 3747263 3289189 3947119 2839714 1668864 1662791 3012376
3062C012376j309535j042036J532596l80987k85860K43999N5371j82845k67810
$$ 3012376 1702841 660805 2193401 1812414 1526554 1770553 1825924 1643079 1375269
3053A375269J06984p23954J147551J0906L92178k09310L90726l66139l66417q98101
$$ 1375269 1482253 758299 1905850 1916756 2308934 2099624 2490350 2124211 1757794 859693
3043H59693k34942J370083m62608j742124j64836N4536K23436J053361L10826
$$ 859693 624751 1994834 1532226 -209898 -374734 -320198 -96762 956599 1267425
3034A267425J43632M24832m14528j50509k43736L26409k07642j465995J020633
$$ 1267425 1411057 1835889 1421361 1270852 1027116 1353525 1145883 -320112 700521
3025G00521l14413M55300k00848m85343p35774Q87372J155973L00376j256590
$$ 700521 386108 841408 640560 155217 -580557 306815 1462788 1763164 506574
3016E06574l59775o43004N01829J48155O36324N38156j181348o81002L66718Q26181
$$ 506574 146799 -496205 5624 153779 790103 1328259 146911 -534091 -167373 658808
3006F58808Q1461p04518M84232l8809k55333J217311J064139k39834n73252n35914
$$ 658808 740269 35751 519983 481174 225841 1443152 2507291 2267457 1694205 1158291
2996A158291r05715q83390K20323Q11266M64093k58680R00628j259203l04102
$$ 1158291 252576 -630814 -410491 400775 864868 606188 1506816 247613 -56489
2987e6489L94502R53691p38362p22402O49161m38742Q96727q9654r720J46136
$$ -56489 338013 1291704 553342 -169060 480101 41359 938086 848432 838712 984848
2977I84848r38336o70172K34460M05467m05953J95170J19785r54096J144905p42446
$$ 984848 46512 -623660 -389200 16267 -389686 -194516 -74731 -1028827 116078 -626368
2967f26368k38480L74955J79587o0179l0091k15015J540128m70526J13454n49054
$$ -626368 -864848 -489893 -310306 -370485 -400576 -615591 924537 454011 567465 18411
2957A8411n43821k79823k12169K76378M36733q93505n27451n46675J085549Q20831
$$ 18411 -525410 -805233 -1017402 -741024 -304291 -1197796 -1725247 -2271922 -1186373 -365542
2947c65542O00840m75799j554698J646093J303762j192573k79009M9768K45673
$$ -365542 235298 -240501 -1795199 -149106 1154656 -37917 -316926 -267158 -21485
2938b1485P92842j676586O15505l82211l30485l85398O86547J76193L18114L32001
$$ -21485 771357 -905229 -289724 -671935 -1002420 -1387818 -701271 -525078 -206964 125037
2928A25037l60894N5628o76324r28392L32442L24355q24950J111945P62185q2271
$$ 125037 -235857 -180229 -856553 -1784945 -1452503 -1128148 -1953098 -841153 -78968 -161239
2918a61239l43709j79645K94294p90215O04373M33066o61457N93n13542M15527
$$ -161239 -504948 -684593 -390299 -1180514 -576141 -143075 -804532 -803939 -1317481 -901954
2908i01954j51972Q85901l06405j6103K58157N1950N0416l56589p06591p01973
$$ -901954 -1053926 -168025 -474430 -490533 -232376 -180426 -130010 -486599 -1193190 -1895163
2898a895163j12689Q10824Q92199m26409N41362j016845O00544o34671M7366J39786
$$ -1895163 -2007852 -1197028 -304829 -731238 -189876 -1206721 -606177 -1240848 -1193482 -1053696
2888a053696M07502N15100q36144n46059J84411j17634k6844P26361P17321j42903
$$ -1053696 -646194 -131094 -967238 -1513297 -1328886 -1446520 -1473364 -747003 -29682 -172585
2878a72585k54859Q25892p08851K41053n55010n54453k97784Q14926L87058L6645
$$ -172585 -427444 398448 -310403 -69350 -624360 -1178813 -1476597 -661671 -274613 -237968
2868b37968j173319q96362J004772P96065o2588O30304O93026j345134m42590
$$ -237968 -1411287 -2307649 -1302877 -506812 -569400 60904 753930 -591204 -1033794
2859a033794J279443L1490O65684O190q50466N2443N79362l84683l40738k84259
$$ -1033794 245649 277139 942823 949013 98547 150990 730352 345669 4931 -279328
2849b79328R7407R46081J07138O23104j771387j474512o43598J151309m38236
$$ -279328 -181921 764160 871298 1494402 -276985 -1751497 -2395095 -1243786 -1682022
2840a682022L16982N39549M79306J96434r8345j022650j2782O64701M90612J65993
$$ -1682022 -1365040 -825491 -346185 -149751 -248096 -1270746 -1283528 -618827 -128215 37778
2830C7778M90371L67245j280796N08297L41772j476029o19801L51673L28919K81380
$$ 37778 528149 895394 -385402 122895 464667 -1011362 -1631163 -1279490 -950571 -669191
2820f69191k31779q63460M07417O73184Q91297r65461q52534J274592k91657R86348
$$ -669191 -900970 -1764430 -1357013 -683829 207468 -757993 -1610527 -335935 -627592 358756
2810C58756K80152q40413L20470j10886K80496l10134p1876q83116o40228Q83537
$$ 358756 638908 -201505 118965 8079 288575 -21559 -93435 -976551 -1616779 -733242
2800g33242l85683P88800o13193R38202j044531m45856N94019l48331o9848M03423
$$ -733242 -1118925 -330125 -943318 -5116 -1049647 -1495503 -901484 -1249815 -1319663 -916240
2790i16240k27872m28178J383478R49791J9045j329101n91468l56629M72518Q93350
$$ -916240 -1144112 -1572290 -188812 760979 780024 -549077 -1140545 -1497174 -1024656 -131306
2780a31306r77730q12622M47097J155469L00374q76949J227219P52648j046304
$$ -131306 -1109036 -1921658 -1474561 -319092 -18718 -895667 331552 1084200 37896
2771C7896m37245J25569M85j3860J082572j112089l46060l68938R1625q28846
$$ 37896 -399349 -273780 -273295 -287155 795417 -316672 -662732 -1031670 -940045 -1768891
2761a768891J132558J385441n14025m06031o8308k04757l07981R31822k43924
$$ -1768891 -636333 749108 235083 -170948 -239256 -444013 -751994 179828 -64096
2752f4096k0517Q26880m74347k076036Q91355K51769J187023O9901l88196p45572
$$ -64096 -84613 742267 267920 -1808116 -916761 -664992 522031 591932 203736 -541836
2742e41836R1848J143046L77240l95822j903m43603k51764M13668k57199l80651
$$ -541836 -449988 693058 1070298 674476 672573 228970 -22794 390874 133675 -246976
2732b46976L30412M24753l60435K14743j13853M58704q44125j277450n5682M76934
$$ -246976 83436 508189 147754 362497 248644 707348 -136777 -1414227 -1469909 -992975
2722i92975J0220J49324J65056M12338j95494p20903J65368o69497P72456J021027
$$ -992975 -982755 -833431 -668375 -256037 -451531 -1172434 -1007066 -1676563 -904107 116920
2712A16920q04766P00698L77014J55940M33862p11580k49776j084217o34948K7908
$$ 116920 -687846 12852 389866 545806 979668 268088 18312 -1065905 -1700853 -1672945
2702a672945P61748P15920j52353N03363j503425L1874M59097J021519n11963
$$ -1672945 -911197 -195277 -347630 155733 -1347692 -1315818 -856721 164798 -347165
2693c47165L44873o84633j86194M70354l28861k92981n18325L47616Q90801L28402
$$ -347165 -2292 -686925 -873119 -402765 -731626 -1024607 -1542932 -1195316 -304515 23887
2683B3887m20645j240992J83374m2822P35075P30095k14085l08065m60967N13071
$$ 23887 -396758 -1637750 -1454376 -1497198 -762123 -32028 -246113 -554178 -1015145 -502074
2673e02074k55840l40755m0551P19709j69603m9319l80277j59843J38465J487704
$$ -502074 -757914 -1098669 -1139220 -419511 -589114 -638433 -1018710 -1178553 -1040088 447616
2663D47616j011180k13256Q29017o89055o20445J108115l5856k51605J19451P0722
$$ 447616 -563564 -776820 52197 -636858 -1257303 -149188 -185044 -436649 -317198 -246476
2653b46476j196449O00557J18123K80504p86360R72435j9143o72749J12208R01949
$$ -246476 -1442925 -842368 -724245 -443741 -1230101 -257666 -276809 -949558 -837350 64599
2643F4599M26286j53663J23284L49508p84265l86167O42091j56447k21522J78304
$$ 64599 490885 337222 460506 810014 25749 -360418 281673 125226 -96296 82008
2633H2008k16766L21231N06954m34251N4187n56231J061585N36074K95395j283595
$$ 82008 -134758 186473 693427 259176 313363 -242868 818717 1354791 1650186 366591
2623C66591M5891k46647o72186J025479J304286K24645o28421n36166m07737J08207
$$ 366591 412482 165835 -506351 519128 1823414 2048059 1419638 883472 475735 583942
2613E83942k93510l88902J699321r89301O32060O66882J94499m09453Q11016m28420
$$ 583942 290432 -98470 1600851 611550 1243610 1910492 2104991 1695538 2506554 2078134
2603B078134j052370P69517Q4489o22372K490j038774j55376o74344J267294Q62824
$$ 2078134 1025764 1795281 1879770 1257398 1259888 221114 65738 -608606 658688 1521512
2593A521512n37438P16095k06601m13498k24992n99832j9026L02009k41199q4084
$$ 1521512 984074 1700169 1493568 1080070 855078 255246 236220 538229 297030 212946
2583B12946J15789n89983M61577O99960m19170n23910L26393J12955r45047J39229
$$ 212946 328735 -261248 200329 900289 481119 -42791 283602 396557 -548490 -409261
2573d09261o71069J327760P02267n03090j66004J764881o54538k05820r12921
$$ -409261 -1080330 247430 949697 446607 280603 2045484 1390946 1185126 272205
2564B72205p95982J162108M42273k59792l5201M33666l71216l17848L25636M6984
$$ 272205 -523777 638331 1080604 820812 785611 1219277 848061 530213 855849 902833
2554I02833M45773l22223O56551R5068j900995n32385K10210J671675j91429P81713
$$ 902833 1348606 1026383 1682934 1778002 -122993 -655378 -445168 1226507 1035078 1816791
2544A816791M6856o88992M95910j237233j14468M18139P94242n2367Q46191l4903
$$ 1816791 1863647 1174655 1670565 433332 318864 737003 1531245 1478878 2325069 2290166
2534B290166j374170j359857Q41009R61445n81174m50628L53132j94059k29822
$$ 2290166 915996 -443861 397148 1358593 777419 326791 679923 485864 256042
2525B56042J005079m37368r1109k57386m28112K47298M3240n52925Q70211J66028
$$ 256042 1261121 823753 732644 475258 47146 294444 337684 -215241 654970 820998
2515H20998q16924R97383O11818K66417k8530m7487k11836p53092J93284J380812
$$ 820998 4074 1001457 1613275 1879692 1851162 1803675 1591839 838747 1032031 2412843
2505B412843K05327j217742j358046R06740J11887o17463J291952L84489K37829
$$ 2412843 2618170 1400428 42382 949122 1061009 443546 1735498 2119987 2357816
2496B357816q00171O68456M31744J05722j030303l23953Q57443r95950p94186
$$ 2357816 1557645 2226101 2657845 2763567 1733264 1409311 2266754 1270804 476618
2487D76618K98698J279649n04189K72389O61921r98383m00692Q78360L79736o59668
$$ 476618 775316 2054965 1550776 1823165 2485086 1486703 1086011 1964371 2344107 1684439
2477A684439k21787k38239k42747J02469R78536q35747M50082L21769N4966P7304
$$ 1684439 1462652 1224413 981666 1084135 2062671 1226924 1677006 1998775 2053741 2131045
2467B131045O80012O94009r87016r14446O5750M64652J0409L08049M00326m36447
$$ 2131045 2811057 3505066 2518050 1603604 1669354 2134006 2144415 2452464 2852790 2416343
2457B416343j273102N35277J091618o3053J83008P43659p93776j199022k0437
$$ 2416343 1143241 1678518 2770136 2707083 2890091 3633750 2839974 1640952 1620515
2448A620515Q90584L25504m1108K97474l28021J729740J024058j325357n80681
$$ 1620515 2511099 2836603 2795495 3092969 2764948 4494688 5518746 4193389 3612708
2439C612708o31916J262191k97801j069445l67489j46685M0124M58126M3833L9611
$$ 3612708 2980792 4242983 3945182 2875737 2508248 2361563 2401687 2859813 2903646 2943257
2429B943257J910568L45699n25344L75725m99299L16545l10610o83499O05410
$$ 2943257 4853825 5199524 4674180 5049905 4550606 4867151 4556541 3873042 4478452
2420D478452Q28130l76379P02471M8920m82340R91806M69052r1668j98352N81954
$$ 4478452 5306582 4930203 5632674 5681594 5199254 6191060 6660112 6568444 6370092 6952046
2410F952046Q52983L49107J413095l91528j366054K07421m95956m4539J981900
$$ 6952046 7805029 8154136 9567231 9175703 7809649 8017070 7521114 7476575 9458475
2401I458475J175668J28181Q60630j603325j012027J584438J046415l44250Q40738
$$ 9458475 10634143 10762324 11622954 10019629 9007602 10592040 11638455 11294205 12134943
2392A2134943O33215P13031l07530k05084P84471J113489J29564J088593K393165
$$ 12134943 12768158 13481189 13173659 12968575 13753046 14866535 14996099 16084692 18477857
2383A8477857J491636R4074J734595K025229J653300M90836o2293N82187l12665
$$ 18477857 19969493 20063567 21798162 23823391 25476691 25967527 25905234 26487421 26174756
2374B6174756O31351Q9976O70021k15519K2821R75326J589161J667464J974789
$$ 26174756 26806107 26896083 27566104 27350585 27373406 28348732 29937893 31605357 33580146
2365C3580146J982604J714141K711503R01667J655811L913976L283132L073494
$$ 33580146 35562750 37276891 39988394 40890061 42545872 46459848 49742980 52816474
2357E2816474M256564O002336N294053O046077P688606R437102O630069P183559
$$ 52816474 57073038 63075374 68369427 74415504 82104110 91541212 98171281 105354840
2349A05354840R129434J0779252J2276133J3982485J6146646K1353870K5033008
$$ 105354840 114484274 125263526 137539659 151522144 167668790 189022660 214055668
2342B14055668K8969311L7237867M5312170O3024588P2654634L9362444j6105875
$$ 214055668 243024979 280262846 325575016 388599604 461254238 500616682 484510807
2335D84510807o4465711q9624347o8647527m4618149l2205278k5474250k0077111
$$ 484510807 420045096 330420749 261773222 217155073 184949795 159475545 139398434
2328A39398434j6777230j1898768q897038p913787n129007m843679m442039n972856
$$ 139398434 122621204 110722436 101825398 93911611 88782604 83938925 79496886 73524030
2320G3524030o058640o054975n734322l836499m698799l117806k566050k721079
$$ 73524030 67465390 61410415 55676093 51839594 47140795 44022989 41456939 38735860
2312C8735860j760449j056409j951677j579129j524814k170419r23861k523788
$$ 38735860 36975411 35919002 33967325 32388196 30863382 28692963 27769102 25245314
2304B5245314m58820j089036j117677l44806q91522r47305j811945j630783p63952
$$ 25245314 24786494 23697458 22579781 22234975 21343453 20396148 18584203 16953420 16189468
2295A6189468l67682J00098q46559m17915K07373j4396j439898O5962k2079r36879
$$ 16189468 15821786 15921884 15075325 14657410 14864783 14850387 13410489 13476451 13454372 12517493
2285A2517493J9170j291943q39910K30299O14015l21047j960886l92856O99232
$$ 12517493 12536663 11244720 10404810 10635109 11249124 10928077 8967191 8574335 9273567
2276I273567k83044k80456J242672r82612m92536q19130j075317J35170p68050
$$ 9273567 8990523 8710067 9952739 8970127 8477591 7658461 6583144 6718314 5950264
2267E950264j8320P8734N93890O12667j130362q3820M85372n54328j62755j67002
$$ 5950264 5931944 6010678 6604568 7217235 6086873 6003053 6488425 5934097 5771342 5604340
2257E604340r82675j25905P02952O61649L8962j4867j486862m93535O90049o66950
$$ 5604340 4621665 4495760 5198712 5860361 5899323 5884456 4397594 3904059 4594108 3927158
2247C927158o67713K47909J13000o8407m78406K43144K04789k29126K63828m38876
$$ 3927158 3259445 3507354 3620354 3551947 3073541 3316685 3521474 3292348 3556176 3117300
2237C117300j97508J48830l34053N27085M48389Q1754k82907r95114o11684l62752
$$ 3117300 2919792 3068622 2734569 3261654 3710043 3791797 3508890 2513776 1902092 1539340
2227A539340Q15604J644655J53441p51355k54427k38720M38093l66830R4041q83853
$$ 1539340 2354944 3999599 4153040 3401685 3147258 2908538 3346631 2979801 3073842 2189989
2217B189989O39483J590973j191335l39454m77431m54229k3513P6711P54334L20047
$$ 2189989 2829472 4420445 3229110 2889656 2412225 1957996 1934483 2011194 2765528 3085575
2207C085575r47813k54877m93174P5501j75635m26154M20726p762K21357P6267
$$ 3085575 2137762 1882885 1389711 1465212 1289577 863423 1284149 1276387 1497744 1574011
2197A574011J66293N39306J587870j528380j217999o4866M867K67667L56035l52896
$$ 1574011 1740304 2279610 3867480 2339100 1121101 1056235 1061102 1328769 1684804 1331908
2187A331908K83488m63050P60470n8479q31585K20288o4537o80814M84627o20649
$$ 1331908 1615396 1152346 1912816 1854337 1022752 1243040 1178503 497689 982316 361667
2177C61667N55222N72479K5307Q1795P4378J45863r5058p74561m54630J25899
$$ 361667 916889 1489368 1514675 1596470 1670848 1816711 1721653 947092 492462 618361
2167F18361J088076j198999k82731l45571o9062M8102R1078J337332j54379n33606
$$ 618361 1706437 507438 224707 -120864 -189926 -141824 -50746 1286586 1132207 598601
2157E98601M11348k46454j168698L66617l0897L41536k76396j49514J191999n20353
$$ 598601 1009949 763495 -405203 -38586 -69483 272053 -4343 -153857 1038142 517789
2147E17789j726822L57259p32009P99241j84333K56775j98905K04455J1911K14467
$$ 517789 -1209033 -851774 -1583783 -784542 -968875 -712100 -911005 -706550 -694639 -480172
2137d80172K81961n029k31652q82324J91009Q71655J77954J56237j65922M30589
$$ -480172 -198211 -203240 -434892 -1317216 -1126207 -254552 -76598 79639 -86283 344306
2127C44306n12580j072458O67924J404734j070803L60645J35524l74063o05080
$$ 344306 -168274 -1240732 -572808 831926 -238877 121768 257292 -116771 -721851
2118g21851N2247N30326q18824M56117M48205J95798m94112n1957P06892q69440
$$ -721851 -669604 -139278 -958102 -501985 -53780 142018 -352094 -404051 302841 -566599
2108e66599Q2517j86662M14157K56776j077453N8377J056044j35204k45344j32664
$$ -566599 -484082 -670744 -256587 189 -1077264 -1018887 37157 -98047 -343391 -476055
2098d76055J85112N19550p77877r03280N6910J02048p00025Q28583O38242J28644
$$ -476055 -290943 228607 -549270 -1452550 -1395640 -1293592 -1993617 -1165034 -526792 -398148
2088c98148j49600K90850M56533n66915N7818Q6147l88708L58704l34394k14729
$$ -398148 -547748 -256898 199635 -367280 -309462 -223315 -612023 -253319 -587713 -802442
2078h02442P85507N59191K94702R02686K26905n48003j29234L25002J63589j37073
$$ -802442 -16935 542256 836958 1739644 1966549 1418546 1289312 1614314 1777903 1640830
2068A640830J00014m98168J88004o53406m66473J170306o72793J64531n5246j31530
$$ 1640830 1740844 1242676 1430680 777274 310801 1481107 808314 972845 917599 786069
2058G86069o4274j77550M30591K73563M19181j153436j115499L05702M15197K83049
$$ 786069 721795 544245 974836 1248399 1667580 514144 -601355 -295653 119544 402593
2048D02593j578609K69566K88231k72312J120340J22745N22664j09687j211580
$$ 402593 -1176016 -906450 -618219 -890531 229809 352554 875218 765531 -446049
2039d46049n36047n04282J45823O74079K38813P39758O07371k09546j175524p79416
$$ -446049 -982096 -1486378 -1340555 -666476 -427663 312095 919466 709920 -465604 -1245020
2029a245020J459092k25297L7757p21340m93171N58281l01003M5102n24354K54778
$$ -1245020 214072 -11225 26532 -694808 -1187979 -629698 -930701 -885599 -1409953 -1155175
2019a155175P73517O51914m46786j744828N49928N41482j5269q6729O82004p85890
$$ -1155175 -381658 270256 -176530 -1921358 -1371430 -829948 -845217 -931946 -249942 -1035832
2009a035832o40108M20156K03680K44448N56252q98002m94444M98333N69773K52811
$$ -1035832 -1675940 -1255784 -1052104 -807656 -251404 -1149406 -1643850 -1145517 -575744 -322933
1999c22933k73907N67776P6210j128302O41199R37253p86412J156737n03048j090021
$$ -322933 -596840 -29064 47146 -1081156 -439957 497296 -289116 867621 364573 -725448
1989g25448L71597J251690o29003r90476k69080k1791P85230J30868n73195P38343
$$ -725448 -353851 897839 268836 -721640 -990720 -1012511 -227281 -96413 -669608 68735
1979F8735P89961O49592q55393j79221j282562K07866K23512k11919l39874k78814
$$ 68735 858696 1508288 652895 473674 -808888 -601022 -377510 -589429 -929303 -1208117
1969a208117N99508O77999m16710J43227k21863p10618k02186j69524n44249P98388
$$ -1208117 -608609 69390 -347320 -204093 -425956 -1136574 -1338760 -1508284 -2052533 -1254145
1959a254145M68084j31915J90154J79869L10958l50278Q52113p65914J27969K56111
$$ -1254145 -786061 -917976 -727822 -547953 -236995 -587273 264840 -501074 -373105 -116994
1949a16994k95202O98102n72250j361062Q79706N59015R97460L64330j183723
$$ -116994 -412196 285906 -286344 -1647406 -767700 -208685 788775 1153105 -30618
1940c0618q88206J014893m33917k09130l06313k96065L2018M87108r4472N03116
$$ -30618 -918824 96069 -337848 -546978 -853291 -1149356 -1117338 -630230 -724702 -221586
1930b21586l41000l27683R62497j98268N843k34096J97842M5056l71318p57140
$$ -221586 -562586 -890269 72228 -126040 -120197 -354293 -156451 -111395 -482713 -1239853
1920a239853k31659j77067J490358M57019r55436K97456l77361J56052J24568
$$ -1239853 -1471512 -1648579 -158221 298798 -656638 -359182 -736543 -580491 -455923
1911d55923n58776J69683l25861O46654K26683k69927M29881j50306q11248K58802
$$ -455923 -1014699 -845016 -1170877 -524223 -297540 -567467 -137586 -287892 -1099140 -840338
1901h40338P42164j52632k61394N9991N3641k94391n75685J98962N25171k67915
$$ -840338 -98174 -250806 -512200 -452209 -398568 -692959 -1268644 -1069682 -544511 -812426
1891h12426K44497O81745J13533n98848J037436q45977j143615P76115P91516
$$ -812426 -567929 113816 227349 -371499 665937 -180040 -1323655 -547540 243976
1882B43976j80981O29041j031522l71825N16651k619o0412j316000M33184P46305
$$ 243976 62995 692036 -339486 -711311 -194660 -197279 -257691 -1573691 -1140507 -394202
1872c94202K80724q3254L29437l98639m54616q94820L65444P15706m02612r75684
$$ -394202 -113478 -196732 132705 -265934 -720550 -1615370 -1249926 -534220 -936832 -1912516
1862a912516P62309J043726m91779o1750N95875q84770K94172J181485l7828m06065
$$ -1912516 -1150207 -106481 -598260 -660010 -64135 -948905 -654733 526752 488924 82859
1852H2859q1791N22572O956K35250m58646j661131m07851O65897Q60477j111191
$$ 82859 1068 523640 530596 765846 307200 -1353931 -1761782 -1095885 -235408 -1346599
1842a346599M59386P70938J36792l08607k71200J3188q36540L74768k93692O78616
$$ -1346599 -887213 -116275 20517 -288090 -559290 -546102 -1382642 -1007874 -1301566 -622950
1832f22950R6738p34181N9330l79154q75555R53162Q80570K34659O22357n22795
$$ -622950 -526212 -1260393 -1201063 -1580217 -2455772 -1502610 -622040 -387381 234976 -287819
1822b87819O06256p38947M43507O14177O65234j428626q76040m50545N55511l30942
$$ -287819 318437 -420510 22997 637174 1302408 -126218 -1002258 -1452803 -897292 -1228234
1812a228234k54419R97295l24994n1686K99493R54340j061736j51604J02785Q4127
$$ -1228234 -1482653 -485358 -810352 -862038 -562545 391795 -669941 -821545 -718760 -634633
1802f34633n10366O39501l77091P00615k94333l95329l89696P22148k00391J84892
$$ -634633 -1144999 -505498 -882589 -181974 -476307 -871636 -1261332 -539184 -739575 -554683
1792e54683K85186q112k52970J297405l64710j593401q44448L77035J198241K74579
$$ -554683 -269497 -277609 -530579 766826 402116 -1191285 -2035733 -1658698 -460457 -185878
1782a85878N3282K49291O42458n20423o83984n86297J15502O32280K37256j04049
$$ -185878 -132596 116695 759153 238730 -445254 -1031551 -916049 -283769 -46513 -150562
1772a50562j35690q13914Q5745M41452k99337J009873m79455K14958q46333m60294
$$ -150562 -286252 -1100166 -1014421 -572969 -872306 137567 -341888 -126930 -973263 -1433557
1762a433557J310493m05571p26010m5487O32214O32366k90272p4731j08946k01159
$$ -1433557 -123064 -528635 -1254645 -1300132 -667918 -35552 -325824 -400555 -509501 -710660
1752g10660R24179l74065O99242j95282p27678j017996L4584o64843J148487L93358
$$ -710660 213519 -160546 538696 343414 -384264 -1402260 -1367676 -2032519 -884032 -490674
1742d90674o95805P70008J152792o17860j172110m70403N39862R61102M29093
$$ -490674 -1186479 -416471 736321 118461 -1053649 -1524052 -984190 -23088 406005
1733D06005r83432o36061l14851L37127P14647j186484P216P79459j15704R43666
$$ 406005 -577427 -1213488 -1528339 -1191212 -476565 -1663049 -1655833 -876374 -992078 -48412
1723d8412o67554P14731K14389j31342Q0954n06454k52323L07473j72466r18949
$$ -48412 -715966 -1235 213154 81812 162766 -343688 -596011 -288538 -461004 -1379953
1713a379953L51132k23127J58387m1626P51195j225529k19676R4072m94003R26764
$$ -1379953 -1028821 -1251948 -1093561 -1135187 -383992 -1609521 -1829197 -1735125 -2229128 -1302364
1703a302364r2257P67119J61813j054308P73666j3745m70509J059460j4919q6368
$$ -1302364 -1394621 -627502 -465689 -1519997 -746331 -760076 -1230585 -171125 -186044 -272412
1693b72412J128322j58636j71462j132089M62821M95254l81737j03784q07341
$$ -272412 855910 697274 525812 -606277 -143456 351798 -29939 -133723 -941064
1684i41064J45650p61476N64230p1031J65086M08073j415330o38509J104461K58845
$$ -941064 -795414 -1556890 -992660 -1063691 -898605 -490532 -1905862 -2544371 -1439910 -1181065
1674a181065J098833m63181K29395L85711j396452M08869N43763m53625j121519
$$ -1181065 -82232 -545413 -316018 69693 -1326759 -917890 -374127 -827752 -1949271
1665a949271J247287M90125n32335k92557L49930o4099L10038m54961j10187Q36921
$$ -1949271 -701984 -211859 -744194 -1036751 -686821 -750920 -440882 -895843 -1006030 -169109
1655a69109o09868N3175N37972j253585K40495p14781J12654P23202j84527J033744
$$ -169109 -778977 -725802 -187830 -1441415 -1200920 -1915701 -1803047 -1079845 -1264372 -230628
1645b30628J41309p95587O87815m43562O93395l61783p13019o1408Q1057J198773
$$ -230628 -89319 -884906 -197091 -640653 52742 -309041 -1022060 -1083468 -1002411 196362
1635A96362o46179n38710J71579j69963L6970N48368n7009m361Q1264k96035J72092
$$ 196362 -449817 -988527 -816948 -986911 -949941 -401573 -458582 -462943 -381679 -677714 -505622
1624e05622R22835J17568j204419K80929L90359P19628n5354l19643j26440j015332
$$ -505622 417213 534781 -669638 -388709 1650 721278 665924 346281 219841 -795491
1614g95491K68926J14426N2289p58933p37321O16004L14645n52548L61517J034441
$$ -795491 -526565 -412139 -359850 -1118783 -1856104 -1240100 -925455 -1478003 -1116486 -82045
1604h2045R37676J1146J90984j479633N05114J00528k7927j043785J11541O93788
$$ -82045 855631 866777 1057761 -421872 83242 183770 155843 -887942 -776401 -82613
1594h2613L10473j03704q80266L62038Q29453R3506q03444l7483p67309K28818
$$ -82613 227860 124156 -756110 -394072 435381 528887 -274557 -312040 -1079349 -850531
1584h50531O59981L57596n13961L91583O31070o29745r7209p13022J8281o09503
$$ -850531 -190550 167046 -346915 44668 675738 45993 -51216 -764238 -745957 -1355460
1574a355460j47054n32310n9868l26607J08069J698220K01234p9513j16999l61900
$$ -1355460 -1502514 -2034824 -2094692 -2421299 -2313230 -615010 -413776 -493289 -610288 -972188
1564i72188J05681l081L14802J347382k50199O07308o87528n94744Q07910p97967
$$ -972188 -866507 -869588 -554786 792596 542397 1149705 462177 -132567 675343 -122624
1554a22624L10421o86142K29746P32654o88274N23683k65748n50549K38024L58141
$$ -122624 187797 -498345 -268599 464055 -224219 299464 33716 -516833 -278809 79332
1544G9332l1859J47653o29687J37857P08638l72408o02169J052999N06930o64068
$$ 79332 47473 195126 -434561 -296704 411934 39526 -562643 490356 997286 333218
1534C33218j602738O53631n31973Q2971K32152K0020J133306R568o80555L80351
$$ 333218 -1269520 -615889 -1147862 -1064891 -832739 -812719 320587 330155 -350400 29951
1524B9951m20155o88249R92612K06044p9077j198590J718890l27810r32796J139686
$$ 29951 -390204 -1078453 -85841 120203 41126 -1157464 561426 233616 -699180 440506
1514D40506M43354r54022o74171P83334L43463O12282l58399l24732K08044Q16233
$$ 440506 883860 -70162 -744333 39001 382464 994746 636347 311615 519659 1335892
1504A335892o69839l91345j45291n01095J39609o59530P07879m1177M86214L1237
$$ 1335892 666053 274708 129417 -371678 -232069 -891599 -183720 -224897 261317 292554
1494B92554j1632K77837m02002L92681o5450j017747R24367K19772J67820p82262
$$ 292554 280922 558759 156757 549438 483988 -533759 390608 610380 778200 -4062
1484d062j110092M31514P1854o28871l83674Q28978q3936R42861L47407n35745
$$ -4062 -1114154 -682640 -610786 -1239657 -1623331 -794353 -878289 64572 411979 -123766
1474a23766q09199j44783J228377j00577j549084q5497J644633k01582r93609
$$ -123766 -932965 -1077748 150629 50052 -1499032 -1584529 60104 -141478 -1135087
1465a135087R49188n74356K20099J034199j004771k53687n77518p2662J379687
$$ -1135087 -185899 -760255 -540156 494043 -510728 -764415 -1341933 -1414595 -34908
1456c4908P76414o33562l43054J71632Q9224j66237l67281p16817n48573Q99033
$$ -34908 741506 107944 -235110 -63478 25746 -140491 -507772 -1224589 -1773162 -874129
1446h74129M37051j97289Q1362L31849l19692l32492r71773J30573J076143R68557
$$ -874129 -437078 -634367 -553005 -221156 -540848 -873340 -1845113 -1714540 -638397 330160
1436C30160j06513q86868n20492k19494O43481J10628J073145o50723J74451O12948
$$ 330160 223647 -663221 -1183713 -1403207 -759726 -649098 424047 -226676 -52225 560723
1426E60723r70258R38076J434870o53552j659774n4534M05706p02959l96631R6905
$$ 560723 -409535 528541 1963411 1309859 -349915 -404449 1257 -701702 -1098333 -1001428
1416a001428O4890J7221N22344J48677l32933J95073j71760L33305R91267J98583
$$ -1001428 -936538 -919317 -396973 -248296 -581229 -386156 -557916 -224611 766656 965239
1406I65239p01149j127207L63206l36048k31054R74091m04711j079083n63484
$$ 965239 264090 -863117 -499911 -835959 -1067013 -92922 -497633 -1576716 -2140200
1397b140200J340279K40355L33918k62890O88621J54730k76548J7179q02173j32333
$$ -2140200 -799921 -559566 -225648 -488538 200083 354813 78265 95444 -706729 -839062
1387h39062Q09250k57728p64056J707988J14008j128262j36252l81553r47665
$$ -839062 -29812 -287540 -1051596 656392 770400 -357862 -494114 -875667 -1823332
1378a823332Q58907M96906K15664l75462j339083Q30223P23007j59311o11682
$$ -1823332 -964425 -467519 -251855 -627317 -1966400 -1136177 -413170 -572481 -1184163
1369a184163Q76655L81202p76429k74263O08279k93507l07804N50797O06397k080082
$$ -1184163 -307508 73694 -702735 -976998 -368719 -662226 -970030 -419233 187164 -1892918
1359a892918Q74558J050718Q71719m3653p63719J74881n21519L20525L84297J023460
$$ -1892918 -1018360 32358 904077 860424 96705 271586 -249933 70592 454889 1478349
1349A478349o42763m37774j294240O44558P28649j19125p46918n98066n52944
$$ 1478349 835586 397812 -896428 -251870 476779 357654 -389264 -987330 -1540274
1340a540274N38432L93614j00005J010734o11466j163203J08128l93205Q84841
$$ -1540274 -1001842 -608228 -708233 302501 -308965 -1472168 -1364040 -1757245 -872404
1331h72404N30140J253463Q4327j342634J06023Q11429l71978o1059O7731J47879
$$ -872404 -342264 911199 995526 -347108 -241085 570344 198366 137307 205038 352917
1321C52917k27519K04446m69249l82202N41430n01071M93824L9019o80969N17246
$$ 352917 125398 329844 -139405 -521607 19823 -481248 12576 51595 -629374 -112128
1311a12128r35088J547L22404M59325L63001r33000j2480o20130K34686N66741
$$ -112128 -1047216 -1045669 -723265 -263940 99061 -833939 -846419 -1466549 -1231863 -665122
1301f65122J87288l23557j20256n80654J46406J196461L82782J50088m37413k54664
$$ -665122 -477834 -801391 -921647 -1502301 -1355895 -159434 223348 373436 -63977 -318641
1291c18641n49315N40789J23658p32358m3026K0415P10939K40127L13209k39173
$$ -318641 -867956 -327167 -203509 -935867 -978893 -958478 -247539 -7412 305797 66624
1281F6624M04458R0209J62235q83821n57800J25010K78252K81510O15570J09394
$$ 66624 471082 561291 723526 -160295 -718095 -593085 -314833 -33323 582247 691641
1271F91641j25923j011584p67560Q94501N39210k11796q75753L47943m30206j54701
$$ 691641 565718 -445866 -1213426 -318925 220285 8489 -867264 -519321 -949527 -1104228
1261a104228J94594m73439N54088L35649q7468k43047k79944j64949N02732K34255
$$ -1104228 -909634 -1383073 -828985 -493336 -580804 -823851 -1103795 -1268744 -766012 -531757
1251e31757K93263P42914K97049k67634K5427r45290Q70651O19165j282025p61262
$$ -531757 -238494 504420 801469 533835 559262 -386028 484623 1103788 -178237 -939499
1241i39499L17207P90529l17343M79648j659522L57222Q23601l26938R09533L51421
$$ -939499 -622292 168237 -149106 330542 -1328980 -971758 -148157 -475095 434438 785859
1231G85859O18782n92538l28031j38265r87127L76489l8004J90446L37904j74444
$$ 785859 1404641 812103 484072 345807 -641320 -264831 -302835 -112389 225515 51071
1221E1071P83790l7042p35702j2475k60652R29807m70862j475120P80715O52579
$$ 51071 834861 797819 62117 49642 -211010 718797 247935 -1227185 -446470 206109
1211B06109R25437p13828Q8073k32643j36616o89883l87283M3002P00765P98854
$$ 206109 1131546 417718 505791 273148 136532 -553351 -940634 -897632 -196867 601987
1201F01987n96001K52956j18070k88109k03389P26645P21395r24795k47672j345172
$$ 601987 5986 258942 140872 -147237 -350626 376019 1097414 172619 -75053 -1420225
1191a420225M75204R1784L64657L83782n20023j269154O72372J59171n36040P66247
$$ -1420225 -945021 -853237 -488580 -104798 -624821 -1893975 -1221603 -1062432 -1598472 -832225
1181h32225K62169J75987q31265R0122j8134J121741m9609k38330m10598k04328
$$ -832225 -570056 -394069 -1225334 -1135212 -1153346 -31605 -81214 -319544 -730142 -934470
1171i34470J45849P8896q11463J44911q7814N78206o23177J410325J712858j033812
$$ -934470 -788621 -709725 -1521188 -1376277 -1464091 -885885 -1509062 -98737 1614121 580309
1161E80309j028763l27084N41534L066j272809O42699L28331N17560P05467n15964
$$ 580309 -448454 -775538 -234004 -230938 -1503747 -861048 -532717 -15157 690310 174346
1151A74346M74784L62766l88289n05548o0403j075382K84679N97553j096489P27848
$$ 174346 649130 1011896 623607 118059 57656 -1017726 -733047 -135494 -1231983 -504135
1141e04135P33095J267j13175n2259j42619P23591N7299n06031k09286o92805
$$ -504135 228960 230227 117052 64793 -77826 645765 703064 197033 -12253 -705058
1131g05058j32594J65539J348584L72739o27087l48132P34528K40534o02291M85798
$$ -705058 -837652 -672113 676471 1049210 422123 73991 808519 1049053 446762 932560
1121I32560k13147p91507Q6083J20387r08543p0624k37257M48131J248525o79172
$$ 932560 719413 -72094 13989 134376 -774167 -844791 -1082048 -633917 614608 -64564
1111f4564J53155r10621J09221k14233Q77917L26880L10322M82747l30741O07592
$$ -64564 88591 -822030 -712809 -927042 -49125 277755 588077 1070824 740083 1347675
1101A347675o86974j20089p99821m47719l83734j66784J063823l91981p45773
$$ 1347675 660701 540612 -259209 -706928 -1090662 -1257446 -193623 -585604 -1331377
1092a331377J31239K0181J910739j589196j353542P28316L51134K35890M91598
$$ -1331377 -1200138 -1179957 730782 -858414 -2211956 -1483640 -1132506 -896616 -405018
1083d05018R98070l75173q63579P7996R08555K9865j143970L42307M05668p71904
$$ -405018 593052 217879 -645700 -567704 340851 370716 -773254 -430947 -25279 -797183
1073g97183Q35054n36546N7239J56199M9239J53920O38697n67283l95549K56655
$$ -797183 37871 -498675 -441436 -285237 -235998 -82078 556619 -10664 -406213 -149558
1063a49558j52953L03637J360184q36711l44741P17324j008203K9522N06530O49798
$$ -149558 -302511 1126 1361310 524599 179858 897182 -111021 -81499 425031 1074829
1053A074829n20372r03648N21702k8490l40340k7767j37366J89132N31752N6688
$$ 1074829 554457 -349191 172511 144021 -196319 -224086 -361452 -172320 359432 416120
1043D16120j98684l87278n01682J023742n46079j14667j35109M56036p52499K73952
$$ 416120 217436 -169842 -671524 352218 -193861 -308528 -443637 12399 -740100 -466148
1033d66148Q81253l0734k67525J18261l58100j060782N22879J093942l80951q43390
$$ -466148 415105 384371 116846 235107 -122993 -1183775 -660896 433046 52095 -791295
1023g91295l73470K32842N19592M20707l10580M88159R82292j427105L76686M90003
$$ -791295 -1164765 -931923 -412331 8376 -302204 185955 1168247 -258858 117828 607831
1013F07831l21832j65787k70957P5642K60640k75018J19598n93289M87259n16281
$$ 607831 285999 120212 -150745 -75103 185537 -89481 30117 -563172 -75913 -592194
1003e92194n0365M70137j057561J779O84168J53151q6888O39633M63762m05984
$$ -592194 -642559 -172422 -1229983 -1228204 -544036 -390885 -477773 161860 625622 219638
993B19638n23880p382O82831K34225l04394k73101N43572n39089L38637M74865
$$ 219638 -304242 -311624 371207 605432 301038 27937 571509 32420 371057 845922
983H45922j16926P45091o64151q74654Q89871N80806r97460q9496R58504o65410
$$ 845922 728996 1474087 809936 -64718 825153 1405959 408499 319003 1277507 612097
973F12097J091790o46099j490239l91793M47775J512365o9757r37028k27839J17347
$$ 612097 1703887 1057788 -432451 -824244 -376469 1135896 1066139 129111 -98728 18619
963A8619P56457L19297r01715L23933M54583M98514j066030r91439m41243J341059
$$ 18619 775076 1094373 192658 516591 971174 1469688 403658 -587781 -1029024 312035
953C12035J30367j51361M7766o28333M72475l92405O6078R68426m01345m96714
$$ 312035 442402 291041 338807 -289526 182949 -209456 -143378 825048 423703 -73011
943g3011J73300k09534N50334p94438K13916k25604o55249n60796J335994J275695
$$ -73011 100289 -109245 441089 -353349 -139433 -365037 -1020286 -1581082 -245088 1030607
933A030607m03270K8925m40129J368564q33101j131484K66181l6869o88275L20705
$$ 1030607 627337 656262 216133 1584697 751596 -379888 -113707 -150576 -838851 -518146
923e18146J65451k37999J56218J163889o29887k20350l89136M18128o23737o52561
$$ -518146 -352695 -590694 -434476 729413 99526 -120824 -509960 -91832 -715569 -1368130
913a368130N53512P77830k64966l3583L43656m46693J549000n75989j81750L26051
$$ -1368130 -814618 -36788 -301754 -335337 8319 -438374 1110626 534637 352887 678938
903F78938o27705J159307j86043r73309j136955M79497O44407m73819k49899j12931
$$ 678938 51233 1210540 1024497 51188 -1085767 -606270 38137 -435682 -685581 -798512
893g98512k61035J512646N82270j978946M94609L82862N08326r14675Q80666K31205
$$ -798512 -1059547 453099 1035369 -943577 -448968 -66106 442220 -472455 408211 639416
883F39416r10638J215009j25933j188623j41894j36193L88819P24282n32658l32027
$$ 639416 -271222 943787 817854 -370769 -512663 -648856 -260037 464245 -68413 -400440
873d00440Q76721Q58024j481485m70251Q56113N3598M52428J87812j0649k14567
$$ -400440 476281 1334305 -147180 -617431 238682 292280 744708 932520 921871 707304
863G07304q45644P70731Q06850j351175o39872P0210J06020K37620K7440j155250
$$ 707304 -138340 632391 1439241 88066 -551806 -481596 -375576 -137956 -110516 -1265766
853a265766P32384O56268j87579J02287Q35221L4842J55396o33944n86867R75565
$$ -1265766 -533382 122886 -64693 37594 872815 907657 1063053 429109 -157758 817807
843H17807m47251P2130J7611N62626J50460j028451q8955P91778m14857K48886
$$ 817807 370556 442686 460297 1022923 1173383 144932 55977 847755 432898 681784
833F81784k76462n69309r05495M58583q7796N01850O54747m97552l77911j82274
$$ 681784 405322 -163987 -1069482 -610899 -698695 -196845 457902 -39650 -417561 -599835
823e99835O70542N61104J00812k8522j10243m53098P98974K76180l27665q81835
$$ -599835 70707 631811 732623 704101 593858 140760 939734 1215914 888249 6414
813F414k6291l77247n6126R00256o0119p90372L45185P68175j182694J042635
$$ 6414 -19877 -397124 -453250 447006 386887 -403485 -58300 709875 -472819 569816
803E69816J26010n75539p40490K95957J338631q40095n86135L09748l07197o81510
$$ 569816 695826 120287 -620203 -324246 1014385 174290 -411845 -102097 -409294 -1090804
793a090804J363091J82979k85109m12173J000J17633k66080O47658P76683k22442
$$ -1090804 272287 455266 170157 -242016 -241016 -123383 -389463 258195 1034878 812436
783H12436m95947p92015J28656Q70084r5204P8907m99902m81843R08975n87143
$$ 812436 316489 -475526 -346870 523214 428010 506917 7015 -474828 434147 -152996
773a52996n04971O23354J359184q76026n33382m55630P22352P22754M50208Q9357
$$ -152996 -657967 -34613 1324571 448545 -84837 -540467 181885 904639 1354847 1444204
763A444204j33391m0716k64362j054288j16309p24320j094037Q75250p56548M86306
$$ 1444204 1310813 1270097 1005735 -48553 -164862 -889182 -1983219 -1107969 -1864517 -1378211
753a378211L44944M77021J282062k70000j080427l39806J293771M1693j17388
$$ -1378211 -1033267 -556246 725816 455816 -624611 -964417 329354 371047 253659
744B53659m38823N16262J24129R465r99627j40618J306206J381412j170469j472071
$$ 253659 -185164 331098 455227 464692 -534935 -675553 630653 2012065 841596 -630475
734f30475M98418O87030J97862m90763Q40521j029635j7948K82775P57056j446463
$$ -630475 -132057 554973 752835 262072 1102593 72958 55010 337785 1094841 -351622
724c51622J71101J398303J74750N86366L04666l44347L74356j42133j534192j191605
$$ -351622 -180521 1217782 1392532 1978898 2283564 1939217 2313573 2171440 637248 -554357
714e54357L87445N18485L16456j55605N49255k43039M89257j432262r11840N66715
$$ -554357 -166912 351573 668029 512424 1061679 818640 1307897 -124365 -1036205 -469490
704d69490J350010j81628m37557P23712o9296Q3108k21327o12316j513343M16192
$$ -469490 880520 698892 261335 985047 915751 998859 777532 165216 -1348127 -931935
694i31935J127753o68853q42389L95969L87204O8121N59798n56795n86122Q17674
$$ -931935 195818 -473035 -1315424 -919455 -532251 -464130 95668 -461127 -1047249 -229575
684b29575L74080n54438J339603l50246m59881M2482K84853K82944L58495K69678
$$ -229575 144505 -409933 929670 579424 119543 162025 446878 729822 1088317 1357995
674A357995j81031o1252r53568o47552j52677r59895J326880O06736m89471L40011
$$ 1357995 1176964 1115712 162144 -485408 -638085 -1597980 -271100 335636 -153835 186176
664A86176j03551Q45996m21578P66469o67940o76955K44479p41441m43739j93084
$$ 186176 82625 928621 507043 1273512 605572 -71383 173096 -568345 -1012084 -1205168
654a205168M39924J019804J63047J51015j90140l37762k24074m45425p4536L02621
$$ -1205168 -765244 254560 417607 568622 378482 40720 -183354 -628779 -703315 -400694
644d00694j42532P00666k1121K54980j92033m71646Q7911R31253q0686o95871
$$ -400694 -543226 157440 136319 391299 199266 -272380 -184469 746784 666098 -29773
634b9773k75129N49918M48710l94782n77838q03572R91891J140027P54885j02896
$$ -29773 -304902 245016 693726 298944 -278894 -1082466 -90575 1049452 1804337 1701441
624A701441j020633N5376j088618M09512R44802K75364j310768j261033J510269
$$ 1701441 680808 736184 -352434 57078 1001880 1277244 -33524 -1294557 215712
615B15712J149581n651j47052M762l16357P4824k18769N5264q43097L18542J560756
$$ 215712 1365293 1359642 1212590 1217352 900995 975819 757050 812314 -30783 287759 1848515
604A848515R7214r13234j157979K7913J36707j51249N37713Q50864l12100J18581
$$ 1848515 1945729 1032495 -125484 -97571 39136 -112113 425600 1276464 964364 1082945
594A082945J70518n12959n71233N06563M31828l95516l79062n38838K00484m02078
$$ 1082945 1253463 740504 169271 675834 1107662 712146 333084 -205754 -5270 -407348
584d07348Q48296q18232j56517R18165j77268R33807m8780M09329L09295n5844
$$ -407348 440948 -377284 -533801 384364 207096 1140903 1092123 1501452 1810747 1754903
574A754903j502990O98630m13950j109630J21721P02303n44223p27273K67527
$$ 1754903 251913 950543 536593 -573037 -451316 250987 -293236 -1020509 -752982
565g52982K61292L42453m2836l11494L38671J068559N30082k15208l82280j689838
$$ -752982 -491690 -149237 -192073 -503567 -164896 903663 1433745 1218537 836257 -853581
555h53581M40353O50595J0719J48248M48029R7272k69036K29646q90137k55994
$$ -853581 -413228 237367 248086 396334 844363 941635 672599 902245 12108 -243886
545b43886j84211O50762L02544p6370j86508k4591M43724L82899k74855l66261
$$ -243886 -428097 222665 525209 448839 262331 237740 681464 1064363 789508 423247
535D23247j138842J459374n07583O55475m22475Q62791L43301L09874l94852M81812
$$ 423247 -715595 743779 236196 891671 469196 1331987 1675288 1985162 1590310 2072122
525B072122k99164o59497p2859r2243j85759n09124K8223K34647M13446k39174
$$ 2072122 1772958 1113461 1040602 948359 762600 253476 281699 516346 929792 690618
515F90618K07840j307459k01144r1837J545269J220742l55477r60230j78399L92444
$$ 690618 898458 -409001 -610145 -701982 843287 2064029 1708552 748322 569923 962367
505I62367O33432J30179o16499r37154J238704P10971o4129L52124j273957j364315
$$ 962367 1595799 1725978 1109479 172325 1411029 2122000 2057871 2409995 1136038 -228277
495b28277P57052r2875J61406o61924l42824N35658n51732l70147K43017N68209
$$ -228277 528775 435900 597306 -64618 -407442 128216 -423516 -793663 -550646 17563
485A7563M89253r723l53812J215128P0611j166712P56557P04617o80294m54621
$$ 17563 506816 497093 143281 1358409 1429020 262308 1018865 1723482 1043188 588567
475E88567m66720o54031J55700j07236p20581J47461Q83289J228894m57809Q0317
$$ 588567 121847 -532184 -376484 -483720 -1204301 -1056840 -173551 1055343 597534 677851
465F77851l245m50531K71954J47248K51006J32966L00486m72482o25461M11714
$$ 677851 674606 224075 496029 643277 894283 1027249 1327735 855253 229792 641506
455F41506q86711j86579J509143L01371n17418j465855O87332J14457K13728Q4536
$$ 641506 -245205 -431784 1077359 1378730 861312 -604543 82789 197246 410974 495510
445D95510N3851j93868j79725N94666o91697k69759L29211o13090K83408N03669
$$ 495510 549361 355493 175768 770434 78737 -191022 138189 -474901 -191493 312176
435C12176K53737M63902j150988r09385k5928J24092J038910P39207p17644l9524
$$ 312176 565913 1029815 -121173 -1030558 -1056486 -932394 106516 845723 128079 88555
425H8555n71847K14058O20352k95322q73235M60740J2394l65859L35083K20253
$$ 88555 -483292 -269234 351118 55796 -817439 -356699 -344305 -710164 -375081 -154828
415a54828M18353J164993P9047Q17099L01143j352659p97116n43528n76376N1874
$$ -154828 263525 1428518 1507565 2324664 2625807 1273148 476032 -67496 -643872 -591998
405e91998k52143J208471j35922n42553l15487m01259l03776R64826Q1380J43205
$$ -591998 -844141 364330 228408 -314145 -629632 -1030891 -1334667 -369841 -288461 -145256
395a45256J58510K04452J201890r44772k09081j48262o40515n43597M48101K73110
$$ -145256 13254 217706 1419596 474824 265743 117481 -523034 -1066631 -618530 -345420
385c45420P43964J34879K13199m58152k10413q33209k6854N27221Q69786n48499
$$ -345420 398544 533423 746622 288470 78057 -755152 -782006 -254785 615001 66502
375F6502o5358R46244m17791j141196J106827L13193n30773o21945j24310J093779
$$ 66502 1144 947388 529597 -611599 495228 808421 277648 -344297 -468607 625172
365F25172j549882o91253Q82678P2009l1240K32024M85738R52959k13617j162098
$$ 625172 -924710 -1615963 -733285 -661276 -692516 -460492 25246 978205 764588 -397510
355c97510l49208J09310n73850L3266Q30299L9953J43125P66398o92398n17799
$$ -397510 -746718 -637408 -1211258 -1177992 -347693 -307740 -164615 601783 -90615 -608414
345f08414K64136n21208O19341P95076l7624j020042K4084J82266r48736R15996
$$ -608414 -344278 -865486 -246145 548931 511307 -508735 -484651 -302385 -1251121 -335125
335c35125J462417o94182l86763M42380L43320k4101j398270K96827J120017j195323
$$ -335125 1127292 433110 46347 488727 832047 807946 -590324 -293497 826520 -368803
325c68803q5853J131061M7020n1075j072759J20718J70504J29602r47695q53137
$$ -368803 -454656 676405 723425 672350 -400409 -279691 -109187 20415 -927280 -1780417
315a780417M21610P69620P14197j25587l65362m34534O71065k19928J002730P25843
$$ -1780417 -1358807 -589187 125010 -577 -365939 -800473 -129408 -349336 653394 1379237
305A379237k77026P04209o99307J66304j623876m43237R37804L31562m19719q67224
$$ 1379237 1102211 1806420 1107113 1273417 -350459 -793696 144108 475670 55951 -811273
295h11273M32014l38689Q41110Q0783j87225k31066p0646j25255K37492m19640
$$ -811273 -379259 -717948 123162 203945 16720 -214346 -284992 -410247 -172755 -592395
285e92395k03551J032958L56857J99980l44080n52327j63703J70754r3610j36426
$$ -592395 -795946 237012 593869 793849 449769 -102558 -266261 -95507 -189117 -325543
275c25543K94136P08871K77998j185012n8618o04311o29553Q18743l55212O96327
$$ -325543 -31407 677464 955462 -229550 -288168 -892479 -1522032 -703289 -1058501 -362174
265c62174N42355J07578J144753j69494p97553j71851j75261j518826P44935K08960
$$ -362174 180181 287759 1432512 1263018 465465 293614 118353 -1400473 -655538 -446578
255d46578q32325K9278L03650J92121R67886L25081n24595J49599O4428l22059
$$ -446578 -1278903 -1249625 -945975 -753854 214032 539113 14518 164117 228545 -93514
245i3514o4429j07599M30616O88800n31396l220n03665Q62095r045J28388k06329
$$ -93514 -157943 -265542 165074 853874 322478 319258 -184407 677688 668643 797031 590702
234E90702l77639j215900L00721M84942L62829r31662n213R49600m37133n16927
$$ 590702 213063 -1002837 -702116 -217174 145655 -786007 -791220 158380 -278753 -795680
224g95680j70117J55513J001679P0604n38413J70345N20687n82520K82499r13894
$$ -795680 -965797 -810284 191395 261999 -276414 -106069 414618 -167902 114597 -799297
214g99297k80309N28876J49532K25814K23526o89368o5118J477420N41971n57398
$$ -799297 -1079606 -550730 -401198 -175384 48142 -641226 -706344 771076 1313047 755649
204G55649j454553J078491O43440o29655K03600M04451r56354K30829J26135l09284
$$ 755649 -698904 379587 1023027 393372 596972 1001423 45069 275898 402033 92749
194I2749J228699m5812j698356J62960j88453K44926n70161L02469P02687K07306
$$ 92749 1321448 1275636 -422720 -259760 -448213 -203287 -773448 -470979 231708 439014
184D39014M13749j027866L43987J50858L14210N69106j009698j97663q24178M33494
$$ 439014 852763 -175103 168884 319742 633952 1203058 193360 -4303 -828481 -394987
174c94987R94803N8655n90231r4169q25080l61887O69048K8912j63708k36398
$$ -394987 599816 658471 68240 -25929 -851009 -1212896 -543848 -514936 -678644 -915042
164i15042j31685k15756L78253k32999L24498l27692P39151J361625j64452j101258
$$ -915042 -1046727 -1262483 -884230 -1117229 -792731 -1120423 -381272 980353 815901 -285357
154b85357r504l50229N04305P44137q5025j17717j177036L44854N078M44276l06863
$$ -285357 -294861 -645090 -140785 603352 518327 400610 -776426 -431572 -426494 17782 -289081
143b89081M98552J73422K08271K53504L22630N00262r45197p87688P44454M62863
$$ -289081 209471 382893 591164 844668 1167298 1667560 722363 -65325 679129 1141992
133A141992r10118j474121J93905Q66268L21390Q0901N69497J11180K1309k10452
$$ 1141992 231874 -1242247 -1048342 -182074 139316 220217 789714 900894 922203 711751
123G11751m37249p3424J14456l15426J10534k11130K15183M38917o32223j31699
$$ 711751 274502 201078 315534 108 110642 -100488 114695 553612 -78611 -210310
113b10310k0911L76362k7067n30348r544R69474N21455j596241O77031M53040
$$ -210310 -231221 145141 118074 -412274 -421818 547656 1069111 -527130 149901 602941
103F02941m93002N55002O2212L90152r6830o37228q0139n45236r97387M48843
$$ 602941 109939 664941 727153 1117305 1020475 383247 303108 -242128 -1239515 -790672
93g90672R9728N61675J45984K13488J03566L23528K01161P5903j225568M73850
$$ -790672 -690944 -129269 16715 230203 333769 657297 858458 934361 -291207 182643
83A82643J51500n75237p98548Q80829P45221R78890Q09759r78297j209391L12551
$$ 182643 334143 -241094 -1039642 -158813 586408 1565298 2375057 1396760 187369 499920
73D99920k8659l79001k70506m24794K05231q4929R36773q76385p75410L39397
$$ 499920 471261 92260 -178246 -603040 -397809 -482738 454035 -422350 -1197760 -858363
63h58363O44599j47247K65991N81048l62143P3260j28548n38905M49567K65600
$$ -858363 -213764 -361011 -95020 486028 123885 197145 68597 -470308 -20741 244859
53B44859k46283L1286j19704P67538Q17139j236688l47471K93416Q1290k14353
$$ 244859 -1424 29862 -89842 677696 1494835 258147 -89324 204092 285382 71029
43G1029p72619L03814k0526J47871o46822n80425n6236P01796J94986p5749j94948
$$ 71029 -701590 -397776 -418302 -270431 -917253 -1497678 -1553914 -852118 -657132 -732881 -927829
32i27829K51714J139329J99708N70735j23548j073145l21890L30969k7032K76779
$$ -927829 -676115 463214 662922 1233657 1110109 36964 -284926 46043 19011 295790
22B95790p3681J42867K18918J37852l64041j70056J65284p7650J80108m02476
$$ 295790 222109 364976 583894 721746 357705 187649 352933 275283 455391 52915
12E2915O148j1452J25897m83118K60807O28799L05290L75752j231409j77560K36286
$$ 52915 59063 47611 173508 -309610 -48803 579996 885286 1261038 29629 -147931 88355
1H8355M82671
$$ 88355 571026
0E71026
$$ 571026
$$ Imaginary data points
##PAGE= N=2
##DATA TABLE= (X++(I..I)), XYDATA
16383b628235k76345J85719k02052M03163N36692l01550L95270K48954k59518
$$ -2628235 -2904580 -2718861 -2920913 -2517750 -1981058 -2282608 -1887338 -1638384 -1897902
16374a897902k45464J55995J70533m26658j53986J176632M65132k87777L99976
$$ -1897902 -2143366 -1987371 -1816838 -2243496 -2397482 -1220850 -755718 -1043495 -643519
16365f43519k74572j61867m88902n89678L01970N65097n73623Q7573J76211Q74186
$$ -643519 -918091 -1079958 -1568860 -2158538 -1856568 -1291471 -1865094 -1777521 -1601310 -727124
16355g27124j162k62741N76955o34883N88488J95012o62085m29748L49340O34032
$$ -727124 -728286 -991027 -414072 -1048955 -460467 -265455 -927540 -1357288 -1007948 -373916
16345c73916J04266o83620J04643O75047Q41749Q7101R31097o47306j098659O03118
$$ -373916 -269650 -953270 -848627 -173580 668169 755270 1686367 1039061 -59598 543520
16335E43520m09672j81427J21450K58264N4432M37039M61723m47018L2804l89475
$$ 543520 133848 -47579 73871 332135 386567 823606 1285329 838311 871115 481640
16325D81640L07475j34234m88377Q23447m79930l8881J23786k35487l00383o9920
$$ 481640 789115 654881 166504 989951 510021 471140 594926 359439 59056 -10864
16315a0864k33648J36741l05535O8461O37186M45907k60718p84986J06206Q75348
$$ -10864 -244512 -107771 -413306 -344845 292341 738248 477530 -307456 -201250 674098
16305F74098L39312q1870n959L29415R3144J40957J2045q0389K99649p74882N38390
$$ 674098 1013410 931540 925581 1254996 1348140 1489097 1501142 1420753 1720402 945520 1483910
16294A483910m99729k68087K26542N79595q3161j273674O03762J350202k11358
$$ 1483910 984181 716094 942636 1522231 1439070 165396 769158 2119360 1908002
16285A908002m05224O30675m47550l81795K58065N60585K11104k2672K95087o41551
$$ 1908002 1502778 2133453 1685903 1304108 1562173 2122758 2333862 2311190 2606277 1964726
16275A964726q4907Q28225j16879K81626q13244m85765L71736L3325N15130K63839
$$ 1964726 1879819 2708044 2591165 2872791 2059547 1573782 1945518 1978843 2493973 2757812
16265B757812m85993n65060Q62477j07936o86383j37857N68824k88438J08304
$$ 2757812 2271819 1706759 2569236 2461300 1774917 1637060 2205884 1917446 2025750
16256B025750P73807n96221R47950p77981N2416m27906K48535O00709N22935m3883
$$ 2025750 2799557 2203336 3151286 2373305 2425721 1997815 2246350 2847059 3369994 3326111
16246C326111k3079m41833j64524J10419K39795m06716o29450Q00953R52340k63314
$$ 3326111 3303032 2861199 2696675 2807094 3046889 2640173 2010723 2811676 3764016 3500702
16236C500702n67140P40805p31071R79252n52126r624m61501m54057L43988Q23144
$$ 3500702 2933562 3674367 2943296 3922548 3370422 3360798 2899297 2445240 2789228 3612372
16226C612372r4377Q25751j057126p25668M16389J159315p24778L09676L26032
$$ 3612372 3517995 4343746 3286620 2560952 2977341 4136656 3411878 3721554 4047586
16217D047586j241110j73153M05692Q00949R9498m5908n30759m3529m1400L25720
$$ 4047586 2806476 2633323 3039015 3839964 3939462 3893554 3362795 3319266 3277866 3603586
16207C603586N08385K03598m31152j13263j090274l48847J123592R09515O24964
$$ 3603586 4111971 4315569 3884417 3771154 2680880 2332033 3455625 4365140 4990104
16198D990104r24647j290903P9848O15888M75076j141079M0222O53559k16730
$$ 4990104 4065457 2774554 2854402 3470290 3945366 2804287 2844509 3498068 3281338
16189C281338m73688K048317Q20220l83913o45492m40885J26992o31270l2612
$$ 3281338 2807650 4855967 5676187 5292274 4646782 4205897 4332889 3701619 3669007
16180C669007J161326M42433M5656p7981j118296M62004M68259j677925P62199
$$ 3669007 4830333 5272766 5318422 5240441 4122145 4584149 5052408 3374483 4136682
16171D136682J52328K90739O7031o84571J077516j03735J213494L86832r40257
$$ 4136682 4289010 4579749 4646780 3962209 5039725 4935990 6149484 6536316 5596059
16162E596059j215451m39339K00036l27516j06768M63201K59113j150842L20371
$$ 5596059 4380608 3941269 4141305 3813789 3707021 4170222 4429335 3278493 3598864
16153C598864m77662L41367P47443j241656Q30312P14888j93714j87171Q0282
$$ 3598864 3121202 3462569 4210012 2968356 3798668 4513556 4319842 4132671 4212953
16144D212953l74611j19467P13547j05048L87735N51915Q9492o83305P66120J82194
$$ 4212953 3838342 3718875 4432422 4327374 4715109 5267024 5356516 4673211 5439331 5621525
16134E621525m33971j27100m61424k51354k17040m30444J299989L35185p237p07054
$$ 5621525 5187554 5060454 4599030 4347676 4130636 3700192 5000181 5335366 5328129 4621075
16124D621075j94973J91059n5373N02996j082000K39999j43092P32894M11226
$$ 4621075 4426102 4617161 4561788 5064784 3982784 4222783 4079691 4812585 5223811
16115E223811L01202K52266P1333j43087K20012j609060J2000m40961M25812O10051
$$ 5223811 5525013 5777279 5848612 5705525 5925537 4316477 4328477 3887516 4313328 4923379
16105D923379Q81331K52304j610051P3721K24265p96920M85799J0848R64085J252217
$$ 4923379 5804710 6057014 4446963 4520684 4744949 3948029 4433828 4444676 5408761 6660978
16095F660978K59526L8304j165365k63980q2218o12525r18268N18496l28504K04558
$$ 6660978 6920504 6958808 5793443 5529463 5447245 4834720 3916452 4434948 4106444 4311002
16085D311002k70713L14124j14066j01472J199521N13591M41096j02149l32165
$$ 4311002 4040289 4354413 4240347 4138875 5338396 5851987 6293083 6190934 5858769
16076E858769j598985p72685O85721m55345P0498J616146J43017j741672l60864
$$ 5858769 4259784 3487099 4172820 3717475 3787973 5404119 5547136 3805464 3444600
16067C444600Q85727O95738q37751J090460J46131p32398O29088j016805P05740
$$ 3444600 4330327 5026065 4188314 5278774 5424905 4692507 5321595 4304790 5010530
16058E010530O59119j246277M4081L05176p59794J36157R40252N73988j044097
$$ 5010530 5669649 4423372 4467453 4772629 4012835 4148992 5089244 5663232 4619135
16049D619135l02540n23063N38010N43282l16313J031185o71388l56584q60596
$$ 4619135 4316595 3793532 4331542 4874824 4558511 5589696 4918308 4561724 3701128
16040C701128M55831M73584m15127l14086p25452q54262P83237J713544J130696
$$ 3701128 4156959 4630543 4215416 3901330 3175878 2321616 3104853 4818397 5949093
16031E949093N2129j047207p21455N70518l76800L40717j2634M22441J9820M09083
$$ 5949093 6001222 4954015 4232560 4803078 4426278 4766995 4754361 5176802 5196622 5605705
16021E605705L31642j225521N32328L28448q87371m81991L54555J158551k96830
$$ 5605705 5937347 4711826 5244154 5572602 4685231 4203240 4557795 5716346 5419516
16012E419516j174741L26746L96236k46258J031425L21960O061l01170n80664
$$ 5419516 4244775 4571521 4967757 4721499 5752924 6074884 6080945 5779775 5199111
16003E199111l47709j67014K1613p67441J124870j5265N98802m09536L68530N67443
$$ 5199111 4851402 4684388 4706001 3938560 5063430 5048165 5646967 5237431 5605961 6173404
15993F173404p37374q12855j123658J127966n31563p58681J446795l68737N3506
$$ 6173404 5436030 4623175 3499517 4627483 4095920 3337239 4784034 4415297 4468803
15984D468803P19491n03368J94909K21918j29232n74178L81339J200377k89475
$$ 4468803 5188294 4684926 4879835 5101753 4972521 4398343 4779682 5980059 5690584
15975E690584J70666m60113o72295m71596N44727k19808L77986m66114O57324
$$ 5690584 5861250 5401137 4728842 4257246 4801973 4582165 4960151 4494037 5151361
15966E151361K49458K46872M61298P04538k4056j333646L75924j47875p62680
$$ 5151361 5400819 5647691 6108989 6813527 6789471 5455825 5831749 5683874 4921194
15957D921194o97892M15739O56000L53351P49228K98326p36322j95075n56796
$$ 4921194 4223302 4639041 5295041 5648392 6397620 6695946 5959624 5764549 5207753
15948E207753q39943L40730J194372j11869L73816n69493j26991p89657L37785
$$ 5207753 4367810 4708540 5902912 5791043 6164859 5595366 5468375 4678718 5016503
15939E016503q0260l69475J910203p36761j788333J94927R00186O11677K836l00369
$$ 5016503 4936243 4566768 6476971 5740210 3951877 4146804 5046990 5658667 5661503 5361134
15929E361134n89299o67898M2669O06640P99870l62313J74827Q82352n06526N3634
$$ 5361134 4771835 4103937 4146606 4753246 5553116 5190803 5365630 6247982 5741456 5795090
15919E795090p36343m14164O50768j093345l02130N93267n63874p6506P67047
$$ 5795090 5058747 4644583 5295351 4202006 3899876 4493143 3929269 3852763 4619810
15910D619810P96414K24072P22144O28694j079211j041728j199161R33635K48078
$$ 4619810 5416224 5640296 6362440 6991134 5911923 4870195 3671034 4604669 4852747
15901D852747M16864j434986J406304J46021J7867j14477O2655k72880n26886
$$ 4852747 5269611 3834625 5240929 5386950 5404817 5290340 5352995 5080115 4553229
15892D553229L53010l36448J30396k10352J98159j2850P792j16486R50788l84931
$$ 4553229 4906239 4569791 4700187 4489835 4687994 4675144 4682936 4566450 5517238 5132307
15882E132307L42615N21536m04364O619k45416p31115l75903M85011P02156j131356
$$ 5132307 5474922 5996458 5592094 5598713 5353297 4622182 4246279 4731290 5433446 4302090
15872D302090M53776J70674n12895l90935l36357m31503J061435J58414L43838
$$ 4302090 4755866 4926540 4413645 4022710 3686353 3254850 4316285 4474699 4818537
$$ [...]
##END NTUPLES=NMR SPECTRUM
##END=
