##TITLE=1H_DE-80H_X3
 200.13MHz, d2o
 8 sc
 
 19ns.26.2.2025
##JCAMPDX= 6.0         $$ Bruker NMR JCAMP-DX V2.0
##DATA TYPE= NMR SPECTRUM
##DATA CLASS= NTUPLES
##ORIGIN= UXNMR, Bruker Analytische Messtechnik GmbH
##OWNER= pz
$$ XWIN-NMR		Version 3.5
$$ Tue Jun 17 14:42:37 2025 Russian Standard Time (UT+4h)  Yarkov@DPX200
##.OBSERVE FREQUENCY= 200.1313
##.OBSERVE NUCLEUS= ^1H
##.ACQUISITION MODE= SIMULTANEOUS
##.ACQUISITION SCHEME= undefined
##.AVERAGES= 8
##.DIGITISER RES= 18
##SPECTROMETER/DATA SYSTEM= spect
##.PULSE SEQUENCE= zg30
##.SOLVENT NAME= CDCl3
##.SHIFT REFERENCE= (INTERNAL, CDCl3, 0, 15.4659)
##AUDIT TRAIL= $$ (NUMBER, WHEN, WHO, WHERE, WHAT)
$$ ##TITLE= Audit trail, XWIN-NMR		Version 3.5
$$ ##JCAMPDX= 5.01
$$ ##ORIGIN= Bruker BioSpin GmbH
$$ ##OWNER= Yarkov
$$ C:/Bruker/XWIN-NMR/data/yarkov2/nmr/H-C/1/pdata/1/auditp.txt
$$ ##AUDIT TRAIL=  $$ (NUMBER, WHEN, WHO, WHERE, WHAT)
(   1,<2025-06-17 14:41:29.10 +0400>,<Yarkov>,<DPX200>,
      <created by zg, POWCHK disabled, PULCHK disabled
       configuration hash MD5:
       00 E9 B6 7A A2 85 ED C7 34 08 36 98 17 FE 4E 26
       data hash MD5: 16K
       36 8F 17 EA DA F0 2C 21 12 36 AB 03 16 68 BF D1>)
(   2,<2025-06-17 14:41:33.57 +0400>,<Yarkov>,<DPX200>,
      <Start of raw data processing
       efp BC_mod = 2 LB = 0.25 FT_mod = 6 PKNL = 1 PHC0 = -1727.746 PHC1 = 22.56657 SI = 16K 
       data hash MD5: 16K
       A7 A0 08 D8 62 C6 7F CB 90 59 45 E2 1A 9F 8E 39>)
(   3,<2025-06-17 14:41:58.15 +0400>,<Yarkov>,<DPX200>,
      <pk PHC0 = 21.91184 PHC1 = -24.19999 
       data hash MD5: 16K
       A4 90 31 46 E9 55 48 76 DD 0D E3 02 87 6C F9 62>)
(   4,<2025-06-17 14:42:01.87 +0400>,<Yarkov>,<DPX200>,
      <abs ABSG = 5 
       data hash MD5: 16K
       8F 1F 45 DA D1 F8 CF F9 94 1D 37 45 49 55 91 18>)
$$ ##END=
$$ 
$$ hash MD5
$$ AE 29 3E 91 22 DC 59 2F 57 A9 27 FA 4C D0 93 DF
##$RELAX= 
##$RELAX= 
##$RELAX= 
##$RELAX= 
##$RELAX= 
##$RELAX= 
$$ Bruker specific parameters
$$ --------------------------
##$DU= <C:/Bruker/XWIN-NMR>
##$EXPNO= 1
##$NAME= <H-C>
##$PROCNO= 1
##$TYPE= <nmr>
##$USER= <yarkov2>
##$AMP= (0..31)
100 100 100 100 100 100 100 100 100 100 100 100 100 100 100 100 100 100 
100 100 100 100 100 100 100 100 100 100 100 100 100 100 
##$AQSEQ= 0
##$AQ_mod= 1
##$AUNM= <au_zg>
##$AUTOPOS= <>
##$BF1= 200.13
##$BF2= 200.13
##$BF3= 200.13
##$BF4= 200.13
##$BF5= 200.13
##$BF6= 200.13
##$BF7= 200.13
##$BF8= 200.13
##$BYTORDA= 1
##$CFDGTYP= 0
##$CFRGTYP= 5
##$CHEMSTR= <none>
##$CNST= (0..31)
1 1 145 1 1 1 1 1 1 1 1 1 1 1 1 1 1 1 1 1 1 1 1 1 1 1 1 1 1 1 1 1 
##$CPDPRG= <>
##$CPDPRG1= <>
##$CPDPRG2= <>
##$CPDPRG3= <>
##$CPDPRG4= <mlev>
##$CPDPRG5= <mlev>
##$CPDPRG6= <mlev>
##$CPDPRG7= <mlev>
##$CPDPRG8= <mlev>
##$CPDPRGB= <>
##$CPDPRGT= <>
##$D= (0..31)
0 0.7 0 0 0 0 0 0 0 0 0 0.03 0 0 0 0 0 0 0 0 0 0 0 0 0 0 0 0 0 0 0 0 
##$DATE= 1750156888
##$DBL= (0..7)
120 120 120 120 120 120 120 120 
##$DBP= (0..7)
150 150 150 150 150 150 150 150 
##$DBP07= 0
##$DBPNAM0= <>
##$DBPNAM1= <>
$$ [...]
##$SUBNAM3= <"">
##$SUBNAM4= <"">
##$SUBNAM5= <"">
##$SUBNAM6= <"">
##$SUBNAM7= <"">
##$SUBNAM8= <"">
##$SUBNAM9= <"">
##$SW= 18.0517328524113
##$SWIBOX= (0..15)
0 0 2 0 0 0 0 0 0 0 0 0 0 0 0 0 
##$SW_h= 3612.71676300578
##$TD= 16384
##$TD0= 1
##$TE= 0
##$TE2= 300
##$TE3= 300
##$TEG= 300
##$TL= (0..7)
0 120 120 120 120 120 120 120 
##$TP= (0..7)
150 150 150 150 150 150 150 150 
##$TP07= 0
##$TPNAME0= <>
##$TPNAME1= <>
##$TPNAME2= <>
##$TPNAME3= <>
##$TPNAME4= <>
##$TPNAME5= <>
##$TPNAME6= <>
##$TPNAME7= <>
##$TPOAL= (0..7)
0.5 0.5 0.5 0.5 0.5 0.5 0.5 0.5 
##$TPOFFS= (0..7)
0 0 0 0 0 0 0 0 
##$TUNHIN= 0
##$TUNHOUT= 0
##$TUNXOUT= 0
##$USERA1= <user>
##$USERA2= <user>
##$USERA3= <user>
##$USERA4= <user>
##$USERA5= <user>
##$V9= 5
##$VALIST= <valist>
##$VCLIST= <CCCCCCCCCCCCCCC>
##$VD= 0
##$VDLIST= <DDDDDDDDDDDDDDD>
##$VPLIST= <PPPPPPPPPPPPPPP>
##$VTLIST= <TTTTTTTTTTTTTTT>
##$WBST= 1024
##$WBSW= 4
##$XGAIN= (0..3)
0 0 0 0 
##$XL= 0
##$YL= 0
##$YMAX_a= 192164
##$YMIN_a= -158366
##$ZGOPTNS= <>
##$ZL1= 120
##$ZL2= 120
##$ZL3= 120
##$ZL4= 120
##$ABSF1= 15.47034
##$ABSF2= -2.58151
##$ABSG= 5
##$ABSL= 3
##$ALPHA= 0
##$AQORDER= 0
##$ASSFAC= 0
##$ASSFACI= 0
##$ASSFACX= 0
##$ASSWID= 0
##$AUNMP= <proc_1d>
##$AZFE= 0.1
##$AZFW= 0.1
##$BCFW= 0
##$BC_mod= 2
##$BYTORDP= 0
##$COROFFS= 0
##$CY= -3
##$DATMOD= 1
##$DC= 0
##$DFILT= <>
##$DTYPP= 0
##$F1P= 0
##$F2P= 0
##$FCOR= 1
##$FTSIZE= 16384
##$FT_mod= 6
##$GAMMA= 0
##$GB= 0
##$INTBC= 1
##$INTSCL= 3.241238e-09
##$ISEN= 128
##$LB= 0.25
##$LEV0= 0
##$LPBIN= 0
##$MAXI= 10000
##$MC2= 0
##$MEAN= 0
##$ME_mod= 0
##$MI= 1.114404
##$NCOEF= 0
##$NC_proc= -9
##$NLEV= 6
##$NOISF1= 3.799351
##$NOISF2= 2.8
##$NSP= 0
##$NTH_PI= 0
##$NZP= 0
##$OFFSET= 15.46593
##$PC= 1
##$PHC0= -1705.834
##$PHC1= -1.633419
##$PH_mod= 1
##$PKNL= yes
##$PPARMOD= 0
##$PSCAL= 0
##$PSIGN= 0
##$REVERSE= no
##$SF= 200.130011161825
##$SI= 16384
##$SIGF1= 3
##$SIGF2= 2
##$SINO= 0.751879
##$SIOLD= 32768
##$SREGLST= <19F.Aceton>
##$SSB= 0
##$STSI= 16384
##$STSR= 0
##$SW_p= 3612.71676300578
##$SYMM= 0
##$S_DEV= 0
##$TDeff= 16384
##$TDoff= 0
##$TI= <>
##$TILT= no
##$TM1= 0
##$TM2= 0
##$TOPLEV= 0
##$USERP1= <user>
##$USERP2= <user>
##$USERP3= <user>
##$USERP4= <user>
##$USERP5= <user>
##$WDW= 1
##$XDIM= 16384
##$YMAX_p= 445062254
##$YMIN_p= -1129340
$$ End of Bruker specific parameters
$$ ---------------------------------
##NTUPLES= NMR SPECTRUM
##VAR_NAME=  FREQUENCY,     SPECTRUM/REAL,   SPECTRUM/IMAG
##SYMBOL=    X,             R,               I
##VAR_TYPE=  INDEPENDENT,   DEPENDENT,       DEPENDENT
##VAR_FORM=  AFFN,          ASDF,            ASDF
##VAR_DIM=   16384,         16384,           16384
##UNITS=     HZ,            ARBITRARY UNITS, ARBITRARY UNITS
##FACTOR=    0.220516191357247, 1,           1
##FIRST=     3095.19674053534, 0,            0
##LAST=      -517.520022470443, 0,           0
##MIN=       -517.520022470443, -1129340,    0
##MAX=       3095.19674053534, 445062254,    0
$$ Real data points
##PAGE= N=1
##DATA TABLE= (X++(R..R)), XYDATA
$$ [...]
$$ plain form
5792 6925864 7208323 7420981 7393818 7715669 7919672 8227953 8480987 8480450 8575439 8558741 8786455
5781 8786455 8815441 9163601 9688029 10175311 10464491 10665130 11054305 11357133 11577828 11844369
5771 11844369 12064778 12150963 12488460 13003032 12880967 12964008 13159359 13380312 13613116 13853698
5761 13853698 14445897 15045073 15487335 16208905 16808678 17567436 18302449 19000889 19711855
5752 19711855 20103790 20748601 21011117 20938702 21216964 21373509 21734203 22197106 22148917 22138843
5742 22138843 22708218 22968493 23756266 24370257 24771081 25117177 25663136 26606279 27802763
5733 27802763 29173074 30162992 31330792 32419477 33567799 34931957 36448121 37924982
5725 37924982 38674635 39384222 39516844 39718362 39936078 39750473 40045200 40217991 40659173
$$ packed form
5792F925864K82459K12658k7163L21851K04003L08281K53034n37R4989j6698K27714
5781H786455K8986L48160N24428M87282K89180K00639L89175L02828K20695K66541
5771A1844369K20409Q6185L37497N14572j22065Q3041J95351K20953K32804K40582
5761A3853698N92199N99176M42262P21570N99773P58758P35013O98440P10966
5752A9711855L91935O44811K62516p2415K78262J56545L60694M62903m8189j0074
5742B2138843N69375K60275P87773O13991M00824L46096N45959R43143J196484
5733B7802763J370311R89918J167800J088685J148322J364158J516164J476861
5725C7924982P49653P09587J32622K01518K17716j85605K94727J72791M41182
$$ plain form
5716 40659173 41304703 42140030 43097047 44060199 45457268 47254934 49098907 51028940 53381389
5707 53381389 56232388 58689798 61009097 63373641 65442666 67465963 69616526 71711792
5699 71711792 73816331 76486752 79146053 82053336 85398692 89047679 92632564 96657825
5691 96657825 100725403 105225275 110045581 114646185 119280098 123604026 127809187 131671785
5683 131671785 135065504 137589446 139834837 141946346 143214666 144099419 145025782 146153109
5675 146153109 148026020 150534303 153558447 156937728 160512614 164841597 169903483 175064291
5667 175064291 180717471 186884697 192421554 197090738 201459224 204393969 205870070 206063954
5659 206063954 203840042 199878078 193947839 186557072 178883077 170992166 163055472 155330742
$$ packed form
5716D0659173O45530Q35327R57017R63152J397069J797666J843973J930033K352449
5707E3381389K850999K457410K319299K364544K069025K023297K150563K095266
5699G1711792K104539K670421K659301K907283L345356L648987L584885M025261
5691I6657825M067578M499872M820306M600604M633913M323928M205161L862598
5683A31671785L393719K523942K245391K111509J268320Q84753R26363J127327
5675A46153109J872911K508283L024144L379281L574886M328983N061886N160808
5667A75064291N653180O167226N536857M669184M368486K934745J476101J93884
5659B06063954k223912l961964n930239p390767p673995p890911p936694p724730
$$ plain form
5651 155330742 148386552 141121290 134961034 128588725 122954055 117960633 113588784 110109482
5643 110109482 106832388 103912882 101351498 98905172 96234993 93680495 91249641 89037613
5635 89037613 86837189 85092645 84125382 82996940 82214694 81992535 81396015 80894150 80168066
5626 80168066 79226901 77597199 75849109 74445611 73046419 71717007 70687806 69712925
5618 69712925 68853358 68342925 68198444 67527917 67011169 66859002 66719296 66616009 66717163
5609 66717163 66462963 66636481 66849254 67016293 67406025 67328784 67378525 67588706 67903912 68280996
5599 68280996 68989251 70013448 70789768 71106610 71031493 70382244 69389651 68472639 67679224
5590 67679224 67510480 67310130 67042537 67773926 68410124 69015082 69936661 70391819 70952346
$$ packed form
5651A55330742o944190p265262o160256o372309n634670m993422m371849l479302
5643A10109482l277094k919506k561384k446326k670179k554498k430854k212028
5635H9037613k200424j744544r67263j128442p82246k22159n96520n01865p26084
5626H0168066r41165j629702j748090j403498j399192j329412j029201r74881
5618F9712925q59567n10433j44481o70527n16748j52167j39706j03287J01154
5609F6717163k54200J73518K12773J67039L89732p7241M9741K10181L15206L77084
5599F8280996P08255J024197P76320L16842p5117o49249r92593r17012p93415
5590F7679224j68744k00350k67593P31389O36198O04958R21579M55158N60527
$$ plain form
5581 70952346 71333046 71964815 72618650 73760932 75111371 76428301 78173121 79789225 80613452
5572 80613452 81191704 81629863 81119133 80492521 79445275 78467121 77888891 77217581 76712045
5563 76712045 76610787 76608540 76478846 76094068 75835375 76086327 76006034 76372348 76975981 78218796
5553 78218796 79722153 81817273 84519411 87190079 90092856 93577706 96817867 98740789
5545 98740789 99053337 97176486 93842452 89669095 85309428 80866449 77135778 73830991
5537 73830991 70822472 68673655 67096027 66050605 65480374 65060328 65005714 64773841 64472296
5528 64472296 64501677 64416716 64221979 64679779 65369013 66316538 67287233 68317022 69063514 69118862
5518 69118862 68262679 67095759 65466778 63078035 60522555 58776457 56573226 54769935
$$ packed form
5581G0952346L80700O31769O53835J142282J350439J316930J744820J616104Q24227
5572H0613452N78252M38159n10730o26612j047246r78154n78230o71310n05536
5563G6712045j01258k247j29694l84778k58693K50952q0293L66314O03633J242815
5553G8218796J503357K095120K702138K670668K902777L484850L240161J922922
5545I8740789L12548j876851l334034m173357m359667m442979l730671l304787
5537G3830991l008519k148817j577628j045422n70231m20046n4614k31873l01545
5528F4472296K9381q4961j94737M57800O89234R47525R70695J029789P46492N5348
5518F9118862q56183j166920j628981k388743k555480j746098k203231j803291
$$ plain form
5510 54769935 53537414 52682698 52250493 52209468 52863116 53703056 54550239 55683004 55615367
5501 55615367 54011929 51530890 48730426 46227045 44205140 43020159 42177335 41798902
5493 41798902 41632559 41675947 41270407 40461840 39774980 39284136 38798607 38474757 37856563 36943200
5483 36943200 36059123 35246443 34634321 34160959 33904652 33868761 33942330 34111982 34332669 34874278
5473 34874278 34898913 34464199 33770504 33277811 32951708 32471723 32136399 32110585 32456540 32756145
5463 32756145 32861261 32968984 32528846 31789928 31254706 30704686 30144961 29589612 28813891
5454 28813891 28462707 28099124 27560236 27281251 27365014 27387424 27485874 27736709 28040405 27769321
5444 27769321 28261811 28702987 28714066 28757629 28902535 29351444 30075685 30556304 31233013 32326979
$$ packed form
5510E4769935j232521q54716m32205m1025O53648Q39940Q47183J132765o7637
5501E5615367j603438k481039k800464k503381k021905j184981q42824l78433
5493D1798902j66343M3388m05540q08567o86860m90844m85529l23850o18194r13363
5483C6943200q84077q12680o12122m73362k56307l5891P3569J69652K20687N41609
5473C4874278K4635m34714o93695m92693l26103m79985l35324k5814L45955K99605
5463C2756145J05116J07723m40138p38918n35222n50020n59725n55349p75721
5454B8813891l51184l63583n38888k78985Q3763K2410R8450K50835L03696k71084
5444B7769321M92490M41176J1079M3563J44906M48909P24241M80619O76709J093966
$$ plain form
5434 32326979 33222655 33420856 32803440 31904732 30527597 28973845 27449511 26394164 25672571
5425 25672571 25039172 24543693 24270712 23824843 23704492 23507284 23332914 23120797 23235972
5416 23235972 23334644 23252189 23212953 23287552 23315557 23293593 23379684 23360377 23473128 23887010 24144910
5405 24144910 24637644 24752367 24675144 24555016 23886767 23150717 22729760 22006171 21520953 20910681
5395 20910681 20441850 20348860 20272638 20249212 20033748 19949875 19649540 19263874 19131874 19192919
5385 19192919 19418932 19704241 19728713 19877134 19988972 19527835 19140930 18725805 18496951 18338240
5375 18338240 18273645 18327406 18496716 18402713 18227363 18641421 18839119 19015115 18970801 19208205
5365 19208205 19326794 19287164 19096384 18919791 18912469 19195547 19267654 19416718 19299408 19451923
$$ packed form
5434C2326979Q95676J98201o17416q98708j377135j553752j524334j055347p21593
5425B5672571o33399m95479k72981m45869j20351j97208j74370k12117J15175
5416B3235972R8672q2455l9236P4599K8005k1964Q6091j9307J12751M13882K57900
5405B4144910M92734J14723p7223j20128o68249p36050m20957p23589m85218o10272
5395B0910681m68831r2990p6222k3426k15464q3873l00335l85666j32000O1045
5385A9192919K26013K85309K4472J48421J11838m61137l86905m15125k28854j58711
5375A8338240o4595N3761J69310r4003j75350M14058J97698J75996m4314K37404
5365A9208205J18589l9630j90780j76593p322K83078P2107J49064j17310J52515
$$ plain form
5355 19451923 19408831 19123810 19042089 19302013 19204996 19116789 19161633 18854798 19303177 19560809
5345 19560809 19856910 20414797 21201722 21738795 22335054 22925044 23555485 23802759 23203263
5336 23203263 22618141 22170605 21963896 21969325 21920006 21962170 21972721 22165743 22614518 22927451
5326 22927451 23130270 23291116 23393002 23099420 22535926 22567563 22904717 22614372 22581235 22619713
5316 22619713 22999214 23569050 23897159 24276162 24561670 24419181 24066921 24031612 23816547 23288135
5306 23288135 22802861 22396657 22218227 22188592 22419640 22306920 22151815 22397616 22651957 23516232
5296 23516232 24038676 24503744 25143107 25864019 25861694 25888194 25711742 25543911 25453147 25029759
5286 25029759 24796325 24596998 24533770 24185227 23800248 23722199 23313369 22903389 22855816 22919933
$$ packed form
5355A9451923m3092k85021q1721K59924r7017q8207M4844l06835M48379K57632
5345A9560809K96101N57887P86925N37073N96259N89990O30441K47274n99496
5336B3203263n85122m47536k06709N429m9319M2164J0551J93022M48775L12933
5326B2927451K02819J60846J01886k93582n63494L1637L37154k90345l3137L8478
5316B2619713L79501N69836L28109L79003K85508j42489l52260l5309k15065n28412
5306B3288135m85274m06204j78430k9635K31048j12720j55105K45801K54341Q64275
5296B3516232N22444M65068O39363P20912k325K6500j76452j67831r0764m23388
5286B5029759k33434j99327o3228l48543l84979p8049m08830m09980m7573O4117
$$ plain form
5276 22919933 23262366 23515978 23305034 23622640 23986185 24119536 24168925 24498052 24953080 25231589
5266 25231589 25158912 25489269 25885406 25991295 26784044 27212056 27469057 27734037 27737799 28111988
5256 28111988 28250856 28344349 28488599 28660238 28866289 28944511 29905904 30212726 30096103 29930284
5246 29930284 29694370 29461179 28998812 29089980 28888479 28605425 28326203 27897837 27860498 27556445
5236 27556445 27658871 27556040 27247434 26767630 26542096 26133908 26220763 26227833 26141864 26027930
5226 26027930 25901460 26021345 26023175 26213152 26303922 26561447 26624973 26971080 27282131 27375456
5216 27375456 27625440 27806827 27851171 28043470 27989435 28234488 28574343 28542827 28815705 28785047
5206 28785047 28518660 28427141 28085897 27726799 27561567 27683969 27436776 27083748 26713275 26661174
$$ packed form
5276B2919933L42433K53612k10944L17606L63545J33351M9389L29127M55028K78509
5266B5231589p2677L30357L96137J05889P92749M28012K57001K64980L762L74189
5256B8111988J38868R3493J44250J71639K06051P8222R61393L06822j16623j65819
5246B9930284k35914k33191m62367R1168k01501k83054k79222m28366l7339l04053
5236B7556445J02426j02831l08606m79804k25534m08188Q6855P070q5969j13934
5226B6027930j26470J19885J830J89977R0770K57525O3526L46107L11051R3325
5216B7375456K49984J81387M4344J92299n4035K45053L39855l1516K72878l0658
5206B8785047k66387r1519l41244l59098j65232J22402k47193l53028l70473n2101
$$ plain form
5196 26661174 26276027 25668084 25276235 24951503 24649775 24172173 23773310 23376867 23000179
5187 23000179 22953832 22702132 22555525 22745853 22580282 22848769 22731582 22812371 22754253 22659865
5177 22659865 22669933 22361039 22108281 21860867 21970610 22126995 21994933 21728191 21773410 21717593
5167 21717593 21603224 21318016 20702707 20645815 20591773 20446977 20346000 19969566 20021152 20020133
5157 20020133 19885377 19656289 19410310 19326112 19185849 19276530 19275344 19223161 19193547 19159480 19065795
5146 19065795 19058539 19058251 18774803 18765625 18994046 18952071 18954894 19065122 19346763 19386415 19397971
5135 19397971 19890436 20233794 20404440 20745653 20949786 21510676 21984107 22191493 22967553
5126 22967553 24085279 24826351 25681423 26981940 27998345 28774943 28749507 27995339 26634361
$$ packed form
5196B6661174l85147o07943l91849l24732l01728m77602l98863l96443l76688
5187B3000179m6347k51700j46607J90328j65571K68487j17187Q0789n8118r4388
5177B2659865J0068l08894k52758k47414J09743J56385j32062k66742M5219n5817
5167B1717593j14369k85208o15309n6892n4042j44796j00977l76434N1586j019
5157B0020133j34756k29088k45979q4198j40263R0681j186n2183k9614l4067r3685
5146A9065795p256k88k83448r178K28421m1975K823J10228K81641L9652J1556
5135A9397971M92465L43358J70646L41213K04133N60890M73431K07386P76060
5126B2967553J117726P41072Q55072J300517J016405P76598k5436p54168j360978
$$ plain form
5117 26634361 25242187 24144348 23404207 22992231 22711934 22308952 21975372 21978277 21784398
5108 21784398 21979993 22247886 21895766 22087701 22114901 22206076 21959474 22023063 22399275 22584371
5098 22584371 22742621 22718934 22952493 23304825 23666609 24041140 24153074 24331870 24486027 24349889
5088 24349889 24460733 24939667 24903240 24855083 25210605 25560670 25799051 25893830 26331886 26833732
5078 26833732 27290137 27516701 27749816 27821909 27983933 28195540 28450919 28877527 29253087 29330066
5068 29330066 29683342 30133390 30775232 31199657 31656493 32044050 32606563 33535586 34446626
5059 34446626 35328540 36118424 36770085 37146118 37814271 38500751 38824841 39276349 39730452
5050 39730452 39890171 39626555 39260722 39087128 38588961 38402626 38071602 38118390 38464061 38598830
$$ packed form
5117B6634361j392174j097839p40141m11976k80297m02982l33580K905j93879
5108B1784398J95595K67893l52120J91935K7200R1175k46602O3589L76212J85096
5098B2584371J58250k3687K33559L52332L61784L74531J11934J78796J54157j36138
5088B4349889J10844M78934l6427m8157L55522L50065K38381R4779M38056N01846
5078B6833732M56405K26564K33115P2093J62024K11607K55379M26608L75560P6979
5068B9330066L53276M50048O41842M24425M56836L87557N62513R29023R11040
5059C4446626Q81914P89884O51661L76033O68153O86480L24090M51508M54103
5050C9730452J59719k63616l65833j73594m98167j86335l31024M6788L45671J34769
$$ plain form
5040 38598830 38592197 38771421 38494573 38382813 38469254 38250961 38321959 38352960 38225334 38293159
5030 38293159 38413494 38076726 38133985 38288911 38561012 38625503 39028048 39425343 39747669 40177278
5020 40177278 40736012 41276736 41975952 42644525 43439244 43916685 44598783 45350726 46372930
5011 46372930 46492370 46690111 47318910 47190897 46745168 46079159 45419200 44909905 44978791 45166859
5001 45166859 45785637 46239605 46510187 46786726 47120522 47596533 48145533 48695412 49768278
4992 49768278 50315905 50851131 51448288 51943699 52614790 53242973 53814045 54632347 55227385
4983 55227385 55850391 56440891 57293818 58445504 59769626 61229246 62774233 64201052 65635843
4974 65635843 67126481 68813621 70521020 72530262 74464472 76129410 77985869 79405053
$$ packed form
5040C8598830o633J79224k76848j11760Q6441k18293P0998L1001j27626O7825
5030C8293159J20335l36768N7259J54926K72101O4491M02545L97295L22326M29609
5020D0177278N58734N40724O99216O68573P94719M77441O82098P51943J022204
5011D6372930J19440J97741O28799j28013m45729o66009o59959n09295O8886J88068
5001D5166859O18778M53968K70582K76539L33796M76011N49000N49879J072866
4992D9768278N47627N35226N97157M95411O71091O28183N71072Q18302N95038
4983E5227385O23006N90500Q52927J151686J324122J459620J544987J426819J434791
4974F5635843J490638J687140J707399K009242J934210J664938J856459J419184
$$ plain form
4966 79405053 80976330 82372338 83437031 83935717 84265238 84689188 84957207 84980243 85111514
4957 85111514 85332839 85223671 85548416 85948587 86256724 86375967 87015961 87871245 88627628
4948 88627628 89467130 90779220 91760938 92670101 93940146 95285201 96933225 98233189 99361865
4939 99361865 100751294 102307208 103506248 104315290 105098905 105850370 106331524 106191938 105631378
4930 105631378 104852844 103816550 103002938 102147824 101651276 101222883 100599246 99821548 98625154
4921 98625154 98020601 97839083 97598422 97281047 97134896 97786881 98335034 98829019 99441714
4912 99441714 100224698 101106543 102422668 103538843 104547538 106034959 107546745 108947489
4904 108947489 110590198 112688713 115377726 118495899 122137988 126003249 129920829 133592351
$$ packed form
4966G9405053J571277J396008J064693M98686L29521M23950K68019K3036J31271
4957H5111514K21325j09168L24745M00171L08137J19243O39994Q55284P56383
4948H8627628Q39502J312090R81718R09163J270045J345055J648024J299964J128676
4939I9361865J389429J555914J199040Q09042P83615P51465M81154j39586n60560
4930A05631378p78534j036294q13612q55114m96548m28393o23637p77698j196394
4921I8625154o04553j81518k40661l17375j46151O51985N48153M93985O12695
4912I9441714P82984Q81845J316125J116175J008695J487421J511786J400744
4904A08947489J642709K098515K689013L118173L642089L865261L917580L671522
$$ plain form
4896 133592351 136148214 137022087 136098692 134609598 133069710 131378927 130096260 129192123
4888 129192123 129175064 129816699 131642079 133963167 136653625 139871042 143170869 146846522
4880 146846522 151358863 155977575 160837592 165642534 170546474 175666930 180826589 186021533
4872 186021533 191854988 198429133 205559192 213428554 221184345 228106697 233779637 237270030
4864 237270030 238947037 239048636 237340765 233607700 228151273 221649603 214253354 207001212
4856 207001212 199709640 192920924 186643911 180921328 175547769 170769531 166245927 161985339
4848 161985339 157509086 153231342 148805565 144072396 139471280 134974267 131164249 126909245
4840 126909245 122335196 118519489 114878188 111300735 108029426 105047264 101888799 99427440
$$ packed form
4896A33592351K555863Q73873r23395j489094j539888j690783j282667r04137
4888A29192123j7059O41635J825380K321088K690458L217417L299827L675653
4880A46846522M512341M618712M860017M804942M903940N120456N159659N194944
4872A86021533N833455O574145P130059P869362P755791O922352N672940L490393
4864B37270030J677007J01599j707871l733065n456427o501670p396249p252142
4856B07001212p291572o788716o277013n722583n373559m778238m523604m260588
4848A61985339m476253m277744m425777m733169m601116m497013l810018m255004
4840A26909245m574049l815707l641301l577453l271309k982162l158465k461359
$$ plain form
4832 99427440 96967726 94489243 92424622 90280938 88531957 86883943 85437242 83909682
4824 83909682 82577461 81791020 80754708 79743163 78661415 77375658 75845140 74617162
4816 74617162 72897234 71491121 70354808 69247617 68410572 67808788 67486883 67006485 66487839
4807 66487839 66137684 65730976 65453690 65362107 65461484 65919765 66275522 66444443 66762080 66706753
4797 66706753 66612232 66435912 66378839 66084770 65479211 65242937 65358962 65644836 65980834 66448585
4787 66448585 66609194 66174011 65499755 64754185 64009275 63932175 63652767 63525674 63223708 63140295
4777 63140295 63249959 63360967 63302849 63044225 62825816 63042558 63411326 63638141 63723833 64054882
4767 64054882 64040781 63476641 62555951 61628155 60804380 60103126 59458734 58689703 58031718 57815972
$$ packed form
4832I9427440k459714k478483k064621k143684j748981j648014j446701j527560
4824H3909682j332221p86441j036312j011545j081748j285757j530518j227978
4816G4617162j719928j406113j136313j107191q37045o01784l21905m80398n18646
4807F6487839l50155m06708k77286r1583R9377M58281L55757J68921L17637n5327
4797F6706753r4521j76320n7073k94069o05559k36274J16025K85874L35998M67751
4787F6448585J60609m35183o74256p45570p44910p7100k79408j27093l01966q3413
4777F3140295J09664J11008n8118k58624k18409K16742L68768K26815Q5692L31049
4767F4054882j4101n64140r20690r27796q23775p01254o44392p69031o57985k15746
$$ plain form
4757 57815972 57484220 57381893 56873989 56245467 55721599 55487295 55764798 55627003 56002794
4748 56002794 56381837 56766158 57204916 57706986 58359267 59029814 60008866 61196243 62073478
4739 62073478 63405957 64812211 65717300 66499181 67172579 67371947 67113273 67099372 66688973
4730 66688973 66388174 66297833 65732000 65473649 65259807 64833748 64910454 65127161 65395972 66138252
4720 66138252 67135728 68139219 69364857 70616071 72140121 73492137 74519854 75422576
4712 75422576 76513139 77483807 78244025 79303244 80211787 81438869 82648317 84211598 85827583
4703 85827583 87301919 88783039 89682391 90103388 90133689 89843139 89688447 89833836 89548215
4694 89548215 89497096 89860713 90602840 91327506 92062120 93431590 95142715 96729512 98710364
$$ packed form
4757E7815972l31752j02327n07904o28522n23868k34304K77503j37795L75791
4748E6002794L79043L84321M38758N02070O52281O70547R79052J187377Q77235
4739F2073478J332479J406254R05089P81881O73398J99368k58674j3901m10399
4730F6688973l00799r0341n65833k58351k13842m26059P6706K16707K68811P42280
4720F6138252R97476J003491J225638J251214J524050J352016J027717R02722
4712G5422576J090563R70668P60218J059219R08543J227082J209448J563281J615985
4703H5827583J474336J481120Q99352M20997L0301k90550j54692J45389k85621
4694H9548215n1119L63617P42127P24666P34614J369470J711125J586797J980852
$$ plain form
4685 98710364 101445583 104081534 107258450 110279827 113835867 117637108 121918913 127193123
4677 127193123 132539288 139026877 146637271 155276118 165307992 176239831 188331299 200929186
4669 200929186 212642518 223268946 232116752 239467591 247754121 257955272 269499794
4662 269499794 281458547 293317315 306554273 321404457 337033873 351478780 363375460
4655 363375460 373036317 381100186 388870116 394235901 394250659 387122817 371559995 350016462
4647 350016462 325921379 302184133 281433394 264773023 252441093 243327587 236360994
4640 236360994 231130773 226167965 221236278 215696525 209998895 205052742 201444960 198957419
4632 198957419 197223013 196598407 196548121 197052554 197513542 197867975 198162946 198409642 198482047
$$ packed form
4685I8710364K735219K635951L176916L021377L556040L801241M281805N274210
4677A27193123N346165O487589P610394Q638847J0031874J0931839J2091468J2597887
4669B00929186J1713332J0626428Q847806P350839Q286530J0201151J1544522
4662B69499794J1958753J1858768J3236958J4850184J5629416J4444907J1896680
4655C63375460R660857Q063869P769930N365785J4758p127842j5562822k1543533
4647C50016462k4095083k3737246k0750739j6660371j2331930r113506o966593
4640B36360994n230221m962808m931687n539753n697630m946153l607782k487541
4632A98957419j734406o24606n0286N04433M60988L54433K94971K46696P2405
$$ plain form
4623 198482047 197620439 195837110 192187665 186674672 179989542 173982181 168829595 163969901
4615 163969901 158409327 151584169 144981461 139179384 134133769 129746041 125838656 122336783
4607 122336783 119224833 116815708 115271978 113688327 112331782 111669035 111383127 111393505 111473460
4598 111473460 111619726 111796606 111807652 111794291 112094340 112822963 114184465 116455406 119100472
4589 119100472 121968607 123557578 123544270 121002563 116741807 112605327 110387740 108372403
4581 108372403 106477757 104596395 102065882 99521105 97297626 95520118 94089104 93757265
4573 93757265 93922967 93815527 94448548 94980936 95934030 97384269 99017828 101228797 103212315
4564 103212315 105138736 107071371 108733797 110151102 111286724 112581178 113883560 114712168
$$ packed form
4623A98482047q61608j783329l649445n512993o685130o007361n152586m859694
4615A63969901n560574o825158o602708n802077n045615m387728l907385l501873
4607A22336783l111950k409125j543730j583651j356545o62747k85908J0378P9955
4598A11473460J46266J76880J1046j3361L00049P28623J361502K270941K645066
4589A19100472K868135J588971j3308k541707m260756m136480k217587k015337
4581A08372403j894646j881362k530513k544777k223479j777508j431014l31839
4573I3757265J65702j07440O33021N32388R53094J450239J633559K210969J983518
4564A03212315J926421J932635J662426J417305J135622J294454J302382Q28608
$$ plain form
4556 114712168 114666091 113539030 111458714 108467990 104894359 101113214 97688772 93912848
4548 93912848 90785933 87816136 85491459 83705638 81840471 80136257 78679278 77828237
4540 77828237 76862648 75963114 75970041 75508092 75095141 75212746 75349128 75230948 75295493 75307867
4530 75307867 74409208 72980941 71460173 70337799 69335662 68465909 68002349 67567836 66805714
4521 66805714 66287795 66304300 65981860 65773077 65654353 65931631 65562767 65016637 64627117 63849271
4511 63849271 62823983 61419813 60060403 58845785 57793846 57303395 56637727 56119578 55608471
4502 55608471 55326189 54858420 54222870 53556112 53317619 52961993 52529560 52234225 51805068
4493 51805068 51613373 51649799 51375978 51077004 51201879 51096154 51168383 51143742 51219236 51343143
$$ packed form
4556A14712168m6077j127061k080316k990724l573631l781145l424442l775924
4548I3912848l126915k969797k324677j785821j865167j704214j456979q51041
4540G7828237r65589q99534O927m61949m12951J17605J36382j18180O4545J2374
4530G5307867q98659j428267j520768j122374j002137q69753m63560m34513p62122
4521F6805714n17919J6505l22440k08783j18724K77278l68864n46130l89520p77846
4511F3849271j025288j404170j359410j214618j051939m90451o65668n18149n11107
4502E5608471k82282m67769o35550o66758k38493l55626m32433k95335m29157
4493E1805068j91695L6426k73821k98974J24875j05725P2229k4641P5494J23907
$$ plain form
4483 51343143 51510624 51643223 52121249 52528265 53184386 53964721 54372177 55093202 55803347
4474 55803347 56323679 56906125 57959611 59496222 60987321 62975865 65586488 68610428
4466 68610428 71429908 73891536 76153940 76894157 76525761 76065998 75720626 75959926 76036927
4457 76036927 76198966 76286584 76358619 76170512 76512539 76894311 77414112 77597292 78689906 80208926
4447 80208926 82005957 83777444 85775981 87888345 90074571 92608522 94888124 96624641
4439 96624641 97212649 96061618 92934758 88430209 83506858 79026118 75444343 72564818
4431 72564818 69977934 67877407 65972650 64454181 62793212 61747400 60465834 59519193
4423 59519193 58934667 58257369 57959479 57786401 57470673 57699851 57481586 57364698 57101353
$$ packed form
4483E1343143J67481J32599M78026M07016O56121P80335M07456P21025P10145
4474E5803347N20332N82446J053486J536611J491099J988544K610623L023940
4466F8610428K819480K461628K262404P40217l68396m59763l45372K39300P7001
4457G6036927J62039Q7618P2035j88107L42027L81772N19801J83180J092614J519020
4447H0208926J797031J771487J998537K112364K186226K533951K279602J736517
4439I6624641N88008j151031l126860m504549m923351m480740l581775k879525
4431G2564818k586884k100527j904757j518469j660969j045812j281566r46641
4423E9519193n84526o77298k97890j73078l15728K29178k18265j16888k63345
$$ plain form
4414 57101353 56690439 56698023 56899182 57238341 57337544 57378607 57246527 56885766 56725597 56695273
4404 56695273 56966754 57535502 58617036 60313668 62914218 65782413 68957095 72774818
4396 72774818 75735746 76497005 73818727 68992087 64517775 61077228 58307764 56390870
4388 56390870 54445855 53495382 52481841 51404255 50897811 50211640 49659784 49243031 48744028
4379 48744028 48368468 47878020 47907495 47717771 47736897 47934359 48060116 48530598 48602497 48829484
4369 48829484 48859885 48639458 48641151 48769871 48785467 48636125 47790804 46870835 46205755 45787748
4359 45787748 45334300 44802494 44334645 44209370 44263611 44166897 44620016 45210262 45663951 45955225
4349 45955225 46176272 46219495 46313407 46315604 46113762 45844884 45140055 44759601 44546256 44776476
$$ packed form
4414E7101353m10914P584K01159L39159R9203M1063j32080l60761j60169l0324
4404E6695273K71481N68748J081534J696632K600550K868195L174682L817723
4396G2774818K960928P61259k678278m826640m474312l440547k769464j916894
4388E6390870j945015r50473j013541j077586n06444o86171n51856m16753m99003
4379D8744028l75560m90448K9475j89724J9126J97462J25757M70482P1899K26987
4369D8829484L0401k20427J693J28720J5596j49342q45321r19969o65080m18007
4359D5787748m53448n31806m67849j25275N4241r6714M53119N90246M53689K91274
4349D5955225K21047M3223R3912K197k01842k68878p04829l80454k13345K30220
$$ plain form
4339 44776476 45172533 45417148 45621602 46216794 46788580 47515256 47806900 47688604 47685126 47795763
4329 47795763 47757506 47395821 47003380 47108541 47166531 47034072 46728600 46553813 46041398 45305234
4319 45305234 45140446 44580655 43925164 43649186 43323306 42573642 42155222 41390391 40850052
4310 40850052 40080719 39652707 39036860 38469955 38077710 37479408 36925038 36451231 36149857
4301 36149857 35412781 34710972 34506996 34161702 33554696 33424995 33260109 33373817 33238777
4292 33238777 33091507 32979705 32991094 33580834 33671638 33656876 33791820 34365108 34813172 35621020
4282 35621020 36267410 36859816 37438276 37693587 38058998 38632117 38867807 38357853 38039862
4273 38039862 37491171 36907451 36279359 36058185 35220058 34788053 34339480 34108501 33852151
$$ packed form
4339D4776476L96057K44615K04454N95192N71786P26676K91644j18296l478J10637
4329D7795763l8257l61685l92441J05161N7990j32459l05472j74787n12415p36164
4319D5305234j64788n59791o55491k75978l25880p49664m18420p64831n40339
4310D0850052p69333m28012o15847n66905l92245n98302n54370m73807l01374
4301C6149857p37076p01809k03976l45294o07006j29701j64886J13708j35040
4292C3238777j47270j11802J1389N89740R0804j4762J34944N73288M48064Q07848
4282C5621020O46390N92406N78460K55311L65411N73119K35690n09954l17991
4273C8039862n48691n83720o28092k21174q38127m32005m48573k30979k56350
$$ plain form
4264 33852151 33466484 33169029 33453738 33151343 33047740 32926756 32877442 32795397 32761897 32905474
4254 32905474 32659303 32863242 32779227 32572953 32761486 32623734 32493998 32181284 32123645 32192896
4244 32192896 31752065 31586670 31189858 30865174 30456965 30161188 30091187 30394657 30243322 30439821
4234 30439821 30901182 31047746 31118667 31355052 31733239 32489150 33384480 34528475 34917392
4225 34917392 35186660 35282023 35597829 35900803 36175941 36058005 35576401 34717303 34009669 33797437
4215 33797437 33508908 32875290 32260649 32224793 31974582 31731550 31663463 31683204 31929690 32043454
4205 32043454 32202807 32222077 32519563 32987312 33390592 33513075 33609142 33857303 34088316 34314988
4195 34314988 34630170 34767197 34806145 34728633 34886394 34971654 34291617 33774176 33912919 33504535
$$ packed form
4264C3852151l85667k97455K84709l02395j03603j20984m9314q2045l3500J43577
4254C2905474k46171K03939q4015k06274J88533j37752j29736l12714n7639O9251
4244C2192896m40831j65395l96812l24684m08209k95777p0001L03470j51335J96499
4234C0439821M61361J46564P0921K36385L78187P55911Q95330J143995L88917
4225C4917392K69268R5363L15806L02974K75138j17936m81604q59098p07634k12232
4215C3797437k88529o33618o14641l5856k50211k43032o8087J9741K46486J13764
4205C2043454J59353J9270K97486M67749M03280J22483R6067K48161K31013K26672
4195C4314988L15182J37027L8948p7512J57761Q5260o80037n17441J38743m08384
$$ plain form
4185 33504535 33011345 32496423 31922134 31831893 31473051 31018919 30996740 30863067 30647972 30831440
4175 30831440 30787810 30607266 30695167 30693813 30742563 30922331 30862366 30927948 30711345 31061118 31307551
4164 31307551 31221589 31261995 31422595 31487654 31577038 31710713 31596163 31644226 31889244 31703548
4154 31703548 31731149 31717500 31206426 30746595 30556205 29889753 29897313 29715526 29590547 29124833
4144 29124833 28909379 28634573 28193206 27935747 27602956 27332854 26808733 26426133 26007538
4135 26007538 25863829 25576452 25459263 25242456 25053727 25057540 24900226 24745257 24961736 25027366
4125 25027366 24804070 24788824 24879294 24820725 24732871 24759832 24365653 24303937 24571809 24628357 24529450
4114 24529450 24383720 24193342 24064928 23950567 23383279 23275079 22752130 22231558 22093264
$$ packed form
4185C3504535m93190n14922n74289r0241l58842m54132k2179j33673k15095J83468
4175C0831440m3630j80544Q7901j354M8750J79768n9965O5582k16603L49773K46433
4164C1307551q5962M0406J60600O5059Q9384J33675j14550M8063K45018j85696
4154C1703548K7601j3649n11074m59831j90390o66452P560j81787j24979m65714
4144B9124833k15454k74806m41367k57459l32791k70102n24121l82600m18595
4135B6007538j43709k87377j17189k16807j88729L813j57314j54969K16479O5630
4125B5027366k23296j5246R0470n8569q7854K6961l94179o1716K67872N6548r8907
4114B4529450j45730j90378j28414j14361n67288j08200n22949n20572j38294
$$ plain form
4105 22093264 21653169 21367225 21310840 21393147 21041093 20639103 20357352 19987320 19914134 19747214
4095 19747214 19377134 19226442 18995666 18632105 18257190 18040931 17900554 17570379 17280940
4086 17280940 17434011 17294846 17109769 17059732 16869622 16779788 16716012 16700617 16466884 16256441
4076 16256441 16334567 16278597 15982349 15861457 15795405 15952412 15691549 15485009 15070255 15119033
4066 15119033 15369517 15297084 15273432 15039848 14920249 15114619 15261156 15068123 15014317 14742900
4056 14742900 14653499 14754651 15018852 15168564 15194877 15685019 15592811 15389536 15277706 15271980
4046 15271980 15280378 15385814 15301818 15177612 15121393 15344609 15605306 15799608 15896643 15784937
4036 15784937 15818896 15554914 15515131 15450719 15669895 15648706 15414398 15587913 15760456 15616868
$$ packed form
4105B2093264m40095k85944n6385Q2307l52054m01990k81751l70032p3186j66920
4095A9747214l70080j50692k30776l63561l74915k16259j40377l30175k89439
4086A7280940J53071j39165j85077n0037j90110q9834o3776j5395k33733k10443
4076A6256441P8126n5970k96248j20892o6052J57007k60863k06540m14754M8778
4066A5119033K50484p2433k3652k33584j19599J94370J46537j93033n3806k71417
4056A4742900q9401J01152K64201J49712K6313M90142r2208k03275j11830n726
4046A5271980Q398J05436q3996j24206n6219K23216K60697J94302R7035j11706
4036A5784937L3959k63982l9783o4412K19176k1189k34308J73515J72543j43588
$$ plain form
4026 15616868 15729486 15880650 16151552 16329940 16217931 16368936 16314563 16124094 16222676 16113948
4016 16113948 15971700 16216249 16203279 16340156 16351200 16424621 16549326 16465676 16358237 16537384
4006 16537384 16530543 16567124 16763597 16931330 16847893 16783631 16611929 16573293 16997498 17259149
3996 17259149 17256662 17129259 17295700 17395534 17366357 17411216 17537372 17311401 17313117 17489986 17495435
3985 17495435 17515351 17449582 17475207 17224241 17180297 17558261 17258159 17152332 17190913 17316435
3975 17316435 17482001 17655254 17708729 17795371 17778397 17827810 18045252 18056720 18431738 18764254
3965 18764254 18982019 19086142 19152107 19024907 19004614 19256886 19278596 19128485 19040646 19102921
3955 19102921 18933673 19067132 19066158 19031368 19295702 19293125 19333243 19151547 18984473 18970867 19139038
$$ packed form
4026A5616868J12618J51164K70902J78388j12009J51005n4373j90469R8582j08728
4016A6113948j42248K44549j2970J36877J1044P3421J24705q3650j07439J79147
4006A6537384o841L6581J96473J67733q3437o4262j71702l8636M24205K61651
3996A7259149k487j27403J66441R9834k9177M4859J26156k25971J716J76869N449
3985A7495435J9916o5769K5625k50966m3944L77964l00102j05827L8581J25522
3975A7316435J65566J73253N3475Q6642j6974M9413K17442J1468L75018L32516
3965A8764254K17765J04123O5965j27200k0293K52272K1710j50111q7839O2275
3955A9102921j69248J33459r74l4790K64334k577M0118j81696j67074j3606J68171
$$ plain form
3944 19139038 19254835 19398855 19548442 19565108 19523706 19521873 19819157 20207036 20549831 20924543
3934 20924543 21309894 21733566 22339365 22654286 22841263 23151526 23289795 23214332 23225245 23081754
3924 23081754 23227323 23118944 23128131 22811370 22281900 22394788 22073551 21887141 21585823 21565644
3914 21565644 21869374 22114018 22185933 22329667 22664519 22678905 22688689 22504735 22649525 22906647
3904 22906647 22956515 23025072 23332492 23856534 24334342 24801160 25111374 25894100 26384260 26462886
3894 26462886 26606688 26795463 26807920 26888879 26915875 27034193 26870162 26920909 26755769 26561851
3884 26561851 26594778 26453873 26593801 26829765 26972595 26922438 26803735 27043573 27209307 26944129
3874 26944129 27090515 27261225 27836387 28184659 28313784 28917396 29286341 29695397 30357473
$$ packed form
3944A9139038J15797J44020J49587J6666m1402j833K97284L87879L42795L74712
3934B0924543L85351M23672O05799L14921J86977L10263J38269p5463J0913j43491
3924B3081754J45569j08379R187l16761n29470J12888l21237j86410l01318k0179
3914B1565644L03730K44644P1915J43734L34852J4386R784j83954J44790K57122
3904B2906647M9868O8557L07420N24042M77808M66818L10214P82726M90160P8626
3894B6462886J43802J88775J2457Q0959K6996J18318j64031N0747j65140j93918
3884B6561851L2927j40905J39928K35964J42830n0157j18703K39838J65734k65178
3874B6944129J46386J70710N75162L48272J29125O03612L68945M09056O62076
$$ plain form
3865 30357473 31038407 31524773 31850011 32007522 32170067 32476832 32448064 32317820 32328548 32613327
3855 32613327 32745467 33459630 33555606 33752221 34001268 34118566 34660419 35001063 35301792 35870305
3845 35870305 36256755 36983865 37448097 38058551 39030370 39838736 40951294 42094174 43351132
3836 43351132 44164667 44452918 44392198 45007993 45645441 46064959 46682959 46848926 47278634 48037394
3826 48037394 48775028 49665517 50490968 51488704 52471319 53102964 53358576 53807057 54718590
3817 54718590 55370500 55992282 56851047 57420485 58859451 60174875 61741507 63883461 66199575
3808 66199575 68226505 70245783 72100545 73540371 75106988 75824305 76048498 76355518 76597817
3799 76597817 77084256 77721886 78660197 80291487 81533801 82448814 83336369 84040685 84853098
$$ packed form
3865C0357473O80934M86366L25238J57511J62545L06765k8768j30244J0728K84779
3855C2613327J32140P14163R5976J96615K49047J17298N41853L40644L00729N68513
3845C5870305L86450P27110M64232O10454R71819Q08366J112558J142880J256958
3836D3351132Q13535K88251o0720O15795O37448M19518O18000J65967M29708P58760
3826D8037394P37634Q90489Q25451R97736R82615O31645K55612M48481R11533
3817E4718590O51910O21782Q58765N69438J438966J315424J566632K141954K316114
3808F6199575K026930K019278J854762J439826J566617P17317K24193L07020K42299
3799G6597817M86439O37630R38311J631290J242314R15013Q87555P04316Q12413
$$ plain form
3790 84853098 85571041 86401269 87052852 87630214 88356685 89059453 90335606 91799514 93149741
3781 93149741 94206876 95369646 96652380 98015321 99336152 100945872 103303029 105736501
3773 105736501 107767271 109529833 110699837 111251325 111883308 112077317 112661815 113083572 113383606
3764 113383606 113434287 112894024 112056081 111293933 110889554 110923239 111627650 112048702 112325032 112737608
3754 112737608 112595746 112332655 112081097 111859957 111543563 111363726 111225899 111265043 111230267 111501348
3744 111501348 111876112 112455859 113167999 113612654 114133501 114892049 115724807 116857129 118491859
3735 118491859 119971603 120810559 121659195 122441498 122413343 122158271 121383804 120326247 119442874
3726 119442874 118278941 117219407 116404074 116136129 115964333 115200100 114161901 113109112 112128973
$$ packed form
3790H4853098P17943Q30228O51583N77362P26471P02768J276153J463908J350227
3781I3149741J057135J162770J282734J362941J320831J609720K357157K433472
3773A05736501K030770J762562J170004N51488O31983J94009N84498M21757L00034
3764A13383606N0681n40263q37943p62148m04379L3685P04411M21052K76330M12576
3754A12737608j41862k63091k51558k21140l16394j79837j37827L9144l4776K71081
3744A11501348L74764N79747P12140M44655N20847P58548Q32758J132322J634730
3735A18491859J479744Q38956Q48636P82303k8155k55072p74467j057557q83373
3726A19442874j163933j059534q15333k67945j71796p64233j038199j052789r80139
$$ plain form
3717 112128973 111192517 110009322 108435531 107546272 106901675 106415704 105635859 105462493 105813701
3708 105813701 106472435 107190137 107802186 108645250 109345019 109937056 110297442 110576122 110765891
3699 110765891 110981584 110714942 110179490 109510743 108406962 107796069 107457446 107009311 106448404
3690 106448404 105860785 105104743 104977428 105030669 105315003 105417754 105664551 106011225 106497859
3681 106497859 106486743 106453597 106602707 107142969 107693439 108600565 109634784 110791533 112511918
3672 112511918 114208618 115806279 117771666 119460960 120679977 121657071 122250048 122722141
3664 122722141 122840656 122836556 122420999 122005950 121659459 121717401 122108762 122610392 123309743 124351219
3654 124351219 125701748 127305533 128942551 130623212 132404511 134060937 136003366 138661116
$$ packed form
3717A12128973r36456j183195j573791q89259o44597m85971p79845j73366L51208
3708A05813701O58734P17702O12049Q43064O99769N92037L60386K78680J89769
3699A10765891K15693k66642n35452o68747j103781o10893l38623m48135n60907
3690A06448404n87619p56042j27315N3241K84334J02751K46797L46674M86634
3681A06497859j1116l3146J49110N40262N50470R07126J034219J156749J720385
3672A12511918J696700J597661J965387J689294J219017R77094N92977M72093
3664A22722141J18515m100m15557m15049l46491N7942L91361N01630O99351J041476
3654A24351219J350529J603785J637018J680661J781299J656426J942429K657750
$$ plain form
3646 138661116 141263359 143543025 146370779 149472713 152634560 155620322 158537209 161765015
3638 161765015 164893620 167259990 169419914 171200867 172237454 172868579 173707012 174252588
3630 174252588 174473496 174398818 173720056 173515707 172980245 172438020 171312838 170749974 170481324
3621 170481324 170796174 171782731 173679882 176126812 178460860 181005056 183278130 185622956
3613 185622956 187447407 188408225 189168423 189847724 191001573 192086910 193638609 195347450
3605 195347450 197282559 198971965 200253338 201202508 202004466 202505272 202912769 202866379 202204815
3596 202204815 201902823 201300057 200536442 200203816 199741504 199184152 198478782 198204987 197806909
3587 197806909 198015229 198529836 199059106 200451052 202123021 203538805 204606951 205799159
$$ packed form
3646A38661116K602243K279666K827754L101934L161847K985762K916887L227806
3638A61765015L128605K366370K159924J780953J036587O31125Q38433N45576
3630A74252588K20908p4678o78762k04349n35462n42225j125182n62864k68650
3621A70481324L14850R86557J897151K446930K334048K544196K273074K344826
3613A85622956J824451R60818P60198O79301J153849J085337J551699J708841
3605A95347450J935109J689406J281373R49170Q01958N00806M07497m6390o61564
3596B02204815l01992o02766p63615l32626m62312n57352p05370k73795l98078
3587A97806909K08320N14607N29270J391946J671969J415784J068146J192208
$$ plain form
3579 205799159 207442435 208889818 210503520 211992405 213457696 214991171 216540010 217751097
3571 217751097 218807734 220008889 220381931 220429875 220340891 219848596 219454880 218731492 217641284
3562 217641284 216500001 214754887 213471702 212212054 210751790 209653520 208961590 208174303
3554 208174303 207606999 207342816 207537632 207521371 207863544 208414410 208852525 209356011 210072236
3545 210072236 210451363 211039163 211178361 211556986 211901797 212312278 212601735 212334963 212287834
3536 212287834 211897076 210669216 209262372 208496459 207818961 207223284 207192390 207401943 207264876
3527 207264876 206736557 206470689 205730850 205155341 204834864 204745232 204609660 204650569 204821082 205375215
3517 205375215 206054104 206652983 207749953 208734895 209695333 210966298 212098570 213206074 214533742
$$ packed form
3579B05799159J643276J447383J613702J488885J465291J533475J548839J211087
3571B17751097J056637J201155L73042M7944q8984m92295l93716p23388j090208
3562B17641284j141283j745114j283185j259648j460264j098270o91930p87287
3554B08174303n67304k64183J94816j6261L42173N50866M38115N03486P16225
3545B10072236L79127N87800J39198L78625L44811M10481K89457k66772m7129
3536B12287834l90758j227860j406844p65913o77498n95677l0894K09553j37067
3527B07264876n28319k65868p39839n75509l20477q9632j35572M0909J70513N54133
3517B05375215O78889N98879J096970R84942R60438J270965J132272J107504J327668
$$ plain form
3508 214533742 215853032 217135380 218639567 220669083 223192743 226513020 230528475 234748546
3500 234748546 239680307 245151932 250950362 256953816 262816904 268149377 272314478 275557604
3492 275557604 276756355 276318303 274203300 270587911 265821183 260048513 253568155 246262861
3484 246262861 238103740 229456027 220579078 212252443 204745086 197486061 190393018 183784228
3476 183784228 177527218 172025809 166949742 162076855 157783065 154004500 150196908 146815387
3468 146815387 143163365 139295730 135505244 132106251 128892254 125518107 122459676 119426874
3460 119426874 116293297 113909693 111929163 109842854 107784780 105768366 103691063 101447796
3452 101447796 99632410 97658280 95970843 94138329 92582950 90955639 89226576 88032481
$$ packed form
3508B14533742J319290J282348J504187K029516K523660L320277M015455M220071
3500B34748546M931761N471625N798430O003454N863088N332473M165101L243126
3492B75557604J198751m38052k115003l615389m766728n772670o480358p305294
3484B46262861q159121q647713q876949q326635p507357p259025p093043o608790
3476A83784228o257010n501409n076067m872887m293790l778565l807592l381521
3468A46815387l652022l867635l790486l398993l213997l374147l058431l032802
3460A19426874l133577k383604j980530k086309k058074k016414k077303k243267
3452A01447796j815386j974130j687437j832514j555379j627311j729063j194095
$$ plain form
3444 88032481 86950874 85813639 85048309 84409029 84032658 84064899 84472673 84430021 84096605
3435 84096605 83812276 83518069 83313372 82495183 81675696 81506327 82117774 82955673 83515518
3426 83515518 83030896 81054762 77405514 73483952 70165335 67508803 65406303 63727447
3418 63727447 62208909 60566575 59539973 58713811 57831541 57042618 56378952 55885980 55241350
3409 55241350 54443830 54059496 53578664 53001623 52719485 52513397 51922396 51362990 50685528
3400 50685528 49776658 48948858 48073176 47444263 46853211 45958864 45023479 44601564 44047604
3391 44047604 43586382 43119845 42938285 43037845 42815520 42577138 42654516 42784844 42809741 42481828
3381 42481828 41986050 41615750 41500344 40696925 40172607 39697189 39138130 38400387 38113976
$$ packed form
3444H8032481j081607j137235p65330o39280l76371L2241M07774m2652l33416
3435H4096605k84329k94207k04697q18189q19487j69369O11447Q37899N59845
3426H3515518m84622j976134l649248l921562l318617k656532k102500j678856
3418F3727447j518538j642334j026602q26162q82270p88923o63666m92972o44630
3409E5241350p97520l84334m80832n77041k82138k06088n91001n59406o77462
3400E0685528r08870q27800q75682o28913n91052q94347r35385m21915n53960
3391D4047604m61222m66537j81560R9560k22325k38382P7378J30328K4897l27913
3381D2481828m95778l70300j15406q03419n24318m75418n59059p37743k86411
$$ plain form
3372 38113976 37481451 36722620 36076966 35697659 35264102 34984027 34870316 34668271 34411597
3363 34411597 34222324 34259305 34048311 34032182 33919542 33870000 33942345 34168827 34246138 34481667
3353 34481667 34772133 34896441 34971951 35207291 35499644 35643388 35235878 35100344 35000769 34579536
3343 34579536 34004570 33789885 33374034 32971720 32744936 32367593 31645421 31519805 31390387
3334 31390387 30969248 30488541 30716800 30643539 30573210 30437080 30287788 30275867 30424753 30669542
3324 30669542 30966312 31381317 31314231 31575520 31916349 32206434 32801852 33160328 33393962 33694160
3314 33694160 33639237 33727071 33939791 33663921 33192085 32878257 32570653 32522672 32380197 32054788
3304 32054788 31729787 31722712 31539625 31719356 31735178 32017756 32687881 32749438 32495884 32462844
$$ packed form
3372C8113976o32525p58831o45654l79307m33557k80075j13711k02045k56674
3363C4411597j89273L6981k10994j6129j12640m9542P2345K26482P7311K35529
3353C4481667K90466J24308P5510K35340K92353J43744m07510j35534r9575m21233
3343C4579536n74966k14685m15851m02314k26784l77343p22172j25616j29418
3334C1390387m21139m80707K28259p3261p0329j36130j49292j1921J48886K44789
3324C0669542K96770M15005o7086K61289L40829K90085N95418L58476K33634L00198
3314C3694160n4923Q7834K12720k75870m71836l13828l07604m7981j42475l25409
3304C2054788l25001p075j83087J79731J5822K82578O70125O1557k53554l3040
$$ plain form
3294 32462844 32668911 32481535 32842064 32896185 32758636 33161970 33401085 33552896 33763991 33952862
3284 33952862 34093648 34710980 35408793 35756075 35959906 35998824 36199944 36670763 36671794 36836715
3274 36836715 36685153 37134095 37561102 37952038 38614872 39223345 39909034 39865151 40338047 40935890
3264 40935890 41209690 41467230 41778300 42277929 42744738 43371581 44225759 45440056 47052367
3255 47052367 48497787 49888419 51257042 52644440 53856733 54691622 54991144 54996701 55420811
3246 55420811 55744789 56147524 56736796 57302033 58076694 59153552 60669289 62005189 63471035
3237 63471035 65291910 67016035 68946096 71000573 73170071 75704760 78072035 81057466
3229 81057466 84205234 87242473 90508690 94186825 98022554 102305268 106812105 111947054
$$ packed form
3294C2462844K06067j87376L60529N4121j37549M03334K39115J51811K11095J88871
3284C3952862J40786O17332O97813L47282K03831L8918K01120M70819J031J64921
3274C6836715j51562M48942M27007L90936O62834O08473O85689m3883M72896N97843
3264D0935890K73800K57540L11070M99629M66809O26843Q54178J214297J612311
3255D7052367J445420J390632J368623J387398J212293Q34889K99522N557M24110
3246E5420811L23978M02735N89272N65237P74661J076858J515737J335900J465846
3237F3471035J820875J724125J930061K054477K169498K534689K367275K985431
3229H1057466L147768L037239L266217L678135L835729M282714M506837N134949
$$ plain form
3221 111947054 117987733 124114379 130775892 137342180 143863197 150828703 158498709 167704078
3213 167704078 178304534 190241638 203021504 215135752 225227225 233086886 237630102
3206 237630102 239090402 239317064 239464130 240436303 242211684 244917445 247848842 250424323
3198 250424323 252844863 254843426 257212381 259878075 262877026 266487059 270617028 275001448
3190 275001448 279326127 283825295 287939874 291945788 296645056 302077206 308939505 318013264
3182 318013264 329667619 344406359 362016210 381721418 401292702 420301221 434903779
3175 434903779 443139700 445062254 442328857 438766915 435713225 433246859 430244389 425046606
3167 425046606 417663006 410276405 403635641 398542832 394827260 391788633 389025212 385476656
$$ packed form
3221A11947054O040679O126646O661513O566288O521017O965506P670006R205369
3213A67704078J0600456J1937104J2779866J2114248J0091473P859661M543216
3206B37630102J460300K26662J47066R72173J775381K705761K931397K575481
3198B50424323K420540J998563K368955K665694K998951L610033M129969M384420
3190B75001448M324679M499168M114579M005914M699268N432150O862299R073759
3182C18013264J1654355J4738740J7609851J9705208J9571284J9008519J4602558
3175D34903779Q235921J922554k733397l561942l053690k466366l002470n197783
3167D25046606p383600p386601o640764n092809l715572l038627k763421l548556
$$ plain form
3159 385476656 381264214 376951430 372484326 366681296 360114254 353625464 347709842 343388711
3151 343388711 341573113 341540976 343187742 345792774 348167974 348530780 346172859 340890791
3143 340890791 333085884 324045463 313993286 303470600 293086239 282743050 273254644
3136 273254644 264502025 256283204 248690745 241237507 234297600 227926616 221732235 215610048
3128 215610048 209741066 204495403 199674277 195061064 190757212 186214725 181607626 176715904
3120 176715904 171503557 166231893 161060581 155684076 150404665 145199877 139762352 134360920
3112 134360920 128811823 123281852 118113729 113339716 109431842 105612186 102090346 98976657
3104 98976657 95953020 93245117 90819501 88749878 86755719 84302931 82203766 80177700
$$ packed form
3159C85476656m212442m312784m467104n803030o567042o488790n915622m321131
3151C43388711j815598l2137J646766K605032K375200L62806k357921n282068
3143C40890791p804907r040421j0052177j0522686j0384361j0343189r488406
3136B73254644q752619q218821p592459p453238o939907o370984o194381o122187
3128B15610048n868982n245663m821126m613213m303852m542487m607099m891722
3120A76715904n212347n271664n171312n376505n279411n204788n437525n401432
3112A34360920n549097n529971n168123m774013l907874l819656l521840l113689
3104I8976657l023637k707903k425616k069623j994159k452788k099165k026066
$$ plain form
3096 80177700 78128645 75773736 73777092 71884608 69600368 67669026 65888020 63992940
3088 63992940 62170690 60342286 58747031 57173913 55537219 53911009 52667111 51476939
3080 51476939 50378198 49196323 48106381 47173192 46323684 45692331 44484745 43829547 42977776
3071 42977776 41955651 41644597 40936090 40113341 39483153 39035253 38209092 37373082 36678784
3062 36678784 36065493 35701972 35035767 34494076 34345635 34183230 33987732 33782424 33603634
3053 33603634 33688012 33287769 32753852 32175900 31235394 30432996 29761089 29095092 28422178 27592314
3043 27592314 26995274 26757538 26434498 26035418 25624549 25415407 24780917 24584109 24636121 24394727
3033 24394727 23958829 23927987 24025117 24022753 24024206 23839866 23572885 23457010 23620905 23668030 24137531
$$ packed form
3096H0177700k049055k354909j996644j892484k284240j931342j781006j895080
3088F3992940j822250j828404j595255j573118j636694j626210j243898j190172
3080E1476939j098741j181875j089942r33189q49508o31353j207586o55198q51771
3071D2977776j022125l11054p08507q22749o30188m47900q26161q36010o94298
3062C6678784o13291l63521o66205n41691j48441j62405j95498k05308j78790
3053C3603634Q4378m00243n33917n77952r40506q02398o71907o65997o72914q29864
3043B7592314n97040k37736l23040l99080m10869k09142o34490j96808N2012k41394
3033B4394727m35898l0842R7130k364J453j84340k66981j15875J63895M7125M69501
$$ plain form
3022 24137531 24428424 24966985 25626420 25578071 24940451 24247525 23319598 22158688 21149910
3013 21149910 20360783 19630371 18960955 18599435 18236738 17775778 17572811 17338667 16993687
3004 16993687 16623427 16420105 15991998 15566121 15114535 15205878 15274765 14935651 14604042 14491282
2994 14491282 14530463 14612395 14563066 14781699 14989576 15059406 15106585 15460046 15291461 14882829
2984 14882829 14727998 14228670 13782575 13345835 12970193 12471834 12099233 11962982 11686567
2975 11686567 11325465 10960058 10697786 10545935 10239690 10011402 10050837 9965014 9977852 9700061
2965 9700061 9574583 9642186 9597350 9257909 8994738 9079916 9066718 9036927 9008264 8983096 9002535
2954 9002535 8744072 8566374 8553988 8395291 8371650 8024199 8074670 7891261 7713399 7641813
$$ packed form
3022B4137531K90893N38561O59435m8349o37620o92926r27927j160910j008778
3013B1149910p89127p30412o69416l61520l62697m60960k02967k34144l44980
3004A6993687l70260k03322m28107m25877m51586R1343O8887l39114l31609j12760
2994A4491282L9181Q1932m9329K18633K07877O9830M7179L53461j68585m08632
2984A4882829j54831m99328m46095m36740l75642m98359l72601j36251k76415
2975A1686567l61102l65407k62272j51851l06245k28288L9435q5823J2838k77791
2965I700061j25478O7603m4836l39441k63171Q5178j3198k9791k8663k5168J9439
2954I002535k58463j77698j2386j58697k3641l47451N0471j83409j77862p1586
$$ plain form
2944 7641813 7599751 7609076 7290663 7159621 7084062 6828097 6803355 6738188 6780274 6963292 7362879
2933 7362879 7277154 7192684 7091634 6947188 6887308 6899938 6961122 6758802 6982329 7148723
2923 7148723 6950556 6970906 6823828 6870646 6871596 6691405 6354775 6028319 6349566 6382082 6278686
2912 6278686 6263069 5901543 5851796 5826566 5915102 6049925 6153333 6224938 6145711 6039531 6036092
2901 6036092 5863122 5915567 5847045 5951244 6145854 5949276 6087782 6373300 6466590 6332117
2891 6332117 6662857 6637653 6301939 5965149 5789415 5982764 5655090 5763014 6027531 5753959
2881 5753959 5510420 5346902 5332177 5543190 5554075 5367460 5705252 5585581 5261925 5364492
2871 5364492 5418475 5178196 5096155 4922585 4886305 4856172 4962993 4855355 4977652 4863361
$$ packed form
2944G641813m2062R325l18413j31042p5559k55965k4742o5167M2086J83018L99587
2933G362879q5725q4470j01050j44446n9880J2630O1184k02320K23527J66394
2923G148723j98167K0350j47078M6818R50j80191l36630l26456L21247L2516j03396
2912F278686j5617l61526m9747k5230Q8536J34823J03408P1605p9227j06180l439
2901F036092j72970N2445o8522J04199J94610j96578J38506K85518R3290j34473
2891F332117L30740k5204l35714l36790j75734J93349l27674J07924K64517k73572
2881E753959k43539j63518j4725K11013J0885j86615L37792j19671l23656J02567
2871E364492N3983k40279q2041j73570l6280l0133J06821j07638J22297j14291
$$ plain form
2861 4863361 4522770 4353518 4409536 4530187 4340165 4294240 4114142 3912115 3849153 3683498
2851 3683498 3804854 3552349 3427467 3478173 3426123 3369063 3339603 3212127 3329965 3489683
2841 3489683 3476870 3433553 3275506 3257688 3114343 3213546 3188707 3097708 2906382 2840512 2791111
2830 2791111 2776137 2624797 2556969 2624269 2534001 2534370 2433330 2390203 2241142 2207808 2079816
2819 2079816 2092297 2267128 2220900 2251401 2011641 1845933 1610506 1515544 1366038 1348252
2809 1348252 1602159 1657895 1619765 1728805 1636953 1518993 1302967 1622599 1667672 1490427
2799 1490427 1385188 1634377 1854830 1776776 1600889 1537472 1625857 1361972 1588679 1488438
2789 1488438 1413754 1516266 1679819 1651348 1472667 1598824 1782670 1383079 1052777 1360869
$$ packed form
2861D863361l40591j69252N6018J20651j90022m5925j80098k02027o2962j65655
2851C683498J21356k52505j24882N0706n2050n7060k9460j27476J17838J59718
2841C489683j2813m3317j58047j7818j43345R9203k4839r0999j91326o5870m9401
2830B791111j4974j51340o7828O7300r0268L69j01040m3127j49061l3334j27992
2819B079816J2481J74831m6228L0501k39760j65708k35427r4962j49506j7786
2809A348252K53907N5736l8130J09040r1852j17960k16026L19632M5073j77245
2799A490427j05239K49189K20453p8054j75887o3417Q8385k63885K26707j00241
2789A488438p4684J02512J63553k8471j78681J26157J83846l99591l30302L08092
$$ plain form
2779 1360869 1284319 1335379 1408476 1447271 1320145 1201496 1326206 1421487 1417286 1336596 1479084
2768 1479084 1440079 1591396 1632181 1689582 1730791 1771415 1878994 1519646 1437556 1478139 1263841
2757 1263841 1371915 1337348 1041715 1010290 1055975 1263920 1037425 951994 1182054 945259
2747 945259 812879 998307 1094432 911373 966584 1107523 1181451 1223660 1242828 1421444 1671023
2736 1671023 1807001 1755466 1921501 2020392 2220242 2239449 2495958 2488395 2122439 1843561
2726 1843561 1391110 1324325 1402666 1326087 1034405 725266 792242 790992 957110 989772 790835
2715 790835 886078 679426 704576 684582 502316 862325 584957 689576 864997 387986
2705 387986 458371 592479 567568 577936 640315 733143 748036 1057115 1187824 1235290 1017464
$$ packed form
2779A360869p6550N1060P3097L8795j27126j18649J24710R5281m201q0690J42488
2768A479084l9005J51317M0785N7401M1209M0624J07579l59348q2090M0583k14298
2757A263841J08074l4567k95633l1425M5685K07945k26495q5431K30060k36795
2747I45259j32380J85428R6125j83059N5211J40939P3928M2209J9168J78616K49579
2736A671023J35978n1535J66035R8891J99850J9207K56509p563l65956k78878
2726A843561m52451o6785P8341p6579k91682l09139O6976j250J66118L2662j98937
2715G90835R5243k06652K5150j9994j82266L60009k77368J04619J75421m77011
2705C87986P0385J34108k4911J0368O2379R2828J4893L09079J30709M7466k17826
$$ plain form
2694 1017464 740949 732094 507962 321079 199439 540312 569451 605973 451456 537681
2684 537681 654347 650765 478574 410286 327704 323891 326756 131483 383948 257124 117608
2673 117608 181736 110971 258618 87130 -94747 -166392 151397 306543 390895 418125 181407
2662 181407 75132 94332 14396 166662 393650 272244 -43933 -104443 -96795 -12444 -264333
2651 -264333 -132014 -189484 -111387 -38176 75954 8208 -129477 -228021 -236792 -3134 48388
2640 48388 20882 167751 74584 -84691 -21374 -41974 143379 212114 308551 169785 165909
2629 165909 -61629 -84718 -149860 -102117 32962 344042 394227 94483 17219 357729 159064
2618 159064 280198 597496 453600 462979 230912 -23035 95265 113131 -94119 83807
$$ packed form
2694A017464k76515q855k24132j86883j21640L40873K9139L6522j54517Q6225
2684E37681J16666l582j72191o8288q2582l813K865j95273K52465j26824j39516
2673A17608O4128p0765J47647j71488j81877p1645L17789J55146Q4352K7230k36718
2662A81407j06275J9200p9936J52266K26988j21406l16177o0510P648Q4351k51889
2651b64333J32319n7470P8097P3211J14130o7746j37685r8544q771K33658N1522
2640D8388k7506J46869r3167j59275O3317k0600J85353O8735R6437j38766l876
2629A65909k27538k3089o5142M7743J35079L11080N0185k99744p7264L40510j98665
2618A59064J21134L17298j43896R379k32067k53947J18300J7866k07250J77926
$$ plain form
2608 83807 -144678 -252394 -116027 -121948 -202347 -458228 -478367 -399747 -120284 -100962 -141727
2597 -141727 -342778 32357 4010 19302 18174 22851 167597 217794 -67734 -342990 -539805
2586 -539805 -638541 -341306 82278 -58053 -168066 -211182 -13225 -269290 -7944 -13674
2576 -13674 -242268 -123677 -97476 -355215 -356046 77381 19441 -67580 -210366 -38591 169639
2565 169639 -136708 -514455 -366335 94797 83574 179837 408327 286954 -3304 -140005
2555 -140005 138860 -111703 -107598 -144246 -193647 -228403 -251602 -323634 -254342 -170352 -294437
2544 -294437 -293401 33351 85877 -28617 -245299 -183640 -124894 42257 32034 -265758 -803220
2533 -803220 -292837 -24894 6044 -136929 -1800 -43157 -51346 -12919 -209043 -3325 -232429
$$ packed form
2608H3807k28485j07716J36367n921q0399k55881k0139P8620K79463J9322m0765
2597a41727k01051L75135k8347J5292j128M677J44746N0197k85528k75256j96815
2586e39805r8736K97235M23584j40331j10013m3116J97957k56065K61346n730
2576a3674k28594J18591K6201k57739q31M33427n7940q7021j42786J71775K08230
2565A69639l06347l77747J48120M61132j1223R6263K28490j21373k90258j36701
2555a40005K78865k50563M105l6648m9401l4756k3199p2032O9292Q3990j24085
2544b94437J036L26752N2526j14494k16682O1659N8746J67151j0223k97792n37462
2533h03220N10383K67943L0938j42973J35129m1357q189L8427j96124K05718k29104
$$ plain form
2522 -232429 -144506 -111237 129873 14585 -148528 -171363 -293949 -90233 -235664 -316210
2512 -316210 -47943 -115855 -284722 -303935 -200814 -66961 -68739 -150041 -286556 -259634 -43636
2501 -43636 -46477 -345191 -55241 -29429 76549 42797 -101471 -185512 -358393 -195853 -9289
2490 -9289 26969 203004 217380 48952 86596 255600 189105 93242 380070 265018 -5915
2479 -5915 -23785 -9792 -67253 -71851 43687 -57075 -195395 79503 21117 -181694 90137
2468 90137 143594 115609 -77540 -301766 -31601 70102 103908 -76024 -59606 -220361 13169
2457 13169 243216 208655 241110 268895 -13762 -144689 230119 -12686 15814 272101 439852
2446 439852 421757 11899 300471 260772 43253 204370 226736 214097 75069 150743 274717
$$ packed form
2522b32429Q7923L3269K41110j15288j63113k2835j22586K03716j45431q0546
2512c16210K68267o7912j68867j9213J03121J33853j778q1302j36515K6922K15998
2501d3636k841k98714K89950K5812J05978l3752j44268q4041j72881J62540J86564
2490i289L6258J76035J4376j68428L7644J69004o6495r5863K86828j15052k70933
2479e915j7870J3993n7461m598J15538j00762j38320K74898n8386k02811K71831
2468I0137N3457k7985j93149k24226K70165J01703L3806j79932J6418j60755K33530
2457A3169K30047l4561L2455K7785k82657j30927L74808k42805K8500K56287J67751
2446D39852j8095m09858K88572l9699k17519J61117K2366j2639j39028P5674J23974
$$ plain form
2435 274717 322371 271609 269273 369771 361244 516146 231155 260478 460510 485060 474674
2424 474674 537838 430399 241611 298625 650923 855340 702424 669905 789790 607524
2414 607524 724852 670067 618969 774307 760605 668702 814816 1109004 1149876 1129061 1191504
2403 1191504 1560648 1439741 1134953 1327823 1376478 1570460 1562274 1518169 1709239 1964152
2393 1964152 2197418 1977731 2177482 2208981 2372696 2455152 2799344 2950462 3142621 3103353
2383 3103353 3345996 3737391 3852183 3872915 4220361 4366603 4798077 5238840 5555587 6119368
2373 6119368 6519570 7038721 7391611 8126736 9011737 9903076 10644789 11714122 13328037
2364 13328037 15079631 17302083 18781256 19939961 20705660 21740578 23112903 24768517
$$ packed form
2435B74717M7654n0762k336J00498q527J54902k84991K9323K00032K4550j0386
2424D74674O3164j07439j88788N7014L52298K04417j52916l2519J19885j82266
2414F07524J17328n4785n1098J55338j3702r1903J46114K94188M0872k0815O2443
2403A191504L69144j20907l04788J92870M8655J93982q186m4105J91070K54913
2393A964152K33266k19687J99751L1499J63715Q2456L44192J51118J92159l9268
2383C103353K42643L91395J14792K0732L47446J46242M31474M40763L16747N63781
2373F119368M00202N19151L52890P35125Q85001Q91339P41713J069333J613915
2364A3328037J751594K222452J479173J158705P65699J034918J372325J655614
$$ plain form
2356 24768517 27092796 30608014 34653104 40074898 47586029 58758115 71640419 87198005
2348 87198005 102156027 110645468 102396679 79332118 62371542 50809131 42695790 36404114
2340 36404114 31912210 28458080 25724452 23680587 22085248 20666743 19498727 18302740
2332 18302740 17045308 15918853 14564960 12942477 11526884 10619099 9884082 9197166 8497445
2323 8497445 8213734 8029433 7393635 7024004 6768543 6272227 5802870 5552323 5435715 5224152
2313 5224152 4842301 4602373 4321961 4189296 4085890 4179928 4153245 3988836 3992746 3681077
2303 3681077 3251636 2860867 2810613 2547388 2370716 1987723 2257468 2236351 1997664 2227119
2293 2227119 2155460 2148036 2146660 2000667 1703154 1343803 1317880 1292479 1423967 1300368 1330572
$$ packed form
2356B4768517K324279L515218M045090N421794P511131J1172086J2882304J5557586
2348H7198005J4958022Q489441q248789k3064561j6960576j1562411q113341o291676
2340C6404114m491904l454130k733628k043865j595339j418505j168016j195987
2332A8302740j257432j126455j353893j622483j415593r07785p35017o86916o99721
2323H497445k83711j84301o35798l69631k55461m96316m69357k50547j16608k11563
2313E224152l81851k39928k80412j32665j03406R4038k6683j64409L910l11669
2303C681077m29441l90769n0254k63225j76672l82993K69745k1117k38687K29455
2293B227119p1659p424j376j45993k97513l59351k5923k5401J31488j23599L0204
$$ plain form
2282 1330572 1453283 1550409 1530018 1444709 1351507 1060438 1034109 1225723 1029791 934936 1170583
2271 1170583 1042837 894283 897914 1082591 1137663 1049004 955121 873257 841854 922742 1127236
2260 1127236 794192 443066 363833 515809 592843 950937 751155 758481 636967 454982
2250 454982 423478 428818 311731 252230 267846 370739 245760 312302 343172 479483 571298
2239 571298 495517 476759 115060 -99414 192891 333864 312509 360280 481970 688583
2229 688583 393895 120344 275795 97027 154449 466529 369655 255392 41232 -218139
2219 -218139 -241987 -251917 -118490 300551 139552 9270 259054 281821 31060 198844
2209 198844 143084 -24552 -202132 -116484 -103190 91126 350191 518082 572211 382961
$$ packed form
2282A330572J22711R7126k0391q5309r3202k91069k6329J91614j95932r4855K35647
2271A170583j27746j48554L631J84677N5072q8659r3883q1864l1403Q0888K04494
2260A127236l33044l51126p9233J51976P7034L58094j99782P326j21514j81985
2250D54982l1504N340j17087n9501J5616J02893j24979O6542L0870J36311R1815
2239E71298p5781j8758l61699k14474K92305J40973k1355M7771J21690K06613
2229F88583k94688k73551J55451j78768N7422L12080r6874j14263k14160k59371
2219b18139k3848r930J33427M19041j60999j30282K49784K2767k50761J67784
2209A98844n5760j67636j77580Q5648J3294J94316K59065J67891N4129j89250
$$ plain form
2199 382961 57876 36756 273938 527066 336809 108073 -72991 -372410 -361388 -256167
2189 -256167 145846 388089 358031 180856 55685 21272 -23994 -85856 1546 166155 62405
2178 62405 21267 -79245 -160045 -255225 -197838 -40283 -8874 -30312 93098 -73079 290
2167 290 -59889 -240331 -350979 -338822 -356721 -245920 44845 5874 -381306 -230288 -159662
2156 -159662 -491596 -423268 -295639 -133132 108263 -105589 -219539 20520 -361762 -304598
2146 -304598 -385524 -503363 -449608 -668837 -414865 -107710 -83860 -127292 -333750 15764
2136 15764 71774 -67441 46827 37648 -9019 -40646 -32524 -36020 76633 19600 -497174 -379850
2124 -379850 -124828 -77484 2820 2794 6976 -262922 -214113 -287126 -128593 -52358 -54276 -384864
$$ packed form
2199C82961l25085k1120K37182K53128j90257k28736j81064k99419J1022J05221
2189b56167M02013K42243l0058j77175j25171l4413m5266o1862Q7402J64609j03750
2178F2405m1138j00512q0800r5180N7387J57555L1409k1438J23410j66177P3369
2167B90o0179j80442j10648J2157j7899J10801K90765l8971l87180J51018P0626
2156a59662l31934O8328J27629J62507K41395k13852j13950K40059l82282N7164
2146c04598q0926j17839N3755k19229K53972L07155K3850m3432k06458L49514
2136A5764N6010j39215J14268r179m6667l1627Q122l496J12653n7033n16774J17324
2124c79850K55022M7344Q0304k6M182k69898M8809p3013J58533P6235j918l30588
$$ plain form
2112 -384864 -405959 -208194 -300871 -169296 254844 86176 -166526 -307415 -389228 -416926
2102 -416926 -294223 -187426 -90791 -264654 -228848 78982 5360 -69508 -383654 -348405 -264917
2091 -264917 -196121 -290551 6123 350274 80288 -42628 -311929 -264697 -219501 -287749 -159175
2080 -159175 99845 382514 252070 73089 -85716 -217149 104631 271180 -80164 -122930
2070 -122930 -137388 -23398 -145132 -125947 46776 127903 58390 305338 -79119 -379371
2060 -379371 -184465 -84688 -15122 -300545 -505841 -219651 -130128 -304432 -179957 -157548
2050 -157548 -386326 -56997 -98419 -121976 -33851 -417465 -702374 -601790 -600909 -285388 -113993
2039 -113993 -236744 -134342 -215984 -319824 -294675 -394894 -458477 -354903 -207186 -157735
$$ packed form
2112c84864k1095J97765r2677J31575M24140j68668k52702j40889q1813k7698
2102d16926J22703J06797R6635j73863L5806L07830p3622p4868l14146L5249Q3488
2091b64917O8796r4430K96674L44151k69986j22916k69301M7232M5196o8248J28574
2080a59175K59020K82669j30444j78981j58805j31433L21780J66549l51344m2766
2070a22930j4458J13990j21734J9185J72723Q1127o9513K46948l84457l00252
2060c79371J94906R9777O9566k85423k05296K86190Q9523j74304J24475K2409
2050a57548k28778L29329m1422k3557Q8125l83614k84909J00584Q81L15521J71395
2039a13993j22751J02402q1642j03840K5149j00219o3583J03574J47717M9451
$$ plain form
2029 -157735 5875 169265 -19410 128229 -24984 -135705 111134 112384 199647 -51449
2019 -51449 -278290 -3892 -324191 -480977 -351882 -423423 -447960 -348369 -310004 -137368 -56784
2008 -56784 -365535 -621684 -372427 -180251 -301987 -654337 -483722 -500498 -438311 -578033
1998 -578033 -381391 -372624 -253867 -160404 -413373 -331914 -516922 -332184 -248127 -289397 -336883
1987 -336883 26548 -248263 -432103 -395204 -667106 -614084 -434609 -497819 -645919 -662694
1977 -662694 -572873 -581019 -559385 -383150 -256190 -151484 -120738 -107848 -120638 -163994 -66059
1966 -66059 -397314 -229647 -387229 -647343 -510249 -396652 -324790 -268259 24690 -166318
1956 -166318 -338718 -467707 -472513 -328648 -285467 -300259 -379950 -211777 -261802 -414744 -424495
$$ packed form
2029a57735J63610J63390j88675J47639j53213j10721K46839J250Q7263k51096
2019e1449k26841K74398l20299j56786J29095p1541k4537R9591L8365J72636Q0584
2008e6784l08751k56149K49257J92176j21736l52350J70615j6776O2187j39722
1998e78033J96642Q767J18757R3463k52969Q1459j85008J84738Q4057m1270m7486
1987c36883L63431k74811j83840L6899k71902N3022J79475o3210j48100j6775
1977f62694Q9821q146K1634J76235J26960J04706L0746J2890j2790m3356R7935
1966f6059l31255J67667j57582k60114J37094J13597P1862N6531K92949j91008
1956a66318j72400j28989m806J43865M3181j4792p9691J68173n0025j52942r751
$$ plain form
1945 -424495 -386072 -360018 -330529 -332082 -309752 -211717 7753 -181251 -329103 -359752 -471745
1934 -471745 -430750 -281175 -354318 -433790 -340824 -531069 -404978 -176642 -303366 -498743
1924 -498743 13773 -80164 -267096 -341925 -249668 -134371 -110442 -124890 -218491 -358900 -299713
1913 -299713 -211761 -469769 -659759 -483085 -530726 -370210 -326098 -236773 -194857 -227468 124722
1902 124722 -135186 -364086 -480969 -454238 -414097 -524165 -566346 -352259 -332980 -530438
1892 -530438 -527584 -281156 -101035 -272176 -256038 -172890 -43186 -261755 -500453 -597195 -331840
1881 -331840 -355634 -372038 -211991 249306 -200798 -478675 -219258 -157221 -125246 -370476
1871 -370476 -232346 -241280 -340211 -544163 -347684 -264432 -220321 -351849 -399241 -210382 -230645
$$ packed form
1945d24495L8423K6054K9489j553K2330R8035K19470j89004j47852l0649j11993
1934d71745M0995J49575p3143p9472R2966j90245J26091K28336j26724j95377
1924d98743N12516r3937j86932p4829R2257J15297K3929j4448r3601j40409N9187
1913b99713Q7952k58008j89990J76674m7641J60516M4112Q9325M1916l2611L52190
1902A24722k59908k28900j16883K6731M0141j10068m2181K14087J9279j97458
1892e30438K854K46428J80121j71141J6138Q3148J29704k18569k38698r6742K65355
1881c31840k3794j6404J60047M61297m50104k77877K59417O2037L1975k45230
1871c70476J38130q934r8931k03952J96479Q3252M4111j31528m7392J88859k0263
$$ plain form
1860 -230645 -120420 -81105 -163145 -261759 -285279 -154812 -131763 -225168 -252201 -410331 -242157
1849 -242157 -166686 -18123 187638 60719 -145561 -110920 -230090 -366315 -310648 -489077
1839 -489077 -514674 -519463 -515953 -674574 -469511 -435845 -439167 -425694 -515962 -473827 -174121 23651
1827 23651 -254995 -455017 -63127 -139892 -282078 -463908 -421984 -391860 -453031 -556841 -365812
1816 -365812 -53971 -123918 -120716 -65681 -265402 -322664 -301290 -376134 -273875 -171798 -418219
1805 -418219 -486843 -616848 -523377 -488539 -233522 -40418 -431183 -378700 -412351 -187559 -122864
1794 -122864 -254124 -303458 -49631 38574 -239118 56334 84917 -242274 -392831 -525970
1784 -525970 -339688 -99035 -307913 -126176 -93418 -401558 -408357 -391065 -193786 -42604
$$ packed form
1860b30645J10225L9315q2040r8614k3520J30467K3049r3405k7033j58130J68174
1849b42157P5471J48563K05761j26919k06280L4641j19170j36225N5667j78429
1839d89077k5597m789L510j58621K05063L3666l322J3473r0268M2135K99706J97772
1827B3651k78646k00022L91890p6765j42186j81830M1924L0124o1171j03810J91029
1816c65812L11841o9947L202N5035j99721n7262K1374p4844J02259J02077k46421
1805d18219o8624j30005R3471L4838K55017J93104l90765N2483l3651K24792O4695
1794a22864j31260m9334K53827Q8205k77692K95452K8583l27191j50557j33139
1784e25970J86282K40653k08878J81737L2758l08140o799J7292J97279J51182
$$ plain form
1774 -42604 -81667 -39467 -35160 -71491 -24204 162836 110184 40532 -153490 -494719 -353579
1763 -353579 -284948 -409075 -312915 -437146 -376219 -472228 -519733 -264111 -350995 -521005 -822092
1752 -822092 -670625 -185145 -155685 -52802 162101 -36287 -80281 -86426 -241633 -547361
1742 -547361 -714270 -437749 -454778 -544503 -427050 -230991 -261840 -206419 -235736 -418291 -472681
1731 -472681 -409488 -331122 -430915 -354319 -742207 -572682 -466377 -381418 -447835 -325700 -424492
1720 -424492 -625833 -571438 -200383 79672 -45983 -193177 -243869 -211797 32075 214083
1710 214083 242581 363227 139910 195715 143142 -416344 -575652 -396843 -245630 -71331
1700 -71331 193262 15898 -279970 -297011 114256 -27913 -235846 -124139 -69076 222809
$$ packed form
1774d2604l9063M2200M307l6331M7287J87040n2652o9652j94022l41229J41140
1763c53579O8631j24127R6160j24231O0927r6009m7505K55622q6884j70010l01087
1752h22092J51467M85480K9460J02883K14903j98388m3994o145j55207l05728
1742e47361j66909K76521j7029q9725J17453J96059l0849N5421k9317j82555n4390
1731d72681O3193P8366r9793P6596l87888J69525J06305Q4959o6417J22135r8792
1720d24492k01341N4395L71055K80055j25655j47194n0692L2072K43872J82008
1710B14083K8498J20646k23317N5805n2573n59486j59308J78809J51213J74299
1700g1331K64593j77364k95868j7041M11267j42169k07933J11707N5063K91885
$$ plain form
1690 222809 173309 246266 -40838 -192520 51136 -205469 -389802 -192414 -229752 -150018
1680 -150018 28432 -9102 -16173 -124361 -293732 -253877 -155864 -205703 -158357 -281998 -365685
1669 -365685 -128304 14226 47705 126583 53580 -18721 -129693 -325553 -196657 -262730 -380971
1658 -380971 -411371 -265453 -199328 -188544 -144351 -50213 -163759 -381196 -477552 -626009 -497601
1647 -497601 -364547 -385134 -438279 -388576 -348053 -189407 -373175 -124909 -167036 -205044 -170241
1636 -170241 -246215 -517717 -464876 -386432 -465258 -109106 -285536 -384603 -39443 -25155 -162942
1625 -162942 48520 79688 -172248 -294713 -14098 -31094 -132851 -496854 -292480 -234313
1615 -234313 -446806 -621002 -368440 -322932 -418969 -304834 -348974 -402545 -235522 -80800
$$ packed form
1690B22809m9500P2957k87104j51682K43656k56605j84333J97388l7338P9734
1680a50018J78450l7534p071j08188j69371L9855R8013m9839M7346j23641q3687
1669c65685K37381J42530L3479P8878p3003p2301j10972j95860J28896o6073j18241
1658c80971l0400J45918O6125J0784M4193R4138j13546k17437r6356j48457J28408
1647d97601J33054k0587n3145M9703M0523J58646j83768K48266m2127l8008L4803
1636a70241p5974k71502N2841P8444p8826L56152j76430r9067L45160J4288j37787
1625a62942K11462L1168k51936j22465K80615j6996j01757l64003K04374N8167
1615b34313k12493j74196K52562M5508r6037J14135m4140n3571J67023J54722
$$ plain form
1605 -80800 -142654 -263968 -418459 -331965 -378168 -272695 -222537 -266077 -394200 -317284 -225848
1594 -225848 -181784 -179214 -270351 -137629 -183734 -315816 -360305 -324392 -124227 -209841 -417124
1583 -417124 -41219 76201 2362 -166997 -224769 -122291 -272581 -324384 -409402 -522060
1573 -522060 -139019 6858 -172074 -214710 -206758 -382068 -524548 -461170 -179442 -243312 -132189
1562 -132189 -479960 -423197 -437312 -513921 -315103 -22888 111348 67372 -53856 -191577
1552 -191577 -396118 -372413 -427780 -477229 -318018 -354705 -452139 -264121 -252357 -269553 -185592
1541 -185592 -194019 227591 93779 -44787 35149 -13197 -105117 -144636 -218935 -45429 -109687
1530 -109687 -251164 -246023 -450999 -655902 -273520 -76660 -69233 -111029 -96186 -188131 -67713
$$ packed form
1605h0800o1854j21314j54491Q6494m6203J05473N0158m3540j28123P6916R1436
1594b25848M4064K570r1137J32722m6105j32082m4489L5913K00165q5614k07283
1583d17124L75905J17420p3839j69359n7772J02478j50290n1803q5018j12658
1573e22060L83041J45877j78932m2636P952j75310j42480O3378K81728o3870J11123
1562a32189l47771N6763j4115p6609J98818K92215J34236m3976j21228j37721
1552a91577k04541K3705n5367m9449J59211l6687r7434J88018J1764j7196Q3961
1541a85592q427M21610j33812j38566P9936m8346r1920l9519p4299J73506o4258
1530a09687j41477N141k04976k04903L82382J96860P427m1796J4843r1945J20418
$$ plain form
1519 -67713 -291799 -337117 -416070 -92435 -65525 -213712 -360696 -217546 -111623 -92777 201119
1508 201119 25030 -222664 -363177 -488522 -337207 10248 -125802 -331105 -146785 90060
1498 90060 16166 -101949 -322884 -471129 -388041 -111493 185465 -119527 -67724 135102
1488 135102 76552 -33983 -65991 -23939 40111 110950 -125981 -383112 -382269 -183238 56425
1477 56425 -68399 108805 248630 -23246 -322766 -123577 -62155 -263959 -12186 -116936
1467 -116936 -115350 -296068 -279434 -90264 63505 -41022 -182435 -168613 -385319 -208612
1457 -208612 8560 179411 253274 336736 337513 287284 411491 268150 234949 162302 225146
1446 225146 73742 -126551 -92553 -105568 -144115 23013 -5028 -196259 -171158 -283694 220039
$$ packed form
1519f7713k24086m5318p8953L23635K6910j48187j46984J43150J05923J8846K93896
1508B01119j76089k47694j40513j25345J51315L47455j36050k05303J84320K36845
1498I0060p3894j18115k20935j48245Q3088K76548K96958l04992N1803K02826
1488A35102n8550j10535l2008M2052O4050P0839k36931k57131Q43J99031K39663
1477E6425j24824J77204J39825k71876k99520J99189O1422k01804K51773j04750
1467a16936J586j80718J6634J89170J53769j04527j41413J3822k16706J76707
1457b08612K17172J70851P3863Q3462P77n0229J24207j43341l3201p2647O2844
1446B25146j51404k00293L3998j3015l8547J67128k8041j91231K5101j12536N03733
$$ plain form
1435 220039 154034 20970 8073 -20642 2066 -121707 -22564 -14891 196708 253962 10222
1424 10222 -163999 -66915 -203085 -277079 -137994 34693 120279 -76526 -170937 -55420 -194117
1413 -194117 -207390 -175520 -498926 -452469 -293571 -322235 -71677 184856 -141737 -206315 103604
1402 103604 -102575 315893 188352 -356248 -169723 122132 148356 -34971 184893 206364
1392 206364 70928 227377 172556 122741 88122 -280615 -366546 -206362 -229150 -15303 95428
1381 95428 93219 7291 -21337 -406362 -570297 -319682 -230479 -377205 -158953 -59829 26425
1370 26425 -119299 -270236 -120476 -47488 -193914 162656 40368 -59442 -79963 -409710
1360 -409710 -349336 -307927 -351962 -555052 -437510 -65759 -157161 -272000 -389092 -136042
$$ packed form
1435B20039o6005j33064j2897k8715K2708j23773R9143P673K11599N7254k43740
1424A0222j74221R7084j36170p3994J39085J72687Q5586j96805r4411J15517j38697
1413a94117j3273L1870l23406M6457J58898k8664K50558K56533l26593o4578L09919
1402A03604k06179M18468j27541n44600J86525K91855K6224j83327K19864K1471
1392B06364j35436J56449n4821m9815l4619l68737q5931J60184k2788K13847J10731
1381I5428k209q5928k8628l85025j63935K50615Q9203j46726K18252R9124Q6254
1370B6425j45724j50937J49760P2988j46426L56570j22288r9810k0521l29747
1360d09710O0374M1409m4035k03090J17542L71751r1402j14839j17092K53050
$$ plain form
1350 -136042 77798 -65345 -82116 -447363 -407561 -234700 -238706 -558293 -641650 -629531 -336275
1339 -336275 -471507 -482927 -490685 -312570 -142999 -93827 -127468 102106 -1557 -300546 -191984
1328 -191984 -131454 -60382 -202263 18559 94820 303612 8891 -57604 72076 -220663
1318 -220663 56562 92533 -149106 -250804 -54737 -221087 -175211 -199857 -37986 27510
1308 27510 -93242 80197 281167 353820 188907 -257230 -331984 -58818 -91492 186735
1298 186735 139429 18873 -113735 -148287 -130076 -145709 -200369 205440 160934 33109 -17818
1287 -17818 -161681 -279650 -42256 -93457 -251209 -82142 27161 -22283 -52397 -333360
1277 -333360 -499164 -181346 -63332 -62097 -128165 -153310 -173360 -91013 -230741 -159486 -31030
$$ packed form
1350a36042K13840j43143j6771l65247L9802J72861m006l19587q3357J2119K93256
1339c36275j35232j1420p758J78115J69571M9172l3641K29574j03663k98989J08562
1328a91984O0530P1072j41881K20822P6261K08792k94721o6495J29680k92739
1318b20663K77225L5971k41639j01698J96067j66350M5876k4646J61871O5496
1308B7510j20752J73439K00970P2653j64913m46137p4754K73166l2674K78227
1298A86735m7306j20556j32608l4552J8211j5633n4660M05809m4506j27825n0927
1287a7818j43863j17969K37394n1201j57752J69067J09303m9444l0114k80963
1277c33360j65804L17818J18014J235o6068k5145k0050Q2347j39728P1255J28456
$$ plain form
1266 -31030 215328 203973 48786 -7427 72831 -17380 -128609 -45391 97686 110832 121326
1255 121326 -114882 -194068 -266071 -178144 -158792 -288716 -454575 -166807 83098 126829 121552
1244 121552 16494 35499 101235 297894 153941 50367 -81046 -93902 28009 -172513
1234 -172513 -99934 -185257 -113236 -43695 43513 3448 -307011 -416615 -514371 -490613 -392405
1223 -392405 -300621 56109 10866 -208285 17496 46190 209304 136840 108862 150092 227466
1212 227466 544462 444448 125272 222149 137879 135094 130976 99203 -5598 58332 -74859
1201 -74859 -182689 88939 67861 152481 210178 381447 402935 217109 -45302 -219886 -77355
1190 -77355 -78875 -121249 60875 59313 -440177 -450265 -371105 -161705 -34659 -115642 52713
$$ packed form
1266c1030K46358j1355j55187n6213Q0258r0211j11229Q3218J43077J3146J0494
1255A21326k36208p9186p2003Q7927J9352j29924j65859K87768K49905M3731n277
1244A21552j05058J9005O5736J96659j43953j03574j31413j2856J21911k00522
1234a72513P2579q5323P2021O9541Q7208m0065l10459j09604r7756K3758R8208
1223c92405R1784L56730m5243k19151K25781K8694J63114p2464k7978M1230P7374
1212B27466L16996j00014l19176R6877q4270k785m118l1773j04801O3930j33191
1201g4859j07830K71628k1078Q4620N7697J71269K1488j85826k62411j74584J42531
1190g7355j520m2374J82124j562m99490j0088P9160K09400J27046q0983J68355
$$ plain form
1179 52713 -75345 -205483 -214833 -58346 345950 115635 -131804 -7982 137427 89277
1169 89277 -171921 -251247 -17400 -85838 107994 328460 326826 338880 190539 18114 109076
1158 109076 -68300 -189120 137200 50203 758 102448 247995 -44938 -245097 10136
1148 10136 180832 22771 -94403 -2490 -204749 -202399 148499 -186394 182685 150755 -68972
1137 -68972 -61222 97984 179989 26070 113750 -209597 -76717 -25806 -41307 -223080 -250557
1126 -250557 -14262 -63477 -256373 -262613 -72223 -168703 -93141 -64148 -44589 192531 -53281
1115 -53281 -72403 115741 79323 100471 335685 220122 240852 446429 177477 -171139 -13648
1104 -13648 263134 215869 -122749 -73682 29488 186379 62308 -31725 16262 35535 -435
$$ packed form
1179E2713j28058j30138r350J56487M04296k30315k47439J23822J45409m8150
1169H9277k61198p9326K33847o8438J93832K20466j634J2054j48341j72425R0962
1158A09076j77376j20820L26320q6997m9445J01690J45547k92933k00159K55233
1148A0136J70696j58061j17174R1913k02259K350L50898l34893L69079l1930k19727
1137f8972P750J59206Q2005j53919Q7680l23347J32880N0911j5501j81773k7477
1126b50557K36295m9215j92896o240J90390r6480P5562K8993J9559K37120k45812
1115e3281j9122J88144l6418K1148K35214j15563K0730K05577k68952l48616J57491
1104a3648K76782m7265l38618M9067J03170J56891j24071r4033M7987J9273l5970
$$ plain form
1093 -435 -78273 -10710 250399 251481 221395 185650 148762 234688 106313 30108 124256 -98349
1081 -98349 62393 181134 136495 -47491 -54634 -9355 27090 73815 -78509 124733 161984
1070 161984 228086 105864 242746 367700 465897 303943 498848 251383 112255 129195
1060 129195 186204 116789 19861 1312 -122406 -124870 -113861 -225129 -18046 67002 -89577
1049 -89577 -62953 244871 162654 -168914 -252384 -370223 -124998 -165000 -321763 -374196 -289756
1038 -289756 247683 469360 405767 271102 95227 166500 299053 329835 244507 243916 250090
1027 250090 295271 274494 -5697 -108375 250293 349765 290687 152273 340977 226421
1017 226421 -38827 -103493 -171281 -38806 5548 215055 -146781 -335806 -312002 -86279
$$ packed form
1093d35p7838O7563K61109J082l0086l5745l6888Q5926j28375p6205R4148k22605
1081i8349J60742J18741m4639j83986p143M5279L6445M6725j52324K03242L7251
1070A61984O6102j22222J36882J24954R8197j61954J94905k47465j39128J6940
1060A29195N7009o9415r6928j8549j23718k464J1009j11268K07083Q5048j56579
1049h9577K6624L07824q2217l31568q3470j17839K45225m0002j56763n2433Q4440
1038b89756N37439K21677o3593j34665j75875P1273J32553L0782q5328n91O174
1027B50090M5181k0777k80191j02678L58668R9472n9078j38414J88704j14556
1017B26421k65248o4666o7788J32475M4354K09507l61836j89025K3804K25723
$$ plain form
1007 -86279 -67021 -131638 -86719 193022 372850 202819 -25474 -3730 162090 233285 190705
996 190705 -108297 -31223 115610 -24206 71640 56583 -91911 -84570 123287 213051 116062
985 116062 151055 94073 163958 197605 52985 -49206 42917 -57859 92560 88731 -86199
974 -86199 53138 202403 27789 -27641 -67585 68908 123837 -40210 -205089 -137725 -47194
963 -47194 -60724 78417 274761 422529 274488 80918 95337 156688 219889 -198353 -383978
952 -383978 -236826 -285469 -234223 -207238 -68767 -78131 -273884 -164623 123949 106273 210661
941 210661 119695 -33533 -86270 79961 -44691 145175 191267 -5002 -82359 -8272 -52
930 -52 -14979 104238 -154871 -35171 -25181 186765 11952 -138794 13710 -65169 21996
$$ packed form
1007h6279J9258o4617M4919K79741J79828j70031k28293K1744J65820P1195m2580
996A90705k99002P7074J46833j39816R5846j5057j48494P341K07857Q9764r6989
985A16062L4993n6982O9885L3647j44620j02191R2123j00776J50419l829j74930
974h6199J39337J49265j74614n5430l9944J36493N4929j64047j64879O7364R0531
963d7194j3530J39141J96344J47768j48041j93570J4419O1351O3201m18242j85625
952c83978J47152m8643N1246K6985J38471r364j95753J09261K88572j7676J04388
941B10661r0966j53228n2737J66231j24652J89866M6092j96269p7357P4087Q220
930e2j4927J19217k59109J19700R990K11946j74813j50746J52504p8879Q7165
$$ plain form
919 21996 234227 139842 179177 301037 72099 -124469 -85005 -365654 -422308 -81016 119832
908 119832 69963 142999 21647 40165 -49552 -278612 -315974 -136968 -132516 -62189 -3176
897 -3176 -132400 124944 531009 160607 1585 190974 178084 11951 -9074 -46336 -43290
886 -43290 17651 -263079 -93912 139096 324293 415024 263656 -129751 186245 194530 222493
875 222493 333409 264218 166352 41044 -20327 143678 60726 -162838 51718 148223 17052
864 17052 111421 198899 188075 -24548 -249856 -80371 54249 259401 14169 144260 406666
853 406666 405378 340620 44641 -189889 -78346 68087 231778 149510 2751 160446 59860
842 59860 70727 87768 154647 111384 91378 118660 136786 35645 -173802 103390 120025
$$ packed form
919B1996K12231r4385L9335J21860k28938j96568L9464k80649n6654L41292K00848
908A19832m9869P3036j21352J8518q9717k29060l7362J79006M452P0327N9013
897c176j29224K57344M06065l70402j59022J89389j2890j66133k1025l7262L046
886d3290O0941k80730J69167K33008J85197R0731j51368l93407L15996Q285K7963
875B22493J10916o9191r7866j25308o1371J64005q2952k23564K14556R6505j31171
864A7052R4369Q7478j0824k12623k25308J69485J34620K05152k45232J30091K62406
853D06666j288o4758k95979k34530J11543J46433J63691q2268j46759J57695j00586
842E9860J0867J7041O6879m3263k0006K7282J8126j01141k09447K77192J6635
$$ plain form
831 120025 223614 457645 602790 341285 117733 174591 -60282 229296 291448 109033
821 109033 334648 185748 -59695 -49423 -20637 19403 -259204 -325324 -119438 -27335 11658
810 11658 -6106 179944 137269 192371 375661 340337 253982 -68133 -27926 -134520 -34672
799 -34672 158511 71131 -28245 -11936 -7121 -81934 139530 98210 165307 124962 205609 483084
787 483084 545511 484206 131641 248284 335821 339069 191637 39955 78851 24847 91635
776 91635 226636 74541 28503 -79425 -58892 33208 363453 7839 48998 124431 111822
765 111822 -11344 313416 98447 27057 209694 363926 536555 582711 417552 168010
755 168010 432702 355237 62148 11818 210920 208750 239027 241117 395501 354326 272587
$$ packed form
831A20025J03589K34031J45145k61505k23552N6858k34873K89578O2152j82415
821A09033K25615j48900k45443J0272K8786M0040k78607o6120K05886R2103L8993
810A1658j7764J86050m2675N5102J83290l5324q6355l22115M0207j06594R9848
799c4672J93183q7380r9376J6309M815p4813K21464m1320O7097m0345Q0647K77475
787D83084O2427o1305l52565J16643Q7537L248j47432j51682L8896n4004O6788
776I1635J35001j52095m6038j07928K0533R2100L30245l55614M1159P5433j2609
765A11822j23166L24760k14969p1390J82637J54232J72629M6156j65159k49542
755A68010K64692p7465k93089n0330J99102k170L0277K090J54384m1175q1739
$$ plain form
744 272587 89324 -151488 -151716 93371 68757 -62773 -206909 -22687 3873 79935 9595
733 9595 133245 98066 107604 78478 135858 78935 164730 -50287 55923 117423 65440 -5603
721 -5603 23787 104779 311691 -8532 -108868 14355 -110737 33901 -69457 221970 136020
710 136020 21995 95506 246271 300229 101700 263767 134136 -30967 40773 106882 321439
699 321439 215681 79119 104562 -28073 145526 -16060 130702 55076 166057 259056
689 259056 400428 363879 115400 378814 378602 267143 411468 302779 272530 253400 227553
678 227553 194380 18036 -167242 -108824 -21933 -21159 245237 239378 177267 162540 -207709 -356349
666 -356349 -159582 9455 211635 199154 218380 -197910 -21379 92808 136798 88608 364236
$$ packed form
744B72587j83263k40812k28K45087k4614j31530j44136J84222K6560P6062p0340
733I595J23650l5179R538k9126N7380n6923Q5795k15017J06210O1500n1983p1043
721e603K9390Q0992K06912l20223j00336J23223j25092J44638j03358K91427q5950
710A36020j14025P3511J50765N3958j98529J62067j29631j65103P1740O6109K14557
699C21439j05758j36562K5443j32635J73599j61586J46762p5626J10981R2999
689B59056J41372l6549k48479K63414k12j11459J44325j08689l0249j9130k5847
678B27553l3173j76344j85278N8418Q6891P74K66396n859o2111j4727l70249j48640
666c56349J96767J69037K02180j2481J9226m16290J76531J14187M3990m8190K75628
$$ plain form
655 364236 81651 -40659 401734 76809 84192 128582 97961 92495 -12506 134514 278362
644 278362 307360 97735 269771 128624 179969 472432 498856 223204 297811 407539 358467
633 358467 266973 297247 155304 -120084 79942 181064 314646 416399 274239 163360
623 163360 363513 408270 352829 211761 253387 222284 339017 201708 165502 633433 416609
612 416609 83766 28584 113661 341276 494898 399462 401998 103315 75532 119948 120882 52355
600 52355 -133225 -62123 332813 352189 225962 186419 151539 156914 -51806 -154677 192553
589 192553 112339 150264 257509 226722 137763 192152 345005 243422 67058 -43854 37926
578 37926 189804 242659 378335 488173 247697 404918 512187 527367 467161 561721 524932
$$ packed form
655C64236k82585j22310M42393l24925P383M4390l0621n466j05001J47020J43848
644B78362K8998k09625J72036j41147N1345K92463K6424k75652P4607J09728m9072
633C58467r1494L0274j41943k75388K00026J01122J33582J01753j42160j10879
623A63360K00153M4757n5441j41068M1626l1103J16733j37309l6206M67931k16824
612D16609l32843n5182Q5077K27615J53622r5436K536k98683k7783M4416R34o8527
600E2355j85580P1102L94936J9376j26227l9543l4880N375k08720j02871L47230
589A92553q0214L7925J07245l0787q8959N4389J52853j01583j76364j10912Q1780
578C7926J51878N2855J35676J09838k40476J57221J07269J5180o0206R4560l6789
$$ plain form
567 524932 288602 264654 443790 78861 66011 100025 84061 33467 281613 88834 178380
556 178380 325927 247747 23534 -102088 -43930 -20795 17636 -23210 318990 450718 363938
545 363938 188296 249459 79749 155212 295469 246316 157112 277971 37185 221050 368714
534 368714 120088 199030 76524 95754 -43251 85916 325133 309957 360009 741971 239981
523 239981 -56550 135142 103037 225642 87280 212007 523636 271354 105780 253234
513 253234 301028 345450 311988 447583 441712 469786 512950 651176 540279 65858 21096
502 21096 305084 269527 403741 358949 267348 345389 284174 448986 302966 263014 63606
491 63606 190252 182815 148867 258336 405781 352184 315026 123411 85209 192274 190813
$$ packed form
567E24932k36330k3948J79136l64929j2850L4014j5964n0594K48146j92779Q9546
556A78380J47547p8180k24213j25622N8158K3135L8431m0846L42200J31728q6780
545C63938j75642O1163j69710P5463J40257m9153q9204J20859k40786J83865J47664
534C68714k48626P8942j22506J9230j39005J29167K39217j5176N0052L81962n01990
523B39981k96531J91692l2105J22605j38362J24727L11629k52282j65574J47454
513B53234M7794M4422l3462J35595n871K8074M3164J38226j10897m74421m4762
502B1096K83988l5557J34214m4792r1601P8041o1215J64812j46020l9952j99408
491F3606J26646p437l3948J09469J47445n3597l7158j91615l8202J07065j461
$$ plain form
480 190813 585647 650363 410740 150987 368174 249702 333502 329427 233895 61263 200275
469 200275 175202 190764 215123 144632 457329 219755 394093 154794 88917 328283 182316
458 182316 406822 390712 292315 81027 -61836 22311 -4875 28118 -18020 -176066 -92291
447 -92291 208211 91516 84357 334820 257903 257312 117777 50525 121442 212319 121999 422811
435 422811 268177 210223 107522 -16037 29718 -8639 298487 288117 -142651 -362026 -137003
424 -137003 82207 222560 727 156276 364495 233503 192641 75913 -115359 285540
414 285540 366972 90610 135540 344825 449223 296142 149983 296096 508308 566339
404 566339 499878 562185 473733 362043 126534 381098 487939 458412 161070 478356 733607
$$ packed form
480A90813L94834O4716k39623k59753K17187j18472Q3800m075r5532j72632J39012
469B00275k5073J5562K4359p0491L12697k37574J74338k39299o5877K39366j45967
458A82316K24506j6110r8397k11288j42863Q4147k7186L2993m6138j58046Q3775
447i2291L00502j16695p159K50463p6917n91j39535o7252P0917R0877r0320L00812
435D22811j54634n7954j02701j23559M5755l8357L07126j0370m30768k19375K25023
424a37003K19210J40353k21833J55549K08219j30992m0862j16728j91272M00899
414B85540Q1432k76362M4930K09285J04398j53081j46159J46113K12212N8031
404E66339o6461O2307q8452j11690k35509K54564J06841k9527k97342L17286K55251
$$ plain form
393 733607 474441 250516 61227 235292 230845 268164 243036 298217 424451 675076 620291
382 620291 338161 370496 527901 674687 745061 638376 638602 349007 360629 344475 348670
371 348670 236128 402191 465347 592035 408303 440198 391053 188985 368836 412793 192763
360 192763 262060 311381 618970 731774 592178 422773 363821 136326 79835 308589 353740
349 353740 453204 425541 565246 409995 353620 426830 317853 238020 245929 423068 746072
338 746072 769034 484266 208166 112497 232847 487243 202595 354853 99433 65229
328 65229 195600 382042 579189 559368 420217 511444 822099 795443 525480 443086 422794
317 422794 261554 447554 378951 190058 210948 314196 513368 564246 451103 108663
$$ packed form
393G33607k59166k23925j89289J74065m447L7319k5128N5181J26234K50625n4785
382F20291k82130L2335J57405J46786P0374j06685K26k89595J1622j6154M195
371C48670j12542J66063O3156J26688j83732L1895m9145k02068J79851M3957k20030
360A92763O9297M9321L07589J12804j39596j69405n8952k27495n6491K28754M5151
349C53740R9464k7663J39705j55251n6375P3210j08977p9833P909J77139L23004
338G46072K2962k84768k76100r5669J20350K54396k84648J52258k55420l4204
328F5229J30371J86442J97147j9821j39151R1227L10655k6656k69963q2394k0292
317D22794j61240J86000o8603j88893K0890J03248J99172N0878j13143l42440
$$ plain form
307 108663 692112 620394 226131 485608 442537 310480 301787 278616 323870 679362 679914
296 679914 585292 451915 369262 457609 471172 320989 524712 326673 155192 287160 373412
285 373412 291713 242614 320505 439891 151836 199308 350945 490456 682221 624086 335133
274 335133 233472 533391 675725 984783 834633 619296 531344 615357 639436 617299 532839
263 532839 351994 265390 365344 563865 707085 446865 438628 161246 146149 512252 706292
252 706292 445388 512715 451263 260603 268621 680818 726988 439843 539366 283693 414768
241 414768 427063 519033 402472 373069 327476 352220 510599 673240 592080 586127 305272
230 305272 164939 223431 321345 443656 487406 537823 792978 623784 724918 604963 493836
$$ packed form
307A08663N83449p1718l94263K59477m3071j32057q693k3171M5254L55492N52
296F79914r4622j33377q2653Q8347J3563j50183K03723j98039j71481J31968Q6252
285C73412q1699m9099P7891J19386k88055M7472J51637J39511J91765n8135k88953
274C35133j01661K99919J42334L09058j50150k15337q7952Q4013K4079k2137q4460
263E32839j80845q6604R9954J98521J43220k60220q237k77382j5097L66103J94040
252G06292k60904O7327o1452j90660Q018M12197M6170k87145R9523k55673J31075
241D14768J2295R1970j16561k9403m5593K4744J58379J62641q1160n953k80855
230C05272j40333N8492R7914J22311M3750N0417K55155j69194J01134j19955j11127
$$ plain form
219 493836 647284 306438 133366 194599 113455 87513 171641 364145 346846 507830 407379
208 407379 394936 553748 486916 501064 502667 263712 293627 516207 478260 690534 511418
197 511418 596926 595892 433656 388652 376931 182291 99484 390026 438228 323084 303345
186 303345 226351 100738 277509 349550 268567 379174 430293 485394 586723 809482 749473
175 749473 460569 236969 500920 725612 647356 501588 351089 482227 659288 573988
165 573988 529561 596036 664869 615621 709888 460544 228925 266725 408704 426978 474202
$$ packed form
219D93836J53448l40846j73072O1233q1144k5942Q4128J92504j7299J60984j00451
208D07379j2443J58812o6832J4148J603k38955K9915K22580l7947K12274j79116
197E11418Q5508j034j62236m5004j1721j94640q2807K90542M8202j15144j9739
186C03345p6994j25613J76771P2041q0983J10607N1119N5101J01329K22759o0009
175G49473k88904k23600K63951K24692p8256j45768j50499J31138J77061q5300
165E73988m4427O6475O8833m9248R4267k49344k31619L7800J41979J8274M7224
$$ [...]
##END NTUPLES=NMR SPECTRUM
##END=
