##TITLE=1H_DE-80H_X3
 200.13MHz, d2o
 8 sc
 
 19ns.26.2.2025
##JCAMPDX= 6.0         $$ Bruker NMR JCAMP-DX V2.0
##DATA TYPE= NMR SPECTRUM
##DATA CLASS= NTUPLES
##ORIGIN= UXNMR, Bruker Analytische Messtechnik GmbH
##OWNER= pz
$$ XWIN-NMR		Version 3.5
$$ Tue Jun 17 14:28:08 2025 Russian Standard Time (UT+4h)  Yarkov@DPX200
##.OBSERVE FREQUENCY= 200.1313
##.OBSERVE NUCLEUS= ^1H
##.ACQUISITION MODE= SIMULTANEOUS
##.ACQUISITION SCHEME= undefined
##.AVERAGES= 8
##.DIGITISER RES= 18
##SPECTROMETER/DATA SYSTEM= spect
##.PULSE SEQUENCE= zg30
##.SOLVENT NAME= CDCl3
##.SHIFT REFERENCE= (INTERNAL, CDCl3, 0, 15.4703)
##AUDIT TRAIL= $$ (NUMBER, WHEN, WHO, WHERE, WHAT)
$$ ##TITLE= Audit trail, XWIN-NMR		Version 3.5
$$ ##JCAMPDX= 5.01
$$ ##ORIGIN= Bruker BioSpin GmbH
$$ ##OWNER= Yarkov
$$ C:/Bruker/XWIN-NMR/data/yarkov2/nmr/H-C/1/pdata/1/auditp.txt
$$ ##AUDIT TRAIL=  $$ (NUMBER, WHEN, WHO, WHERE, WHAT)
(   1,<2025-06-17 14:27:12.75 +0400>,<Yarkov>,<DPX200>,
      <created by zg, POWCHK disabled, PULCHK disabled
       configuration hash MD5:
       00 E9 B6 7A A2 85 ED C7 34 08 36 98 17 FE 4E 26
       data hash MD5: 16K
       CA 5A 6C D5 CE 1F 9C 69 51 EF 42 2B F8 F7 BD 5B>)
(   2,<2025-06-17 14:27:18.45 +0400>,<Yarkov>,<DPX200>,
      <Start of raw data processing
       efp BC_mod = 2 LB = 0.25 FT_mod = 6 PKNL = 1 PHC0 = -1721.517 PHC1 = 19.96656 SI = 16K 
       data hash MD5: 16K
       CD 4E 72 13 1B CB AC 3B DC 11 3C 28 05 4D 2B 3B>)
(   3,<2025-06-17 14:27:28.14 +0400>,<Yarkov>,<DPX200>,
      <abs ABSG = 5 
       data hash MD5: 16K
       09 13 31 29 49 EB 1B 88 0D D7 A4 C8 6A 7A 04 DC>)
$$ ##END=
$$ 
$$ hash MD5
$$ 55 F3 1E 6B 87 FB 08 CB 50 7C E8 EF 80 5F 22 CC
##$RELAX= 
##$RELAX= 
##$RELAX= 
##$RELAX= 
##$RELAX= 
##$RELAX= 
$$ Bruker specific parameters
$$ --------------------------
##$DU= <C:/Bruker/XWIN-NMR>
##$EXPNO= 1
##$NAME= <H-C>
##$PROCNO= 1
##$TYPE= <nmr>
##$USER= <yarkov2>
##$AMP= (0..31)
100 100 100 100 100 100 100 100 100 100 100 100 100 100 100 100 100 100 
100 100 100 100 100 100 100 100 100 100 100 100 100 100 
##$AQSEQ= 0
##$AQ_mod= 1
##$AUNM= <au_zg>
##$AUTOPOS= <>
##$BF1= 200.13
##$BF2= 200.13
##$BF3= 200.13
##$BF4= 200.13
##$BF5= 200.13
##$BF6= 200.13
##$BF7= 200.13
##$BF8= 200.13
##$BYTORDA= 1
##$CFDGTYP= 0
##$CFRGTYP= 5
##$CHEMSTR= <none>
##$CNST= (0..31)
1 1 145 1 1 1 1 1 1 1 1 1 1 1 1 1 1 1 1 1 1 1 1 1 1 1 1 1 1 1 1 1 
##$CPDPRG= <>
##$CPDPRG1= <>
##$CPDPRG2= <>
##$CPDPRG3= <>
##$CPDPRG4= <mlev>
##$CPDPRG5= <mlev>
##$CPDPRG6= <mlev>
##$CPDPRG7= <mlev>
##$CPDPRG8= <mlev>
##$CPDPRGB= <>
##$CPDPRGT= <>
##$D= (0..31)
0 0.7 0 0 0 0 0 0 0 0 0 0.03 0 0 0 0 0 0 0 0 0 0 0 0 0 0 0 0 0 0 0 0 
##$DATE= 1750156032
##$DBL= (0..7)
120 120 120 120 120 120 120 120 
##$DBP= (0..7)
150 150 150 150 150 150 150 150 
##$DBP07= 0
##$DBPNAM0= <>
##$DBPNAM1= <>
##$DBPNAM2= <>
##$DBPNAM3= <>
##$DBPNAM4= <>
##$DBPNAM5= <>
##$DBPNAM6= <>
##$DBPNAM7= <>
##$DBPOAL= (0..7)
0.5 0.5 0.5 0.5 0.5 0.5 0.5 0.5 
##$DBPOFFS= (0..7)
0 0 0 0 0 0 0 0 
##$DE= 6
$$ [...]
##$SUBNAM3= <"">
##$SUBNAM4= <"">
##$SUBNAM5= <"">
##$SUBNAM6= <"">
##$SUBNAM7= <"">
##$SUBNAM8= <"">
##$SUBNAM9= <"">
##$SW= 18.0517328524113
##$SWIBOX= (0..15)
0 0 2 0 0 0 0 0 0 0 0 0 0 0 0 0 
##$SW_h= 3612.71676300578
##$TD= 16384
##$TD0= 1
##$TE= 0
##$TE2= 300
##$TE3= 300
##$TEG= 300
##$TL= (0..7)
0 120 120 120 120 120 120 120 
##$TP= (0..7)
150 150 150 150 150 150 150 150 
##$TP07= 0
##$TPNAME0= <>
##$TPNAME1= <>
##$TPNAME2= <>
##$TPNAME3= <>
##$TPNAME4= <>
##$TPNAME5= <>
##$TPNAME6= <>
##$TPNAME7= <>
##$TPOAL= (0..7)
0.5 0.5 0.5 0.5 0.5 0.5 0.5 0.5 
##$TPOFFS= (0..7)
0 0 0 0 0 0 0 0 
##$TUNHIN= 0
##$TUNHOUT= 0
##$TUNXOUT= 0
##$USERA1= <user>
##$USERA2= <user>
##$USERA3= <user>
##$USERA4= <user>
##$USERA5= <user>
##$V9= 5
##$VALIST= <valist>
##$VCLIST= <CCCCCCCCCCCCCCC>
##$VD= 0
##$VDLIST= <DDDDDDDDDDDDDDD>
##$VPLIST= <PPPPPPPPPPPPPPP>
##$VTLIST= <TTTTTTTTTTTTTTT>
##$WBST= 1024
##$WBSW= 4
##$XGAIN= (0..3)
0 0 0 0 
##$XL= 0
##$YL= 0
##$YMAX_a= 89074
##$YMIN_a= -53838
##$ZGOPTNS= <>
##$ZL1= 120
##$ZL2= 120
##$ZL3= 120
##$ZL4= 120
##$ABSF1= 15.50119
##$ABSF2= -2.550659
##$ABSG= 5
##$ABSL= 3
##$ALPHA= 0
##$AQORDER= 0
##$ASSFAC= 0
##$ASSFACI= 0
##$ASSFACX= 0
##$ASSWID= 0
##$AUNMP= <proc_1d>
##$AZFE= 0.1
##$AZFW= 0.1
##$BCFW= 0
##$BC_mod= 2
##$BYTORDP= 0
##$COROFFS= 0
##$CY= -3
##$DATMOD= 1
##$DC= 0
##$DFILT= <>
##$DTYPP= 0
##$F1P= 0
##$F2P= 0
##$FCOR= 1
##$FTSIZE= 16384
##$FT_mod= 6
##$GAMMA= 0
##$GB= 0
##$INTBC= 1
##$INTSCL= 3.241238e-09
##$ISEN= 128
##$LB= 0.25
##$LEV0= 0
##$LPBIN= 0
##$MAXI= 10000
##$MC2= 0
##$MEAN= 0
##$ME_mod= 0
##$MI= 1.114404
##$NCOEF= 0
##$NC_proc= -11
##$NLEV= 6
##$NOISF1= 3.799351
##$NOISF2= 2.8
##$NSP= 0
##$NTH_PI= 0
##$NZP= 0
##$OFFSET= 15.47034
##$PC= 1
##$PHC0= -1721.517
##$PHC1= 19.96656
##$PH_mod= 1
##$PKNL= yes
##$PPARMOD= 0
##$PSCAL= 0
##$PSIGN= 0
##$REVERSE= no
##$SF= 200.130010279418
##$SI= 16384
##$SIGF1= 3
##$SIGF2= 2
##$SINO= 0.751879
##$SIOLD= 32768
##$SREGLST= <19F.Aceton>
##$SSB= 0
##$STSI= 16384
##$STSR= 0
##$SW_p= 3612.71676300578
##$SYMM= 0
##$S_DEV= 0
##$TDeff= 16384
##$TDoff= 0
##$TI= <>
##$TILT= no
##$TM1= 0
##$TM2= 0
##$TOPLEV= 0
##$USERP1= <user>
##$USERP2= <user>
##$USERP3= <user>
##$USERP4= <user>
##$USERP5= <user>
##$WDW= 1
##$XDIM= 16384
##$YMAX_p= 402271348
##$YMIN_p= -3130192
$$ End of Bruker specific parameters
$$ ---------------------------------
##NTUPLES= NMR SPECTRUM
##VAR_NAME=  FREQUENCY,     SPECTRUM/REAL,   SPECTRUM/IMAG
##SYMBOL=    X,             R,               I
##VAR_TYPE=  INDEPENDENT,   DEPENDENT,       DEPENDENT
##VAR_FORM=  AFFN,          ASDF,            ASDF
##VAR_DIM=   16384,         16384,           16384
##UNITS=     HZ,            ARBITRARY UNITS, ARBITRARY UNITS
##FACTOR=    0.220516191357247, 1,           1
##FIRST=     3096.07925821394, 0,            0
##LAST=      -516.63750479184, 0,            0
##MIN=       -516.63750479184, -3130192,     0
##MAX=       3096.07925821394, 402271348,    0
$$ Real data points
##PAGE= N=1
##DATA TABLE= (X++(R..R)), XYDATA
$$ [...]
6018E8777437Q10868l73558j195881j66951M82836K74880j159386k72090M07106
$$ 58777437 59588305 59214747 58018866 57851915 58334751 58609631 57450245 57178155 57585261
6009E7585261K81427k06754k79806o81621j278934n13012n73914J226119J50403
$$ 57585261 57866688 57659934 57380128 56698507 55419573 54906561 54332647 55558766 55709169
6000E5709169j02277m21050l63700j994003k75643m36662O93302j1412K10459
$$ 55709169 55606892 55185842 54822142 52828139 52552496 52115834 52809136 52797724 53008183
5991E3008183N23336n76675L8105j17744R48414m56322k89724N4851L86057L72624
$$ 53008183 53531519 52954844 52992949 52875205 53823619 53367297 53077573 53132424 53518481 53891105
5981E3891105J25704l83967p24483K58510r44252j296943m83r47002j367006o47674
$$ 53891105 54016809 53632842 52908359 53166869 52222617 50925674 50925191 49978189 48611183 47963509
5971D7963509M22734n61528M58498Q72743J57363Q96580j042767j182483n44750
$$ 47963509 48386243 47824715 48283213 49155956 49313319 50209899 49167132 47984649 47439899
5962D7439899l1725k01997K27666J24051K85178l02761l79801P33099K12756q20827
$$ 47439899 47408174 47206177 47433843 47557894 47843072 47540311 47160510 47893609 48106365 47285538
5952D7285538J9656N41921j399053j85925l89267P69680n41699m03203N22270
$$ 47285538 47305194 47847115 46448062 46262137 45872870 46642550 46100851 45697648 46219918
5943D6219918o55854k08230L60027P9999J9945K85235l13629O82258n71012N13647
$$ 46219918 45564064 45355834 45715861 45795860 45815805 46101040 45787411 46469669 45898657 46412304
5933D6412304N98980q94298j79481k60046O53456M532j04240L5011j277311l71464
$$ 46412304 47011284 46116986 45937505 45677459 46330915 46335447 46231207 46266218 44988907 44617443
5923D4617443r25156J502375j19797n17154o23264K47918P92039M58445P3207
$$ 44617443 43692287 45194662 45074865 44557711 43934447 44182365 44974404 45432849 45506056
5914D5506056k70821r364o88149K9068q8649q89861j77889N37617N73289m90528
$$ 45506056 45235235 45225871 44537722 44566790 44478141 43588280 43410391 43948008 44521297 44030769
5904D4030769P6236n16349n85846N26906J411945o94027q94887j19845R89670
$$ 44030769 44107005 43590656 43004810 43531716 44943661 44249634 43354747 43234902 44224572
5895D4224572l78560K95544N80624K17153J020673n13522p51638m87709p29257
$$ 44224572 43846012 44141556 44722180 44939333 45960006 45446484 44694846 44207137 43477880
5886D3477880L74714J306612N98634l64466q03623J034406m34332k74056l47604
$$ 43477880 43852594 45159206 45757840 45393374 44589751 45624157 45189825 44915769 44568165
5877D4568165M88676L39029l35039R18665P29634j007555q58692j46999J402893
$$ 44568165 45056841 45395870 45060831 45979496 46709130 45701575 44842883 44695884 46098777
5868D6098777K93692n16791J17730O77629o50576M8804J142058K90126j163220
$$ 46098777 46392469 45875678 45993408 46671037 46020461 46069265 47211323 47501449 46338229
5859D6338229K04692K48084J5945o32823Q57263P03005M77203K71585O07445l52781
$$ 46338229 46542921 46791005 46806950 46174127 47031390 47734395 48211598 48483183 49090628 48737847
5849D8737847M79551M50307k70190J81870N28072M06633J63551j014702R08100
$$ 48737847 49217398 49667705 49397515 49579385 50107457 50514090 50677641 49662939 50571039
5840E0571039J141522K88473r3332j61493O46558J03534J81088l69234J27572
$$ 50571039 51712561 52001034 51907702 51746209 52392767 52496301 52677389 52308155 52435727
5831E2435727J310015J401921M69213l32707N63733J119415J656P59806o3588
$$ 52435727 53745742 55147663 55616876 55284169 55847902 56967317 56968973 57728779 57665191
5822E7665191k03503J255054M62961P58178J184755J294275N56253M30692R43027
$$ 57665191 57461688 58716742 59179703 59937881 61122636 62416911 62973164 63403856 64346883
5813F4346883J763235J607649n7548M38313J467318J580111p664J10405R60279
$$ 64346883 66110118 67717767 67660219 68098532 69565850 71145961 71138297 71248702 72208981
5804G2208981K462755K820096J593066K365683P03816J834124L282415J367604
$$ 72208981 74671736 77491832 79084898 81450581 82154397 83988521 87270936 88638540
5796H8638540J408384K656426K979537L845716M729336L921857L922882M589043
$$ 88638540 90046924 92703350 95682887 99528603 104257939 108179796 112102678 116691721
5788A16691721N390299N588796M462648N070785M772640K601187K379441j48519
$$ 116691721 122082020 127670816 132133464 137204249 141976889 144578076 146957517 146808998
5780A46808998P49685L0139K001240J276260L298194M120917N016945N237595
$$ 146808998 147558683 147588822 149590062 150866322 154164516 158285433 163302378 168539973
5772A68539973L029478J514493J355285K69153J249819L742173K826786K543953
$$ 168539973 171569451 173083944 174439229 174708382 175958201 179700374 182527160 185071113
5764A85071113J716433K000415K54932Q95764K98858M39731O8535q86491K316872
$$ 185071113 186787546 188787961 189042893 189938657 190237515 190677246 190745781 189859290 192176162
5755A92176162J916680J38182m41544J098453K208289K797041K899576M366741
$$ 192176162 194092842 194231024 193789480 194887933 197096222 199893263 202792839 207159580
5747B07159580N204803P110411N270517O002661K764080j782355k548846m871466
$$ 207159580 212364383 219474794 224745311 230747972 233512052 231729697 229180851 224309385
5739B24309385n937963o581286n559525o459065n550395l210077k177812k851605
$$ 224309385 218371422 211790136 206230611 199771546 194221151 191011074 188833262 185981657
5731A85981657j486252j662237j684412j104135j009769j095035k02640j71520
$$ 185981657 184495405 182833168 181148756 180044621 179034852 177939817 177737177 177565657
5723A77565657P34600K91134J574609K83061p3758K185230J293345J996707K033708
$$ 177565657 178300257 178591391 180166000 180449061 180375303 182560533 183853878 185850585 187884293
5714A87884293J34741K81703m48782k438030j534656j252467j151129j028366
$$ 187884293 188019034 188300737 187851955 185413925 183879269 182626802 181475673 180447307
5706A80447307M75281M73379p16804n34574O79207J242837M31075j58508j41509
$$ 180447307 180922588 181395967 180679163 180144589 180823796 182066633 182497708 182339200 182197691
5697A82197691N05391J66749L64341R88467J56101K64719M11213J418700J846188
$$ 182197691 182703082 182869831 183234172 184222639 184378740 184643459 185054672 186473372 188319560
5688A88319560R64175J093620K309890J542647J225386K238955L036700K441380
$$ 188319560 189283735 190377355 192687245 194229892 195455278 197694233 200730933 203172313
5680B03172313L228928L411503K486764K682718K904424K025489K648577K733521
$$ 203172313 206401241 209812744 212299508 214982226 217886650 219912139 222560716 225294237
5672B25294237J370212J882721J327870N57843J096294J900423J609073J416086
$$ 225294237 226664449 228547170 229875040 230432883 231529177 233429600 235038673 236454759
5664B36454759M10494J374205R09947j8387J352999n01970j719213j153913l449684
$$ 236454759 236865253 238239458 239149405 239131018 240484017 239982047 238262834 237108921 233659237
5655B33659237k863138k186722k268370j359482l43171q3342R20305p57376Q90989
$$ 233659237 230796099 228609377 226341007 224981525 224638354 224555012 225475317 224717941 225608930
5646B25608930J926244J899542J630945J682616L43825J598955P96369Q95553
$$ 225608930 227535174 229434716 231065661 232748277 233092102 234691057 235487426 236382979
5638B36382979J986548P64528J602058Q63862K852110K289748J955685J729104
$$ 236382979 238369527 239134055 240736113 241599975 244452085 246741833 248697518 250426622
5630B50426622J381348j271393j290849j045492k856445l640623m041662j927672
$$ 250426622 251807970 250536577 249245728 248200236 245343791 241703168 237661506 235733834
5622B35733834k448559l044358j197718r95031k197510k274679j492866j180147
$$ 235733834 233285275 230240917 229043199 228048168 225850658 223575979 222083113 220902966
5614B20902966j198363L25052J242680j88376Q2190L51971J70544J341122o51962
$$ 220902966 219704603 220029655 221272335 221083959 221166149 221518120 221688664 223029786 222377824
5605B22377824n13296L59963N04644J033692p84806j200573j142162r55208j244792
$$ 222377824 221864528 222224491 222729135 223762827 222978021 221777448 220635286 219680078 218435286
5596B18435286l122301k017242P1389j732455k207830r31100l8212j271756j088198
$$ 218435286 215312985 213295743 213367132 211634677 209426847 208495747 208457535 207185779 206097581
5587B06097581q79954j300881q10584j044777p67882m33032j328016j251311n73610
$$ 206097581 205217627 203916746 203106162 202061385 201293503 200860471 199532455 198281144 197707534
5578A97707534k88805j550402n46909m70848j388068r18705n82910l68087j275539
$$ 197707534 197418729 195868327 195321418 194850570 193462502 192543797 191960887 191592800 190317261
5569A90317261j063606j085105n28019k68364o91453J50809j658253q01259K22896
$$ 190317261 189253655 188168550 187640531 187372167 186680714 186831523 185173270 184372011 184594907
5560A84594907p11406L20335j229881q46543j151165j120127n89885l34574q66849
$$ 184594907 183883501 184203836 182973955 182127412 180976247 179856120 179266235 178931661 178064812
5551A78064812j948302j887951L60867p16487j144016n87033m51612q89163j000295
$$ 178064812 176116510 174228559 174589426 173872939 172728923 172141890 171690278 170801115 169800820
5542A69800820n13937r07378J87139n39746j062583j124328q96263m42455j65465
$$ 169800820 169286883 168379505 168566644 168026898 166964315 165839987 164943724 164501269 164335804
5533A64335804q84331j109493p1586r12957q13502L61699P14208j04077n88450
$$ 164335804 163451473 162341980 162270394 161357437 160543935 160905634 161619842 161515765 160927315
5524A60927315J84029j21159j001471J13375J165448m84744n77021q45698l35139
$$ 160927315 161111344 160990185 159988714 160102089 161267537 160782793 160205772 159360074 159024935
5515A59024935j127055j95078j118870p81705o13441j036934K26258K05437P28486
$$ 159024935 157897880 157702802 156583932 155802227 155188786 154151852 154378110 154583547 155312033
5506A55312033p07927j16578l28153j63548o86513p28881j001312L8137K05499
$$ 155312033 154604106 154487528 154159375 153995827 153309314 152580433 151579121 151617258 151822757
5497A51822757j059448q69084o20096j53288M49330R84639j159718k18807M54985
$$ 151822757 150763309 149894225 149274129 149120841 149570171 150554810 149395092 149176285 149631270
5488A49631270k28307l57548j152236n15377k83632j366867o43278K68069l88402
$$ 149631270 149402963 149045415 147893179 147377802 147094170 145727303 145084025 145352094 144963692
5479A44963692q59795o39264L06457J50684j447930L32606K96419j448590p17867
$$ 144963692 144103897 143464633 143771090 143921774 142473844 142806450 143102869 141654279 140936412
5470A40936412N39636N9781j129283j120284n4493j094296q06208j607J083169
$$ 140936412 141476048 141535829 140406546 139286262 139231769 138137473 137331265 137329658 138412827
5461A38412827j242952j347210M18101k18786j101969o41027q13268r41467o82057
$$ 138412827 137169875 135822665 136240766 136021980 134920011 134278984 133465716 132524249 131842192
5452A31842192k4194R83964n54074r57672r7990j057812N16462n75496o74833
$$ 131842192 131817998 132801962 132247888 131290216 131192226 130134414 130650876 130075380 129400547
5443A29400547r8043R5607M71809m53412N08604L54524j206444m15955M47273
$$ 129400547 129302504 129398111 129869920 129416508 129925112 130279636 129073192 128657237 129104510
5434A29104510l86284m02564j534707r90647L53623j78561q2083q9906q61413
$$ 129104510 128718226 128315662 126780955 125790308 126143931 125965370 125883287 125793381 124931968
5425A24931968j75747j036742j365473q00418N08728j056474r84941p25694J35808
$$ 124931968 124756221 123719479 122354006 121553588 122062316 121005842 120020901 119295207 119431015
5416A19431015n08852p12610J49530R08637j497097j209078p84419K66656O53025
$$ 119431015 118922163 118209553 118359083 119267720 117770623 116561545 115777126 116043782 116696807
5407A16696807j741275o4675P29082l19484n66009k29031n42356r36537j64296
$$ 116696807 114955532 114890857 115619939 115300455 114734446 114505415 113963059 113026522 112862226
5398A12862226p27280m56071J5356j702814k63574J021082O6582j439426o089
$$ 112862226 112134946 111678875 111694231 109991417 109727843 110748925 110815507 109376081 109369992
5389A09369992l16450j009005m56378n54525P2186J91337P7414j651185r99095
$$ 109369992 109053542 108044537 107588159 107033634 107105820 107297157 107374571 105723386 104724291
5380A04724291p72642o58526j005765M03556K5643l99640j30939m87809o08166
$$ 104724291 103951649 103293123 102287358 102690914 102716557 102316917 102185978 101698169 101090003
5371A01090003O42210q82816k03052J182445k53593j008233r26320J16701L56337
$$ 101090003 101732213 100849397 100646345 101828790 101575197 100566964 99640644 99757345 100113682
5362A00113682p64507L10599q97263p85676P32095n46128q47868k11651q1988
$$ 100113682 99349175 99659774 98762511 97976835 98708930 98162802 97314934 97103283 97021295
5353I7021295j373469m34441N19960k66696M4125P1142q12331P4451O8988q8694
$$ 97021295 95647826 95213385 95733345 95466649 95510774 95581916 94769585 94844036 94913024 94824330
5343I4824330r86252J30667j57602L01464p8720n88261M06196J76904r93723n38169
$$ 94824330 93838078 93968745 93811143 94112607 94033887 93445626 93851822 94028726 93035003 92496834
5333I2496834J981240l64018l9887n02701m8334m93477k47138n786j419087K27944
$$ 92496834 94478074 94114056 94074169 93571468 93523134 93029657 92782519 92776733 91357646 91585590
5323I1585590N54024k693j489482q8028J150201j656322l21343M91023j179033
$$ 91585590 92139614 92136921 90647439 90559411 91709612 90053290 89731947 90222970 89043937
5314H9043937P73840n00369o10296O4500R66301q1466o31340q75448M71902O60334
$$ 89043937 89817777 89317408 88707112 88771612 89737913 89656447 89025107 88149659 88621561 89281895
5304H9281895M61858J002218n41418J06209R90280J4314j40325n9987L2980j204079
$$ 89281895 89743753 90745971 90204553 90310762 91301042 91315356 91175031 91115044 91148024 89943945
5294H9943945p54323J44309K95068q94243j156865o15219N27870n12163m19203
$$ 89943945 89189622 89333931 89628999 88734756 87577891 86962672 87490542 86978379 86559176
5285H6559176j097645n04385J335912J22142n1678j67707L4319k63421j010625
$$ 86559176 85461531 84957146 86293058 86415200 86363522 86195815 86230134 85966713 84956088
5276H4956088O21165o00884N16451K03516j78277J128103R7307q85439p57838
$$ 84956088 85577253 84976369 85492820 85696336 85518059 86646162 86743469 85858030 85100192
5267H5100192n17014j92370L50316o7926m57958O67466j1292j543689o15300Q60568
$$ 85100192 84583178 84390808 84741124 84673198 84215240 84882706 84871414 83327725 82712425 83572993
5257H3572993n08290L57412J82098o44420K15922j416174m35027J157928K74462
$$ 83572993 83064703 83422115 83604213 82959793 83175715 81759541 81324514 82482442 82756904
5248H2756904K51319L3541m55283o78917l57015O67779l48534l5141M83868p14209
$$ 82756904 83008223 83041764 82586481 81907564 81550549 82218328 81869794 81834653 82318521 81604312
5238H1604312j97507L76134j137287m99330n80929m66039Q27093J405762n05884
$$ 81604312 81406805 81782939 80645652 80146322 79565393 79099354 79926447 81332209 80826325
5229H0826325L78084P18713r38381l64771m4020n7647O04205M55031l24044M05851
$$ 80826325 81204409 81923122 80984741 80619970 80575950 80518303 81122508 81577539 81253495 81659346
5219H1659346k33846l29813n9115o27216Q97628M9366l42157k67897R48024J092139
$$ 81659346 81425500 81095687 81036572 80409356 81306984 81356350 81014193 80746296 81694320 82786459
5209H2786459k70408j339746M91373r44142O53921J054475o31631p72221J216387
$$ 82786459 82516051 81176305 81667678 80723536 81377457 82431932 81800301 81028080 82244467
5200H2244467j77270J026755o05175J44798m63830l63899N71304L2522J410711
$$ 82244467 82067197 83093952 82488777 82633575 82169745 81805846 82377150 82409672 83820383
5191H3820383j71138o24365j425412P48360n03267R56355O29627Q03050J161750
$$ 83820383 83649245 83024880 81599468 82347828 81844561 82800916 83430543 84233593 85395343
5182H5395343J236729J98358K67646j65118n00274J326629o59352m82468J64107
$$ 85395343 86632072 86830430 87098076 86932958 86432684 87759313 87099961 86617493 86781600
5173H6781600L64232Q04403m27362N2563J363714o9337J44936P16285j88274J104323
$$ 86781600 87145832 87950235 87522873 87575436 88939150 88869813 89014749 89731034 89542760 90647083
5163I0647083J048754O19132M01232Q90347J598857L70025P43234K757779k60546
$$ 90647083 91695837 92314969 92716201 93606548 95205405 95575430 96318664 99076443 98815897
5154I8815897j59813K94863l00316R78035J523798J343641J360061K075449K048694
$$ 98815897 98656084 98950947 98650631 99628666 101152464 102496105 103856166 105931615 107980309
5145A07980309R61857J293378J453444J707072K692905K637994L777066L264731
$$ 107980309 108942166 110235544 111688988 113396060 116088965 118726959 122504025 125768756
5137A25768756L138657L927915N665245N861965M872029L679000K439246K016812
$$ 125768756 128907413 132835328 138500573 144362538 149234567 152913567 155352813 157369625
5129A57369625K045530K640669K882393L947279M401896O538239Q358379R572420
$$ 157369625 159415155 162055824 164938217 168885496 173287392 179825631 188184010 197756430
5121A97756430J2242847J7127936J8028502J9022590K1289302K1385999J6403388
$$ 197756430 209999277 227127213 245155715 264178305 285467607 306853606 323256994
5114C23256994j253824j2364350k1617318k7135616k5222786k0095849j5325645
$$ 323256994 322003170 309638820 288021502 260885886 235663100 215567251 200241606
5107B00241606j3031421j0857814o444086m562337o472265m389509k928209j919568
$$ 200241606 187210185 176352371 169908285 165345948 158873683 154484174 151555965 149636397
5099A49636397m419137k175112q01964j569293o82163J41768m88577j580930O66500
$$ 149636397 145217260 143042148 142240184 140670891 139988728 140130496 139641919 138060989 138727489
5090A38727489O25357M13636J241444Q09641M69207J061750R52739J42492J02089
$$ 138727489 139352846 139766482 141007926 141817567 142286774 143348524 144301263 144443755 144545844
5081A44545844J929847q1271l28951p16149m6226L14870r5983M65880j13253N00345
$$ 144545844 146475691 146394420 146065469 145349320 145303094 145617964 145521981 145987861 145874608 146374953
5071A46374953K031915J832144K45069J662059K431857J648538J374323K115773
$$ 146374953 148406868 150239012 150484081 152146140 154577997 156226535 157600858 159716631
5063A59716631K405174J806135J904167L167975J616438N01745J023787L080318
$$ 159716631 162121805 163927940 165832107 169000082 170616520 171118265 172142052 175222370
5055A75222370K516642R22911j1770M01323r27957j307005P58001k02035l31706
$$ 175222370 177739012 178661923 178650153 179051476 178123519 176816514 177574515 177372480 177040774
5046A77040774O52151K11263j020709P88909O14400N15417K6099j007013k60014
$$ 177040774 177692925 177904188 176883479 177672388 178286788 178802205 178828304 177821291 177561277
5037A77561277k261888k510643k622900p2599k020776j810489r05288j546530
$$ 177561277 175299389 172788746 170165846 170093247 168072471 166261982 165356694 163810164
5029A63810164j892095l65683J55625k63490k25959K02650n58027M94867N768
$$ 163810164 161918069 161552386 161708011 161444521 161218562 161421212 160863185 161358052 161363820
5020A61363820p06190Q5396j749304k166031p25379l57686k236205j223726n8305
$$ 161363820 160657630 160743026 158993722 156827691 156102312 155744626 153508421 152284695 152226390
5011A52226390k376477j322527r91012K86384O052n52804q7778m60686j27177
$$ 152226390 149849913 148527386 147536374 147822758 147828810 147276006 147188228 146727542 146600365
5002A46600365N74133P56250P2196K83846M43931J555190p32152J261792Q75665
$$ 146600365 147174498 147930748 148002944 148286790 148730721 150285911 149553759 150815551 151691216
4993A51691216O17066J58278J672655J060750M20882K413115J676200K134496
$$ 151691216 152308282 152466560 154139215 155199965 155620847 158033962 159710162 161844658
4985A61844658J457735J654281J843714J695030O94558O0599R02571p76880K03437
$$ 161844658 163302393 164956674 166800388 168495418 169189976 169250575 170153146 169376266 169579703
4976A69579703J104544J210835J244373Q91484N99194O26529l79591J287652J160297
$$ 169579703 170684247 171895082 173139455 174030939 174630133 175256662 174877071 176164723 177325020
4967A77325020j33820R20719L31850O00897J021167J972152M6691K54578r43896
$$ 177325020 177191200 178111919 178443769 179044666 180065833 182037985 182084676 182339254 181395358
4958A81395358k11801Q13241j434395j177813j542686j437559q09359p83146j299963
$$ 181395358 181183557 181996798 180562403 179384590 177841904 176404345 175594986 174811840 173511877
4949A73511877n15912K44472O80341k40351R56275m96486O86761n14067k27539
$$ 173511877 172995965 173240437 173920778 173680427 174636702 174140216 174826977 174312910 174085371
4940A74085371O37322L23007K322044M59599o05353N27986j076548K01407K26933
$$ 174085371 174722693 175045700 177367744 177827343 177221990 177749976 176673428 176874835 177101768
4931A77101768J435762K27898J194252J00450L19203K46752J415504K74559j014006
$$ 177101768 178537530 178765428 179959680 180060130 180379333 180626085 182041589 182316148 181302142
4922A81302142k35093R5851R9218o58679L14622l93774j57920j039663J053238
$$ 181302142 181067049 181162900 181262118 180603439 180918061 180524287 180366367 179326704 180379942
4913A80379942M277J33497l37469p50643J016545J989822Q83922J146096N68882
$$ 180379942 180384219 180517716 180180247 179429604 180446149 182435971 183319893 184465989 185034871
4904A85034871M55577q83717j000543r49063j757947j106273n70382q91810m65627
$$ 185034871 185490448 184606731 183606188 182657125 180899178 179792905 179222523 178330713 177865086
4895A77865086J85545N31472j744557q97044l12977K91195O82944Q59654m30488
$$ 177865086 178050631 178582103 176837546 175940502 175627525 175918720 176601664 177461318 177030830
4886A77030830p63171k81586o45965K28698J346566J121656k09128J313557l2047
$$ 177030830 176267659 175986073 175340108 175568806 176915372 178037028 177827900 179141457 179109410
4877A79109410R92959J662418J029442K26560j31314m44151J23127m12203K46175
$$ 179109410 180102369 181764787 182794229 183020789 182889475 182445324 182568451 182156248 182402423
4868A82402423J087581J73000L94764l69080J208753K51224J416652M21342Q25414
$$ 182402423 183490004 183663004 184057768 183688688 184897441 185148665 186565317 186986659 187812073
4859A87812073L56422J529382J293142O81755M59957J426987J713651J924550
$$ 187812073 188168495 189697877 190991019 191672774 192132731 193559718 195273369 197197919
4851A97197919K283534J587960J138311J971848K859002Q64182J184485K571564
$$ 197197919 199481453 201069413 202207724 204179572 207038574 207902756 209087241 211658805
4843B11658805K240458J153796P24404J829936Q97220M30034J560487R27287o2308
$$ 211658805 213899263 215053059 215777463 217607399 218504619 218934653 220495140 221422427 221360119
4834B21360119k81232j83521m36465j69616k44148l03417q03222j928650j078340
$$ 221360119 221078887 220895366 220458901 220289285 220045137 219741720 218938498 217009848 215931508
4825B15931508j099794q07224j411182j094083k535527j811426o56082k068615
$$ 215931508 214831714 214024490 212613308 211519225 208983698 207172272 206516190 204447575
4817B04447575j194286j14490o61953J71829J03000o84722K23048k0112R16876
$$ 204447575 203253289 203138799 202476846 202648675 202751675 202066953 202290001 202269889 203186765
4808B03186765p77946J038362Q73492J031337M40367J939558M56157j6385J30022
$$ 203186765 202408819 203447181 204320673 205352010 205792377 207731935 208188092 208171707 208301729
4799B08301729r31491j724306j398983M47134j188838n91010j022964l015058
$$ 208301729 207370238 205645932 204246949 204694083 203505245 202914235 201891271 198876213
4791A98876213q39024K24343q07389k59468o85983m71760N61125k69573j30895
$$ 198876213 198037189 198261532 197454143 197194675 196508692 196036932 196598057 196328484 196197589
4782A96197589J40108P7356k97766j021287n77442O344M96486k90268m51680L64964
$$ 196197589 196337697 196415053 196117287 195096000 194518558 194524902 195021388 194731120 194279440 194644404
4772A94644404m62948j297844j465151P2478o91447J053371k66969n89740P6747
$$ 194644404 194181456 192883612 191418461 191490939 190799492 191852863 191585894 190996154 191072901
4763A91072901P7865n49236m80925j032719r70049J55900j59301Q03458j328928
$$ 191072901 191150766 190601530 190120605 189087886 188117837 188273737 188114436 188917894 187588966
4754A87588966q96393j334221L48126L08893l40675j742302J93471N50359o12967
$$ 187588966 186692573 185358352 185706478 186015371 185674696 183932394 184125865 184676224 184063257
4745A84063257n42251K33375O4521j241252J131132l28721J51070k07385n06443
$$ 184063257 183521006 183754381 183818902 182577650 183708782 183380061 183531131 183323746 182817303
4736A82817303k46192o58112k61120K71332j75922k69959J82888k14291l03656
$$ 182817303 182571111 181912999 181651879 181923211 181747289 181477330 181660218 181445927 181142271
4727A81142271J04274J013367p1120q30942o60033k64748m6853m36546O5509M26195
$$ 181142271 181246545 182259912 182188792 181357850 180697817 180433069 180386216 179949670 180015179 180441374
4717A80441374O8637J14442J052362o2224R73151J73451K20599J660977J014467
$$ 180441374 180510011 180624453 181676815 181614591 182587742 182761193 182981792 184642769 185657236
4708A85657236O58466r97141R85859J367707J354778J636220J339525J130917
$$ 185657236 186315702 185318561 186304420 187672127 189026905 190663125 192002650 193133567
4700A93133567K16824K78319K085494K173443J761617J078650J841281J267045
$$ 193133567 193350391 193628710 195714204 197887647 199649264 200727914 202569195 203836240
4692B03836240J630092M55503J3327K216932R65323J429773J511641K435274K999652
$$ 203836240 205466332 205921835 205935162 208152094 209117417 210547190 212058831 214494105 217493757
4683B17493757K239283L708213L072580L186911L552136N217086O083397N799272
$$ 217493757 219733040 223441253 226513833 229700744 233252880 238469966 244553363 250352635
4675B50352635O374403N186664L364618K620534J722518M57142J076814O86295
$$ 250352635 256727038 261913702 265278320 267898854 269621372 270078514 271155328 271841623
4667B71841623J970429L285775L553630L070199J144611r69937j441436k238468
$$ 271841623 273812052 277097827 280651457 283721656 284866267 283896330 282454894 280216426
4659B80216426l043725m685854m133043k566478l560900l797293k105381k601806
$$ 280216426 277172701 272486847 268353804 265787326 262226426 258429133 256323752 253721946
4651B53721946j485280j192569J53009P66226M55021q210O6239N18821P65656
$$ 253721946 252236666 251044097 251197106 251963332 252418353 252410143 252476382 252995203 253760859
4642B53760859J20839j238223p98015j670748l77990m85285O45613l8024J034412
$$ 253760859 253881698 252643475 251845460 250174712 249796722 249311437 249957050 249919026 250953438
4633B50953438K309574J359423K875977L009044P02308J654774K747910K041942
$$ 250953438 253263012 254622435 257498412 260507456 261209764 262864538 265612448 267654390
4625B67654390K693805N00862K243544K762403L145192J958002K046808K335748
$$ 267654390 270348195 270849057 273092601 275855004 279000196 280958198 283005006 285340754
4617B85340754J246292J713181P85766J586223L91118n94000j379169j795202
$$ 285340754 286587046 288300227 289085993 290672216 291063334 290469334 289090165 287294963
4609B87294963l273537k359938k812621l016613k811415k859762l564876k058753
$$ 287294963 284021426 281661488 278848867 275832254 273020839 270161077 266596201 264537448
4601B64537448k895580k075232j397202k999897k968395k311126j483316j575351
$$ 264537448 261641868 259566636 258169434 255169537 252201142 249890016 248406700 246831349
4593B46831349j484288j864515j621477p42910j257413k337360j474722k96651
$$ 246831349 245347061 243482546 241861069 241118159 239860746 237523386 236048664 235752013
4585B35752013n98823l007207k674056r72646j135359k323496k059991l29265
$$ 235752013 235153190 232145983 229471927 228499281 227363922 225040426 222980435 222651170
4577B22651170o93212q00724k122941j884052j384020j715294j289698k586074
$$ 222651170 221957958 221157234 219034293 217150241 215766221 214050927 212761229 210175155
4569B10175155q49416l08268j647480o27403j242514l5589J3341j768570k30642
$$ 210175155 209325739 209017471 207369991 206742588 205500074 205464485 205477826 203709256 203478614
4560B03478614p61610l51127k401118j200534k91758q25873p30708l16381l93524
$$ 203478614 202717004 202365877 199964759 198764225 198472467 197646594 196915886 196599505 196205981
4551A96205981j283281j561967q18438j768499q53562m88984j364826k41396k932690
$$ 196205981 194922700 193360733 192542295 190773796 189920234 189431250 188066424 187825028 184892338
4542A84892338j61876j69499p73866K61552p91639k934682j024343n41766j416512
$$ 184892338 184730462 184560963 183787097 184048649 183257010 180322328 179297985 178756219 177339707
4533A77339707k85072p37093j238785p70186k14298P1271j57862j186379r49347
$$ 177339707 177054635 176317542 175078757 174308571 174094273 174165544 174007682 172821303 171871956
4524A71871956o38973p75118q5983q39414q15460q67125j090743m75837k057212
$$ 171871956 171232983 170457865 170371882 169532468 168717008 167849883 166759140 166283303 164226091
4515A64226091j498429J22163j376664j252726n21644q35370j260304j185728
$$ 164226091 162727662 162849825 161473161 160220435 159698791 158863421 157603117 156417389
4507A56417389j511715L1807m42339j259246j64992j944626n56788j275098l83019
$$ 156417389 154905674 154937481 154495142 153235896 153070904 151126278 150569490 149294392 148911373
4498A48911373n50836p84123j507021m32252l85335o06919r13046j028601j093023
$$ 148911373 148360537 147576414 146069393 145637141 145251806 144644887 143731841 142703240 141610217
4489A41610217r5263m45138j151662k01852m06240r4454o40738r68002n11482
$$ 141610217 141514954 141069816 139918154 139716302 139310062 139215608 138574870 137606868 137095386
4480A37095386K67141j3518j16164k2691j93068q06926j77923j36836j149021
$$ 137095386 137362527 137349009 137232845 137210154 137017086 136210160 136032237 135895401 134746380
4471A34746380J063555N04830P7580q39217J05694O1292m94762q93445J16374
$$ 134746380 135809935 136314765 136392345 135553128 135658822 135720114 135225352 134331907 134448281
4462A34448281J37414j54642L22813j19706L64169M034k73667m17872L81161J91475
$$ 134448281 134585695 134431053 134753866 134634160 134998329 135002363 134728696 134310824 134691985 134883460
4452A34883460l74949l24686K13422l82603p445J354706k4570K75975R41109M19165
$$ 134883460 134508511 134183825 134397247 134014644 134007199 135361905 135337335 135613310 136554419 136973584
4442A36973584J197075l23724l93760j25617M21306N62340L31660R24804L68299
$$ 136973584 138170659 137846935 137453175 137327558 137748864 138311204 138642864 139567668 139935967
4433A39935967M2644N47079l80482K320396j22134R08952J107392L41645N02054
$$ 139935967 139978611 140525690 140145208 142465604 142343470 143252422 144359814 144701459 145203513
4424A45203513R12185K500259K979402K556900K494782K573777J64079k270221
$$ 145203513 146115698 148615957 151595359 154152259 156647041 159220818 159384897 157114676
4416A57114676j661685j947826k503807j024417k558061j338953J92955l35029
$$ 157114676 155452991 153505165 151001358 149976941 147418880 146079927 146272882 145937853
4408A45937853j24505q54462n58067J508917q40466k37516R38430L54721J016676
$$ 145937853 145813348 144958886 144400819 145909736 145069270 144831754 145770184 146124905 147141581
4399A47141581Q19926J86039M90416J687929R95892M80644O53601r24816l16452
$$ 147141581 147961507 148147546 148637962 150325891 151321783 151802427 152456028 151531212 151214760
4390A51214760n70919Q7112m26179n67414Q13097J11021Q35791Q77324Q37463
$$ 151214760 150643841 150730953 150304774 149737360 150550457 150661478 151497269 152374593 153212056
4381A53212056M2335J002425P17864K57779J182429k89057J107939J714817m24117
$$ 153212056 153254391 154256816 154974680 155232459 156414888 156125831 157233770 158948587 158524470
4372A58524470l95616J894658O73843K6771K80104P31666J868573K50292q174
$$ 158524470 158128854 160023512 160697355 160724126 161004230 161735896 163604469 163854761 163846587
4363A63846587l4197L38139J375472N99381L77852l88093L34484J437584j92534
$$ 163846587 163812390 164150529 165526001 166125382 166503234 166115141 166449625 167887209 167694675
4354A67694675j03663O37506P49017O69726j77163K41458R96447m90125R68976
$$ 167694675 167591012 168228518 168977535 169647261 169470098 169711556 170708003 170217878 171186854
4345A71186854Q6363L33503J1531j112295J3578K290293m27162j77481l83086
$$ 171186854 171273217 171606720 171618251 170505956 170519534 172809827 172382665 172205184 171822098
4336A71822098O13530R70836j556870q19909o24336n10065Q9437l98704O77980
$$ 171822098 172435628 173406464 171849594 171029685 170405349 169895284 169984721 169586017 170263997
4327A70263997L37737j80558m56428p94798J40530R728l30418L40372R32871P306
$$ 170263997 170601734 170421176 169964748 169169950 169310480 169320208 168989790 169330162 170263033 170270339
4317A70270339r39878j554934o89345K67440N43054J561604j195934k69008J30680
$$ 170270339 169330461 167775527 167086182 167353622 167896676 169458280 168262346 167993338 168124018
4308A68124018m80519q17671j169175N94423k76658m33198j138559p79469L48063
$$ 168124018 167643499 166825828 165656653 166251076 165974418 165541220 164402661 163623192 163971255
4299A63971255o81976j031666j060016o28835L50592j862079q43606j383571m86939
$$ 163971255 163289279 162257613 161197597 160568762 160919354 159057275 158213669 156830098 156343159
4290A56343159j64724j428894j126125j02782j539477j641251o33925j367213
$$ 156343159 156178435 154749541 153623416 153520634 151981157 150339906 149705981 148338768
4282A48338768j271024R6024j285881p58818m16731m43801m13929m20714q87694
$$ 148338768 147067744 147163768 145877887 145119069 144702338 144258537 143844608 143423894 142536200
4273A42536200j471955j746582J77234j223194r99865q61563j419645k74645J286416
$$ 142536200 141064245 139317663 139494897 138271703 137271838 136410275 134990630 134715985 136002401
4264A36002401K77015j102762l128802m6851J07687j394192J97527J24326j326781
$$ 136002401 136279416 135176654 132047852 132001001 132108688 130714496 130912023 131036349 129709568
4255A29709568q87257j054955j398019o58130J16860j36693j92147n82847q07279
$$ 129709568 128822311 127767356 126369337 125711207 125828067 125691374 125499227 124916380 124109101
4246A24109101o23562k87677R2903l7584j016691j060854j247275p98024j339435
$$ 124109101 123485539 123197862 123290765 123253181 122236490 121175636 119928361 119130337 117790902
4237A17790902P0524L25383r6738J66113p75498r28187J96866L2875r24615p70087
$$ 117790902 117861426 118186809 118090071 118256184 117480686 116552499 116749365 116782240 115857625 115087538
4227A15087538O09696R45852p81805j784256q90937J134773j633533k99966q62491
$$ 115087538 115697234 116643086 115861281 114077025 113186088 114320861 112687328 112387362 111524871
4218A11524871m77635k2940o16054o00559R19382j285761j2183r23003j037063
$$ 111524871 111047236 111024296 110408242 109807683 110727065 109441304 109429121 108506118 107469055
4209A07469055M79322L69140j363622r60748P08356l96575o18660K93823j046286
$$ 107469055 107948377 108317517 106953895 105993147 106701503 106304928 105686268 105980091 104933805
4200A04933805M25889J94990j504224k08442K24755l57736k29462m84317r92743
$$ 104933805 105359694 105554684 104050460 103842018 104066773 103709037 103479575 102995258 102002515
4191A02002515q9409M09302n14977j79515j773342j60880P13359L40888m80943
$$ 102002515 101913106 102322408 101807431 101627916 99854574 99693694 100407053 100747941 100266998
4182A00266998o641m02335j12165q23274n58115K49296j51537p75154p40891o79265
$$ 100266998 100260357 99858022 99745857 98922583 98364468 98613764 98462227 97687073 96946182 96266917
4172I6266917P11929q43286l37061O60584k28425j78879j458535j755529r45392
$$ 96266917 96978846 96135560 95798499 96459083 96230658 96051779 94593244 92837715 91892323
4163I1892323J28027l92579J050418n58078j78699l80579o84770l18617j56620
$$ 91892323 92020350 91627771 92678189 92120111 91941412 91560833 90876063 90557446 90400826
4154I0400826j092730o15875j08531j7668o88324N87691k66841m64245n38525
$$ 90400826 89308096 88692221 88583690 88566022 87877698 88465389 88198548 87734303 87195778
4145H7195778l30004N25951j90795R4001j034482N14368J68439j89693p00093
$$ 87195778 86865774 87391725 87200930 87294931 86260449 86774817 86943256 86753563 86053470
4136H6053470l73789p88526k154744N20097L61966j626868j277486K41164O66680
$$ 86053470 85679681 84891155 82736411 83256508 83618474 81991606 80714120 80955284 81621964
4127H1621964p00464p19208m60759K55068J706429K17457j315887k63801j145106
$$ 81621964 80921500 80202292 79741533 79996601 81703030 81920487 80604600 80340799 79195693
4118G9195693q92488N06568M29860Q7610o20174q67085p02803L34013p4597P42600
$$ 79195693 78303205 78809773 79239633 79327243 78707069 77839984 77137181 77471194 77396597 78139197
4108G8139197J89346j252902l72969Q91053O49906q0467j844649p56337k05147
$$ 78139197 78328543 77075641 76702672 77593725 78243631 78163164 76318515 75562178 75357031
4099G5357031Q39965m84981q00384M38777k07263L47845P19200k99760K65496
$$ 75357031 76196996 75712015 74911631 75350408 75143145 75490990 76210190 75910430 76175926
4090G6175926N35521p3203J181321O66585j078702j093602K8923J107194L35086
$$ 76175926 76711447 76638244 77819565 78486150 77407448 76313846 76342769 77449963 77785049
4081G7785049o08878m52547O85276M45093n91169L13958K14678o26227J103288
$$ 77785049 77176171 76723624 77408900 77853993 77262824 77576782 77791460 77165233 78268521
4072G8268521n43721M51951J95361K36144P47735M84881J121199O12858J164205
$$ 78268521 77724800 78176751 78372112 78608256 79355991 79840872 80962071 81574929 82739134
4063H2739134P91663L60427J262965K306602J393400O97501K112007K118035K278317
$$ 82739134 83530797 83891224 85154189 87460791 88854191 89551692 91663699 93781734 96060051
4054I6060051L839290K387525J231743K36547l51911k43235r7519q43483m90811
$$ 96060051 99899341 102286866 103518609 103755156 103403245 103160010 103062491 102219008 101728197
4045A01728197K34409Q26455K024559J854378K917853J823841L056364K519448
$$ 101728197 101962606 102789061 104813620 106667998 109585851 111409692 114466056 116985504
4037A16985504J41512K58627o77693j86425J012358l26578J11269J534819J263260
$$ 116985504 117127016 117385643 116707950 116521525 117533883 117207305 117318574 118853393 120116653
4028A20116653J269373L011143L658088N258038N262448N158248J660531j981962
$$ 120116653 121386026 124397169 128055257 133313295 138575743 143733991 145394522 143412560
4020A43412560l965657m492429n036225o722839m259775k816898j718402j680648
$$ 143412560 139446903 134954474 129918249 123195410 118935635 116118737 114400335 112719687
4012A12719687L92645m6646q49965n23288J70683j296786o02287j638762l090691
$$ 112719687 113112332 113065686 112215721 111692433 111863116 110566330 109964043 108325281 105234590
4003A05234590k336363j864863j912623k845751j110498r43438j811783L39769
$$ 105234590 102898227 101033364 99120741 96274990 95164492 94221054 92409271 92749040
3995I2749040J69088J577676L55883j88780k535029k191935k602619k531231k753719
$$ 92749040 92918128 94495804 94851687 94662907 92127878 89935943 87333324 84802093 82048374
3986H2048374l077331j715900o63106k320915L22094j537793j531842j724614
$$ 82048374 78971043 77255143 76592037 74271122 74593216 73055423 71523581 69798967
3978F9798967j544590L01168r74655r82540q95126P37517j392403Q25253R67635
$$ 69798967 68254377 68555545 67580890 66598350 65703224 66440741 65048338 65873591 66841226
3969F6841226j159489k77524l17067j98335O60497p05072j168036r54158Q50626
$$ 66841226 65681737 65404213 65087146 64888811 65549308 64844236 63676200 62722042 63572668
3960F3572668J098217j0578j757506j592936J255491O11049p45335l00324N89506
$$ 63572668 64670885 64660307 62902801 61309865 62565356 63176405 62431070 62130746 62720252
3951F2720252M64415q33053O61001r62397j060692L26143k31415n0484r73388
$$ 62720252 63184667 62351614 63012615 62050218 60989526 61315669 61084254 61033770 60060382
3942F0060382j478901J881534J014814L69569M71932n0418Q9719J63173j439564
$$ 60060382 58581481 60463015 61477829 61847398 62319330 62268912 62358631 62521804 61082240
3933F1082240j646895O84484J195676M68888K0941j187311m01286J41245P39787
$$ 61082240 59435345 60119829 61315505 61784393 61805334 60618023 60216737 60357982 61097769
3924F1097769J217432m47886M6398O63083o71252N7993j066952j243771J244900
$$ 61097769 62315201 61867315 61913713 62576796 61905544 61963537 60896585 59652814 60897714
3915F0897714J24768j614987L06853J346487M41773j332398K82J888226r08706
$$ 60897714 61022482 59407495 59714348 61060835 61502608 60170210 60170492 62058718 61150012
3906F1150012n97485O64833O9523O33406j20499o41656p62348K39850Q61321M24751
$$ 61150012 60552527 61217360 61286883 61920289 61799790 61158134 60395786 60635636 61496957 61921708
3896F1921708J108758q35054n96345J77529K03281j07206l65563j27617M93181
$$ 61921708 63030466 62195412 61599067 61776596 61979877 61872671 61507108 61379491 61872672
3887F1872672o17674l4102j99173l39326j56637M44993k09188M79174N07098j642790
$$ 61872672 61254998 61220896 61021723 60682397 60525760 60970753 60761565 61240739 61747837 60105047
3877F0105047j63457j03445J303834o68677l49052N94675k99183M81856n81140
$$ 60105047 59941590 59838145 61141979 60473302 60124250 60718925 60419742 60901598 60320458
3868F0320458J97117R03478N47783p89251l4782R180K15486L22124r64372J007888
$$ 60320458 60517575 61421053 61968836 61179585 61144803 61153983 61369469 61691593 60727221 61735109
3858F1735109k07704m76700J273637J195831p71442j298389n69375K41176O65524
$$ 61735109 61527405 61050705 62324342 63520173 62748731 61450342 60880967 61122143 61787667
3849F1787667O47616k00966j96338n75962J267147J241725l16347n86792L24662
$$ 61787667 62435283 62234317 62037979 61462017 62729164 63970889 63654542 63067750 63392412
3840F3392412l61059K47223Q28731p32665P62944l43316L66795m65827K27397
$$ 63392412 63031353 63278576 64107307 63374642 64137586 63794270 64161065 63695238 63922635
3831F3922635J85964K9847o67879J063415K39199r35068P14115L6361q94301m15364
$$ 63922635 64108599 64138446 63470567 64533982 64773181 63838113 64552228 64588589 63694288 63278924
3821F3278924K067810N72741k16169M74294J353093j048616n03439R36540j68766
$$ 63278924 65346734 65919475 65703306 66177600 67530693 66482077 65978638 66915178 66746412
3812F6746412M87233K27563M36581J732471R39028J261750k46708L15134K141124
$$ 66746412 67233645 67461208 67897789 69630260 70569288 71831038 71584330 71899464 74040588
3803G4040588p1075l98114L03387k7579O18382J112930j102054M02783p39870
$$ 74040588 73969513 73571399 73874786 73847207 74465589 75578519 74476465 74879248 74139378
3794G4139378n43843O61221J668846O03024p37701R07244J178140l24736o5739
$$ 74139378 73595535 74256756 75925602 76528626 75790925 76698169 77876309 77551573 77485834
3785G7485834J306031Q52856J904417Q05187J171168K50059J117433O87707O46806
$$ 77485834 78791865 79644721 81549138 82354325 83525493 83775552 84892985 85580692 86227498
3776H6227498J509303P52407M01712J070543J585764p0646J51563n64556j608853
$$ 86227498 87736801 88489208 88890920 89961463 91547227 91476581 91628144 91063588 89454735
3767H9454735o13706J229652K57653l30676Q92101k25790p18023P16004J744904
$$ 89454735 88841029 90070681 90328334 89997658 90889759 90663969 89945946 90661950 92406854
3758I2406854J360506L18141m21776J102409J030362O16995M61086K67175O45691
$$ 92406854 93767360 94085501 93663725 94766134 95796496 96413491 96874577 97141752 97787443
3749I7787443m4257J274359R38099M69831Q07438j68752J471869K68301l52327
$$ 97787443 97743186 99017545 99955644 100425475 101232913 101064161 102536030 102804331 102452004
3740A02452004j52610J230912K55137k30737M24081P87550o3754j107389K57494
$$ 102452004 102299394 103530306 103785443 103554706 103978787 104766337 104702583 103595194 103852688
3731A03852688o82307J804020o19703O9988j625131j189268J31874k81558M22164
$$ 103852688 103170381 104974401 104354698 104424686 102799555 101610287 101742161 101460603 101882767
3722A01882767m59150n38555J08327r01362K80154Q76118Q7957J509981J212733
$$ 101882767 101423617 100885062 100993389 100092027 100372181 101248299 101336256 102846237 104058970
3713A04058970o01776R24687J41636J026035O43071L5383N34487K80463P21500
$$ 104058970 103457194 104381881 104523517 105549552 106192623 106228006 106762493 107042956 107764456
3704A07764456q18155j234095j439360k44697O47873k51644l64275m89372j173708
$$ 107764456 106946301 105712206 104272846 104028149 104676022 104424378 104060103 103570731 102397023
3695A02397023o77873q75753j087257J60799J51989j74748l60110O09024l91073
$$ 102397023 101719150 100843397 99756140 99916939 100068928 99894180 99534070 100143094 99752021
3686I9752021l64809J073191p86942J044633k722J387179J142109o65231r04497
$$ 99752021 99387212 100460403 99673461 100718094 100715372 102102551 103244660 102579429 101674932
3677A01674932j141420N28479R33668N3740K50863Q77428M13639m92329K18384
$$ 101674932 100533512 101061991 101995659 102049399 102300262 103177690 103591329 103099000 103317384
3668A03317384O69901Q99210J200008k79015j207168m19309N46452K81754m95497
$$ 103317384 103987285 104886495 106086503 105807488 104600320 104181011 104727463 105009217 104513720
3659A04513720o45033j8285L31816m26423Q53207J17555J273892o43611p668N32908
$$ 104513720 103868687 103850402 104182218 103755795 104609002 104726557 106000449 105356838 105349170 105882078
3649A05882078R81366J54567O91526O05749J870234R62289N62989J424286K693234
$$ 105882078 106863444 107018011 107709537 108315286 110185520 111147809 111710798 113135084 115828318
3640A15828318K601235K25874O07868J90497M96013J909265J806786n14271P77274
$$ 115828318 118429553 118655427 119263295 119453792 119949805 121859070 123665856 123151585 123928859
3631A23928859K50238m05840j46752R6257n02636l33667j28582L53820n17120
$$ 123928859 124179097 123773257 123626505 123722762 123220126 122886459 122757877 123111697 122594577
3622A22594577q28963J245495n18657j140607J988084J994155L53191K047070
$$ 122594577 121765614 123011109 122492452 121351845 123339929 125334084 125687275 127734345
3614A27734345N96745K29558J765327L33054O08955N56041K184875J329275K26425
$$ 127734345 128331090 128560648 130325975 130659029 131267984 131824025 134008900 135338175 135564600
3605A35564600l1182K049721K335751N57953O17951Q42375k25592L60932J198637
$$ 135564600 135533418 137583139 139918890 140476843 141094794 141937169 141711577 142072509 143271146
3596A43271146O59416p66854m04492l29585q96679J06437J093110M88331O9618
$$ 143271146 143930562 143163708 142759216 142429631 141532952 141639389 142732499 143220830 143290448
3587A43290448p44620J19967J103646K78639N11607J956308N11115L53754P86299
$$ 143290448 142545828 142665795 143769441 144048080 144559687 146515995 147027110 147380864 148167163
3578A48167163N50033M23620N96551J761201J463212J313613J516452J352558
$$ 148167163 148717196 149140816 149737367 151498568 152961780 154275393 155791845 157144403
3570A57144403J741926J110754L75677M00641Q24960J951724R2808J011233N83365
$$ 157144403 158886329 159997083 160372760 160773401 161598361 163550085 163642893 164654126 165237491
3561A65237491K86357J57285p88134K01213m03434N34634n0792L47889O23322
$$ 165237491 165523848 165681133 164892999 165094212 164690778 165225412 165174620 165522509 166145831
3552A66145831N66589k58183R70193J902437K71757K29307K397210J519124K18790
$$ 166145831 166712420 166454237 167424430 169326867 169598624 169827931 172225141 173744265 173963055
3543A73963055J331070J945067J995402J105034Q39221R99610J647629K047756
$$ 173963055 175294125 177239192 179234594 180339628 181178849 182178459 183826088 185873844
3535A85873844K113789K663712K245135J177101M11683J534106L86654M29513
$$ 185873844 187987633 190651345 192896480 194073581 194485264 196019370 196406024 196835537
3527A96835537M11255N67424K829264R85709N84588K432952K040500O77705K131680
$$ 196835537 197246792 197814216 200643480 201629189 202213777 204646729 206687229 207364934 209496614
3518B09496614K536642K010501J616561L533953K998056L261549L286457L373326
$$ 209496614 212033256 214043757 215660318 219194271 222192327 225453876 228740333 232113659
3510B32113659K943709L550384M213835L281094L994954M703321M470597M525349
$$ 232113659 235057368 238607752 242821587 246102681 250097635 254800956 259271553 263796902
3502B63796902M918773O175369N711469O166682O258241O936926Q329418Q640850
$$ 263796902 268715675 274891044 280602513 286769195 293027436 299964362 308293780 316934630
3494C16934630Q040786Q688396Q392047Q553298R636070Q720813Q617618Q411062
$$ 316934630 324975416 333663812 342055859 350609157 360245227 368966040 377583658 385994720
3486C85994720N935744N274372M601477M65035l42785l848009o966365p862245
$$ 385994720 391930464 397204836 401806313 402271348 401928563 398080554 391114189 383251944
3478C83251944r988860j0236682j1700148j0458357j0430846j1792413r336693
$$ 383251944 373263084 363026402 351326254 340867897 330437051 318644638 309307945
3471C09307945q897059p490877p726916p386318p759530o925609n387183n201991
$$ 309307945 300410886 292920009 285193093 277806775 270047245 263121636 257734453 252532462
3463B52532462o128149m867109m673790l708602l687406m994292l352457l428500
$$ 252532462 246404313 241537204 236863414 233154812 229467406 224473114 221120657 217692157
3455B17692157k775031l233226j151911j734389k897703j579996j095756j628562
$$ 217692157 214917126 211683900 210531989 208797600 205899897 204319901 203224145 201595583
3447B01595583j686620j409154k369801q59889K77405r45615L40973j105688k850901
$$ 201595583 199908963 198499809 196130008 195270119 195547524 194601909 194942882 193837194 190986293
3438A90986293l398336l712721m068657m121266l951445l911829m433185l339042
$$ 190986293 187587957 183875236 179806579 175685313 171733868 167822039 163388854 160049812
3430A60049812k086907k164054k641588k240704k791114k132845k67602j821135
$$ 160049812 157962905 155798851 153157263 150916559 148125445 145992600 145724998 143903863
3422A43903863o07992p31154k95878O6971q07353o27542N84003K17843R68383
$$ 143903863 143295871 142564717 142268839 142335810 141528457 140900915 141484918 141702761 142671144
3413A42671144m15140q74815o30245k308332l360066k298092j901741k814105
$$ 142671144 142256004 141381189 140750944 138442612 135082546 132784454 130882713 128068608
3405A28068608k530438k095293j989271r91737j417027j714179j339705j327500
$$ 128068608 125538170 123442877 121453606 120461869 119044842 117330663 115990958 114663458
3397A14663458M0135k040816j975988q98794o59799r59759j676076j562740j878185
$$ 114663458 114703593 112662777 110686789 109787995 109128196 108168437 106492361 104929621 103051436
3388A03051436k53754l05951o67032q31016j538861l82874n49099K60192m98040
$$ 103051436 102797682 102491731 101824699 100993683 99454822 99071948 98522849 98783041 98285001
3379I8285001j324919q15535n82481k13501j013956q15471r10153p3331j44490
$$ 98285001 96960082 96144547 95562066 95348565 94334609 93519138 92608985 92535654 92391164
3370I2391164q08144r09366j503094n47605n1255K52133j837390L14124L74903
$$ 92391164 91583020 90673654 89170560 88622955 88571700 88823833 86986443 87300567 87675470
3361H7675470j752948k60489P31485l40878j241908j170757o64437k95114L14291
$$ 87675470 85922522 85662033 86393518 86052640 84810732 83639975 82975538 82680424 82994715
3352H2994715j69978m72294k90501n87139o32572l13835n83076j041650N79164
$$ 82994715 82824737 82352443 82061942 81474803 80842231 80528396 79945320 78903670 79482834
3343G9482834k59083j90492k347826l90493j7670j14321K86821k90586O17507
$$ 79482834 79223751 79033259 76685433 76294940 76277270 76162949 76449770 76159184 76776691
3334G6776691j08231q43151m32529j199763j124694J385279j068450o32263J464378
$$ 76776691 76668460 75825309 75392780 74193017 73068323 74453602 73385152 72752889 74217267
3325G4217267j287773k51641J20444j208318L34467N52087o22731n77435p6213
$$ 74217267 72929494 72677853 72798297 71589979 71924446 72476533 71853802 71276367 71200154
3316G1200154J4764o97872J595713L50570r94189o06006p60915r58540m53671
$$ 71200154 71214918 70517046 72112759 72463329 71469140 70863134 70102219 69143679 68690008
3307F8690008N64317J97160j97840N05300K26898n76911m01990p04033M52563
$$ 68690008 69254325 69451485 69253645 69758945 69985843 69408932 69006942 68302909 68755472
3298F8755472o51673j133053Q18395Q23677R2895j53112j587982Q6278J060878
$$ 68755472 68103799 66970746 67789141 68612818 68705713 68552601 66964619 67050897 68111775
3289F8111775m5433M8980q94298K18929K10612L26886M60011j376184J209346
$$ 68111775 68066342 68115322 67221024 67439953 67650565 67977451 68437462 67061278 68270624
3280F8270624P58106o68270p44828Q86928O7233K02742p09408J2109J976441O37150
$$ 68270624 69028730 68360460 67615632 68502560 68569793 68772535 68063127 68075236 70051677 70688827
3270G0688827q46975J41057M4045J277027n13285l37564J087550J55540L99130
$$ 70688827 69841852 69982909 70026954 71303981 70790696 70453132 71540682 71696222 72095352
3261G2095352J652267Q38808L82232P27019R03686J345697J147292J130416K44902
$$ 72095352 73747619 74586427 74968659 75695678 76599364 77945061 79092353 80222769 80467671
3252H0467671L54274p25616J330645K98832N10349J057063M68133l23895Q60702
$$ 80467671 80821945 80096329 81426974 81725806 82236155 83293218 83761351 83437456 84298158
3243H4298158J105956m36662R18289J821638K090102J150136K93321K183589J153753
$$ 84298158 85404114 84967452 85885741 87707379 89797481 90947617 91240938 93424527 94578280
3234I4578280J510580J529464K113366Q98790J938262J494394J550937J896808
$$ 94578280 96088860 97618324 99731690 100630480 102568742 104063136 105614073 107510881
3226A07510881J920387K711415K931901M275271L107148M878776L305387K971320
$$ 107510881 109431268 112142683 115074584 119349855 122457003 127335779 130641166 133612486
3218A33612486L566205M093270K788424M212884L781835K559443K941610L292769
$$ 133612486 137178691 141271961 144060385 148273269 152055104 154614547 157556157 160848926
3210A60848926J390495K86057l06575K33459j051636m15086Q78259j11765K47075
$$ 160848926 162239421 162525478 162218903 162452362 161400726 160985640 161863899 161752134 161999209
3201A61999209J307177J595464J458456K683147J824077J953466R04118J311806
$$ 161999209 163306386 164901850 166360306 169043453 170867530 172820996 173725114 175036920
3193A75036920L022191K433301L545569L071487K401945M658957M917142M146038
$$ 175036920 178059111 180492412 184037981 187109468 189511413 194170370 199087512 203233550
3185B03233550M947444N658563O529973Q082691P350398P816117L873804L740465
$$ 203233550 208180994 213839557 220369530 228452221 235802619 243618736 247492540 251233005
3177B51233005K763123J377281j38409L78894j84592j018843j44677J04104n2364
$$ 251233005 253996128 255373409 255235000 255613894 255429302 254410459 254265782 254369886 254317522
3168B54317522j607027m20625J44830R24842J8471j826536N29696n03004j383297
$$ 254317522 252710495 252289870 252434700 253359542 253378013 251551477 252081173 251578169 250194872
3159B50194872N23331J344799K484772K281930K012930K036780M015884N007676
$$ 250194872 250718203 252063002 254547774 256829704 258842634 260879414 264895298 269902974
3151B69902974M017750L967664N753413N582805N585743O232559N586007L949624
$$ 269902974 273920724 277888388 283641801 289224606 294810349 301042908 306628915 310578539
3143C10578539K248839J84857l686898n366880o254830o056734n968967n579720
$$ 310578539 312827378 313012235 309325337 303958457 297703627 291646893 285677926 280098206
3135B80098206n301846n585783m500678m500391k153233k746663j988350j137276
$$ 280098206 274796360 269210577 264709899 260209508 258056275 255309612 253321262 252183986
3127B52183986p08169O26488o18108N9887J669292N34803J185826O44289l69187
$$ 252183986 251475817 252102305 251484197 251544084 253213376 253748179 254934005 255578294 255209107
3118B55209107N34479J579014J036953j013386j060141l174817l052472m353140
$$ 255209107 255743586 257322600 258359553 257346167 256286026 253111209 250058737 245705597
3110B45705597n073820n319555n760043o216784n793061n973034n106555l821334
$$ 245705597 240631777 235312222 229552179 223335395 217542334 211569300 206462745 202641411
3102B02641411l613408l266907k389563l518779k534648k073870j737090j220928
$$ 202641411 199028003 195761096 193371533 189852754 187318106 185244236 183507146 182286218
3094A82286218l298250k089117k490857k996959k683647k733064k604413k574364
$$ 182286218 178987968 176898851 174407994 171411035 168727388 165994324 163389911 160815547
3086A60815547l800530l484499l352899l193730l319413l619045m369099m163349
$$ 160815547 157015017 153530518 150177619 146983889 143664476 140045431 135676332 131512983
3078A31512983l394314k435587j968416k088520k400924k371183l125033j692426
$$ 131512983 128118669 125683082 123714666 121626146 119225222 116854039 113729006 112036580
3070A12036580k505875j421869j085928j773046j636692k236859j141952k524264
$$ 112036580 109530705 108108836 107022908 105249862 103613170 101376311 100234359 97710095
3062I7710095k097480j424735j996293j899336j372977j158811j602458j648368
$$ 97710095 95612615 94187880 92191587 90292251 88919274 87760463 86158005 84509637
3054H4509637j24873j448461k436461j674125j255890j064233p97102K64656k94582
$$ 84509637 84384764 82936303 80499842 78825717 77569827 76505594 75708492 75973148 75678566
3045G5678566j742756k820423r92391j336404j272844r44261j391923k072426
$$ 75678566 73935810 71115387 70122996 68786592 67513748 66569487 65177564 63105138
3037F3105138q51305m97170j210388p52878M87112K39966l021762j023845n75961
$$ 63105138 62253833 61756663 60546275 59793397 60280509 60520475 57498713 56474868 55898907
3028E5898907n98263J10129j300260j89916m99804o89300j486730n38787p78898
$$ 55898907 55300644 55410773 54110513 53920597 53420793 52731493 51244763 50705976 49927078
3019D9927078K79349o79883j756689K15248k67580r62712j243793n22501j665752
$$ 49927078 50206427 49526544 47769855 47985103 47717523 46754811 45511018 44988517 43322765
3010D3322765m46140k00086m04806p22728r10883m85036n47809o70471l60773
$$ 43322765 42876625 42676539 42271733 41549005 40638122 40153086 39605277 38934806 38574033
3001C8574033N66549o11727l24228r22566l47613j053094l36592m41887j310167
$$ 38574033 39140582 38528855 38204627 37282061 36934448 35881354 35544762 35102875 33792708
2992C3792708j65935n86497R8554M54413r33857k83865o09798r19014p4344n6520
$$ 33792708 33626773 33040276 33138830 33593243 32659386 32375521 31765723 30846709 30772365 30715845
2982C0715845m17592m31778m55470o24827m37246p01829m06064j016275O83415
$$ 30715845 30298253 29866475 29411005 28786178 28348932 27647103 27241039 26224764 26908179
2973B6908179M77927n23329j787578L13043k2469K71732n14065r17158j242280
$$ 26908179 27386106 26862777 25075199 25388242 25365773 25637505 25123440 24206282 22964002
2964B2964002O39415m40373q96670n98475P95977J278981m18207p61463j485896
$$ 22964002 23603417 23163044 22266374 21667899 22463876 23742857 23324650 22563187 21077291
2955B1077291m30997m40263l54938K593J95141P47775j550440l30190K263507
$$ 21077291 20646294 20206031 19851093 19853686 20048827 20796602 19246162 18915972 21179479
2946B1179479L24887j225291j594792O55776L85099n63411j63590J07873r40034
$$ 21179479 21504366 20279075 18684283 19340059 19725158 19161747 18998157 19106030 18165996
2937A8165996O03215J42367p15865K93426K66502q26778m60983M65710n66024
$$ 18165996 18769211 18911578 18195713 18489139 18755641 17928863 17467880 17933590 17367566
2928A7367566K73703n54445p2622p13171J62665o74737O98257M00401l64638o60885
$$ 17367566 17641269 17086824 17014202 16301031 16463696 15788959 16487216 16887617 16522979 15862094
2918A5862094o80562l64307J07511m27969M19539K3653Q595J9235o09276O98297
$$ 15862094 15181532 14817225 14924736 14496767 14916306 14939959 14948554 14967789 14358513 15056810
2908A5056810q70504L64409j033401j88986N35974J125971m41080P56384j38589
$$ 15056810 14186306 14550715 13517314 13328328 13864302 14990273 14549193 15305577 15166988
2899A5166988r31082j143269K98167k18884l93200J110097r93021J117954k15661
$$ 15166988 14235906 13092637 13390804 13171920 12778720 13888817 12895796 14013750 13798089
2890A3798089n46290L69935j062353P86592p58552J96101p24319j226739M07252
$$ 13798089 13251799 13621734 12559381 13345973 12587421 12783522 12059203 10832464 11239716
2881A1239716N33531K47123Q17984m55794q93331J047949Q8372j091112O9492
$$ 11239716 11773247 12020370 12838354 12382560 11489229 12537178 12625550 11534438 11603930
2872A1603930J6280n30626J04632j02519k39954j85147j37888q96955R89416P57674
$$ 11603930 11620210 11089584 11194216 11091697 10851743 10666596 10528708 9631753 10621169 11378843
2862A1378843k65782l15822O78418L1651o36205O68505N16700j897277p20105
$$ 11378843 11113061 10797239 11475657 11507308 10871103 11539608 12056308 10159031 9438926
2853I438926M85314k89028l79896j9251j589j065121J024422N4099M79229j32192
$$ 9438926 9924240 9635212 9255316 9236065 9234476 8169355 9193777 9247876 9727105 9594913
2843I594913M20151r26327N85025p12823m54728N76271m39709j56000j4338n02514
$$ 9594913 10015064 9088737 9673762 8960939 8506211 9082482 8642773 8486773 8472435 7969921
2833G969921P75868Q46506q55443J217709l78330K26943L27503k172347J114297
$$ 7969921 8745789 9592295 8736852 9954561 9576231 9803174 10130677 7958330 9072627
2824I072627L84373m98895o55921l74368q62348M31418M85297L16560q2346j90980
$$ 9072627 9457000 8958105 8302184 7927816 7065468 7496886 7982183 8298743 8216397 8025417
2814H025417P43427j214778q70359p4557R62137q32971M17289N47468N5068p46534
$$ 8025417 8768844 7554066 6683707 6609150 7571287 6738316 7155605 7703073 7758141 7011607
2804G011607m18131p64637J474366l04241l81964Q83389j78692j061480R09192
$$ 7011607 6593476 5828839 7303205 6998964 6617000 7500389 7321697 6260217 7169409
2795G169409j60n24825l21373k13935L05919O69348j47204J035631n42355j021223
$$ 7169409 7169249 6644424 6323051 6109116 6415035 7084383 6937179 7972810 7430455 6409232
2785F409232O94297M55430m46857j388100O1278m19744O01336J566558p99288
$$ 6409232 7103529 7558959 7112102 5724002 5785280 5365536 5966872 7533430 6734142
2776F734142j200922k86650N58311L67627j302622O7710k22196l36312R75884
$$ 6734142 5533220 5246570 5804881 6172508 4869886 4937596 4715400 4379088 5354972
2767E354972l1882j81891o26887O17860O70977j48668l49495O02165o20923O61637
$$ 5354972 5323090 5141199 4514312 5132172 5803149 5654481 5304986 5907151 5286228 5947865
2757E947865j073286o35886R45838l74286J123677k00612l89581r00806n51792
$$ 5947865 4874579 4238693 5184531 4810245 5933922 5733310 5343729 4442923 3891131
2748C891131J91117m6403l29312r47796N88049R86353N76201N18453j424540R2043
$$ 3891131 4082248 4035845 3706533 2758737 3346786 4333139 4909340 5427793 4003253 4095296
2738D095296P4206m02719l04432J089198K84724m40266q13695K83737J97781R71268
$$ 4095296 4169502 3766783 3462351 4551549 4836273 4396007 3582312 3866049 4063830 5035098
2728E035098L65227n48195j19093K79365j44180l14734P58878o26992l96245r4026
$$ 5035098 5400325 4852130 4733037 5012402 4868222 4553488 5312366 4685374 4289129 4195103
2718D195103R5543l33583n80866K96736J091535k10045R4378o12020p8354M4249
$$ 4195103 4290646 3957063 3376197 3672933 4764468 4554423 4648801 4036781 3958427 4002676
2708D002676k89004k64204J53815m65817P361P70711J80897K78384k90638n71692
$$ 4002676 3713672 3449468 3603283 3137466 3144827 3915538 4096435 4374819 4084181 3512489
2698C512489M7994j96235l02084P19459M61821q34245M46435O71594o92695l48890
$$ 3512489 3560483 3364248 3062164 3781623 4243444 3409199 3855634 4527228 3834533 3485643
2688C485643k94808k34671j241596J65787O22541O86522o2523K74114N97893Q05480
$$ 3485643 3190835 2956164 1714568 1880355 2502896 3189418 3126895 3401009 3998902 4804382
2678D804382m44100l68479r83766p42437j80339J019162P2991j02018O7609n22796
$$ 4804382 4360282 3991803 3008037 2265600 2085261 3104423 3177414 3075396 3143005 2620209
2668B620209L65569Q0194J04647Q42433r82972k81672k33021l8909K36242J042307
$$ 2620209 2985778 3065972 3170619 4013052 3030080 2748408 2515387 2476478 2712720 3755027
2658C755027J30416o82510M1429j57430l69182k75805j96184J603604N81335j274384
$$ 3755027 3885443 3202933 3244362 3086932 2717750 2441945 2245761 3849365 4430700 3156316
2648C156316N17219m9230j211909J073852R34444p59340k01930o75100q59376
$$ 3156316 3673535 3624305 2412396 3486248 4420692 3661352 3459422 2784322 1924946
2639A924946J010879J00496q58784J322300m62463q10060k9142O89716N36810
$$ 1924946 2935825 3036321 2177537 3499837 3037374 2227314 2198172 2887888 3424698
2630C424698o87295r11141j34367N34813L23116q5256R0715k29532O36489k22588
$$ 3424698 2737403 1826262 1691895 2226708 2549824 2464568 2555283 2325751 2962240 2739652
2620B739652P24426n00423J8936J97537j94840m82051R87953M12858J32118q3201
$$ 2739652 3464078 2963655 2982591 3180128 2985288 2503237 3491190 3904048 4036166 3952965
2610C952965j59251M63275q8598j361757M71415j11993j48304J74772j13051p19516
$$ 3952965 3793714 4256989 4168391 2806634 3278049 3166056 3017752 3192524 3079473 2359957
2600B359957n27824k75355O28512J443396j326511k62699k9167p69428R55401
$$ 2359957 1832133 1556778 2185290 3628686 2302175 2039476 2010309 1240881 2196282
2591B196282M27355N35599j5312j319454O45815m84905m2835m79189L45683N10533
$$ 2196282 2623637 3159236 3143924 1824470 2470285 1985380 1942545 1463356 1809039 2319572
2581B319572j5986j030450O22681N97770p40547l69067J43018j659303L11946
$$ 2319572 2303586 1273136 1895817 2493587 1753040 1383973 1526991 -132312 179634
2572A79634J212742N69460M4840M97049q29304j79515J41923R90865L29745n33323
$$ 179634 1392376 1961836 2006676 2503725 1674421 1494906 1636829 2627694 2957439 2424116
2562B424116L86657o81460m25992p63136Q93708L34484O97307R7328j10340J15500
$$ 2424116 2810773 2129313 1703321 940185 1833893 2168377 2865684 2963012 2852672 2968172
2552B968172O84884n54522Q53293j440476p36539O82261Q69994J106689l70490
$$ 2968172 3653056 3098534 3951827 2511351 1774812 2457073 3327067 4433756 4063266
2543D063266m65572p13990q86031p23881J57736M77503Q33554m96282p39587M06716
$$ 4063266 3597694 2883704 1997673 1273792 1431528 1909031 2742585 2246303 1506716 1913432
2533A913432R43038P18820J39935n90741L54912O36765j022912n13464k24620
$$ 1913432 2856470 3575290 3715225 3124484 3479396 4116161 3093249 2579785 2355165
2524B355165Q00216l80412J2648J211241p59898k09848M25626j813275j15722
$$ 2355165 3155381 2774969 2787617 3998858 3238960 3029112 3454738 1641463 1525741
2515A525741k29341J027309N33616L11506Q15031K65874j72969l31159m60196
$$ 1525741 1296400 2323709 2857325 3168831 3983862 4249736 4076767 3745608 3285412
2506C285412j52374j147269p33239J651690K78752n99076l93724N1258q36581
$$ 3285412 3133038 1985769 1252530 2904220 3182972 2583896 2190172 2241430 1404849
2497A404849Q00471M98709l09342L69431p76510P21828r8843J31668L41289k68251
$$ 1404849 2205320 2704029 2394687 2764118 1987608 2709436 2610593 2742261 3083550 2815299
2487B815299K47429N75550M40751j292917J9712K41982k87977j125395J88816
$$ 2815299 3062728 3638278 4079029 2786112 2805824 3047806 2759829 1634434 1823250
2478A823250J292742R77295j095370j39255o11164Q13969l66096P47532k05969
$$ 1823250 3115992 4093287 2997917 2858662 2247498 3061467 2695371 3442903 3236934
2469C236934n47122m38452M74180L69420p81293J16016L66928R63895k81869k12498
$$ 3236934 2689812 2251360 2725540 3094960 2313667 2429683 2796611 3760506 3478637 3266139
2459C266139j20853j94999P83906n94279O2131K22670k86502L71125J078278r77924
$$ 3266139 3145286 2950287 3734193 3139914 3202045 3424715 3138213 3509338 4587616 3609692
2449C609692n72409K21163M04540N3598J07908J67304m56653L19397K73679K83628
$$ 3609692 3037283 3258446 3662986 3716584 3824492 3991796 3535143 3854540 4128219 4411847
2439D411847l36221O38503n96298K54213L80653l75122L03063k80301J143966
$$ 4411847 4075626 4714129 4117831 4372044 4752697 4377575 4680638 4400337 5544303
2430E544303J5313j97621K96861n0296L55476q51267p98704m28682l8484O98286
$$ 5544303 5559616 5361995 5658856 5608560 5964036 5112769 4314065 3885383 3846899 4545185
2420D545185J193714J04190J26341O88422o49046o76474m60258J072069J679327
$$ 4545185 5738899 5843089 5969430 6657852 6008806 5332332 4872074 5944143 7623470
2411G623470j76047o28838O94519P28730P60112j232780m89895K36306j97246
$$ 7623470 7447423 6818585 7513104 8241834 9001946 7769166 7279271 7515577 7318331
2402G318331J72314L3852J674553P76022Q64002k62008o28659p35764J490203
$$ 7318331 7490645 7524497 9199050 9975072 10839074 10577066 9948407 9212643 10702846
2393A0702846N71494k38814O29069R51626m05909P87274J536053M27894p85202
$$ 10702846 11274340 11035526 11664595 12616221 12210312 12997586 14533639 14961533 14176331
2384A4176331j99889J180584K310472O18809N90166J261033O57684K39630J897585
$$ 14176331 13976442 15157026 17467498 18086307 18676473 19937506 20595190 20834820 22732405
2375B2732405Q25798J792776J838979K475948K808030K806168L222270K264780
$$ 22732405 23558203 25350979 27189958 29665906 32473936 35280104 38502374 40767154
2367D0767154K206300M089584K826161K978866K741954K535282K690305M150281
$$ 40767154 42973454 47063038 49889199 52868065 55610019 58145301 60835606 64985887
2359F4985887M917461N308136M443049N745068M787790O968250P418419J0567059
$$ 64985887 69903348 75211484 79654533 85399601 90187391 97155641 104574060 115141119
2351A15141119J2954863J5084577J7287363K2840002K7704201L8350230M3991759
$$ 115141119 128095982 143180559 160467922 183307924 211012125 249362355 293354114
2344B93354114N0687566L3787648j2573905l0938353l3769078l3268907m1184862
$$ 293354114 344041680 377829328 365255423 334317070 300547992 267279085 226094223
2337B26094223l5287885k8753651k1023406j6180747j1049189j0835003p325212
$$ 226094223 190806338 162052687 141029281 124848534 113799345 102964342 95639130
2330I5639130o108928m330644m606152n039585m728300m538989l942153m524633
$$ 95639130 89530202 85199558 80593406 75553821 70825521 66286532 62344379 57819746
2322E7819746l819911l404691l525240j960271k383206k674052j405295j196215
$$ 57819746 53999835 50595144 47069904 45109633 42726427 40052375 38647080 37450865
2314C7450865j097021k414478k542881o02314q88250p95852k27383j062792j551187
$$ 37450865 36353844 33939366 31396485 30794171 29905921 29110069 28882686 27819894 26268707
2305B6268707j122306j406680k373400j349484J89949q96786o76149l89905j743036
$$ 26268707 25146401 23739721 21366321 20016837 20206786 19310000 18633851 18243946 16500910
2296A6500910k24528o19248l81080r88474K66182n35292l36509q07847m84930
$$ 16500910 16276382 15657134 15276054 14287580 14553762 14018470 13681961 12874114 12389184
2287A2389184J040822j938841m5833m25984J01880N89025j112843k36837O56108
$$ 12389184 13430006 11491165 11445332 11019348 11121228 11710253 10597410 10360573 11016681
2278A1016681j067704L05972K08864O55593l88507q12812K59571r07866K83861
$$ 11016681 9948977 10254949 10463813 11119406 10730899 9918087 10177658 9269792 9553653
2269I553653l44871K94021m80953J88383P65503j015123j532588N5841J000448
$$ 9553653 9208782 9502803 9021850 9210233 9975736 8960613 7428025 7483866 8484314
2260H484314J375565j177115p27599q0172l64721k09110k38219j374569K27440
$$ 8484314 9859879 8682764 7955165 7874993 7510272 7301162 7062943 5688374 5915814
2251E915814L55213j100105l55973J028284O00766K01748j747241k25358R23461
$$ 5915814 6271027 5170922 4814949 5843233 6443999 6645747 4898506 4673148 5596609
2242E596609N95875k13552M11550j32812j13098j57567q43608o38850K67770P5863
$$ 5596609 6192484 5978932 6390482 6257670 6144572 5987005 5143397 4504547 4772317 4848180
2232D848180K47203k89891J24524J143738m98628n62060p15131M51449J67856
$$ 4848180 5095383 4805492 4930016 6073754 5575126 5013066 4297935 4749384 4917240
2223D917240p3553N99709p5690j260849k87816L15740r519K84452j235784l54376
$$ 4917240 4843687 5443396 5367706 4106857 3819041 4134781 4125262 4409714 3173930 2819554
2213B819554M92670N59610m43640l35156N17586M02710l56841n94570j14089N24807
$$ 2819554 3312224 3871834 3428194 3093038 3610624 4013334 3656493 3061923 2947834 3472641
2203C472641k32846j308670l2532J914897J092310l59485j614108j00706Q27685
$$ 3472641 3239795 1931125 1898593 3813490 4905800 4546315 2932207 2831501 3659186
2194C659186J47557l93385m17548P96647p03147k68585o0010M00510m02562m42178
$$ 3659186 3806743 3413358 2995810 3792457 3089310 2820725 2760715 3161225 2758663 2316485
2184B316485N97857j35514O5892k61094q9219k56135o61022K32375M28836O17624
$$ 2316485 2914342 2778828 2844720 2583626 2494407 2238272 1577250 1809625 2238461 2856085
2174B856085R5098M54959j7595r53050p88350k81046J485799m00467j723238o12914
$$ 2856085 2951183 3406142 3388547 2435497 1647147 1366101 2851900 2451433 728195 115281
2164A15281M21940J338348M93680L15268M50073n70420j510994L65780K21322
$$ 115281 537221 1875569 2369249 2684517 3134590 2564170 1053176 1418956 1640278
2155A640278M2984o17123Q38747k83886Q78911N70474o0957r21276N78559M26357
$$ 1640278 1683262 1066139 1904886 1621000 2499911 3070385 3009428 2088152 2666711 3093068
2145C093068r15879l58165M85347K15916o95171R21050n81412j478598M87406
$$ 3093068 2177189 1819024 2304371 2520287 1825116 2746166 2164754 686156 1173562
2136A173562k77681J59888k0083K14475k60359p39203L90676o27102J036231K3553
$$ 1173562 895881 1055769 1035686 1250161 989802 250599 641275 14173 1050404 1073957
2126A073957Q03934M77239K64668j02637K48401o81010j17950N53173l77942Q28951
$$ 1073957 1877891 2355130 2619798 2517161 2765562 2084552 1966602 2519775 2141833 2970784
2116B970784l76118K48975o4536r89415L8873p95160j309815Q11830P78058O58248
$$ 2970784 2594666 2843641 2779105 1789690 1828563 1033403 -276412 535418 1313476 1971724
2106A971724L18145J34298J108783j344284M1041J194685m49693q57095r94237
$$ 1971724 2289869 2424167 3532950 2188666 2229707 3424392 2974699 2117604 1123367
2097A123367l12303M79438J99175j244661L09553r85003N55895R72963M26412
$$ 1123367 811064 1290502 1489677 245016 554569 -430434 125461 1098424 1524836
2088A524836K8421Q99401k64375r6243k49629J75341O19019j122657Q88946j66173
$$ 1524836 1553257 2452658 2188283 2092040 1842411 2017752 2636771 1514114 2403060 2236887
2078B236887j290060J97237J174615o80335O29835J521250m43788m16478L27454
$$ 2236887 946827 1144064 2318679 1638344 2268179 3789429 3345641 2929163 3256617
2069C256617o64105L57676r40271L32707q33267J08909K88668N7496k03817j061714
$$ 3256617 2592512 2950188 2009917 2342624 1509357 1618266 1906934 1964430 1760613 698899
2059F98899L97858j21177R16418L7340o98240n20241r1038J530700j02299l43474
$$ 698899 1096757 975580 1891998 1929338 1231098 710857 619819 2150519 2048220 1704746
2049A704746j063806q816o965L38508M55957P23785r802m95967k512m38392K20750
$$ 1704746 640940 632124 625159 963667 1419624 2143409 2133607 1637640 1635128 1196736 1417486
2038A417486j205317l39565N81015J5571n70133n5587l7509M64974L96895L77530
$$ 1417486 212169 -127396 453619 469190 -100943 -156530 -194039 270935 667830 1045360
2028A045360O39657j87145n09473N26718j56545j039403J113656M9326L63583
$$ 1045360 1685017 1497872 988399 1515117 1358572 319169 1432825 1482151 1845734
2019A845734O12057p70522J79157j172554q72680P92239K35155p50308n99060
$$ 1845734 2457791 1687269 1866426 693872 -178808 613431 848586 98278 -500782
2010e00782L6563R11404R21097q63336j74664M21178p31031j97538N1586J153934
$$ -500782 -464219 447185 1368282 504946 330282 751460 20429 -177109 -125523 1028411
2000A028411J90072J57381J818l39474k67012N8844n14938K8507O59343k16631
$$ 1028411 1218483 1375864 1377682 1038208 771196 830040 315102 343609 1002952 786321
1990G86321P15781k24545J3884l4027N7317q2791r27329M07570J72376k17943
$$ 786321 1502102 1277557 1291441 1257414 1314731 1231940 304611 712181 884557 666614
1980F66614M78189l53863Q88432k90884j244045q10878K76353J046197J84606
$$ 666614 1144803 790940 1679372 1388488 144443 -666435 -390082 656115 840721
1971H40721l15505p86844Q17651k10292q05054m6602O54213Q63537J062325l92127
$$ 840721 525216 -261628 556023 345731 -459323 -505925 148288 1011825 2074150 1682023
1961A682023K35188M22301j357523j200257J80389P86546o24167j00407J46895
$$ 1682023 1917211 2339512 981989 -218268 -37879 748667 124500 24093 170988
1952A70988j14030R96451O66761K32366n9319j475542j064918R91333o99097m71778
$$ 170988 56958 1053409 1720170 1952536 1893217 417675 -647243 344090 -355007 -826785
1942h26785J581871j74685p48298j07172N73810n67547r4492J81426K33392n6260
$$ -826785 755086 580401 -167897 -275069 298741 -268806 -363298 -181872 51520 -4740
1932d740L3062L80675L34652N31497k53627p25717p58904j5910r75358K71344
$$ -4740 28322 408997 743649 1275146 1021519 295802 -463102 -479012 -1454370 -1183026
1922a183026R71424r94259J192379J081136K62413p75360j393705J512372J16444
$$ -1183026 -211602 -1205861 -13482 1067654 1330067 554707 -838998 673374 789818
1913G89818m91277M35610j07815m03660O5474L25025N92134p57056J69510L32305
$$ 789818 298541 734151 626336 222676 288150 613175 1205309 448253 617763 950068
1903I50068n79830r93107R66186N43421j373128o55479J385113L95008k04743
$$ 950068 370238 -622869 343317 886738 -486390 -1141869 243244 638252 433509
1894D33509k44887n56745n78317p17005J864990n7863O7290M14872L88317O33439
$$ 433509 188622 -368123 -946440 -1663445 201545 143682 210972 625844 1014161 1647600
1884A647600r38530L37957L04590O42952n90084L91577j085117q00385J345169
$$ 1647600 709070 1047027 1351617 1994569 1404485 1796062 710945 -89440 1255729
1875A255729J42442m79789j327489o25199R04455K65102K30306j78338L84694
$$ 1255729 1398171 918382 -409107 -1034306 -129851 135251 365557 187219 571913
1866E71913P10009m52871O71286K45134o85204J28995K88026q91801j52344K73763
$$ 571913 1281922 829051 1500337 1745471 1060267 1189262 1477288 585487 433143 706906
1856G06906O7176M00284K35455q32352P44627N52968L13432r08202j191591M8830
$$ 706906 774082 1174366 1409821 577469 1322096 1875064 2188496 1280294 88703 137533
1846A37533R17616l57655K1349j91129L66552M93775k14097r86105m31825l63667
$$ 137533 1055149 697494 718843 527714 894266 1388041 1173944 187839 -243986 -607653
1836f07653J323557j69631l68325m21045j40057J108646j308247k10846M66262
$$ -607653 715904 546273 177948 -243097 -383154 725492 -582755 -793601 -327339
1827c27339J65953J6402K37639n36590J431378o8807l28144o40683J21819L58636
$$ -327339 -161386 -144984 92655 -443935 987443 918636 590492 -50191 71628 430264
1817D30264k96237J133630q14809Q30723j080805l66650K61250m9301l98384m40697
$$ 430264 134027 1267657 452848 1283571 202766 -163884 97366 48065 -350319 -791016
1807g91016M51090N49003J056692l39489K61202J7999J06568m09988Q1683j83165
$$ -791016 -339926 209077 1265769 926280 1187482 1205481 1312049 902061 983744 800579
1797H00579r68657K10050O94345J02910q61555K96950N32148l72947K66628j117117
$$ 800579 -168078 41972 736317 839227 -22328 274622 806770 433823 700451 -416666
1787d16666M5109J94302m09102J363831l51310l35632Q8176k62299o8774L02256
$$ -416666 -371557 -177255 -586357 777474 426164 90532 178708 -83591 -152365 149891
1777A49891L33762o2163o63109l5059k7882P86493J59425j067433K17775j22616
$$ 149891 483653 421490 -241619 -276678 -304560 481933 641358 -426075 -208300 -330916
1767c30916M84643K64590k84513j02579P53473K42950J08895j063329j150184
$$ -330916 153727 418317 133804 31225 784698 1027648 1136543 73214 -1076970
1758a076970M98921N93587L58926P25080k22751j18158j06554j51712l76383j161181
$$ -1076970 -578049 15538 374464 1099544 876793 758635 652081 500369 123986 -1037195
1748a037195J214512J242234q48624k81406J06026N05122L5863m65972o1114q0494
$$ -1037195 177317 1419551 570927 289521 395547 900669 936532 470560 409446 328952
1738C28952L36358Q7248M46972l40166j18275m8885k61985L04467j40276M86488
$$ 328952 665310 752558 1199530 859364 741089 692204 430219 734686 594410 1080898
1728A080898m61612K9521J17789l10079n06306m56675N25089p66761Q7884J1543
$$ 1080898 619286 648807 766596 456517 -49789 -506464 18625 -748136 -660252 -648709
1718f48709k37697Q10999N03335M36000M09075j377087m39541L8262L50986j72304
$$ -648709 -886406 -75407 427928 863928 1273003 -104084 -543625 -505363 -154377 -326681
1708c26681j31949K64135l06392L88482N45256K70032j337792l62565R22493M90930
$$ -326681 -458630 -194495 -500887 -112405 432851 702883 -634909 -997474 -74981 415949
1698D15949L77162j95257j867205P6562l17405Q03960M47563K12053k03366K07567
$$ 415949 793111 597854 -1269351 -1192789 -1510194 -706234 -258671 -46618 -249984 -42417
1688d2417p09709n03601M37214j453795k02750J514108K32100N05197M08403K44677
$$ -42417 -752126 -1255727 -818513 -2272308 -2475058 -960950 -728850 -223653 184750 429427
1678D29427m23480N82728O38965K8577m14528q87938j012781R14532l98911K4714
$$ 429427 5947 588675 1227640 1256217 841689 -46249 -1059030 -144498 -543409 -518695
1668e18695R49650M0230k70945K29556m94699P01174J498479j029868k26943o11661
$$ -518695 430955 471185 200240 429796 -64903 636271 2134750 1104882 877939 266278
1658B66278M59823l53508l27057l65188N76121M30357j004430N4010O11836j020977
$$ 266278 726101 372593 45536 -319652 256469 686826 -317604 -263594 348242 -672735
1648f72735j0422p35922N50593J49521O94980m00714K35848K24390R5637k59615
$$ -672735 -683157 -1419079 -868486 -718965 -23985 -424699 -188851 35539 131176 -128439
1638a28439O47954m26368j012616j69550J201060O7573n46536J086112m11136
$$ -128439 519515 93147 -919469 -1089019 112041 179614 -366922 719190 308054
1629C08054q65747p323J074981L71415j59002K539j004151o1647R1510J364O00801
$$ 308054 -557693 -565016 509965 881380 722378 724917 -279234 -340881 -249371 -248007 352794
1618C52794J222386j15640l28766o06066m70445n87651L24841q667n11844N40395
$$ 352794 1575180 1459540 1130774 524708 54263 -533388 -208547 -217214 -729058 -188663
1608a88663j16479K57238N88041j8707p92261K60552n98810J415367M22995q86368
$$ -188663 -305142 -47904 540137 521430 -270831 -10279 -609089 806278 1229273 342905
1598C42905L48873l98799q79333L04692N11044j216693M49691J606137Q6952m61176
$$ 342905 691778 292979 -586354 -281662 229382 -987311 -537620 1068517 1155469 694293
1588F94293n0637l45580l49116m85538o56313K44480Q480R64726k82860J86616
$$ 694293 643656 298076 -51040 -536578 -1192891 -948411 -939931 24795 -258065 -71449
1578g1449J91071O8690Q14778l28254j98059M07397n4486q13618l66233L69890
$$ -71449 119622 188312 1003090 674836 476777 884174 829688 16070 -350163 19727
1568A9727m56602J246873N59284o81915q49681r05132J080235Q1113j329114p22180
$$ 19727 -436875 809998 1369282 687367 -162314 -1067446 12789 93902 -1235212 -1957392
1558a957392k00563K99495K89618K037559j075489o4963L34037J20701j01648
$$ -1957392 -2157955 -1858460 -1568842 468717 -606772 -671735 -337698 -216997 -318645
1549c18645j62082m95044n05220m98244Q91021P32423L61417j9994L6721O11206
$$ -318645 -480727 -975771 -1480991 -1979235 -1088214 -355791 5626 -14368 22353 633559
1539F33559q40418N24691q16207m97133J282745J45329J54126l11953p28235j82460
$$ 633559 -206859 317832 -498375 -995508 287237 432566 586692 274739 -453496 -635956
1529f35956P44210M8226n36127J636800j124255L68107K00693R15303K57316r43764
$$ -635956 108254 156480 -379647 1257153 132898 501005 701698 1617001 1874317 930553
1519I30553j658596K89296L03939l71398k72515J65321N13888L72507p94788j84601
$$ 930553 -728043 -438747 -134808 -506206 -778721 -613400 -99512 272995 -521793 -706394
1509g06394J390187j15096P24329l38928p20571p6792n73226k1565o05109L02251
$$ -706394 683793 568697 1293026 954098 233527 156735 -416491 -438056 -1043165 -740914
1499g40914N60139O3018J449818L25685n96515m88842m23611j331336J353647
$$ -740914 -180775 -117757 1332061 1657746 1061231 572389 148778 -1182558 171089
1490A71089L69224k58065M89005j053286k24565m24698O77955P38922p03200j00379
$$ 171089 540313 282248 771253 -282033 -506598 -931296 -253341 485581 -217619 -317998
1480c17998o03227K57017l25665k12329J540422N47573r92922J149268P87514
$$ -317998 -921225 -664208 -989873 -1202202 338220 885793 -107129 1042139 1829653
1471A829653q24591l68344J06438Q4015k01787o25252j31382Q26617Q509N4788
$$ 1829653 1005062 636718 743156 827171 625384 132 -131250 695367 703876 758664
1461G58664l2239l92930q43064l46402r2792Q81193M07531N23888j288903j183349
$$ 758664 726425 333495 -509569 -855971 -948763 -67570 339961 863849 -425054 -1608403
1451a608403N27639N77561L41655j20737q5144M86613n94004P54797P9511M8552
$$ -1608403 -1080764 -503203 -161548 -282285 -367429 119184 -474820 279977 359488 408040
1441D08040n16722l79182P49861p97721O08429o0037m03731L69701J43135J12476
$$ 408040 -108682 -487864 261997 -535724 72705 12668 -391063 -21362 121773 234249
1431B34249j86226k52074r890R2993n68037l9232R95091p50993m86183L17014
$$ 234249 48023 -204051 -213941 -120948 -688985 -728217 266874 -484119 -970302 -653288
1421f53288R58837J06590q48268P36454Q19406k8430l64183N97852l60822p9980
$$ -653288 305549 412139 -436129 300325 1119731 1091301 727118 1324970 964148 884168
1411H84168o2270o47339l8743n10855j67697R479j83895n8668O9949M95536N56365
$$ 884168 821898 174559 135816 -375039 -542736 -533257 -717152 -775820 -705871 -210335 346030
1400C46030J60096l90858r97886J954757n18840l69685o97847l05560J95626m7863
$$ 346030 506126 115268 -882618 1072139 553299 183614 -514233 -819793 -624167 -672030
1390f72030Q11829K64115P6507j170743j075132M35256L0580Q10745j62442J34892
$$ -672030 139799 403914 480421 -690322 -1765454 -1330198 -1299618 -488873 -651315 -516423
1380e16423r3795l52217K96322P00612j76613o10997j1895K40013P71974Q07486
$$ -516423 -610218 -962435 -666113 34499 -142114 -753111 -765006 -524993 246981 1054467
1370A054467m92660j566071j00210N66347N85777J50889l86024M78403j57811
$$ 1054467 561807 -1004264 -1104474 -538127 47650 198539 -187485 290918 133107
1361A33107r24804M90758o07882l5238N95034K99365P36553q32755p13433R43241
$$ 133107 -791697 -300939 -908821 -944059 -349025 -49660 686893 -145862 -859295 83946
1351H3946j53516l60035J07565Q95894j58224m9022k51341j9669o00590j31308
$$ 83946 -69570 -429605 -322040 573854 415630 366608 115267 95598 -504992 -636300
1341f36300j87375K72695M00969m78380L43746J069431j381117p4293j0593L95636
$$ -636300 -823675 -550980 -150011 -628391 -284645 784786 -596331 -670624 -681217 -285581
1331b85581q59503N58091J485766r35447o9730M19687o89498o04834K43091J072694
$$ -285581 -1145084 -586993 898773 -36674 -106404 313283 -376215 -981049 -737958 334736
1321C34736K47598n51208J029618k38194j180806K15984L95780O7973m89775r12189
$$ 334736 582334 31126 1060744 822550 -358256 -142272 253508 321481 -168294 -1080483
1311a080483J91667J5436N54391o32406M38944P26578l77512m03939M18424P64330
$$ -1080483 -888816 -873380 -318989 -951395 -512451 214127 -163385 -567324 -148900 615430
1301F15430o68951L73291m88008M84846o65857p73672O31210L56261j85816K41852
$$ 615430 -53521 319770 -168238 316608 -349249 -1122921 -491711 -135450 -321266 -79414
1291g9414M57987L00182L6479j383577n88068P09365J259420k18023M362N07132
$$ -79414 378573 678755 715234 -668343 -1256411 -547046 712374 494351 498713 1005845
1281A005845j058893j358678j48839M8068p6380m47878Q88311R60538p42536l63344
$$ 1005845 -53048 -1411726 -1560565 -1512497 -1588877 -2036755 -1148444 -187906 -930442 -1293786
1271a293786j12313j19403J090009r64084q1400J308451M86760J55201m14999
$$ -1293786 -1406099 -1525502 -435493 -1399577 -1480977 -172526 314234 469435 54436
1262E4436l48456L81854m95815k73429K11901q404p88418M66701J332081P8723
$$ 54436 -294020 87834 -407981 -681410 -469509 -477913 -1266331 -799630 532451 611174
1252F11174o25012l08082l3406J8736L55307L15242j111248j66987J115478P3722
$$ 611174 -13838 -321920 -355326 -336590 18717 333959 -777289 -944276 171202 244924
1242B44924l36657N15922p95853m86856L8963Q0865j30352K18487L60138J65564
$$ 244924 -91733 424189 -371664 -858520 -819557 -738692 -869044 -650557 -290419 -124855
1232a24855K23408p67880m34049L89251L80471K62978o73356m15963M39339N33656
$$ -124855 98553 -669327 -1103376 -714125 -333654 -70676 -744032 -1159995 -720656 -187000
1222a87000k24230R0389P71066J2178l64724m33506j25790k82205n4651O51020
$$ -187000 -411230 -320841 450225 462403 97679 -335827 -461617 -743822 -798473 -147453
1212a47453j15069j57667o3000O11909J98409M78277P4149P08638j021275n64608
$$ -147453 -262522 -420189 -483189 128720 327129 805406 879555 1588193 566918 2310
1202B310R51511p3319J27284j067270O80750K58447j186594m7733m92625k28979
$$ 2310 953821 880502 1007786 -59484 621266 879713 -306881 -354614 -847239 -1076218
1192a076218M12731M87352o35238o67927K87535J04908O31350o98714M71943j14876
$$ -1076218 -663487 -176135 -811373 -1479300 -1191765 -1086857 -455507 -1154221 -682278 -797154
1182g97154M42718p30939M04299M98186l02949L89494K27698r09054K42089K46842
$$ -797154 -354436 -1085375 -681076 -182890 -485839 -96345 131353 -777701 -535612 -288770
1172b88770n24196P42717J40944j007549Q62644J41412k36796O1372k01779J29146
$$ -288770 -812966 -70249 70695 -936854 -74210 67202 -169594 -108222 -310001 -180855
1162a80855J48284L91336r840K83526O6317r26552J54983o90007r64196Q04695
$$ -180855 -32571 358765 348925 632451 698768 -227784 -72801 -762808 -1727004 -922309
1152i22309Q36448J23213N97217M21529k32627p8537r91550l72176P28990J93496
$$ -922309 -85861 37352 634569 1056098 823471 744934 -246616 -618792 110198 303694
1142C03694j61492J05690j083701j83894J125532K38418j49654j35249L17032
$$ 303694 142202 247892 -835809 -1019703 105829 344247 194593 59344 376376
1133C76376j37398M77888K11376q65095P36289k62952j36753N43841r21837k89944
$$ 376376 238978 716866 928242 63147 799436 536484 399731 943572 21735 -268209
1123b68209O45765Q24300J43780j18569l08006p55052l47039o86842j27477Q1058
$$ -268209 377556 1201856 1345636 1227067 919061 164009 -183030 -869872 -997349 -916291
1113i16291N29932M55206q29468j336178M77113R78104n02214J046805p04109
$$ -916291 -386359 68847 -760621 -2096799 -1619686 -641582 -1143796 -96991 -801100
1104h01100O17223Q71447p24360Q6981n14684M09058k02162R89039m69946j77842
$$ -801100 -183877 687570 -36790 50191 -464493 -55435 -257597 731442 261496 83654
1094H3654l4959o73457l95254J40745l46487J30405m10695j19628K01732M14029
$$ 83654 48695 -624762 -1020016 -879271 -1225758 -1095353 -1506048 -1625676 -1423944 -1009915
1084a009915N81536O18553m9187o8324k58063L68971M81732k95933m28733r45580
$$ -1009915 -428379 190174 140987 72663 -185400 183571 665303 369370 -59363 -1004943
1074a004943P24617n13275Q41107N43712k4766n41286j15324q1269O02469Q82310
$$ -1004943 -280326 -793601 47506 591218 566452 25166 -90158 -171427 431042 1313352
1064A313352k44690l01863j0238M49977M37596j652923j58606j057877M45600
$$ 1313352 1068662 766799 756561 1206538 1644134 -8789 -167395 -1225272 -779672
1055g79672K30302P2531K39007p15049O71210k68030o12965l96704L71672o36646
$$ -779672 -549370 -476839 -237832 -952881 -281671 -549701 -1162666 -1559370 -1187698 -1824344
1045a824344P21630k03145J382217K28531o92944n04774q23577R97586M84858
$$ -1824344 -1102714 -1305859 76358 304889 -388055 -892829 -1716406 -718820 -233962
1036b33962o76835j33596O03173J157140l12912j439858M16976R58122k17615
$$ -233962 -910797 -1044393 -441220 715920 403008 -1036850 -619874 338248 120633
1027A20633j061163o4425Q84597J80338k98975J86297m09811m4199L95186p00180
$$ 120633 -940530 -1004955 -120358 59980 -238995 -52698 -462509 -506708 -111522 -811702
1017h11702n77965O02473P60636j27033N94113J6238k63062l66527p7291K33614
$$ -811702 -1389667 -787194 -26558 -153591 440522 456760 193698 -172829 -250120 -16506
1007a6506J8435k49488J221747j55789j214794k88713J82309l07676o46865O66723
$$ -16506 1929 -247559 974188 818399 -396395 -685108 -502799 -810475 -1457340 -790617
997g90617O20345k69474P57720m63276P16406l53065j26401l9159N9165K42970
$$ -790617 -170272 -439746 317974 -145302 571104 218039 91638 52479 111644 354614
987C54614m37700J7281o97051j077271P97691J151350J030317j067105M52919
$$ 354614 -83086 -65805 -762856 -1840127 -1042436 108914 1139231 72126 525045
978E25045k36312j298908p18284L71798J507839K22398n88521P4543Q71504j598041
$$ 525045 288733 -1010175 -1728459 -1356661 151178 373576 -214945 -140402 731102 -866939
968h66939o33805o5183m72647n47875R48120O17251R75757r34632K13657L9754
$$ -866939 -1500744 -1565927 -2038574 -2586449 -1638329 -1021078 -45321 -979953 -766296 -726542
958g26542j890l3379J530086p40643K08749M79736o10057n09844O0048r4008J9487
$$ -726542 -728432 -761811 768275 27632 236381 716117 106060 -403784 -343736 -437744 -418257
947d18257M57137k98253m58284O37469l09365r09167L04596J629464P4582m29609
$$ -418257 38880 -259373 -717657 -80188 -389553 -1298720 -994124 635340 709922 280313
937B80313N46927k08435q11311n94076N39475J627295j025051J213246M00491
$$ 280313 827240 618805 -192506 -786582 -247107 1380188 355137 1568383 1968874
928A968874j066692l80645m07218L74345q18981j130720j11870L96651J091245
$$ 1968874 902182 521537 114319 488664 -330317 -1461037 -1572907 -1176256 -85011
919h5011R15507l48508j281802j021351R48360L930J270831k96472j07435o10575
$$ -85011 830496 481988 -799814 -1821165 -872805 -868875 401956 105484 -1951 -612526
909f12526N10047O87671n65544J96342n62055r116L64279J59265J85924o68443
$$ -612526 -102479 585192 19648 215990 -346065 -355181 9098 168363 354287 -314156
899c14156k09868j68522q78K70107j90355J271994m34448p02955q56930k95913
$$ -314156 -524024 -692546 -693424 -423317 -613672 658322 223874 -479081 -1336011 -1631924
889a631924J807342r6201K57619l56145j9459j399796K40662N55057N36892L66177
$$ -1631924 175418 79217 336836 -19309 -38768 -1438564 -1197902 -642845 -105953 260224
879B60224K1035k15812j507259Q73952P82509m99504K42343l77563M95009M99766
$$ 260224 281259 65447 -1441812 -567860 214649 -284855 -42512 -420075 74934 574700
869E74700j424980K86398k23239o26904J140446J40211j78352p03148j41940K4291
$$ 574700 -850280 -563882 -787121 -1414025 -273579 -133368 -311720 -1014868 -1156808 -1132517
859a132517M60449N99655l33245L69429O27995L6523p11641p56618J19932N67630
$$ -1132517 -672068 -72413 -405658 -36229 591766 628289 -83352 -839970 -720038 -152408
849a52408N55364Q2426o70602l47593L65153R03888j95436m14260Q37492j35687
$$ -152408 402956 485382 -185220 -532813 -167660 736228 540792 126532 964024 828337
839H28337l87370n0171o89100q15783M07667J016816k03923L9617K07503M48829
$$ 828337 440967 390796 -298304 -1114087 -706420 310396 106473 146090 353593 802422
829H02422J240095j259890q88440n89249k36221P99537L6868P33263l62525q62968
$$ 802422 2042517 782627 -105813 -695062 -931283 -131746 -94878 638385 275860 -587108
819e87108L87348m13013J013891O53979k90738q10975o51964R25644j003633Q15422
$$ -587108 -199760 -612773 401118 1055097 764359 -46616 -698580 227064 -776569 38853
809C8853P52241j95674M84672m61499j09921k46712n98933K11723p57904J31510
$$ 38853 791094 595420 1080092 618593 508672 261960 -336973 -125250 -883154 -751644
$$ [...]
##END NTUPLES=NMR SPECTRUM
##END=
