##TITLE=1H_DE-80H_X3
 200.13MHz, d2o
 8 sc
 
 19ns.26.2.2025
##JCAMPDX= 6.0         $$ Bruker NMR JCAMP-DX V2.0
##DATA TYPE= NMR SPECTRUM
##DATA CLASS= NTUPLES
##ORIGIN= UXNMR, Bruker Analytische Messtechnik GmbH
##OWNER= pz
$$ XWIN-NMR		Version 3.5
$$ Tue Jun 10 10:29:31 2025 Russian Standard Time (UT+4h)  Yarkov@DPX200
##.OBSERVE FREQUENCY= 200.1313
##.OBSERVE NUCLEUS= ^1H
##.ACQUISITION MODE= SIMULTANEOUS
##.ACQUISITION SCHEME= undefined
##.AVERAGES= 8
##.DIGITISER RES= 18
##SPECTROMETER/DATA SYSTEM= spect
##.PULSE SEQUENCE= zg30
##.SOLVENT NAME= CDCl3
##.SHIFT REFERENCE= (INTERNAL, CDCl3, 0, 15.4781)
##AUDIT TRAIL= $$ (NUMBER, WHEN, WHO, WHERE, WHAT)
$$ ##TITLE= Audit trail, XWIN-NMR		Version 3.5
$$ ##JCAMPDX= 5.01
$$ ##ORIGIN= Bruker BioSpin GmbH
$$ ##OWNER= Yarkov
$$ C:/Bruker/XWIN-NMR/data/yarkov2/nmr/H-C/1/pdata/1/auditp.txt
$$ ##AUDIT TRAIL=  $$ (NUMBER, WHEN, WHO, WHERE, WHAT)
(   1,<2025-06-10 10:28:45.67 +0400>,<Yarkov>,<DPX200>,
      <created by zg, POWCHK disabled, PULCHK disabled
       configuration hash MD5:
       00 E9 B6 7A A2 85 ED C7 34 08 36 98 17 FE 4E 26
       data hash MD5: 16K
       63 C0 3A 93 9B 1F A8 9E A6 4E 2F A0 A5 6E A3 F5>)
(   2,<2025-06-10 10:28:52.53 +0400>,<Yarkov>,<DPX200>,
      <Start of raw data processing
       efp BC_mod = 2 LB = 0.25 FT_mod = 6 PKNL = 1 PHC0 = -1710.501 PHC1 = 9.76656 SI = 16K 
       data hash MD5: 16K
       FE F0 60 F8 07 B2 50 94 49 20 7E 98 5B 22 FA AE>)
$$ ##END=
$$ 
$$ hash MD5
$$ 01 EC C5 37 3E 7A 30 86 5E 41 C4 D9 C8 DA 81 45
##$RELAX= 
##$RELAX= 
##$RELAX= 
##$RELAX= 
##$RELAX= 
##$RELAX= 
$$ Bruker specific parameters
$$ --------------------------
##$DU= <C:/Bruker/XWIN-NMR>
##$EXPNO= 1
##$NAME= <H-C>
##$PROCNO= 1
##$TYPE= <nmr>
##$USER= <yarkov2>
##$AMP= (0..31)
100 100 100 100 100 100 100 100 100 100 100 100 100 100 100 100 100 100 
100 100 100 100 100 100 100 100 100 100 100 100 100 100 
##$AQSEQ= 0
##$AQ_mod= 1
##$AUNM= <au_zg>
##$AUTOPOS= <>
##$BF1= 200.13
##$BF2= 200.13
##$BF3= 200.13
##$BF4= 200.13
##$BF5= 200.13
##$BF6= 200.13
##$BF7= 200.13
##$BF8= 200.13
##$BYTORDA= 1
##$CFDGTYP= 0
##$CFRGTYP= 5
##$CHEMSTR= <none>
##$CNST= (0..31)
1 1 145 1 1 1 1 1 1 1 1 1 1 1 1 1 1 1 1 1 1 1 1 1 1 1 1 1 1 1 1 1 
##$CPDPRG= <>
##$CPDPRG1= <>
##$CPDPRG2= <>
##$CPDPRG3= <>
##$CPDPRG4= <mlev>
##$CPDPRG5= <mlev>
##$CPDPRG6= <mlev>
##$CPDPRG7= <mlev>
##$CPDPRG8= <mlev>
##$CPDPRGB= <>
##$CPDPRGT= <>
##$D= (0..31)
0 0.7 0 0 0 0 0 0 0 0 0 0.03 0 0 0 0 0 0 0 0 0 0 0 0 0 0 0 0 0 0 0 0 
##$DATE= 1749536925
##$DBL= (0..7)
120 120 120 120 120 120 120 120 
##$DBP= (0..7)
150 150 150 150 150 150 150 150 
##$DBP07= 0
##$DBPNAM0= <>
##$DBPNAM1= <>
##$DBPNAM2= <>
##$DBPNAM3= <>
##$DBPNAM4= <>
##$DBPNAM5= <>
##$DBPNAM6= <>
##$DBPNAM7= <>
##$DBPOAL= (0..7)
0.5 0.5 0.5 0.5 0.5 0.5 0.5 0.5 
##$DBPOFFS= (0..7)
0 0 0 0 0 0 0 0 
##$DE= 6
##$DECBNUC= <off>
##$DECIM= 32
##$DECNUC= <off>
##$DECSTAT= 4
##$DIGMOD= 1
##$DIGTYP= 9
##$DL= (0..7)
0 120 120 120 120 120 120 120 
##$DP= (0..7)
$$ [...]
##$SUBNAM2= <"">
##$SUBNAM3= <"">
##$SUBNAM4= <"">
##$SUBNAM5= <"">
##$SUBNAM6= <"">
##$SUBNAM7= <"">
##$SUBNAM8= <"">
##$SUBNAM9= <"">
##$SW= 18.0517328524113
##$SWIBOX= (0..15)
0 0 2 0 0 0 0 0 0 0 0 0 0 0 0 0 
##$SW_h= 3612.71676300578
##$TD= 16384
##$TD0= 1
##$TE= 0
##$TE2= 300
##$TE3= 300
##$TEG= 300
##$TL= (0..7)
0 120 120 120 120 120 120 120 
##$TP= (0..7)
150 150 150 150 150 150 150 150 
##$TP07= 0
##$TPNAME0= <>
##$TPNAME1= <>
##$TPNAME2= <>
##$TPNAME3= <>
##$TPNAME4= <>
##$TPNAME5= <>
##$TPNAME6= <>
##$TPNAME7= <>
##$TPOAL= (0..7)
0.5 0.5 0.5 0.5 0.5 0.5 0.5 0.5 
##$TPOFFS= (0..7)
0 0 0 0 0 0 0 0 
##$TUNHIN= 0
##$TUNHOUT= 0
##$TUNXOUT= 0
##$USERA1= <user>
##$USERA2= <user>
##$USERA3= <user>
##$USERA4= <user>
##$USERA5= <user>
##$V9= 5
##$VALIST= <valist>
##$VCLIST= <CCCCCCCCCCCCCCC>
##$VD= 0
##$VDLIST= <DDDDDDDDDDDDDDD>
##$VPLIST= <PPPPPPPPPPPPPPP>
##$VTLIST= <TTTTTTTTTTTTTTT>
##$WBST= 1024
##$WBSW= 4
##$XGAIN= (0..3)
0 0 0 0 
##$XL= 0
##$YL= 0
##$YMAX_a= 57338
##$YMIN_a= -44008
##$ZGOPTNS= <>
##$ZL1= 120
##$ZL2= 120
##$ZL3= 120
##$ZL4= 120
##$ABSF1= 0
##$ABSF2= 0
##$ABSG= 0
##$ABSL= 0
##$ALPHA= 0
##$AQORDER= 0
##$ASSFAC= 0
##$ASSFACI= 0
##$ASSFACX= 0
##$ASSWID= 0
##$AUNMP= <proc_1d>
##$AZFE= 0.1
##$AZFW= 0.1
##$BCFW= 0
##$BC_mod= 2
##$BYTORDP= 0
##$COROFFS= 0
##$CY= -3
##$DATMOD= 1
##$DC= 0
##$DFILT= <>
##$DTYPP= 0
##$F1P= 0
##$F2P= 0
##$FCOR= 1
##$FTSIZE= 16384
##$FT_mod= 6
##$GAMMA= 0
##$GB= 0
##$INTBC= 1
##$INTSCL= 3.241238e-09
##$ISEN= 128
##$LB= 0.25
##$LEV0= 0
##$LPBIN= 0
##$MAXI= 10000
##$MC2= 0
##$MEAN= 0
##$ME_mod= 0
##$MI= 1.114404
##$NCOEF= 0
##$NC_proc= -10
##$NLEV= 6
##$NOISF1= 3.799351
##$NOISF2= 2.8
##$NSP= 0
##$NTH_PI= 0
##$NZP= 0
##$OFFSET= 15.47805
##$PC= 1
##$PHC0= -1710.501
##$PHC1= 9.76656
##$PH_mod= 1
##$PKNL= yes
##$PPARMOD= 0
##$PSCAL= 0
##$PSIGN= 0
##$REVERSE= no
##$SF= 200.130008735624
##$SI= 16384
##$SIGF1= 3
##$SIGF2= 2
##$SINO= 0.751879
##$SIOLD= 32768
##$SREGLST= <19F.Aceton>
##$SSB= 0
##$STSI= 16384
##$STSR= 0
##$SW_p= 3612.71676300578
##$SYMM= 0
##$S_DEV= 0
##$TDeff= 16384
##$TDoff= 0
##$TI= <>
##$TILT= no
##$TM1= 0
##$TM2= 0
##$TOPLEV= 0
##$USERP1= <user>
##$USERP2= <user>
##$USERP3= <user>
##$USERP4= <user>
##$USERP5= <user>
##$WDW= 1
##$XDIM= 16384
##$YMAX_p= 489397494
##$YMIN_p= -2230418
$$ End of Bruker specific parameters
$$ ---------------------------------
##NTUPLES= NMR SPECTRUM
##VAR_NAME=  FREQUENCY,     SPECTRUM/REAL,   SPECTRUM/IMAG
##SYMBOL=    X,             R,               I
##VAR_TYPE=  INDEPENDENT,   DEPENDENT,       DEPENDENT
##VAR_FORM=  AFFN,          ASDF,            ASDF
##VAR_DIM=   16384,         16384,           16384
##UNITS=     HZ,            ARBITRARY UNITS, ARBITRARY UNITS
##FACTOR=    0.220516191357247, 1,           1
##FIRST=     3097.6223281273, 0,             0
##LAST=      -515.094434878483, 0,           0
##MIN=       -515.094434878483, -2230418,    0
##MAX=       3097.6223281273, 489397494,     0
$$ Real data points
##PAGE= N=1
##DATA TABLE= (X++(R..R)), XYDATA
$$ [...]
11668B994017R37308l87253P34508j98798p82625o40407o30082j34834M79078
$$ 2994017 3931325 3544072 4278580 4079782 3297157 2656750 2026668 1891834 2370912
11659B370912J58523K8328N58446o1924J20016r27827n61021R96605P9440p02588
$$ 2370912 2529435 2557763 3116209 3054285 3174301 2246474 1685453 2682058 2761498 2058910
11649B058910J153225k3678o76268J540209P91424j126987J114392j648136n54965
$$ 2058910 3212135 3188457 2512189 4052398 4843822 3716835 4831227 3183091 2628126
11640B628126L25404k12427N80397m70059n46204o47651k58627P85287L76228
$$ 2628126 2953530 2741103 3321500 2851441 2305237 1657586 1398959 2184246 2560474
11631B560474q81481k88848N59348J897780j69259j593465n28847J71927J18919
$$ 2560474 1678993 1390145 1949493 3847273 3678014 2084549 1555702 1727629 1846548
11622A846548k91384k35639J53687K81506J1422n09434K80949J38050O7175P58338
$$ 1846548 1555164 1319525 1473212 1754718 1766140 1256706 1537655 1675705 1742880 2501218
11612B501218p75008o83806J170843N3414j11608m16323R52709J043013j77705
$$ 2501218 1726210 1042404 2213247 2266661 2155053 1738730 2691439 3734452 3556747
11603C556747j101559k91289K80586l69859M99207Q64779j10295q87976J88126
$$ 3556747 2455188 2163899 2444485 2074626 2573833 3438612 3328317 2440341 2628467
11594B628467m80829J5031j61376J556906j159358j181459j71645R34386O22890
$$ 2628467 2147638 2162669 2001293 3558199 2398841 1217382 1045737 1980123 2603013
11585B603013Q8950j99385p18551J7336j88803P96659R17925J525069r92565M80211
$$ 2603013 2691963 2492578 1774027 1791363 1602560 2399219 3317144 4842213 3849648 4329859
11575D329859j282875k41355o89724L10283j31428k86406k01847P75626L90337
$$ 4329859 3046984 2805629 2115905 2426188 2294760 2008354 1806507 2582133 2972470
11566B972470k02469J71734n26914J35392L67762K93257j35324J596351K08021
$$ 2972470 2770001 2941735 2414821 2550213 2917975 3211232 3075908 4672259 4880280
11557D880280j429170n40282K06783k48720J68435N79564j392364Q03764L04132
$$ 4880280 3451110 2910828 3117611 2868891 3037326 3616890 2224526 3028290 3332422
11548C332422q48743O35795K01928m93899j068499J407111n94642l75323J193806
$$ 3332422 2483679 3119474 3321402 2827503 1759004 3166115 2571473 2196150 3389956
11539C389956N51949p96250P59107L1719o87892N19632l8043o18590N63606j93516
$$ 3389956 3941905 3145655 3904762 3936481 3248589 3768221 3730178 3111588 3675194 3481678
11529C481678n26826m15167J64465N36649N38385J074445k0419l97192k31059
$$ 3481678 2954852 2539685 2704150 3240799 3779184 4853629 4833210 4436018 4204959
11520D204959L17146n36246j446372N24505O14734k80348o40870P28771o20968
$$ 4204959 4522105 3985859 2539487 3063992 3678726 3398378 2757508 3486279 2865311
11511B865311k44431J262796l11825q75663J58568R2775l7605L84932j0543q01003
$$ 2865311 2620880 3883676 3571851 2696188 2854756 2947531 2909926 3294858 3284315 2483312
11501B483312p16558J346367M39739P1730O9909J46190j6703K15963k60357k8231
$$ 2483312 1766754 3113121 3552860 3624590 3694499 3840689 3823986 4039949 3779592 3751361
11491C751361K04141k35457L12422r52661j53472p27456O09338k51580L45267
$$ 3751361 3955502 3720045 4032467 3079806 2926334 2198878 2808216 2556636 2901903
11482B901903Q01899n63572j170054m09693P92575J068828m34600k79055K31312
$$ 2901903 3703802 3140230 1970176 1560483 2353058 3421886 2987286 2708231 2939543
11473B939543o62741Q50859J256527l19151j94457n99458l16116j30284m40429
$$ 2939543 2276802 3127661 4384188 4065037 3870580 3271122 2955006 2824722 2384293
11464B384293P00785J218437Q23657p37522l53688j395688P63013J224498K21281
$$ 2384293 3085078 4303515 5127172 4389650 4035962 2640274 3403287 4627785 4849066
11455D849066p26173K68699M325j196292M32387M1873m4061J467185L53711o59400
$$ 4849066 4122893 4391592 4395917 3199625 3632012 3673885 3629824 5097009 5450720 4791320
11445D791320n87018l67264l31006Q75467p46574L52702K59192N7798Q664M89340
$$ 4791320 4204302 3837038 3506032 4381499 3634925 3987627 4246819 4304617 4313281 4802621
11435D802621p65598j48244P57714j049770n05896J251770o56810P7037M60039
$$ 4802621 4037023 3888779 4646493 3596723 3090827 4342597 3685787 3762824 4222863
11426D222863K89274m9150j46822r7990r43122k52951m5262J55878K60829K13637
$$ 4222863 4512137 4462987 4316165 4218175 3275053 3022102 2976840 3132718 3393547 3607184
11416C607184j75899N81092J80418K90036j175998N49223l31080j247616m25221
$$ 3607184 3431285 4012377 4192795 4482831 3306833 3856056 3524976 2277360 1852139
11407A852139O27933j4709k87665Q46305P24453K62255M2303q87924l52117O76409
$$ 1852139 2480072 2465363 2177698 3024003 3748456 4010711 4053014 3165090 2812973 3489382
11397C489382N77408p54756o06770N01213p2677L50420j63424L30880q87703p72356
$$ 3489382 4066790 3312034 2705264 3206477 3133800 3484220 3320796 3651676 2763973 1991617
11387A991617N16547M56560O9492j12375m97608P74457j0992o83619M52861K09988
$$ 1991617 2508164 2964724 3034216 2921841 2424233 3198690 3187698 2504079 2956940 3166928
11377C166928m27786L12740k69631j265988N6028J274649l3342j22164R39549
$$ 3166928 2739142 3051882 2782251 1516263 1572291 2846940 2813598 2691434 3630983
11368C630983M1057j51698q35733J131216L22245l59999n42132j096277l61404
$$ 3630983 3672040 3520342 2684609 3815825 4138070 3778071 3235939 2139662 1778258
11359A778258J629778j59854n20313l018K58318N88108j164l04951O16240J80690
$$ 1778258 3408036 3248182 2727869 2724851 2983169 3571277 3570113 3265162 3881402 4062092
11349D062092J83758j495289j090369J679403n753m16427K95530J98422n15553
$$ 4062092 4245850 2750561 1660192 3339595 3333842 2917415 3212945 3411367 2895814
11340B895814L0916j055679L16396J15208n0309P57002J36734M17995r90912l45281
$$ 2895814 2926730 1871051 2187447 2302655 2252346 3009348 3146082 3564077 2573165 2227884
11330B227884m08611K29045R9736P55779J84630l09971k34166J123037k17217
$$ 2227884 1819273 2048318 2148054 2903833 3088463 2778492 2544326 3667363 3450146
11321C450146m64600P66476P9996l72482j40416m44224O54684m89724j98714K72270
$$ 3450146 2985546 3752022 3832018 3459536 3319120 2874896 3529580 3039856 2841142 3113412
11311C113412j295352j91074n62302J317836k21433l96072k15858m87891R2949
$$ 3113412 1818060 1626986 1064684 2382520 2161087 1765015 1549157 1061266 1154215
11302A154215O47759O1557L96743k96566k98325L34031K91236m2012M72114J13185
$$ 1154215 1801974 1863531 2260274 1963708 1665383 1999414 2290650 2248638 2720752 2833937
11292B833937j00810j77012p87597m65997J69463K48290J356616l75632p62336
$$ 2833937 2733127 2556115 1768518 1302521 1471984 1720274 3076890 2701258 1938922
11283A938922J016657m42088m98984O42403k26651n03236L41060L39588R90210
$$ 1938922 2955579 2513491 2014507 2656910 2430259 1927023 2268083 2607671 3597881
11274C597881m4664o45896m92012j83411N04935l05451p69039j52141M72331o2096
$$ 3597881 3553217 2907321 2415309 2231898 2736833 2431382 1662343 1510202 1982533 1920437
11264A920437L92188J99995M76726J02479o25862l79474N68913K68404j071710
$$ 1920437 2312625 2512620 2989346 3091825 2465963 2086489 2655402 2923806 1852096
11255A852096n67540k38027j61189K93848J38130k19475m71672J43477R79778
$$ 1852096 1284556 1046529 885340 1179188 1317318 1097843 626171 769648 1749426
11246A749426M15702L87096n55992k07762O02626K53179n50421p44265r232J295692
$$ 1749426 2165128 2552224 1996232 1788470 2391096 2644275 2093854 1349589 1340357 2636049
11236B636049P35758r91454o33227N23010M80299M26525K27186q89974n86967
$$ 2636049 3371807 2380353 1747126 2270136 2750435 3176960 3404146 2514172 1927205
11227A927205j1651l45212J49244O28262J99261p90782j52454k07578O56040O59215
$$ 1927205 1915554 1570342 1719586 2347848 2547109 1756327 1603873 1396295 2052335 2711550
11217B711550K43727J55732j162726m12376M33796q860r26070J40355P62763m28503
$$ 2711550 2955277 3111009 1948283 1535907 1969703 1960843 1034773 1175128 1937891 1509388
11207A509388O37722Q80399m89465K8604l10847m91185R20977o67372O2010K3636
$$ 1509388 2147110 3027509 2538044 2566648 2255801 1764616 2685593 2018221 2080231 2103867
11197B103867L34097O66167p26532l78915K30527L18313n97373N12307N72705
$$ 2103867 2437964 3104131 2377599 1998684 2229211 2547524 1950151 2462458 3035163
11188C035163n11321q20380L65404L98539R36902N42987o86386n66900L41620
$$ 3035163 2523842 1703462 2068866 2467405 3404307 3947294 3260908 2694008 3035628
11179C035628L2783K08048J406682K62944j576072l65327N31846k09285k88154
$$ 3035628 3068411 3276459 4683141 4946085 3370013 3004686 3536532 3327247 3039093
11170C039093k59265N56316Q26199r02683O87013P088k51741r45006K36526K64728
$$ 3039093 2779828 3336144 4162343 3259660 3946673 3953761 3702020 2757014 2993540 3258268
11160C258268N33176N760o84784M76672r6275q09736j213791N82399K10184J69849
$$ 3258268 3791444 3797204 3112420 3589092 3492817 2683081 1469290 2051689 2261873 2431722
11150B431722J51616M4425L0780P24370n32821j400753k36198J840478p03772
$$ 2431722 2583338 2627763 2658543 3382913 2850092 1449339 1213141 3053619 2349847
11141B349847l51699K32599m83141l3777P5377L21266K49178j09867K5905r07470
$$ 2349847 1998148 2230747 1747606 1713829 1789206 2110472 2359650 2249783 2275688 1368218
11131A368218j79720Q58558n69088j66420J066105n6140l68734K80655J558102
$$ 1368218 1188498 2047056 1477968 1311548 2377653 2321513 1952779 2233434 3791536
11122C791536o90773j209273o9770J98915l01735r65062P76604Q11734J89565
$$ 3791536 3100763 1891490 1821720 2020635 1718900 753838 1530442 2342176 2531741
11113B531741N43612r42963k71076J73887p5114J468245p53820m54058M75935
$$ 2531741 3075353 2132390 1861314 2035201 1960087 3428332 2674512 2220454 2696389
11104B696389p64414r61271N43471o1500O50931m11324k50561J97930m87609M21384
$$ 2696389 1931975 970704 1514175 1452675 2103606 1692282 1441721 1639651 1152042 1573426
11094A573426O17847k9404P1400N07266k61771p40329J145412M18314j217469
$$ 1573426 2191273 2161869 2233269 2740535 2478764 1738435 2883847 3302161 2084692
11085B084692J88818L63818l2653m31651K59871L15242k31866L23057q44297K78030
$$ 2084692 2273510 2637328 2604675 2173024 2432895 2748137 2516271 2839328 1995031 2273061
11075B273061m59828m03100J156354l03798n92171j05125r7774n06664P20406
$$ 2273061 1813233 1410133 2566487 2262689 1670518 1565393 1467619 960955 1681361
11066A681361r30823q63213J234977P25249p97672J81296J343123L2783j66106
$$ 1681361 750538 -112675 1122302 1847551 1049879 1231175 2574298 2607081 2440975
11057B440975q60181j33281j9278K59049J263802j30795l96776R60010J32172
$$ 2440975 1580794 1447513 1428235 1687284 2951086 2820291 2423515 3383525 3515697
11048C515697k227358L9248Q79621R0210l67462j20057j17672L79126K65976q31010
$$ 3515697 1288339 1327587 2207208 2297418 1929956 1809899 1692227 2071353 2337329 1506319
11038A506319k76098O11442l06827q09957J360537N77296N61372N93407o21666
$$ 1506319 1230221 1841663 1534836 724879 2085416 2662712 3224084 3817491 3195825
11029C195825r30471o52831J47822r8926P72022p9351n75137p8578P39563l34277
$$ 3195825 2265354 1612523 1760345 1661419 2433441 2354090 1778953 1700375 2439938 2105661
11019B105661k03034m10357k68232K05465J008144N84208q58639K69153q00895
$$ 2105661 1902627 1492270 1224038 1429503 2437647 3021855 2163216 2432369 1631474
11010A631474L106m79751M58805P26948K33756n92721j71078L4260n59116J169153
$$ 1631474 1634580 1154829 1613634 2340582 2574338 1981617 1810539 1844799 1285683 2454836
11000B454836O48402j382038R7606K55661n72787o06602J405172L33862p40555
$$ 2454836 3103238 1721200 1818806 2074467 1501680 895078 2300250 2634112 1893557
10991A893557k2327L19751K40610o77007o56328j82633J131330R18444q08621
$$ 1893557 1871230 2190981 2431591 1754584 1098256 915623 2046953 2965397 2156776
10982B156776m34591n17713k94041L58626k82081R03279k06285O4956K80974m07426
$$ 2156776 1722185 1204472 910431 1269057 986976 1890255 1683970 1748926 2029900 1622474
10972A622474o04424P22604J99138r42424P61741K89482j07492M41193K71738
$$ 1622474 1018050 1740654 1939792 997368 1759109 2048591 1941099 2382292 2654030
10963B654030o99906Q4988O54073m43078l86075p0064o44943R45496K22453j33358
$$ 2654030 1954124 2039112 2693185 2250107 1864032 1793968 1149025 2094521 2316974 2183616
10953B183616j054573N4298L9921J158723m86497k73573K37703p13150J222267
$$ 2183616 1129043 1183341 1223262 2381985 1895488 1621915 1859618 1146468 2368735
10944B368735K01830N15911j189491N38518o83870j21345M6996R31248p65230
$$ 2368735 2570565 3086476 1896985 2435503 1751633 1630288 1677284 2608532 1843302
10935A843302O80389K21129n70915l96163k07842k05630L37162K19104O91411
$$ 1843302 2523691 2744820 2173905 1777742 1569900 1364270 1701432 1920536 2611947
10926B611947j53371l68769l93573k74121N84307Q12241k40695k66477J092601
$$ 2611947 2458576 2089807 1696234 1422113 2006420 2818661 2577966 2311489 3404090
10917C404090r78009J10125j068649K59494k12077J067854n57183m60562J167115
$$ 3404090 2426081 2536206 1467557 1727051 1514974 2582828 2025645 1565083 2732198
10908B732198J10560j520613O24579N88186M37932P48301j316773r94672K7353
$$ 2732198 2842758 1322145 1946724 2534910 2972842 3721143 2404370 1409698 1437051
10899A437051O14495n71100n00852J244731P32694r31186j02254m74359j04799
$$ 1437051 2051546 1480446 979594 2224325 2957019 2025833 1923579 1449220 1344421
10890A344421P62372k9794j7549Q79913o87568m35410Q084K76008K87130n29474
$$ 1344421 2106793 2076999 2059450 2939363 2251795 1816385 1824469 2100477 2387607 1858133
10880A858133q5984n79619J264787k07351l58412L36721o39068L13534M65976
$$ 1858133 1772149 1192530 2457317 2249966 1891554 2228275 1589207 1902741 2368717
10871B368717Q16546L95149r9177q62442l0734J97485j11764q67302j136940J00621
$$ 2368717 3185263 3580412 3481235 2618793 2588059 2785544 2673780 1806478 669538 770159
10861G70159J124938J74925Q34828o53049n99959O84747J37788m74280K41160
$$ 770159 1895097 2070022 2904850 2251801 1651842 2336589 2474377 2000097 2241257
10852B241257l21710n8652j24598K75609N10100j150875p95760p0062L11608J062236
$$ 2241257 1919547 1860895 1736297 2011906 2522006 1371131 575371 505309 816917 1879153
10842A879153J69738j9582N83980m35001M08819p83568j162722N69526K02829
$$ 1879153 2048891 2029309 2613289 2178288 2587107 1803539 640817 1210343 1413172
10833A413172j33360p35238K88476l97550k52063Q77109n57069L67000Q98007
$$ 1413172 1279812 544574 833050 435500 183437 1060546 503477 870477 1768484
10824A768484M9189q43439R44533R78251P63108j77686K99562r23827J08644j430538
$$ 1768484 1817673 974234 1918767 2897018 3660126 3482440 3782002 2858175 2966819 1536281
10814A536281Q10889j49532m94457Q84258N6637N3932j639662K98390M14920j393234
$$ 1536281 2347170 2197638 1703181 2587439 2644076 2698008 1058346 1356736 1771656 378422
10804C78422l17206J356214J022345j63554r09646l49931j289185j65419Q91751
$$ 378422 61216 1417430 2439775 2276221 1366575 1016644 -272541 -437960 453791
10795D53791P78679J354034j36379q36636M74581N59919m58729j119096L39093
$$ 453791 1232470 2586504 2450125 1613489 2088070 2647989 2189260 1070164 1409257
10786A409257J185037M4405L60717o02752j399941P35093o27440L75744l96614
$$ 1409257 2594294 2638699 2999416 2396664 996723 1731816 1104376 1480120 1083506
10777A083506N08574N87787K19209o52490k71278m13302n57576k11339P67715
$$ 1083506 1592080 2179867 2399076 1746586 1475308 1062006 504430 293091 1060806
10768A060806M81367J44651j96371O46146J313985j025177O31919j084071O6457
$$ 1060806 1542173 1686824 1490453 2136599 3450584 2425407 3057326 1973255 2039712
10759B039712n25006K94292o38426l74966k72259M87553Q86560Q24858k84456
$$ 2039712 1514706 1808998 1170572 795606 523347 1010900 1897460 2722318 2437862
10750B437862n34136m0655k19157J920890K5342n17112n58785j106177n10729
$$ 2437862 1903726 1863071 1643914 3564804 3590146 3073034 2514249 1408072 897343
10741H97343J069688L63856m82632n19636P8315P2890O80891M14580p24302k6330
$$ 897343 1967031 2330887 1848255 1328619 1406934 1479824 2160715 2575295 1850993 1824663
10731A824663O28849j85683N86528j389269j01404J242379R516k49834L02120
$$ 1824663 2453512 2267829 2854357 1465088 1363684 2606063 2615579 2365745 2667865
10722B667865m69632j62159j81667r80877L619N90586k02350K10457o1426L05155
$$ 2667865 2198233 2036074 1854407 873530 877149 1467735 1265385 1475842 1414416 1719571
10712A719571p35063r4062M87604J001184O41359m11234l10415n01198K77193
$$ 1719571 984508 890446 1378050 2379234 3020593 2609359 2298944 1797746 2074939
10703B074939Q7138P5366l83206O59476j6347k93315M34893j27624m49545n50274
$$ 2074939 2162077 2237443 1854237 2513713 2497366 2204051 2638944 2511320 2061775 1511501
10693A511501J09624j02147k62054J145931r47289J63007K4659m73059p91217
$$ 1511501 1621125 1518978 1256924 2402855 1455566 1618573 1643232 1170173 378956
10684C78956R55426M75073k15762J363840r23584J129460m50013n21515N71149
$$ 378956 1334382 1809455 1593693 2957533 2033949 3163409 2713396 2191881 2763030
10675B763030n77504p50051M4887N37167q86847M78863j846R26341m243q22065
$$ 2763030 2185526 1435475 1480362 2017529 1130682 1609545 1607699 2534040 2529797 1707732
10665A707732J8018N21708p44666L26033L79906r25702K7158N70123Q70179J13983
$$ 1707732 1725750 2247458 1502792 1828825 2208731 1283029 1310187 1880310 2750489 2864472
10655B864472k71678k30615k39678j111711Q73097N7938k52636k06433o34016
$$ 2864472 2592794 2362179 2122501 1010790 1883887 1941825 1689189 1482756 848740
10646H48740M79702m93134O60626R23352n24680N4403Q00381o60427Q6664k82559
$$ 848740 1328442 835308 1495934 2419286 1894606 1949009 2749390 2088963 2175627 1893068
10636A893068L10472l42414o76862j54055J07086P48866k72202O8682j03590k97692
$$ 1893068 2203540 1861126 1184264 1030209 1137295 1886161 1613959 1682641 1579051 1281359
10626A281359O49673l7258n40501N43502k31363j62460o91764J24184P70012m97701
$$ 1281359 1931032 1893774 1353273 1896775 1665412 1502952 811188 935372 1705384 1207683
10616A207683K17817J99088j82514l57001K53621J022926m19172p3167k05438
$$ 1207683 1425500 1624588 1442074 1085073 1338694 2361620 1942448 1869281 1663843
10607A663843p55716R71245P27187P5187q00541j94924j037857P40445J562934
$$ 1663843 908127 1879372 2606559 2681746 1881205 1686281 648424 1388869 2951803
10598B951803Q39327r56847p31879K55507m41591k32916N43049q14633o64983
$$ 2951803 3791130 2834283 2102404 2357911 1916320 1683404 2226453 1411820 746837
10589G46837j02176n35086R98643j8222R62957k82723k53449j6671R6903l15954
$$ 746837 644661 109575 1108218 1089996 2052953 1770230 1516781 1500110 1597013 1281059
10579A281059P00880J84933k16517m76113N10229N51965j15364m40483j72362
$$ 1281059 1981939 2166872 1950355 1474242 1984471 2536436 2421072 1980589 1808227
10570A808227p45685m2875K18428j281849J60999O46632R16739k29144K57835
$$ 1808227 1062542 1019667 1238095 -43754 117245 763877 1680616 1451472 1709307
10561A709307K66016r99025N45802J6911j59963M08769Q59158K01582o50465p62658
$$ 1709307 1975323 976298 1522100 1539011 1379048 1787817 2646975 2848557 2198092 1435434
10551A435434M00064L05777m2571M21073J017912j142029k17183Q75615k68452
$$ 1435434 1835498 2141275 2098704 2519777 3537689 2395660 2178477 3054092 2785640
10542B785640l67534j131790K68629j04527j33359K56716l27485j074384J811713
$$ 2785640 2418106 1286316 1554945 1450418 1317059 1573775 1246290 171906 1983619
10533A983619N99364r01760K2710J273169k44609l22414p17916L09830P816O89774
$$ 1983619 2582983 1681223 1703933 2977102 2732493 2410079 1692163 2001993 2009809 2699583
10523B699583M70730q89738N87619n72555l21474N6539l04630n13399L09615q07115
$$ 2699583 3170313 2280575 2868194 2295639 1974165 2030704 1726074 1212675 1522290 715175
10513G15175Q65305l5160N89936p53556Q4167n71955Q04664P0830O5846R1738
$$ 715175 1580480 1545320 2135256 1381700 1465867 893912 1698576 1769406 1835252 1926990
10503A926990M04276k26881M38891J01858j187786j58362k42251J389972l32095
$$ 1926990 2331266 2104385 2543276 2645134 1457348 1298986 1056735 2446707 2114612
10494B114612l9132L69530K13664J4903m82379q3123P57742q69650J11970o35791
$$ 2114612 2075480 2445010 2658674 2673577 2191198 2108075 2865817 1996167 2108137 1472346
10484A472346J23152k38158J286610k39244J41109m78480r7754m50028m12234
$$ 1472346 1595498 1357340 2643950 2404706 2545815 2067335 1969581 1519553 1107319
10475A107319O9261j40148K14432O51209r9683p70861o65916N52027Q83423k56159
$$ 1107319 1176580 1036432 1250864 1902073 1802390 1031529 365613 917640 1801063 1544904
10465A544904m81315o12686R57418k59189O61149L82539o58172O55788n54793
$$ 1544904 1063589 450903 1408321 1149132 1810281 2192820 1534648 2190436 1635643
10456A635643r55849J24648N13209O07444n28439j21254P13548P88032r65328
$$ 1635643 679794 804442 1317651 1925095 1396656 1275402 1988950 2776982 1811654
10447A811654m44469j25937P29409P59960N88953J79436j126502j088831n36424
$$ 1811654 1367185 1241248 1970657 2730617 3319570 3499006 2372504 1283673 747249
10438G47249Q98974K51759o6704K09395M18677q40431r6529k82569k39725N5323
$$ 747249 1646223 1897982 1831278 2040673 2459350 1618919 1522390 1239821 1000096 1055419
10428A055419K84603j24761J191931l87464k96165l26436q49148L08411P52153
$$ 1055419 1340022 1215261 2407192 2019728 1723563 1397127 547979 856390 1608543
10419A608543j385478M37285J085006p3322o97503r2284N72256K02305k62497
$$ 1608543 223065 660350 1745356 1672034 974531 882247 1454503 1656808 1394311
10410A394311M43352N82900j83554M70691j208437m44703P4533M58129p06042
$$ 1394311 1837663 2420563 2237009 2707700 1499263 1054560 1129093 1587222 881180
10401H81180O61299j61619N19715j020076K14616M23004q2912o71527J75363M7213
$$ 881180 1542479 1380860 1900575 880499 1095115 1518119 1435207 763680 939043 986256
10391I86256m49212J89092J337756o39457K29033j09532k2258R90948o96362o58058
$$ 986256 537044 726136 2063892 1424435 1653468 1543936 1521678 2512626 1816264 1158206
10381A158206J294564O65303r75821p72735N14691m60727O80364n74739R18589
$$ 1158206 2452770 3118073 2142252 1369517 1884208 1423481 2103845 1529106 2447695
10372B447695n76423q96729Q36471k15012O83376l73845l86900p22023K86649
$$ 2447695 1871272 974543 1811014 1596002 2279378 1905533 1518633 796610 1083259
10363A083259l93884J399091n35091N88001q60691r96889J557735r5200p28593
$$ 1083259 689375 2088466 1553375 2141376 1280685 283796 1841531 1746331 1017738
10354A017738j29674M52081o49878R73132R01459K3403J68875K61374K44144q54134
$$ 1017738 888064 1340145 690267 1663399 2564858 2588261 2757136 3018510 3262654 2408520
10344B408520P2285j56713o8513j039397q39906J804236P40689k54475L90051
$$ 2408520 2480805 2324092 2255579 1216182 376276 2180512 2921201 2666726 3056777
10335C056777k98441r24995N20048K19112k29342M35602r17341Q5206n50219O4455
$$ 3056777 2758336 1833341 2353389 2572501 2343159 2778761 1861420 1946626 1396407 1460862
10325A460862l74555j30857L45445Q14059J59997k82399k63840l7242L28593j546902
$$ 1460862 1086307 955450 1300895 2114954 2274951 1992552 1728712 1691470 2020063 473161
10315D73161N31915R22988l61326l9120M02258P29824k13034L65219j62305M78555
$$ 473161 1005076 1928064 1566738 1527618 1929876 2659700 2446666 2811885 2649580 3128135
10305C128135q49108k38318p81947l94339O59477J52919p8188Q19387M73375p48528
$$ 3128135 2279027 2040709 1258762 864423 1523900 1676819 1598631 2418018 2891393 2142865
10295B142865n50582O05633r72107j29263J412902L34045j205865m98695j182167
$$ 2142865 1592283 2197916 1225809 1096546 2509448 2843493 1637628 1138933 -43234
10286d3234P23854J531117n13902O54749m98961N82235m8708o23493r12456P35020
$$ -43234 680620 2211737 1697835 2352584 1853623 2435858 2387150 1763657 851201 1586221
10276A586221K43216O02057o59600o54497P23313j57686J72436N41074M26703
$$ 1586221 1829437 2431494 1771894 1117397 1840710 1683024 1855460 2396534 2823237
10267B823237o56297m15693N53652k4521l93607j036315J99222M46991p3642k86021
$$ 2823237 2166940 1751247 2304899 2280378 1886771 850456 1049678 1496669 1423027 1137006
10257A137006P29283J63156j036024l3098R1669K31001N67982P6344j01426n49612
$$ 1137006 1866289 2029445 993421 960323 1051992 1282993 1850975 1927319 1825893 1276281
10247A276281J46751l35718L29308J50678J42152k52509q3837L88291M83641j79432
$$ 1276281 1423032 1087314 1416622 1567300 1709452 1456943 1373106 1761397 2245038 2065606
10237B065606j506177L4813J61956M18705K327J196201j95861r33260m09847J400216
$$ 2065606 559429 594242 756198 1174903 1177230 2373431 2177570 1244310 834463 2234679
10227B234679J35351p50250M70987n74053j60884M29900N78045p70528P84602
$$ 2234679 2370030 1619780 2090767 1516714 1355830 1785730 2363775 1593247 2377849
10218B377849r13112j119164J264012O54427k80971n29277P93822k52932l00431
$$ 2377849 1464737 345573 1609585 2264012 1983041 1453764 2247586 1994654 1694223
10209A694223J76593l6150J026363m69363o30947N42038p01760P23391L17446
$$ 1694223 1870816 1834666 2861029 2391666 1760719 2302757 1600997 2324388 2641834
10200B641834J05615p09594J10320N77982j083125K79445j0192J33830K50013
$$ 2641834 2747449 2037855 2148175 2726157 1643032 1922477 1912285 2046115 2296128
10191B296128L44874r8606L23434n54956L36454j59372j83176L78775m00088J71673
$$ 2296128 2641002 2542396 2865830 2310874 2647328 2487956 2304780 2683555 2283467 2455140
10181B455140K84113l84855P18727j121281j792224J36516Q33470Q74856J182992
$$ 2455140 2739253 2354398 3073125 1951844 159620 296136 1129606 2004462 3187454
10172C187454m97011q43602J114608l99416j681253L3655L41240J194909k71147
$$ 3187454 2690443 1846841 2961449 2562033 880780 914435 1255675 2450584 2179437
10163B179437q01885l28215K13048P01587j26022M62309j54201j070157R3527
$$ 2179437 1377552 1049337 1262385 1963972 1837950 2300259 2146058 1075901 1169428
10154A169428J194419q10710m57469j57398J001423J50062p75864J34894J004654
$$ 1169428 2363847 1553137 1095668 938270 1939693 2089755 1313891 1448785 2453439
10145B453439n52384M25497M05750j88483l27527J75889J024732k59222j10155
$$ 2453439 1901055 2326552 2732302 2543819 2216292 2392181 3416913 3157691 3047536
10136C047536L49909r76836j71006l75315p79026N7971O66031q02516M45915L27679
$$ 3047536 3397445 2420609 2249603 1874288 1095262 1153233 1819264 1016748 1462663 1790342
10126A790342J174085k08288J14104l83954k50853m80039j200557N72322K15479
$$ 1790342 2964427 2756139 2870243 2486289 2235436 1755397 554840 1127162 1342641
10117A342641j83560o06577P35213N96901J69350n41094L09030N33970N8526L92209
$$ 1342641 1159081 552504 1287717 1884618 2053968 1512874 1821904 2355874 2414400 2806609
10107B806609p92833K78393J152847l39698n03936K15251p02005r28033L55958
$$ 2806609 2013776 2292169 3445016 3105318 2601382 2816633 2114628 1186595 1542553
10098A542553k41567M90818N33307K80751o67456j1333Q6386K34038n99938l80996
$$ 1542553 1300986 1791804 2325111 2605862 1938406 1927073 2013459 2247497 1647559 1266563
10088A266563m11731P94886N57474K87709M11572j4454Q26382o0938m97468j032288
$$ 1266563 854832 1649718 2207192 2494901 2906473 2892019 3718401 3657463 3159995 2127707
10078B127707j103895N47213P4458l72180l10180R33661J15566o16750L03302
$$ 2127707 1023812 1571025 1645483 1273303 963123 1896784 2012350 1395600 1698902
10069A698902L02645L4983l7133j037788L2928o2620J250867K41760J5143R47168
$$ 1698902 2001547 2036530 1999397 961609 994537 931917 2182784 2424544 2439687 3386855
10059C386855j97244p04075o82322r1951L3095k58622K56337P19180Q1167R75736
$$ 3386855 3189611 2485536 1803214 1711263 1744358 1485736 1742073 2461253 2542420 3518156
10049C518156K76859k74962j666445M25014R7212Q33889Q89628q56851q49025
$$ 3518156 3795015 3520053 1853608 2278622 2375834 3209723 4099351 3242500 2393475
10040B393475j50317p85276L44862M71650m1900K33242N40935J32979n78766q54340
$$ 2393475 2243158 1457882 1802744 2274394 2232494 2465736 3006671 3139650 2560884 1706544
10030A706544p1691O20849P87002O99236r77855n35460o71083o0832J299670N3583
$$ 1706544 1634853 2255702 3042704 3741940 2764085 2228625 1557542 1496710 2796380 2849963
10020B849963L05249Q09982n31894m48076r81025K92834m12760N92582J86724
$$ 2849963 3155212 3965194 3433300 2985224 2004199 2297033 1884273 2476855 2663579
10011B663579M42577q24441L68084q05264q48360J986528o98526k8046J90869
$$ 2663579 3106156 2281715 2649799 1844535 996175 2982703 2284177 2256131 2447000
10002B447000P42260j147377m02881J80359j57215K24868M40638J66704l08917
$$ 2447000 3189260 2041883 1639002 1819361 1662146 1887014 2327652 2494356 2185439
9993B185439L31063M41589p6909j26238Q98203r70868j88144K13619M22214j006655
$$ 2185439 2516502 2958091 2881182 2754944 3653147 2682279 2494135 2707754 3129968 2123313
9983B123313l32451O7281l55250k33536J12613L88103n11508m85794N69347N50030
$$ 2123313 1790862 1858143 1502893 1269357 1381970 1770073 1258565 772771 1342118 1892148
9973A892148O00648Q31379j329009m67260p142K68947P35677J22987k51382K97537
$$ 1892148 2492796 3324175 1995166 1527906 1520764 1789711 2525388 2648375 2396993 2694530
9963B694530J93820J69706k64259l16008R728K5534P24784j82870p69291L61619
$$ 2694530 2888350 3058056 2793797 2477789 2487517 2513051 3237835 3054965 2285674 2647293
9953B647293k4622m5724n02486J169366j28123J68126n01132K74752O51642k35971
$$ 2647293 2622671 2576947 2074461 3243827 3115704 3283830 2782698 3057450 3709092 3473121
9943C473121J70094j038518j231162R53992N86988L55743q72771m13459j52446
$$ 3473121 3643215 2604697 1373535 2327527 2914515 3270258 2397487 1984028 1831582
9934A831582O00496J08624o2894L00593J25675j24137J45530K65288O24403J216720
$$ 1831582 2432078 2540702 2477808 2778401 2904076 2779939 2925469 3190757 3815160 5031880
9924E031880l98384j487251J63042j105137l68395o78156Q6998J807548k23730
$$ 5031880 4633496 3146245 3309287 2204150 1835755 1157599 1244597 3052145 2828415
9915B828415l78943L27047N06889j281014l81299K63454J168739N37362o91733
$$ 2828415 2449472 2776519 3283408 2002394 1621095 1884549 3053288 3590650 2898917
9906B898917j188218J185583n4651O11120r91361l18962J251091n87268K33640
$$ 2898917 1710699 2896282 2841631 3452751 2461390 2142428 3393519 2806251 3039891
9897C039891J341730j519411k39358N01969M75536L09889k24433j426178K78841
$$ 3039891 4381621 2862210 2622852 3124821 3600357 3910246 3685813 2259635 2538476
9888B538476J372041k61927j03429n28149j97071p20390l71573K302939K36791
$$ 2538476 3910517 3648590 3545161 3017012 2819941 2099551 1727978 4030917 4267708
9879D267708r42711o62927K01704K03190R3972k88211J12103q73293N10733O77983
$$ 4267708 3324997 2662070 2863774 3066964 3160936 2872725 2984828 2111535 2622268 3300251
9869C300251j126193J06489p89779J095091J229906o0272Q09805j194043j700937
$$ 3300251 2174058 2280547 1490768 2585859 3815765 3755493 4565298 3371255 1670318
9860A670318J432413k70466J0173L09103J90609o2011m79260J556749O11423r51656
$$ 1670318 3102731 2832265 2842438 3151541 3342150 3280139 2800879 4357628 4969051 4017395
9850D017395K69099Q18737q89710r01454q68833K60020R30149P91195n81101p78243
$$ 4017395 4286494 5105231 4215521 3314067 2445234 2705254 3635403 4426598 3845497 3067254
9840C067254q84558L97004o16159O6110J484620j107114n61281K26219J403831
$$ 3067254 2182696 2579700 1963541 2029651 3514271 2407157 1845876 2072095 3475926
9831C475926N37911p95354J5025k46725L7776J132236j072809N809P27129l98218
$$ 3475926 4013837 3218483 3233508 2986783 3024559 4156795 3083986 3089795 3816924 3418706
9821C418706M392O86230l44908j27870J03304N8482l76609p81184p1678O89925
$$ 3418706 3423098 4109328 3764420 3636550 3739854 3798336 3421727 2640543 2568865 3258790
9811C258790O96607Q73194j127043q70544O63664O75912j49122k08736O1082M43475
$$ 3258790 3955397 4828591 3701548 2831004 3494668 4170580 4021458 3812722 3873804 4317279
9801D317279j90434J110542L4769q02456o23193o51620Q44715L71452m38203K79073
$$ 4317279 4126845 5237387 5272156 4469700 3846507 3194887 4039602 4411054 3972851 4251924
9791D251924N55615O8527L01590m06942l94704Q2502L23741q81924j075337O24625
$$ 4251924 4807539 4876066 5177656 4770714 4376010 4458512 4782253 3900329 2824992 3449617
9781C449617m62412N71227k1896M36543J086993L24101q04136L19465p44027J91935
$$ 3449617 2987205 3558432 3536536 3973079 5060072 5384173 4580037 4899502 4155475 4347410
9771D347410M98258j11158N09196n66337M13515L89412k21611l02855K51283l61019
$$ 4347410 4845668 4734510 5243706 4677369 5090884 5480296 5258685 4955830 5207113 4846094
9761D846094p41860n15006J068269Q5716p19631L5373N62911j37601L8536m4351
$$ 4846094 4104234 3589228 4657497 4743213 4023582 4058955 4621866 4484265 4522801 4478450
9751D478450L76077j2368l06311L87938j006045J03954J8865m82797R70996J86933
$$ 4478450 4854527 4842159 4535848 4923786 3917741 4021695 4040560 3557763 4528759 4715692
9741D715692j386r29317K58915R81933j12182q17807N7707N00790r964R79565
$$ 4715692 4714306 3784989 4043904 5025837 4913655 4095848 4153555 4654345 4644381 5623946
9731E623946K71313l75093l27484K99082o92809o15185M31015n85621Q39605q89298
$$ 5623946 5895259 5520166 5192682 5491764 4798955 4183770 4614785 4029164 4868769 3979471
9721C979471K73319L86740N1205K01521j72546n83127O91169p4026N23064J248928
$$ 3979471 4252790 4639530 4690735 4892256 4719710 4136583 4827752 4753726 5276790 6525718
9711F525718m19670l09763L82713o99142j86554K70131M63601p13233j438490
$$ 6525718 6106048 5796285 6178998 5479856 5293302 5563433 6027034 5313801 3875311
9702C875311J360383J17967n68653j01693l39252J495305R60354p76116O40221
$$ 3875311 5235694 5353661 4785008 4683315 4344063 5839368 6799722 6023606 6663827
9693F663827j008595j7144J36779K47082l19682N11713n42441j470772K99565
$$ 6663827 5655232 5638088 5774867 6021949 5702267 6213980 5671539 4200767 4500332
9684D500332J320329j88437k93077m77685q08777J40942k2024J70174J433567
$$ 4500332 5820661 5632224 5339147 4861462 4052685 4193627 4171603 4341777 5775344
9675E775344L81163j954491n4919L56564J231660m61271M86109j04482j0334J42016
$$ 5775344 6156507 4202016 4147097 4503661 5735321 5274050 5760159 5655677 5645343 5787359
9665E787359L05746j72280p38076N20057M35790J38882j02177q90738p36794o95606
$$ 5787359 6093105 5920825 5182749 5702806 6138596 6277478 6175301 5284563 4547769 3852163
9655C852163N25038L61368L690K35570k42279L13489j93208J51569K47923K88723
$$ 3852163 4377201 4738569 4742259 4977829 4735550 5049039 4855831 5007400 5255323 5544046
9645E544046m35173M13914n8362j83372J3779O6579Q29619o21583m27200J98058
$$ 5544046 5108873 5522787 5464425 5281053 5294832 5361411 6191030 5569447 5142247 5340305
9635E340305J23539J27324m88184N1211M83750O77523j3392J35192Q24142k86152
$$ 5340305 5463844 5591168 5102984 5154195 5637945 6315468 6302076 6437268 7261410 6975258
9625F975258j504277K05382m82496l98299Q93215p56226r43943J957767J92348
$$ 6975258 5470981 5676363 5193867 4795568 5688783 4932557 3988614 5946381 6138729
9616F138729j232873R69235J413643J46123j480571k39532m95982N64052J84717
$$ 6138729 4905856 5875091 7288734 7434857 5954286 5714754 5218772 5782824 5967541
9607E967541L94147M46325M91733r3701j40759M12958o55641l67890k31371O22257
$$ 5967541 6361688 6808013 7299746 7206045 7065286 7478244 6822603 6454713 6223342 6845599
9597F845599j74006K19164K26432N75687p14969K47478q1940l28096M01320j82217
$$ 6845599 6671593 6890757 7117189 7692876 6977907 7225385 7143445 6815349 7216669 7034452
9587G034452k73092M46094m11768J04887l40443Q22304J31947k22012J854335
$$ 7034452 6761360 7207454 6795686 6900573 6560130 7382434 7514381 7292369 9146704
9578I146704J84577J23584o31760L27074M50611L5299K75899r87724M41908k41890
$$ 9146704 9331281 9454865 8823105 9150179 9600790 9636089 9911988 8924264 9366172 9124282
9568I124282K25485J022096m64183M75961O66775j074084M62590R02085j00562
$$ 9124282 9349767 10371863 9907680 10383641 11050416 9976332 10438922 11341007 11240445
9559A1240445k46995j077652L51608J18592N49261n68413m43652k18167k00302
$$ 11240445 10993450 9915798 10267406 10385998 10935259 10366846 9923194 9705027 9504725
9550I504725K96454Q35194R14859k37344j801963n42937K69217P68435N58286
$$ 9504725 9801179 10636373 11551232 11313888 9511925 8968988 9238205 10006640 10564926
9541A0564926j122958m95089m30486Q08648o63038P1426k29010K6962q62613p37930
$$ 10564926 9441968 8946879 8516393 9325041 8662003 8733429 8504419 8531381 7668768 6930838
9531F930838N28917K24851R28499J38509L24869M76708o76810j198963l46303
$$ 6930838 7459755 7684606 8613105 8751614 9076483 9553191 8876381 7677418 7331115
9522G331115j087553J81552J064562n04071j42859J45519j3896M16338q87308
$$ 7331115 6243562 6425114 7489676 6985605 6842746 6988265 6974369 7390707 6503399
9513F503399k54141Q53730n41734m34201K476783o52556L34020P7340j807668
$$ 6503399 6249258 7102988 6561254 6127053 8603836 7951280 8285300 8362640 6554972
9504F554972O22241P48069Q06269L22465j449457p35029o89771m84653O38791
$$ 6554972 7177213 7925282 8731551 9054016 7604559 6869530 6179759 5695106 6333897
9495F333897K09914J765916k17137p98821j215363N9748R70860K23161l76765
$$ 6333897 6543811 8309727 8092590 7293769 6078406 6138154 7109014 7332175 6955410
9486F955410k85923k1690J32986R58622j092528l47925k77084O79899K65440N49898
$$ 6955410 6669487 6647797 6780783 7739405 6646877 6298952 6021868 6701767 6967207 7517105
9476G517105K40548n73076Q8560O93516P07309n5086r70747J96902K64552J471909
$$ 7517105 7757653 7184577 7273137 7966653 8673962 8618876 7648129 7845031 8109583 9581492
9466I581492q49703p34957N49421O53731j234185n75727Q61644k40952J457434
$$ 9581492 8731789 7996832 8546253 9199984 7965799 7390072 8251716 8010764 9468198
9457I468198m00947k46650m82921j77842L76124o23275N19458j90453J39624J77195
$$ 9468198 9067251 8820601 8337680 8159838 8535962 7912687 8432145 8241692 8381316 8558511
9447H558511r12185J96621o3933J212037J8333q8941j96185Q96978n09571j086339
$$ 8558511 7646326 7842947 7779014 8991051 9009384 8920443 8724258 9621236 9111665 8025326
9437H025326K62483K73318j078176L52023m7014K70982K51205K22622J104183
$$ 8025326 8287809 8561127 7482951 7834974 7787960 8058942 8310147 8532769 9636952
9428I636952K23324p78259p4576p2101o52662J41048n30798Q70314J543006J22308
$$ 9636952 9860276 9082017 9007441 8935340 8282678 8423726 7892928 8763242 10306248 10428556
9418A0428556m96776j309173o23612M20761k56427P31982J37026J59448k79236
$$ 10428556 9931780 8622607 7998995 8419756 8163329 8895311 9032337 9191785 8912549
9409H912549R83466N41504O76699M71403J2908j305454r30620O68013Q91061J065665
$$ 8912549 9896015 10437519 11114218 11585621 11598529 10293075 9362455 10030468 10921529 11987194
9399A1987194O52716k26875k23074j09826m53610R07966K65865j229213m94977
$$ 11987194 12639910 12413035 12189961 12080135 11626525 12534491 12800356 11571143 11076166
9390A1076166k09040K89267K70237J07236l62899l80210J4146M63862R6090p36810
$$ 11076166 10867126 11156393 11426630 11533866 11170967 10790757 10804903 11268765 11364855 10628045
9380A0628045J4116J40482J240940n89387O2260O88308l1958q43362Q9273k74504
$$ 10628045 10642161 10782643 12023583 11434196 11496456 12184764 12152806 11309444 11398717 11124213
9370A1124213j1631j02818J70413J231742j71403J07333l36184L23847j07672
$$ 11124213 11112582 11009764 11180177 12411919 12240516 12347849 12011665 12335512 12227840
9361A2227840j52506M47875r23246N31158L72566R23266q38631k92286K27639
$$ 12227840 12075334 12523209 11599963 12131121 12503687 13426953 12588322 12296036 12523675
9352A2523675L57275Q96545r81429K39180k56214P67727L38682j030058k2846
$$ 12523675 12880950 13777495 12796066 13035246 12779032 13546759 13885441 12855383 12832537
9343A2832537l11365l12033M85718M37627o65517M57621J741678m48755n84324
$$ 12832537 12521172 12209139 12694857 13132484 12466967 12924588 14666266 14217511 13633187
9334A3633187Q8652o25697N07765M20956N56372N60105j72048o00201L76675K31671
$$ 13633187 13721839 13096142 13603907 14024863 14581235 15141340 14969292 14369091 14745766 14977437
9324A4977437N44087O46424j784791k11981m20594l21354Q29959L76887O87987
$$ 14977437 15521524 16167948 14383157 14171176 13750582 13429228 14259187 14636074 15324061
9315A5324061o14015o19838n50856J249432R67066m84773K43970K31580J25138
$$ 15324061 14710046 14090208 13539352 14788784 15755850 15271077 15515047 15746627 15871765
9306A5871765Q4623q35442k01123J55517q45659n31148J36560R22838n39013M98858
$$ 15871765 15956388 15120946 14919823 15075340 14229681 13698533 13835093 14757931 14218918 14717776
9296A4717776K89180J039696R68161q82416o2411j55665k33075J75726m02345
$$ 14717776 15006956 16046652 17014813 16132397 16069986 15914321 15681246 15856972 15454627
9287A5454627M60545J180113o32993n67506P49383k15847k71880j11172K007794
$$ 15454627 15915172 17095285 16462292 15894786 16644169 16428322 16156442 16045270 18053064
9278A8053064p35578j32999q56950m35248l78875j9519O33512k39595k27651n60662
$$ 18053064 17317486 17184487 16327537 15892289 15513414 15493895 16127407 15887812 15660161 15099499
9268A5099499J111482J298280N044r03584M14232N3129R46193O98561j92414j68853
$$ 15099499 16210981 17509261 17514305 16610721 17024953 17078082 18024275 18722836 18530422 18361569
9258A8361569Q96833j194402K7669o24413J32877O34503j42232o68580m6233J159939
$$ 18361569 19258402 18064000 18091669 17467256 17600133 18234636 18092404 17423824 17377591 18537530
9248A8537530l2526l58539n05048k00016O20780J53346j098855l72802k22678
$$ 18537530 18505004 18146465 17641417 17441401 18062181 18215527 17116672 16743870 16521192
9239A6521192M20632R290J895876L06456q65994K39885j115277l35655N0790J89026
$$ 16521192 16941824 16951114 18846990 19153446 18287452 18527337 17412060 17076405 17127195 17316221
9229A7316221M30152Q24332r95592K36582J566982n92186k15892J94512j02435
$$ 17316221 17746373 18570705 17575113 17811695 19378677 18786491 18570599 18765111 18662676
9220A8662676L008K59786q81131J799139J32054N19880j87899l80891N50371j746206
$$ 18662676 18665684 18925470 18044339 19843478 19975532 20495412 20307513 19926622 20476993 18730787
9210A8730787L70353O7719N23216O37703j057369P10353m73291J235073O49567
$$ 18730787 19101140 19168859 19692075 20329778 19272409 19982762 19509471 20744544 21394111
9201B1394111j520866J263525j35634n66638N42372j06641N1780o13409O71698
$$ 21394111 19873245 21136770 21001136 20434498 20976870 20870229 20922009 20308600 20980298
9192B0980298R37079q30475k80765L33808M58362m11757P65978p27787q08738
$$ 20980298 21917377 21086902 20806137 21139945 21598307 21186550 21952528 21224741 20416003
9183B0416003M63299O14981O95820N91542n47809j49248l26891K01915N33927
$$ 20416003 20879302 21494283 22190103 22781645 22233836 22084588 21757697 21959612 22493539
9174B2493539R55818O03311q89178R26059l769m00685j71846k44151M5922j155172
$$ 22493539 23449357 24052668 23163490 24089549 24085780 23685095 23513249 23269098 23315020 22159848
9164B2159848k77549Q28114J756127m30711P1559O32301l21843l58669P39858
$$ 22159848 21882299 22710413 24466540 24035829 24107388 24739689 24417846 24059177 24799035
9155B4799035L12249O13906p254n34853p30175q50134K20992R47753n36846o51434
$$ 24799035 25111284 25725190 25717936 25183083 24452908 23602774 23823766 24771519 24234673 23583239
9145B3583239m74634N74432J236349J36866p84758j167072R95127J50428N17034
$$ 23583239 23108605 23683037 24919386 25056252 24271494 23104422 24099549 24249977 24767011
9136B4767011k65458k1753j16545K9541O85903j34939K58015M9994j54444K62473
$$ 24767011 24501553 24479800 24363255 24392796 25078699 24943760 25201775 25251769 25097325 25359798
9126B5359798J8899J363588k55888m09922L41573L04260K61660N53200N21515
$$ 25359798 25378697 26742285 26486397 26076475 26418048 26722308 26983968 27537168 28058683
9117B8058683k55346o69541L237M73939M54938J057861o48000n91967J109077
$$ 28058683 27803337 27133796 27137033 27610972 28065910 29123771 28475771 27883804 28992881
9108B8992881R08269j285104P4422J492592l66127m64935P38041k53717O40446
$$ 28992881 29901150 28616046 28690468 30183060 29816933 29351998 30090039 29836322 30476768
9099C0476768K15240l74091L55685j12549k55910J12221O93316J039241J164050
$$ 30476768 30692008 30317917 30673602 30561053 30305143 30417364 31110680 32149921 33313971
9090C3313971j54160m7871J7201l74304R18445L41885j25581N03825J477269R85316
$$ 33313971 33159811 33111940 33129141 32754837 33673282 34015167 33889586 34393411 35870680 36855996
9080C6855996O12974O98728N97777j071722K59352J792406m61261J284153k95543
$$ 36855996 37468970 38167698 38765475 37693753 37953105 39745511 39284250 40568403 40272860
9071D0272860j293442L03328O44093N27440J357764L74581O01662Q69730n00367
$$ 40272860 38979418 39282746 39926839 40454279 41812043 42186624 42788286 43658016 43157649
9062D3157649L11585P25958J223313m47071N4631L82781j497808N19388J327975
$$ 43157649 43469234 44195192 45418505 44971434 45026065 45408846 43911038 44430426 45758401
9053D5758401J87246Q06721K59008j164840j965846p93957R62358J770412k90142
$$ 45758401 45945647 46752368 47011376 45846536 43880690 43086733 44049091 45819503 45529361
9044D5529361p53454L10085J03791q22060j84961Q80356K23213J48991O0822J45123
$$ 45529361 44775907 45085992 45189783 44367723 44182762 45063118 45286331 45435322 45496144 45641267
9034D5641267n03474j72146K54536J406166N45481j131532k58504N89065j025120
$$ 45641267 45137793 44965647 45220183 46626349 47171830 46040298 45781794 46370859 45345739
9025D5345739R31534N46398j94728r701J73240q73119r83834j25510O30513J88223
$$ 45345739 46277273 46823671 46628943 46619242 46792482 45919363 44935529 44810019 45440532 45628755
9015D5628755j329864j184573K07918N99030q19391o13455o90444J58291M80736
$$ 45628755 44298891 43114318 43322236 43921266 43101875 42488420 41797976 41956267 42437003
9006D2437003K45771K58442M9335m63465l04775k92578K12969Q04746k10081l2898
$$ 42437003 42682774 42941216 42990551 42527086 42222311 41929733 42142702 42947448 42737367 42704469
8996D2704469J34065O60245r07147n6817R27341L61909R65980J000469p23603
$$ 42704469 42838534 43498779 42591632 42534815 43462156 43824065 44790045 45790514 45066911
8987D5066911L22799M54118Q45029M44352k82259K53070O84735J536453P7387
$$ 45066911 45389710 45843828 46688857 47133209 46850950 47104020 47788755 49325208 49402595
8978D9402595l00267Q02763K87022K02313K06810J314616J007699J17060J811035
$$ 49402595 49102328 49905091 50192113 50394426 50601236 51915852 52923551 53040611 54851646
8969E4851646J82093J475604J804244K441464J933974J847923K250112L505338
$$ 54851646 55033739 56509343 58313587 60755051 62689025 64536948 66787060 70292398
8961G0292398K611437J196347K414743K376846R65265P28198K001533J791931
$$ 70292398 72903835 74100182 76514925 78891771 79857036 80585234 82586767 84378698
8953H4378698Q67983L9397K630117K974500J960359K523727L159604L211115L214584
$$ 84378698 85246681 85286078 87916195 90890695 92851054 95374781 98534385 101745500 104960084
8944A04960084M732631N089853N396340N113821O439958O721705Q046915Q186813
$$ 104960084 109692715 114782568 120178908 125292729 131732687 138454392 146501307 154688120
8936A54688120J0614577J0787966J2489675J4823939K1347024K7338377L6628289
$$ 154688120 165302697 176090663 188580338 203404277 224751301 252089678 288717967
8929B88717967N0028862O7370260N9145078K2985515J149812j0375788j6372288
$$ 288717967 338746829 406117089 465262167 488247682 489397494 479021706 462649418
8922D62649418l1118686n2853947n3102927l8355903k8379315k5741687k5616734
$$ 462649418 431530732 378676785 325573858 287217955 258838640 233096953 207480219
8915B07480219k0144121j6227890j3626560j0716602p949252p624826o256622
$$ 207480219 187336098 171108208 157481648 146765046 138815794 131190968 124934346
8908A24934346m746052n243629m816161m676686l298191k309587j710105k611359
$$ 124934346 120188294 114944665 110128504 105451818 102153627 99844040 98133935 95522576
8900I5522576l687548l083161k661490k080148r97607j009492j340656j366227
$$ 95522576 91835028 88751867 86090377 84010229 83012622 82003130 80662474 79296247
8892G9296247j311851j177705m13845k463r90632l05052M29520j774353O61557
$$ 79296247 77984396 76806691 76392846 76390383 75399751 75094699 75524219 73749866 74411423
8883G4411423R10888j35253n04727j479367p530q43229M27184M95043J77166p96597
$$ 74411423 75322311 75187058 74682331 73202964 73195434 72352205 72779389 73274432 73451598 72655001
8873G2655001o55526p248j537557Q94395j11250j720543m04582j42792J5552r39928
$$ 72655001 71999475 71992227 70454670 71349065 71237815 69517272 69112690 68969898 68985450 68045522
8863F8045522j2013p07010M0614K04483o47718k79812J511431l32538l6421l03203
$$ 68045522 68033509 67326499 67367113 67571596 66923878 66644066 68155497 67822959 67786538 67483335
8853F7483335j57648k22983j321242K00548J205615K0882q29001k26029P62195
$$ 67483335 67325687 67102704 65781462 65982010 67187625 67208507 66379506 66153477 66915672
8844F6915672J330835N77353j772741J27925M570O62409J545099r63233l43906
$$ 66915672 68246507 68823860 67051119 67179044 67183614 67846023 69391122 68427889 68083983
8835F8083983J108229j03211j92967O60975R48176N32209k08949K66936J136904
$$ 68083983 69192212 69089001 68896034 69557009 70505185 71037394 70828445 71095381 72232285
8826G2232285J173629p11621N7563J65170R00507O81699P83600j47053q82644
$$ 72232285 73405914 72694293 72751856 72917026 73817533 74499232 75282832 75135779 74253135
8817G4253135M43640K61766O74066j38748k75764q8139j8608P65944K72886q45634
$$ 74253135 74696775 74958541 75632607 75493859 75218095 75129956 75111348 75877292 76150178 75304544
8807G5304544N19409J551444N18225r08408K80894J133198J596736J184356o8743
$$ 75304544 75823953 77375397 77893622 76985214 77266108 78399306 79996042 81180398 81111655
8798H1111655P14129N5235J191555N69406m09613K24262P90651m50144o97540
$$ 81111655 81825784 81881019 83072574 83641980 83232367 83456629 84247280 83797136 83099596
8789H3099596k98882J76237N81214M00665m8705n69041J038548r1042p14334j94254
$$ 83099596 82800714 82976951 83558165 83958830 83910125 83341084 84379632 84288590 83574256 83380002
8779H3380002L39762J107746J50J817736j2745j31625R77765O06095K92081j414287
$$ 83380002 83719764 84827510 84827660 86645396 86632651 86501026 87478791 88084886 88376967 86962680
8769H6962680j44987P6884N7043n97477Q09681j09272j285701j92674K35589N64810
$$ 86962680 86817693 86894577 86951620 86354143 87163824 87054552 85768851 85576177 85811766 86376576
8759H6376576o84937n01432J09904m73789p12563k54370n01422o87725j101709
$$ 86376576 85691639 85190207 85300111 84826322 84113759 83859389 83357967 82670242 81568533
8750H1568533l91590o76748O36046P6296j29082k28498Q4401m05977K14012Q98662
$$ 81568533 81176943 80500195 81136241 81212537 81083455 80854957 80939358 80533381 80747393 81646055
8740H1646055p69724j318320K03711m38275j793285j246861n22213j077416p39116
$$ 81646055 80876331 79558011 79761722 79323447 77530162 76283301 75761088 74683672 73944556
8731G3944556K47416k034224r238O08534r78079n04594j354294J23338j88629
$$ 73944556 74191972 72157748 72148510 72757044 71778965 71274371 69920077 70043415 69854786
8722F9854786q79576j210316J49364Q52261k37184j51866m66673n77721q77619
$$ 69854786 68975210 67764894 67914258 68766519 68529335 68377469 67910796 67333075 66455456
8713F6455456r4222j010543J67391M57309J66148r35079o34175l61214n57208
$$ 66455456 66361234 65350691 65518082 65975391 66141539 65206460 64572285 64211071 63653863
8704F3653863r43617O05785p89725j068800n85607n28225j070022p63459l56066
$$ 63653863 62710246 63316031 62526306 61457506 60871899 60343674 59273652 58510193 58154127
8695E8154127m87270M79166p07780J09919p31382r1293n90202N42571j275897
$$ 58154127 57666857 58146023 57438243 57548162 56816780 56725487 56135285 56677856 55401959
8686E5401959j9047Q86394O09700K20311k47782R23553Q5762n44362r70941q59170
$$ 55401959 55382912 56269306 56879006 57099317 56851535 57775088 57860850 57316488 56345547 55486377
8676E5486377l21181n64277p54204j357452q28613Q36587j331966k68320j52728
$$ 55486377 55165196 54600919 53846715 52489263 51660650 52497237 51165271 50896951 50744223
8667E0744223k50388n61715j354282N99307k38527o46541o93365p68640m6755
$$ 50744223 50493835 49932120 48577838 49177145 48938618 48292077 47598712 46830072 46783317
8658D6783317J15820M72643O82493r97940n40266R24401j91210m1851k08482m68441
$$ 46783317 46899137 47371780 48054273 47056333 46516067 47440468 47249258 47207407 46998925 46530484
8648D6530484m81174o1439j95687R8801J34625k1906j048007m86695N94665n01844
$$ 46530484 46049310 45987871 45792184 45890985 46025610 46003704 44955697 44469002 45063667 44561823
8638D4561823K31213j377804j293420q25658L45538k18853m10596J175011j193919
$$ 44561823 44793036 43415232 42121812 41296154 41641692 41422839 41012243 42187254 40993335
8629D0993335k078432m5015M27732M74139J36669j061331r39227j167479J004899
$$ 40993335 38914903 38869888 39297620 39771759 39908428 38847097 37907870 36740391 37745290
8620C7745290N95878p6443n72173r921l51675k7144o25693M16220M79064q96932
$$ 37745290 38341168 38264725 37692552 37682631 37330956 37303812 36678119 37094339 37573403 36676471
8610C6676471p52581p54818M59523J58697j166773n00271j416019p11056J468323
$$ 36676471 35923890 35169072 35628595 35787292 34620519 34120248 32704229 31993173 33461496
8601C3461496K94343j348469k13574n83907M80731O25301M69185q79553p20700
$$ 33461496 33755839 32407370 32193796 31609889 32090620 32715921 33185106 32305553 31584853
8592C1584853M12423N50927M65587j28035q73521m15655r32002j044724j78153
$$ 31584853 31997276 32548203 33013790 32885755 32012234 31596579 30664577 29619853 29441700
8583B9441700m93922J70498o00708J753216j71426j1382n45196M46782k51086
$$ 29441700 28947778 29118276 28517568 30270784 30099358 30087976 29542780 29989562 29738476
8574B9738476J669949j773481j520090O68610M36444K53230j252990J22683k95555
$$ 29738476 31408425 29634944 28114854 28783464 29219908 29473138 28220148 28342831 28047276
8565B8047276Q75305j98392n20321N58180l43212l56437K34514o59221o46553
$$ 28047276 28922581 28724189 28203868 28762048 28418836 28062399 28296913 27637692 26991139
8556B6991139K26136k31651o09997N14593J40719p61116m51727m9269O4760j177851
$$ 26991139 27217275 26985624 26375627 26890220 27030939 26269823 25818096 25768827 25833587 24655736
8546B4655736K41475K623793l33651n63919p11379M49125n50435O04605o79592
$$ 24655736 24897211 27521004 27187353 26623434 25912055 26361180 25810745 26415350 25735758
8537B5735758j021715O62570Q96119m4882J20235j443262j568028J88046J202822
$$ 25735758 24714043 25376613 26272732 26227850 26348085 24904823 23336795 23524841 24727663
8528B4727663o16580L73016l77911j639926K97032l22265R56769Q14172O69243
$$ 24727663 24111083 24484099 24106188 22466262 22763294 22441029 23397798 24211970 24881213
8519B4881213L41699q07745m25458K27918k61788o1762k27157j50635p13952P33404
$$ 24881213 25222912 24415167 23989709 24217627 23955839 23894077 23666920 23516285 22802333 23535737
8509B3535737l94415r6935m55524j60136k25104j08702P79693l98795n98878M81322
$$ 23535737 23141322 23044387 22588863 22428727 22203623 22094921 22874614 22475819 21876941 22358263
8499B2358263J06721O97527j537263J97429Q4246n09865l54146o70964l35124
$$ 22358263 22464984 23162511 21625248 21822677 21906923 21397058 21042912 20371948 20036824
8490B0036824K83070J723101p15724o95955l1568R88106K48610m769k52045j040853
$$ 20036824 20319894 22042995 21327271 20631316 20599748 21587854 21836464 21831695 21579650 20538797
8480B0538797K44348k37282K33406j031261P85486L35386n8213m31950j228633
$$ 20538797 20783145 20545863 20779269 19748008 20533494 20868880 20810667 20378717 19150084
8471A9150084L34558n0922L75654N31459P24280l28936m55942J88088r12212m75116
$$ 19150084 19484642 19433720 19809374 20340833 21065113 20736177 20280235 20468323 19556111 19080995
8461A9080995L80062L7634J80913m86743n74139L98043K53074n0142Q76066M53466
$$ 19080995 19461057 19498691 19679604 19192861 18618722 19016765 19269839 19219697 20095763 20549229
8451B0549229j098754J29838P6182K63784N37922o41079j54026j28145j22328
$$ 20549229 19450475 19580313 19656495 19920279 20458201 19817122 19663096 19534951 19412623
8442A9412623J26566j387019j307060J043503K64078k00109l19702J07800J3394
$$ 19412623 19539189 18152170 16845110 17888613 18152691 17952582 17632880 17740680 17754074
8433A7754074j051658k38395m72829N15008N89955k76952o21689M67497l46039
$$ 17754074 16702416 16464021 15991192 16506200 17096155 16819203 16197514 16665011 16318972
8424A6318972m87566J863746L97102q40511l36099l62721j666608R26927L79982
$$ 16318972 15831406 17695152 18092254 17251743 16915644 16552923 14886315 15813242 16193224
8415A6193224j279810q41855R72742Q75908Q88156N91588K49578j090913K38850
$$ 16193224 14913414 14071559 15044301 15920209 16808365 17399953 17649531 16558618 16797468
8406A6797468m89687r72327M057R18161l5943L5322j105500L60453P2988j849421
$$ 16797468 16307781 15335454 15339511 16257672 16221729 16257051 15151551 15512004 15584992 13735571
8396A3735571n24793J017058J015155l78677J650626J14109k023262m5525k07233
$$ 13735571 13210778 14227836 15242991 14864314 16514940 16629049 14605787 14560262 14353029
8387A4353029l99064M48814k50881l3447k64779Q94423N68323n65969M3739l42239
$$ 14353029 13953965 14402779 14151898 14118451 13853672 14748095 15316418 14750449 14794188 14451949
8377A4451949j062343O40842j022460K17683J355147L33978K35476Q5576r25238
$$ 14451949 13389606 14030448 13007988 13225671 14580818 14914796 15150272 15235848 14310610
8368A4310610j024806P32187J79457L004j307473j83362M25588O06539n05287
$$ 14310610 13285804 14017991 14197448 14200452 12892979 12709617 13135205 13741744 13236457
8359A3236457J55032k37778J82913K007275j97842K6567r04304j327291m61492
$$ 13236457 13391489 13153711 13336624 15343899 15146057 15172624 14268320 12941029 12479537
8350A2479537J047814n6527n97176O31653j259799o36464N13745L42842j34317
$$ 12479537 13527351 13470824 12873648 13505301 12245502 11609038 12122783 12465625 12331308
8341A2331308p33457P94471N639O18458o90600j40095P60978N04718m42356L64279
$$ 12331308 11597851 12392322 12397961 13016419 12325819 12185724 12946702 13451420 13009064 13373343
8331A3373343o50829q66171M47023N79848J049286n07755J68166n6951j499595
$$ 13373343 12722514 11856343 12303366 12883214 13932500 13424745 13592911 13535960 12036365
8322A2036365j201589j048245J503025k44251K11222L42903l43181q9876n5413
$$ 12036365 10834776 9786531 11289556 11045305 11256527 11599430 11256249 11166373 11110960
8313A1110960L42590L563k1252M74485l39408r42985l47809Q21037j25585j051958
$$ 11110960 11453550 11457113 11435861 11910346 11570938 10627953 10280144 11101181 10975596 9923638
8303I923638L19660M89300q17666o7106J284651k42788k52394K78416N1903N86825
$$ 9923638 10243298 10732598 9914932 9847826 11132477 10889689 10637295 10915711 10967614 11554439
8293A1554439J91167j041839r2884j56271o53547n79429P27692N3755J028889
$$ 11554439 11745606 10703767 10610883 10454612 9801065 9221636 9949328 10003083 11031972
8284A1031972n33203q24470J83497J324718j038225P29481N61043j227985o46757
$$ 11031972 10498769 9674299 9857796 11182514 10144289 10873770 11434813 10206828 9560071
8275I560071R57784M84308O03790L22973n37253j442048k7804P50537P88973r70130
$$ 9560071 10517855 11002163 11605953 11928926 11391673 9949625 9921821 10672358 11461331 10491201
8265A0491201j155866Q07601k10924o59358J94466J91226M64844J76443n40770
$$ 10491201 9335335 10142936 9932012 9272654 9467120 9658346 10123190 10299633 9758863
8256I758863N97196p74778K43147o54144p47537J95624Q60908k99798l1890o38190
$$ 9758863 10356059 9581281 9824428 9170284 8422747 8618371 9479279 9179481 9147591 8509401
8246H509401J677258q94648m42616M2890P17565R58031n43130j054552j329281
$$ 8509401 10186659 9292011 8849395 8892285 9609850 10567881 10024751 8970199 7640918
8237G640918k03362L69726J648607O57099n13463J07651o2833r34111r6657m62789
$$ 7640918 7437556 7807282 9455889 10112988 9599525 9707176 9644343 8710232 8613575 8150786
8227H150786j7468N08634M96480P74234J0517j101377L94612P95018l22740k35488
$$ 8150786 8133318 8641952 9138432 9912666 9923183 8821806 9216418 10011436 9688696 9453208
8217I453208K86837P42363p92336q89259L27434j475878m57045J009103K07466
$$ 9453208 9740045 10482408 9690072 8800813 9128247 7652369 7195324 8204427 8411893
8208H411893K64252m11126k46j540817N4799M67258j92971P66434J889977j527091
$$ 8411893 8676145 8265019 8264773 6723956 6778755 7246013 7053042 7819476 9709453 8182362
8198H182362j082170m93380K16495j373566j18307p266067P05143J3678912j201588
$$ 8182362 7100192 6606812 6823307 5449741 5331434 -1934633 -1229490 12449422 11247834
8189A1247834q50562j147556l98163N9027O51204o79387Q27704k86359j199294
$$ 11247834 10397272 9249716 8851553 8910580 9561784 8882397 9710101 9423742 8224448
8180H224448p05193N21718N01667j71472L60585j18071l39160j094562l09722
$$ 8224448 7519255 8040973 8542640 8371168 8731753 8613682 8274522 7179960 6870238
8171F870238O33342L3730Q22185J58318N17626p59473j216407J99651L07997P49394
$$ 6870238 7503580 7537310 8359495 8517813 9035439 8275966 7059559 7259210 7567207 8316601
8161H316601o30096p1484l05182J16097k97597J20331p9813L23168L86013J122810
$$ 8316601 7686505 7615021 7309839 7425936 7128339 7248670 7168857 7492025 7878038 9000848
8151I000848j754273q69498L95911o53935K27504J008015M52590j162530p5385
$$ 9000848 7246575 6377077 6772988 6119053 6346557 7354572 7807162 6644632 6569247
8142F569247Q85498K56899Q7683L937N37659j460566K85554J749590j287685m10298
$$ 6569247 7454745 7711644 7799327 7803264 8340923 6880357 7165911 8915501 7627816 7217518
8132G217518j88852q19609M31624j58929l38818l0471L33477n40174Q38037K06880
$$ 7217518 7028666 6209057 6640681 6481752 6142934 6112463 6445940 5905766 6743803 6950683
8122F950683Q54276l85521L14370K82556k51780m63257R41461q04823k142793
$$ 6950683 7804959 7419438 7733808 8016364 7764584 7301327 8242788 7437965 5295172
8113E295172L0464O21733Q10557R54961p14822Q4420J215218L39313K39563j706522
$$ 5295172 5325636 5947369 6757926 7712887 6998065 7082485 8297703 8637016 8876579 7170057
8103G170057m94054o2135M62235k26970n25750j211172J618141K99570l39695
$$ 7170057 6676003 6613868 7076103 6849133 6323383 5112211 6730352 7029922 6690227
8094F690227J343132J23630q57618j96461j73718q24646r8898K36404j80803k23239
$$ 6690227 8033359 8156989 7299371 7102910 6929192 6104546 6005648 6242052 6061249 5838010
8084E838010J166365r26308l06409R72868o96516Q75141r88477N34270M51107
$$ 5838010 7004375 6078067 5771658 6744526 6048010 6923151 5934674 6468944 6920051
8075F920051N70224k93722M53103n05548m42475O64798n07566k133118p101R41769
$$ 6920051 7490275 7196553 7649656 7144108 6701633 7366431 6858865 4725747 4718646 5660415
8065E660415O3537M19142L80635l93588K02255K21725j1974L2461r03217k8505
$$ 5660415 5723952 6143094 6523729 6130141 6332396 6554121 6542147 6574608 5671391 5642886
8055E642886q87727l84977J494675O81553N17332q80256r50615N34526K98357
$$ 5642886 4755159 4370182 5864857 6546410 7063742 6183486 5232871 5767397 6065754
8046F065754j75408n86801P88649k5387M11649q78521K95988P21932l17803K82005
$$ 6065754 5890346 5303545 6092194 6066807 6478456 5599935 5895923 6617855 6300052 6582057
8036F582057j81467J68785j00619j024518n28932n82134L86351Q81250J84998
$$ 6582057 6400590 6569375 6468756 5444238 4915306 4333172 4719523 5600773 5785771
8027E785771m29087l82915j09815J487200j1497p16415r57195n482P93989J009921
$$ 5785771 5356684 4973769 4863954 6351154 6339657 5623242 4666047 4660565 5454554 6464475
8017F464475m53202P33397j322355m07344J313757k44527J199217L92351j054001
$$ 6464475 6011273 6744670 5422315 5014971 6328728 6084201 7283418 7675769 6621768
8008F621768k68462J09376K87682j184136m11858p21730P27022J100344j331451
$$ 6621768 6353306 6462682 6750364 5566228 5154370 4432640 5159662 6260006 4928555
7999D928555K49026O562l448O44615O64965r87664p42455L02515m03890K26230
$$ 4928555 5177581 5184143 5180695 5825310 6490275 5502611 4760156 5062671 4658781 4885011
7989D885011k07442J60169L93525J281493m05912j127896j36167P9377K47157
$$ 4885011 4677569 4837738 5231263 6512756 6106844 4978948 4842781 4922158 5169315
7980E169315k23936l68743k31649J104663M6963K21497l70642j036657j467129
$$ 5169315 4945379 4576636 4344987 5449650 5496613 5718110 5347468 4310811 2843682
7971B843682Q09543J5408J191711O80544m73221J0818M73446L00735m09285J49947
$$ 2843682 3653225 3668633 4860344 5540888 5067667 5078485 5551931 5852666 5443381 5593328
7961E593328o67194N2526p9213k50186K085896J71170j668787m05498J447714
$$ 5593328 4926134 4978660 4899447 4649261 6735157 6906327 5237540 4832042 6279756
7952F279756j2986m37716l90885q89541l76730P64446J278646n07731j060889
$$ 6279756 6266770 5829054 5438169 4548628 4171898 4936344 6214990 5707259 4646370
7943D646370J0136O82259m92277L20023K40880O10892j154979O10975l05708l1984
$$ 4646370 4656506 5338765 4846488 5166511 5407391 6018283 4863304 5474279 5168571 5136587
7933E136587K10180r36083J24205k00298Q27835O97915o57526j36409j91959m09101
$$ 5136587 5346767 4410684 4534889 4334591 5162426 5860341 5202815 5066406 4874447 4465346
7923D465346M65892N44173m32751r21820j55530P71278l11005l36821K94200N59623
$$ 4465346 4931238 5475411 5042660 4120840 3965310 4736588 4425583 4088762 4382962 4942585
7913D942585L23181k42315K56946m83913n95777J18491L17315m38188J09632j96236
$$ 4942585 5265766 5023451 5280397 4796484 4200707 4319198 4636513 4198325 4307957 4111721
7903D111721J458165k96655K66475J00607o94622r84009J102554Q90836R6097
$$ 4111721 5569886 5273231 5539706 5640313 4945691 3961682 5064236 5955072 6051169
7894F051169o96935p08899n97942M99344M97175L67977j89527J034746j74406
$$ 6051169 5354234 4645335 4047393 4546737 5043912 5411889 5222362 6257108 6082702
7885F082702k50062P9035j512406p4005l50746J611527j333L70973N49438p25867
$$ 6082702 5832640 5911675 4399269 4325264 3974518 5586045 5584712 5955685 6505123 5779256
7875E779256r83403q15404J77322N42001o83831j623128J34045J015613J259729
$$ 5779256 4795853 3980449 4157771 4699772 4015941 2392813 2526858 3542471 4802200
7866D802200L4214o45563K31756j36490p18703l67293K37441L89391J025866p1067
$$ 4802200 4836414 4190851 4422607 4286117 3567414 3200121 3437562 3826953 4852819 4781752
7856D781752k66325M01405O59045P2379N49584r03742j033232L45684P2524l27665
$$ 4781752 4515427 4916832 5575877 5648256 6197840 5294098 4260866 4606550 4679074 4351409
7846D351409r70089j38793J047887P9513q25686J69487J633486n97681q48876
$$ 4351409 3381320 3242527 4290414 4369927 3544241 3713728 5347214 4749533 3900657
7837C900657Q22072r0362m16540k50582P96663k37233N73515q56524Q4871J0351
$$ 3900657 4722729 4632367 4215827 3965245 4761908 4524675 5098190 4241666 4326537 4336888
7827D336888l45600k43856J01634J344879M10017j487239m11202J861685R4114
$$ 4336888 3991288 3747432 3849066 5193945 5603962 4116723 3705521 5567206 5661320
7818E661320J41209j9451K16924r41596j23816m61729J115654l075026n08384
$$ 5661320 5802529 5783078 6000002 5058406 4934590 4472861 5588515 2513489 2005105
7809B005105J181911J183783k96554m61390P38957j505597m70275J549415K8512
$$ 2005105 3187016 4370799 4074245 3612855 4351812 2846215 2375940 3925355 3953867
7800C953867m99861K06438l94415L14553K44219O34249R6927J35444J44216k38511
$$ 3953867 3454006 3660444 3266029 3580582 3824801 4459050 4555977 4691421 4835637 4597126
7790D597126r7191m92437j31363o2074O14444m1029M20584J071136j340359r18123
$$ 4597126 4499935 4007498 3876135 3814061 4428505 4387476 4808060 5879196 4538837 3620714
7780C620714n87692L75216J5096L37505k06850j10661K53440J77240k61502N41712
$$ 3620714 3033022 3408238 3423334 3760839 3553989 3443328 3696768 3874008 3612506 4154218
7770D154218k13713J93276j66404O40776j77424o1465k76311J65763Q33046J89714
$$ 4154218 3940505 4133781 3967377 4608153 4430729 4369264 4092953 4258716 5091762 5281476
7760E281476l24038j7462J4713l09780P45293l93714m0285j58743j416896j18595
$$ 5281476 4957438 4939976 4954689 4644909 5390202 4996488 4956203 4797460 3380564 3261969
7750C261969J245137j067539R45792k05012O3958L31973K15486j084270j30767
$$ 3261969 4507106 3439567 4385359 4180347 4244305 4576278 4791764 3707494 3576727
7741C576727O6682K59094j30056m27092l91723M66877J320204q05315K85566J56823
$$ 3576727 3643409 3902503 3772447 3345355 2953632 3420509 4740713 3935398 4220964 4377787
7731D377787q6373n67114P00341Q12208j095381k10885O59412J20552j42577l62272
$$ 4377787 4291414 3724300 4424641 5236849 4141468 3930583 4589995 4710547 4567970 4205698
7721D205698K08228k01641J266570l68973n69207k90486M44481K01382N64876
$$ 4205698 4413926 4212285 5478855 5109882 4540675 4250189 4694670 4896052 5460928
7712E460928m31025n34278K44511m54752p1396j97254M12951p08954P57453N73320
$$ 5460928 5029903 4495625 4740136 4285384 4213988 4016734 4429685 3720731 4478184 5051504
7702E051504j258258J495341k24647j317057O87258N29645r13134p9451j38296
$$ 5051504 3793246 5288587 5063940 3746883 4434141 4963786 4050652 3971201 3832905
7693C832905k05269N2198K95704L71721q76188L14324L39393M9571R2769l09419
$$ 3832905 3627636 3679834 3975538 4347259 3471071 3785395 4124788 4174359 4267128 3957709
7683C957709L54204k59648q03124m8568J99300p81621P84184M78051M16764K6332
$$ 3957709 4311913 4052265 3249141 3200573 3399873 2618252 3402436 3880487 4297251 4323583
7673D323583j70402l5540m79070J229454L1349r53788K0414J43011q3274J09168
$$ 4323583 4153181 4117641 3638571 4868025 4899374 3945586 3966000 4109011 4025737 4134905
7663D134905l74060K86935L02526j64539J81127j02827K00506J69075n30961R28765
$$ 4134905 3760845 4047780 4350306 4185767 4366894 4264067 4464573 4633648 4102687 5031452
7653E031452l18606L32772L49147j383249J37998j13892M36678L5752p89295m17543
$$ 5031452 4712846 5045618 5394765 4011516 4149514 4035622 4472300 4508052 3718757 3301214
7643C301214N85895Q58771j5652q80728j18884j00640l8937K81165R1611l03432
$$ 3301214 3887109 4745880 4730228 3849500 3730616 3629976 3591039 3872204 3963815 3660383
7633C660383q55884j26108Q86199L3022j3193K626J026967o51882r08793K25583
$$ 3660383 2804499 2678391 3564590 3597612 3584419 3587045 4614012 3962130 3053337 3278920
7623C278920q89812O25114P17429P6561J11893J38257o04643O27822K16042j020882
$$ 3278920 2389108 3014222 3731651 3808212 3920105 4058362 3453719 4081541 4297583 3276701
7613C276701o43346J66598N65743J26869o7958L54460k72596K27397M50857N08029
$$ 3276701 2633355 2799953 3365696 3492565 3424607 3779067 3506471 3733868 4184725 4692754
7603D692754j293351m15413L09987J530446O3449o02242m76398j89309Q23878
$$ 4692754 3399403 2983990 3293977 4824423 4887872 4285630 3809232 3619923 4443801
7594D443801j33426P39542k60457l40961p23759K85583K68282o55777m23860N99666
$$ 4443801 4310375 5049917 4789460 4448499 3724740 4010323 4278605 3622828 3198968 3798634
7584C798634l34173k86232R01884o66765J60982L69260L14782n96912j694926
$$ 3798634 3464461 3178229 4080113 3413348 3574330 3943590 4258372 3661460 1966534
7575A966534P95144J302207P5968j06294j427153J36127J293685J6607l16066
$$ 1966534 2761678 4063885 4139853 4033559 2606406 2742533 4036218 4052825 3736759
7566C736759J658694j195536k03945M32579j60475p63421K87968m22408L31023
$$ 3736759 5395453 4199917 3995972 4428551 4268076 3504655 3792623 3370215 3701238
7557C701238M4025N62340R93465o96325j531829L79026J764315N15695j695344
$$ 3701238 3745263 4307603 5301068 4604743 3072914 3451940 5216255 5731950 4036606
7548D036606q49J287398o95544k60720K39455L22212o90026K14246m23590J05157
$$ 4036606 4035757 5323155 4627611 4366891 4606346 4928558 4238532 4452778 4029188 4134345
7538D134345J06165J62135q70105M03477L96602l35174q28140P89593J485893
$$ 4134345 4240510 4402645 3532540 3936017 4332619 3997445 3169305 3958898 5444791
7529E444791J10199j322501L59267m93654j118222M35920J355164J02784p07210
$$ 5444791 5554990 4232489 4591756 4098102 2979880 3415800 4770964 4873748 4166538
7520D166538k86876Q28860o44844N23567N2523m41108m56673N8961j95356k06038
$$ 4166538 3879662 4708522 4063678 4587245 4639768 4198660 3741987 3800948 3605592 3399554
7510C399554n03332K45170R50984k07546M99709k33470l58619J95660J140109
$$ 3399554 2896222 3141392 4092376 3884830 4384539 4151069 3792450 3988110 5128219
7501E128219j199567J36233N33482k61934J178717l09118M5400j11500j023780
$$ 5128219 3928652 4064885 4598367 4336433 5515150 5206032 5251432 5139932 4116152
7492D116152M57101M02574k16814r28254J3099l09902O82139Q15133j317493P77381
$$ 4116152 4573253 4975827 4759013 3830759 3843858 3533956 4216095 5031228 3713735 4491116
7482D491116m95226K08397J183599r48896n59596N04296p35675J18596L14988
$$ 4491116 3995890 4204287 5387886 4438990 3879394 4383690 3648015 3766611 4081599
7473D081599p00769L21383R85445M46644j66052O1179M61974R8704k46161K50402
$$ 4081599 3380830 3702213 4687658 5134302 4968250 5029429 5491403 5590107 5343946 5594348
7463E594348r11158P40169l0420q51904k54469K40761J64257N96486q2705l13035
$$ 5594348 4683190 5423359 5392939 4541035 4286566 4527327 4691584 5288070 5205365 4892330
7453D892330m80576K75368O6426k07529l17485k32780O56374l66849k83581j94402
$$ 4892330 4411754 4687122 4753548 4546019 4228534 3995754 4652128 4285279 4001698 3807296
7443C807296O26727O84236k2171l58562n0219p10884q68817N87250L12495R80692
$$ 3807296 4434023 5118259 5096088 4737526 4687307 3976423 3107606 3694856 4007351 4988043
7433D988043O50735M51417k26847r63289r38047m95881R29433J62415n22156J043254
$$ 4988043 5638778 6090195 5863348 4900059 3962012 3466131 4395564 4557979 4035823 5079077
7423E079077J93965k88787K13384L74156Q38910j102210l07670j98943j25686
$$ 5079077 5273042 4984255 5197639 5571795 6410705 5308495 5000825 4801882 4676196
7414D676196l80154J246348k82918p55039l68811J343190j175539J14564K84802
$$ 4676196 4296042 5542390 5259472 4504433 4135622 5478812 4303273 4417837 4702639
7405D702639M30060k63711l45521J19610k81284J421658N33662M36447j674053
$$ 4702639 5132699 4868988 4523467 4643077 4361793 5783451 6317113 6753560 5079507
7396E079507M34030q59168p79681J677391k14985j358077L71474j5901J66454
$$ 5079507 5513537 4654369 3874688 5552079 5337094 3979017 4350491 4334590 4501044
7387D501044K14199l04221l43158K85875J155618m5261P04079p62209m95884N27563
$$ 4501044 4715243 4411022 4067864 4353739 5509357 5464096 6168175 5405966 4910082 5437645
7377E437645m08475j68067Q69514j03751o66333J457449q25080K02883j162719
$$ 5437645 5029170 4861103 5730617 5626866 4960533 6417982 5592902 5795785 4633066
7368D633066j6930l51697k07585L70252j16277K47042N39556k31461O19514P82131
$$ 4633066 4616136 4264439 4056854 4427106 4310829 4557871 5097427 4865966 5485480 6267611
7358F267611r5490o16670N72623J96839o28205o4433p5160k693J015812Q1927
$$ 6267611 6172121 5555451 6128074 6324913 5696708 5632275 5557115 5554422 6570234 6652161
7348F652161q14627j12173O15301j4175l21614J005837o11535m99816l10118K43722
$$ 6652161 5837534 5725361 6340662 6326487 6004873 7010710 6399175 5899359 5589241 5832963
7338E832963m88238k10827M44852J20279l92546J71147J297576P90561p61750
$$ 5832963 5344725 5133898 5578750 5699029 5306483 5477630 6775206 7565767 6804017
7329F804017n61086k01164L22409L7778J11106L59587m71249m35744j82643m8317
$$ 6804017 6242931 6041767 6364176 6401954 6513060 6872647 6401398 5965654 5783011 5734694
7319E734694P7766K50142j60670R8310P45275k39062q89045R05171J11838l51887
$$ 5734694 5812460 6062602 5901932 6000242 6745517 6506455 5617410 6522581 6634419 6282532
7309F282532r79189j76277L16720J026860l74138j67396L18100l89318K87176
$$ 6282532 5303343 5127066 5443786 6470646 6096508 5929112 6247212 5857894 6145070
7300F145070l24311J53580p06069j105614M4384O99944J525109k31072p91492
$$ 6145070 5820759 5974339 5268270 4162656 4207040 4906984 6432093 6201021 5409529
7291E409529r41136L12289J134198M41773R08198j014844K14922j163169o97601
$$ 5409529 4468393 4780682 5914880 6356653 7264851 6250007 6464929 5301760 4604159
7282D604159Q05113M90964M3795k0207M60268q19648Q32102M13659J51700R5318
$$ 4604159 5409272 5900236 5944031 5923824 6384092 5564444 6396546 6810205 6961905 7057223
7272G057223j115091l76517m07245l4988Q0578l79376N41244P04168Q4368k79635
$$ 7057223 5942132 5565615 5158370 5123382 5203960 4824584 5365828 6069996 6154364 5874729
7262E874729l82773O05001O7679j37406Q5817r2864k34621L17046n78192n53175
$$ 5874729 5491956 6096957 6164636 6027230 6113047 6020183 5785562 6102608 5524416 4971241
7252D971241J138281l45474j96668L49043j160321O22567L86838J26431m82749
$$ 4971241 6109522 5764048 5567380 5916423 4756102 5378669 5765507 5891938 5409189
7243E409189o54194J256574K17832m14416Q62783j458161K59111Q24381l82438
$$ 5409189 4754995 6011569 6229401 5814985 6677768 5219607 5478718 6303099 5920661
7234E920661N63289K27167L66101q81326r28770K371306k05526J12740k31136
$$ 5920661 6483950 6711117 7077218 6195892 5267122 7638428 7432902 7545642 7314506
7225G314506q54044j64059Q18398M74000j11003n46200j38720K09272O7427P15167
$$ 7314506 6460462 6296403 7114801 7588801 7477798 6931598 6792878 7002150 7069577 7784744
7215G784744Q39918j78469l99632l849J633785l5949p84605J289008M34795p34574
$$ 7784744 8624662 8446193 8046561 8042712 9676497 9640548 8855943 10144951 10579746 9845172
7205I845172J46147J125609P96N69663N56732l34596J33343L48584q8261l6517
$$ 9845172 9991319 11116928 11117724 11687387 12244119 11909523 12042866 12391450 12303189 12266672
7195A2266672R68300l70611J93330O16426N57366k36505O45662l15925o8858O68144
$$ 12266672 13234972 12864361 13057691 13674117 14231483 13994978 14640640 14324715 14255857 14924001
7185A4924001m06745J44240j162312n62186k97884j022931O88907n03927j327287
$$ 14924001 14517256 14661496 13499184 12936998 12639114 11616183 12305090 11801163 10473876
7176A0473876l64373l00785M70039j598686m75039j726051R6185M7895J036967
$$ 10473876 10109503 9808718 10278757 8680071 8205032 6478981 6575166 6623061 7660028
7167G660028K54389O119o90587J235317N01568p24753j005823K38847O03352q01054
$$ 7660028 7914417 7920536 7229949 8465266 8966834 8242081 7236258 7475105 8078457 7277403
7157G277403k67045Q19554p76236m8686k11946k23358K1618M07372n33877L52074
$$ 7277403 7010358 7829912 7053676 7004990 6793044 6569686 6591304 6998676 6464799 6816873
7147F816873P61774q48897N02248J55486m30933j227166q9746N35126o01572J2483
$$ 6816873 7578647 6729750 7231998 7387484 6956551 5729385 5639639 6174765 5573193 5585676
7137E585676L59604l81891P51685O4656L72296j022697o30951l03147K43703J450925
$$ 5585676 5945280 5563389 6315074 6379730 6752026 5729329 5098378 4795231 5038934 6489859
7127F489859m198j238962J13409M74393k31451j13113l01508j25343K28548J033498
$$ 6489859 6485661 5246699 5360108 5834501 5603050 5489937 5188429 5063086 5291634 6325132
7117F325132K13515k89181j124134J011320n46819N50335p0675r18692J28408
$$ 6325132 6538647 6249466 5125332 6136652 5589833 6140168 6069493 5150801 5279209
7108E279209M18362M81854P76823j268051r94218O85808o48367j37390M84493
$$ 5279209 5697571 6179425 6956248 5688197 4693979 5379787 4731420 4594030 5078523
7099E078523k40850M01860L20502k64479m34898m84721l38028m88451J119601
$$ 5078523 4837673 5239533 5560035 5295556 4860658 4375937 4037909 3549458 4669059
7090D669059R65290N65701L13440l27017j29573j517286P44482l79648o60613
$$ 4669059 5634349 6200050 6513490 6186473 6056900 4539614 5284096 4904448 4243835
7081D243835J498292N19835j542501n00341L60122n86144R71195K19335M86773
$$ 4243835 5742127 6261962 4719461 4219120 4579242 3993098 4964293 5183628 5670401
7072E670401k99808K47783m68159k18369J5739m72091j162468J047988J12686
$$ 5670401 5370593 5618376 5150217 4931848 4947587 4475496 3313028 4361016 4473702
7063D473702L49818l1215o37003o16713R55087J031745q1092k92220M16261k6365
$$ 4473702 4823520 4792305 4155302 3538589 4493676 5525421 5444329 5152109 5568370 5542005
7053E542005O63106q30132J27114j13049K88899K9873j56557j376492o5162Q20505
$$ 5542005 6205111 5374979 5502093 5389044 5677943 5707816 5551259 4174767 4109605 4930110
7043D930110N38890N70791r62340j009589R65460L3686p57318R71843P37100k2826
$$ 4930110 5469000 6039791 5077451 4067862 5033322 5067008 4309690 5281533 6018633 5995807
7033E995807M98009q05607q48262J48775m91717m82663J298398R45914J4860l4772
$$ 5995807 6493816 5688209 4839947 4988722 4497005 4014342 5312740 6258654 6273514 6238742
7023F238742L74027Q96913k51775q22103M96218j78205n11703J09094M07840n42864
$$ 6238742 6612769 7509682 7257907 6435804 6932022 6753817 6242114 6351208 6759048 6216184
7013F216184o95343K80873J51625J059045m23553l50081j300017J0883o59554
$$ 6216184 5520841 5801714 5953339 7012384 6588831 6238750 4938733 4949616 4290062
7004D290062O6996N25890O161q13009j80056N94469j189339K34256J129475p73990
$$ 4290062 4357058 4882948 4889109 4076100 3896044 4490513 3301174 3535430 4664905 3890915
6994C890915j40754O7082q58939R18590M26286l1706P43654j38926Q53562o23827
$$ 3890915 3750161 3817243 2958304 3876894 4303180 4271474 5015128 4876202 5729764 5105937
6984E105937l40969N40145N04985m57089l0237J355568j206110m75362L09211
$$ 5105937 4764968 5305113 5810098 5353009 5322772 6678340 5472230 4996868 5306079
6975E306079m44993K89458q89477j15657K84997P01043Q1024j137675m3841j87859
$$ 5306079 4861086 5150544 4261067 4145410 4430407 5131450 5212474 4074799 4030958 3843099
6965C843099j055450P44381J264036J328451l49779l58179P7467o6481p583l33551
$$ 3843099 2787649 3532030 4796066 6124517 5774738 5416559 5494026 5427545 5419962 5086411
6955E086411q09377K28558J94325q78814N22232K71714Q84604L74821J219301
$$ 5086411 4277034 4505592 4699917 3821103 4343335 4615049 5499653 5874474 7093775
6946G093775l31214j429244K46407J05223P96911n92362O6124p32696p23547O42124
$$ 7093775 6762561 5333317 5579724 5684947 6481858 5889496 5955620 5222924 4499377 5141501
6936E141501M61812J85533P61307l89228p84344k76311o59178J56540k5029O87415
$$ 5141501 5603313 5788846 6550153 6160925 5376581 5100270 4441092 4597632 4572603 5260018
6926E260018L4797o109N54210M85307J186827j043416N72828j7060K45048M59096
$$ 5260018 5294815 5288706 5842916 6328223 7515050 6471634 7044462 7027402 7272450 7731546
6916G731546k97313p10348k72062N47252o81608L79812k87469q32414J084402
$$ 7731546 7434233 6723885 6451823 6999075 6317467 6697279 6409810 5577396 6661798
6907F661798j09063o33567K67868k07161L50807j537850k37001P25560R66315
$$ 6661798 6552735 5919168 6187036 5979875 6330682 4792832 4555831 5281391 6247706
6898F247706J76816r04576K7250j14330J31266K24190o27517R9892N25952j025773
$$ 6247706 6424522 5519946 5547196 5432866 5564132 5788322 5160805 5260697 5786649 4760876
6888D760876M92187O11526K50675j581889m30026P54282j018230L53630J668411
$$ 4760876 5253063 5864589 6115264 4533375 4103349 4857631 3839401 4193031 5861442
6879E861442K61494n28911R43062J57740o87267k85057o25164O25644R3347o47232
$$ 5861442 6122936 5594025 6537087 6694827 6007560 5722503 5097339 5722983 5816330 5169098
6869E169098J14689p6288J33697n442n20380n5821k66036j33378k47727j81892
$$ 5169098 5283787 5207499 5341196 5335754 4815374 4759553 4493517 4360139 4112412 3930520
6859C930520m67965P21948q243K57373O11030q22725O0473K91826J258975n13478
$$ 3930520 3462555 4184503 4176260 4433633 5044663 4221938 4282411 4574237 5833212 5319734
6849E319734j87128K54356L90476j086904j74444k85802Q17363J78302O58917
$$ 5319734 5132606 5386962 5777438 4690534 4516090 4230288 5047651 5225953 5884870
6840E884870P28348j310987j67033n0559q43552J011822n55213P7346R9585M04583
$$ 5884870 6613218 5302231 5135198 5084639 4241087 5252909 4697696 4775042 4874627 5279210
6830E279210O18497j177864K18936Q23679M67783j051045r75558K15625j57703
$$ 5279210 5897707 4719843 4938779 5762458 6230241 5179196 4203638 4419263 4261560
6821D261560J520561J92137L08038l19930l46375j11334k7054j71532k23806j111876
$$ 4261560 5782121 5974258 6282296 5962366 5615991 5504657 5477603 5306071 5082265 3970389
6811C970389M58422L09947j479083J307469j96775K84250K120361j018499m39340
$$ 3970389 4428811 4738758 3259675 4567144 4370369 4654619 6774980 5756481 5317141
6802E317141q53307Q45308j49115l17205J80145K57565j00385o32930P21748j075357
$$ 5317141 4463834 5309142 5160027 4842822 5022967 5280532 5180147 4547217 5268965 4193608
6792D193608j69735L8837J149372M65874J37677J98329l57700l98011l59718Q36006
$$ 4193608 4023873 4062710 5212082 5677956 5815633 6013962 5656262 5258251 4898533 5734539
6782E734539O05179j662907P40394k35787K30014j670021Q25273Q76940r91015
$$ 5734539 6339718 4676811 5417205 5181418 5411432 3741411 4566684 5443624 4452609
6773D452609P1194L96692N94092L9898p14163p83068j119367J016496O72665m31657
$$ 4452609 4523803 4920495 5514587 5554485 4840322 4057254 2937887 3954383 4627048 4195391
6763D195391P76377m88207Q8958J31558P97116l01657j236571n68830m94673J549344
$$ 4195391 4971768 4483561 4572519 4704077 5501193 5199536 3962965 3394135 2899462 4448806
6753D448806R08131L24280q3575l28537m58875N65011j54338J03302K15487J80153
$$ 4448806 5356937 5681217 5597642 5269105 4810230 5375241 5220903 5324205 5539692 5719845
6743E719845q75189N09236J164257j518898p00002m07912J950O51297J373440
$$ 5719845 4844656 5353892 6518149 4999251 4299249 3891337 3893287 4544584 5918024
6734E918024N82789O53255j652472k97408R35L93570M6871n29432j15800J072583
$$ 5918024 6500813 7154068 5501596 5204188 5205123 5598693 5645564 5116132 5000332 6072915
6724F072915L51063j273084q82809L34535J048987n7051j7670O6687j1146J06354
$$ 6072915 6423978 5150894 4268085 4602620 5651607 5594556 5576886 5643573 5632427 5738781
6714E738781M52529k652j12211r20448l63613J405n91837J59197J091203n71956
$$ 5738781 6191310 6188658 6076447 5155999 4792386 4793791 4201954 4361151 5452354 4880398
6704D880398L48655R2185m16678J05913M02674M59082L57218K38221o14155p45698
$$ 4880398 5229053 5321238 4904560 5010473 5413147 5872229 6229447 6467668 5853513 5107815
6694E107815Q17067m83953j23732p10147N69623m1593L90828J42868m79902M84326
$$ 5107815 5924882 5440929 5317197 4607050 5176673 5135080 5525908 5668776 5188874 5673200
6684E673200n07409R77714q77087n31679J147064J03614P236J0670MO02764k65762
$$ 5673200 5165791 6143505 5266418 4734739 5881803 5985417 5992653 6003323 6003327 6606091 6340329
6673F340329k5638j599164l67345j16418j176311P18938R37403M70294N67059
$$ 6340329 6314691 4715527 4348182 4231764 3055453 3774391 4711794 5182088 5749147
6664E749147M48171j08914J181296O59207q81930q17345q01166L27151J63440
$$ 5749147 6197318 6088404 7269700 7928907 7046977 6229632 5428466 5755617 5919057
6655E919057k95002J79897J150420j270686J99649n5294j36208M97196n21243
$$ 5919057 5624055 5803952 6954372 5683686 5883335 5828041 5691833 6189029 5667786
6646E667786r3333L0009K71274J069275n80237k76044P33369o53985P63890J063976
$$ 5667786 5574453 5604462 5875736 6945011 6364774 6088730 6822099 6168114 6932004 7995980
6636G995980p88470l44533N33173k57234k19544n47238J165999M35425j15699
$$ 7995980 7207510 6862977 7396150 7138916 6919372 6372134 7538133 7973558 7857859
6627G857859L74322K77227n5147n37902N32805q02231p31819m3686j41729L92857
$$ 7857859 8232181 8509408 8454261 7916359 8449164 7646933 6915114 6871428 6729699 7122556
6617G122556O14558q7945J324739J481917r31897O51250K09450m30635R41629
$$ 7122556 7737114 7649169 8973908 10455825 9523928 10175178 10384628 9953993 10895622
6608A0895622k55418l71388n81968n4654J111553J043874J255596N11822J97353
$$ 10895622 10640204 10268816 9686848 9632194 10743747 11787621 13043217 13555039 13752392
6599A3752392l96061J21915P38320K2658K36916j075080n19290R43544j09217
$$ 13752392 13356331 13478246 14216566 14239224 14476140 13401060 12881770 13825314 13716097
6590A3716097o94514M0974J02342J047282m55308n93249K212755j09663N82566
$$ 13716097 13021583 13062557 13164899 14212181 13756873 13163624 15376379 15266716 15849282
6581A5849282J014486j043708o20413J311076J432340j00634J81983p93748J735301
$$ 15849282 16863768 15820060 15199647 16510723 17943063 17842429 18024412 17230664 18965965
6572A8965965m683j259067p32692P2079j438445r7364n62361o22208K26842p28737
$$ 18965965 18961282 17702215 16969523 17041602 15603157 15505793 14943432 14321224 14548066 13819329
6562A3819329R00934k57397r86988L4806K34543l81191J16120m85239P56659J021132
$$ 13819329 14720263 14462866 13475878 13510684 13745227 13364036 13480156 12994917 13751576 14772708
6552A4772708j224270J43958M82856r3389J329798J55558Q96782P02570o70231
$$ 14772708 13548438 13692396 14175252 14081863 15411661 15567219 16464001 17166571 16496340
6543A6496340j300449L24956R1893P38970m38747J88152j353239j319460O15981
$$ 16496340 15195891 15520847 15612740 16351710 15912963 16101115 14747876 13428416 14044397
6534A4044397Q44767j72736j443023j098101J95997O68741N41211m26301o18069
$$ 14044397 14889164 14716428 13273405 12175304 12371301 13040042 13581253 13154952 12536883
6525A2536883p17949N5005n8722n27106M66376m46810l5550n46563o5484J35024
$$ 12536883 11818934 11873939 11815217 11288111 11754487 11307677 11272127 10725564 10660080 10795104
6515A0795104j006674k17792r5016M37089L23898j51587P94777o04129j32409
$$ 10795104 9788430 9570638 9475622 9912711 10236609 10085022 10879799 10275670 10143261
6506A0143261L6708l00339J93590j364380j297631J056600L40783L34536k59380
$$ 10143261 10179969 9879630 10073220 8708840 7411209 8467809 8808592 9143128 8883748
6497H883748n12671P73797J99878n23768n78688N18568L49064m70971N85891q66401
$$ 8883748 8371077 9144874 9344752 8820984 8242296 8760864 9109928 8638957 9224848 8358447
6487H358447Q31245J40530n70387M31184o29166R2857J53424O04388J00777p1596
$$ 8358447 9189692 9330222 8759835 9191019 8561853 8654710 8808134 9412522 9513299 9441703
6477I441703r2622p37997o61286k11315j55081R198l8715k77556M72022N01271
$$ 9441703 9349081 8611084 7949798 7738483 7583402 7592600 7553885 7276329 7748351 8249622
6467H249622l67879L99919j33431K51959n23349j277886J91830O47229m05184
$$ 8249622 7881743 8281662 8148231 8400190 7876841 6598955 6790785 7438014 7032830
6458G032830J394112j150851m70163P55547r1845P48521m80671J64754L96786
$$ 7032830 8426942 7276091 6805928 7561475 7469630 8218151 7737480 7902234 8299020
6449H299020p39964p24961R54937K28992o50059N76517O89276n18217k16472K72008
$$ 8299020 7559056 6834095 7789032 8018024 7367965 7944482 8633758 8115541 7899069 8171077
6439H171077J25951k95711o22919K76985K44557l82628m65921k10645L89149O78807
$$ 8171077 8297028 8001317 7378398 7655383 7899940 7517312 7051391 6840746 7229895 7908702
6429G908702N00286K53212k46463m61343J51400q55722J71270O77262O02658j236970
$$ 7908702 8408988 8662200 8415737 7954394 8105794 7250072 7421342 8098604 8701262 7464292
6419G464292J457725J117534k075530j07864r6382r7337Q48568j34667n76223
$$ 7464292 8922017 10039551 7964021 7856157 7759775 7662438 8511006 8376339 7800116
6410G800116n56345M19971l56298m99261J219500K87615L45381q54092q94516
$$ 7800116 7243771 7663742 7307444 6808183 8027683 8315298 8660679 7806587 6912071
6401F912071P86908J542979N52498o52181K09894J1577r52598o12711O15904m48866
$$ 6912071 7698979 9241958 9794456 9142275 9352169 9363746 8411148 7798437 8414341 7965475
6391G965475p17234M27342N7817k41036L55096Q03613n61399L78301N27767l06167
$$ 7965475 7248241 7675583 7733400 7492364 7847460 8651073 8089674 8467975 8995742 8689575
6381H689575p0346k79041Q175J8126k20641n17515j87838J1398O32098K14165
$$ 8689575 8619229 8340188 8348363 8366489 8145848 7628333 7440495 7451893 8083991 8298156
6371H298156o12700O09226n3789J91879q24729l42936N31889L6022O22659P28987
$$ 8298156 7685456 8294682 8240893 8432772 7608043 7265107 7796996 7833018 8455677 9184664
6361I184664J72969j97240j065380j127372P43165M90111L97175R79984R70099
$$ 9184664 9357633 9160393 8095013 6967641 7710806 8200917 8598092 9578076 10548175
6352A0548175j900379k78826N0229M07011M20875m73871r2676K32927O76758q22848
$$ 10548175 8647796 8368970 8419199 8826210 9247085 8773214 8680538 8913465 9590223 8767375
6342H767375m26235J78902O05324j68716M92053Q69307k93705m89718k75176k59402
$$ 8767375 8341140 8520042 9125366 8956650 9448703 10318010 10024305 9534587 9259411 9000009
6332I000009J489631p4221q87674P89940M10086k62654q62285k09026J012300
$$ 9000009 10489640 10415419 9527745 10317685 10727771 10465117 9602832 9393806 10406106
6323A0406106P29700k05170n77139m6053J121375p87475n72369R29010J92639
$$ 10406106 11135806 10930636 10353497 10307444 11428819 10641344 10068975 10997985 11190624
6314A1190624l38874N90619j18642k48559N48651K24370O73221K39723r92748
$$ 11190624 10851750 11442369 11323727 11075168 11623819 11848189 12521410 12761133 11768385
6305A1768385n16277L03709J888950j049418m89937p8802M05032Q79026O379n86342
$$ 11768385 11252108 11555817 13444767 12395349 11905412 11826610 12231642 13110668 13117047 12530705
6295A2530705n53511P68708j466681J173197J804990K22190o82928j11725l45840
$$ 12530705 11977194 12745902 11279221 12452418 14257408 14479598 13796670 13684945 13339105
6286A3339105j71224M81550K74719j92124j04136n63351N02762n0041M81419j20867
$$ 13339105 13167881 13649431 13924150 13732026 13627890 13064539 13567301 13517260 13998679 13877812
6276A3877812k41632J7980m68904N56338J44202J155793r64046N52257l15586
$$ 13877812 13636180 13654160 13185256 13741594 13885796 15041589 14077543 14629800 14314214
6267A4314214L2776O70552j279186m25065j071552L57718L10980R60372r8656
$$ 14314214 14346990 15017542 13738356 13313291 12241739 12599457 12910437 13870809 13772153
6258A3772153Q4976J88443k87561J50653J43450M58209k00175Q1305j257040N28410
$$ 13772153 13857129 14045572 13758011 13908664 14052114 14510323 14310148 14391453 13134413 13662823
6248A3662823P74747J8939M3812j460423R86414N39052n25116k04338n30253P74336
$$ 13662823 14437570 14456509 14500321 13039898 14026312 14565364 14040248 13835910 13305657 14079993
6238A4079993K30022J57811K587M52043P8950m93278m25121n25414N5285R18487
$$ 14079993 14310015 14467826 14470413 14922456 15001406 14508128 14083007 13557593 13612878 14531365
6228A4531365r82901j46390K326168m41967q89404l69172k30022J551347J214133
$$ 14531365 13548464 13402074 15728242 15286275 14396871 14027699 13797677 15349024 16563157
6219A6563157j420311r29230J66862M54921M59758k19563O01002L87279l78290
$$ 16563157 15142846 14213616 14380478 14835399 15295157 15075594 15676596 16063875 15685585
6210A5685585J75645q16914N24768R7606O5378O1516l79832K92066J69467j31439
$$ 15685585 15861230 15044316 15569084 15666690 15732068 15793584 15413752 15705818 15875285 15743846
6200A5743846l96056j4393J115826r494j142494m47590P01629L28159O10446L36071
$$ 15743846 15347790 15333397 16449223 16439729 15297235 14849645 15551274 15879433 16489879 16825950
6190A6825950N74494O42990P410k39570q41258P33284Q76609k6800j25045j129544
$$ 16825950 17400444 18043434 18050844 17811274 16970016 17703300 18579909 18553109 18428064 17298520
6180A7298520K17434Q73818m32825J194921K36621l36050J400496n87329q74747
$$ 17298520 17515954 18389772 17956947 19151868 19388489 19052439 20452935 19865606 18990859
6171A8990859N86587J085544P51368o89641O01116R30256K45937L46827j72242
$$ 18990859 19577446 20662990 21414358 20724717 21325833 22256089 22502026 22848853 22676611
6162B2676611j15168o91735l17626J421624K5439Q07369M62907k5887j053189
$$ 22676611 22561443 21869708 21552082 22973706 22999145 23806514 24269421 24243534 23190345
6153B3190345q14399K26142M37046k35265k48419N94775k25958L23629J127283
$$ 23190345 22375946 22602088 23039134 22803869 22555450 23150225 22924267 23247896 24375179
$$ [...]
##END NTUPLES=NMR SPECTRUM
##END=
