##TITLE=1H_DE-80H_X3
 200.13MHz, d2o
 8 sc
 
 19ns.26.2.2025
##JCAMPDX= 6.0         $$ Bruker NMR JCAMP-DX V2.0
##DATA TYPE= NMR SPECTRUM
##DATA CLASS= NTUPLES
##ORIGIN= UXNMR, Bruker Analytische Messtechnik GmbH
##OWNER= pz
$$ XWIN-NMR		Version 3.5
$$ Wed Jun 11 11:54:43 2025 Russian Standard Time (UT+4h)  Yarkov@DPX200
##.OBSERVE FREQUENCY= 200.1313
##.OBSERVE NUCLEUS= ^1H
##.ACQUISITION MODE= SIMULTANEOUS
##.ACQUISITION SCHEME= undefined
##.AVERAGES= 8
##.DIGITISER RES= 18
##SPECTROMETER/DATA SYSTEM= spect
##.PULSE SEQUENCE= zg30
##.SOLVENT NAME= CDCl3
##.SHIFT REFERENCE= (INTERNAL, CDCl3, 0, 15.4803)
##AUDIT TRAIL= $$ (NUMBER, WHEN, WHO, WHERE, WHAT)
$$ ##TITLE= Audit trail, XWIN-NMR		Version 3.5
$$ ##JCAMPDX= 5.01
$$ ##ORIGIN= Bruker BioSpin GmbH
$$ ##OWNER= Yarkov
$$ C:/Bruker/XWIN-NMR/data/yarkov2/nmr/H-C/1/pdata/1/auditp.txt
$$ ##AUDIT TRAIL=  $$ (NUMBER, WHEN, WHO, WHERE, WHAT)
(   1,<2025-06-11 11:53:46.78 +0400>,<Yarkov>,<DPX200>,
      <created by zg, POWCHK disabled, PULCHK disabled
       configuration hash MD5:
       00 E9 B6 7A A2 85 ED C7 34 08 36 98 17 FE 4E 26
       data hash MD5: 16K
       39 B5 95 11 34 B3 74 49 C6 6D BE 74 1F 0B C2 9F>)
(   2,<2025-06-11 11:53:51.75 +0400>,<Yarkov>,<DPX200>,
      <Start of raw data processing
       efp BC_mod = 2 LB = 0.25 FT_mod = 6 PKNL = 1 PHC0 = -1714.501 PHC1 = 9.76656 SI = 16K 
       data hash MD5: 16K
       49 7F A2 77 9D AD 12 13 66 27 E8 A3 42 BD 94 5D>)
(   3,<2025-06-11 11:54:00.26 +0400>,<Yarkov>,<DPX200>,
      <abs ABSG = 5 
       data hash MD5: 16K
       C7 20 C5 B1 8D 45 0D 2C 3E AF C7 AE 2A 4D 35 D5>)
$$ ##END=
$$ 
$$ hash MD5
$$ CD FC A4 19 8C 40 DE 60 D9 CB B7 1A D0 A0 5B 87
##$RELAX= 
##$RELAX= 
##$RELAX= 
##$RELAX= 
##$RELAX= 
##$RELAX= 
$$ Bruker specific parameters
$$ --------------------------
##$DU= <C:/Bruker/XWIN-NMR>
##$EXPNO= 1
##$NAME= <H-C>
##$PROCNO= 1
##$TYPE= <nmr>
##$USER= <yarkov2>
##$AMP= (0..31)
100 100 100 100 100 100 100 100 100 100 100 100 100 100 100 100 100 100 
100 100 100 100 100 100 100 100 100 100 100 100 100 100 
##$AQSEQ= 0
##$AQ_mod= 1
##$AUNM= <au_zg>
##$AUTOPOS= <>
##$BF1= 200.13
##$BF2= 200.13
##$BF3= 200.13
##$BF4= 200.13
##$BF5= 200.13
##$BF6= 200.13
##$BF7= 200.13
##$BF8= 200.13
##$BYTORDA= 1
##$CFDGTYP= 0
##$CFRGTYP= 5
##$CHEMSTR= <none>
##$CNST= (0..31)
1 1 145 1 1 1 1 1 1 1 1 1 1 1 1 1 1 1 1 1 1 1 1 1 1 1 1 1 1 1 1 1 
##$CPDPRG= <>
##$CPDPRG1= <>
##$CPDPRG2= <>
##$CPDPRG3= <>
##$CPDPRG4= <mlev>
##$CPDPRG5= <mlev>
##$CPDPRG6= <mlev>
##$CPDPRG7= <mlev>
##$CPDPRG8= <mlev>
##$CPDPRGB= <>
##$CPDPRGT= <>
##$D= (0..31)
0 0.7 0 0 0 0 0 0 0 0 0 0.03 0 0 0 0 0 0 0 0 0 0 0 0 0 0 0 0 0 0 0 0 
##$DATE= 1749628426
##$DBL= (0..7)
120 120 120 120 120 120 120 120 
##$DBP= (0..7)
150 150 150 150 150 150 150 150 
##$DBP07= 0
##$DBPNAM0= <>
##$DBPNAM1= <>
##$DBPNAM2= <>
##$DBPNAM3= <>
##$DBPNAM4= <>
##$DBPNAM5= <>
##$DBPNAM6= <>
##$DBPNAM7= <>
##$DBPOAL= (0..7)
0.5 0.5 0.5 0.5 0.5 0.5 0.5 0.5 
##$DBPOFFS= (0..7)
0 0 0 0 0 0 0 0 
##$DE= 6
$$ [...]
##$SUBNAM3= <"">
##$SUBNAM4= <"">
##$SUBNAM5= <"">
##$SUBNAM6= <"">
##$SUBNAM7= <"">
##$SUBNAM8= <"">
##$SUBNAM9= <"">
##$SW= 18.0517328524113
##$SWIBOX= (0..15)
0 0 2 0 0 0 0 0 0 0 0 0 0 0 0 0 
##$SW_h= 3612.71676300578
##$TD= 16384
##$TD0= 1
##$TE= 0
##$TE2= 300
##$TE3= 300
##$TEG= 300
##$TL= (0..7)
0 120 120 120 120 120 120 120 
##$TP= (0..7)
150 150 150 150 150 150 150 150 
##$TP07= 0
##$TPNAME0= <>
##$TPNAME1= <>
##$TPNAME2= <>
##$TPNAME3= <>
##$TPNAME4= <>
##$TPNAME5= <>
##$TPNAME6= <>
##$TPNAME7= <>
##$TPOAL= (0..7)
0.5 0.5 0.5 0.5 0.5 0.5 0.5 0.5 
##$TPOFFS= (0..7)
0 0 0 0 0 0 0 0 
##$TUNHIN= 0
##$TUNHOUT= 0
##$TUNXOUT= 0
##$USERA1= <user>
##$USERA2= <user>
##$USERA3= <user>
##$USERA4= <user>
##$USERA5= <user>
##$V9= 5
##$VALIST= <valist>
##$VCLIST= <CCCCCCCCCCCCCCC>
##$VD= 0
##$VDLIST= <DDDDDDDDDDDDDDD>
##$VPLIST= <PPPPPPPPPPPPPPP>
##$VTLIST= <TTTTTTTTTTTTTTT>
##$WBST= 1024
##$WBSW= 4
##$XGAIN= (0..3)
0 0 0 0 
##$XL= 0
##$YL= 0
##$YMAX_a= 88393
##$YMIN_a= -58052
##$ZGOPTNS= <>
##$ZL1= 120
##$ZL2= 120
##$ZL3= 120
##$ZL4= 120
##$ABSF1= 15.54305
##$ABSF2= -2.508801
##$ABSG= 5
##$ABSL= 3
##$ALPHA= 0
##$AQORDER= 0
##$ASSFAC= 0
##$ASSFACI= 0
##$ASSFACX= 0
##$ASSWID= 0
##$AUNMP= <proc_1d>
##$AZFE= 0.1
##$AZFW= 0.1
##$BCFW= 0
##$BC_mod= 2
##$BYTORDP= 0
##$COROFFS= 0
##$CY= -3
##$DATMOD= 1
##$DC= 0
##$DFILT= <>
##$DTYPP= 0
##$F1P= 0
##$F2P= 0
##$FCOR= 1
##$FTSIZE= 16384
##$FT_mod= 6
##$GAMMA= 0
##$GB= 0
##$INTBC= 1
##$INTSCL= 3.241238e-09
##$ISEN= 128
##$LB= 0.25
##$LEV0= 0
##$LPBIN= 0
##$MAXI= 10000
##$MC2= 0
##$MEAN= 0
##$ME_mod= 0
##$MI= 1.114404
##$NCOEF= 0
##$NC_proc= -10
##$NLEV= 6
##$NOISF1= 3.799351
##$NOISF2= 2.8
##$NSP= 0
##$NTH_PI= 0
##$NZP= 0
##$OFFSET= 15.48025
##$PC= 1
##$PHC0= -1714.501
##$PHC1= 9.76656
##$PH_mod= 1
##$PKNL= yes
##$PPARMOD= 0
##$PSCAL= 0
##$PSIGN= 0
##$REVERSE= no
##$SF= 200.130008294095
##$SI= 16384
##$SIGF1= 3
##$SIGF2= 2
##$SINO= 0.751879
##$SIOLD= 32768
##$SREGLST= <19F.Aceton>
##$SSB= 0
##$STSI= 16384
##$STSR= 0
##$SW_p= 3612.71676300578
##$SYMM= 0
##$S_DEV= 0
##$TDeff= 16384
##$TDoff= 0
##$TI= <>
##$TILT= no
##$TM1= 0
##$TM2= 0
##$TOPLEV= 0
##$USERP1= <user>
##$USERP2= <user>
##$USERP3= <user>
##$USERP4= <user>
##$USERP5= <user>
##$WDW= 1
##$XDIM= 16384
##$YMAX_p= 344466863
##$YMIN_p= -5830505
$$ End of Bruker specific parameters
$$ ---------------------------------
##NTUPLES= NMR SPECTRUM
##VAR_NAME=  FREQUENCY,     SPECTRUM/REAL,   SPECTRUM/IMAG
##SYMBOL=    X,             R,               I
##VAR_TYPE=  INDEPENDENT,   DEPENDENT,       DEPENDENT
##VAR_FORM=  AFFN,          ASDF,            ASDF
##VAR_DIM=   16384,         16384,           16384
##UNITS=     HZ,            ARBITRARY UNITS, ARBITRARY UNITS
##FACTOR=    0.220516191357247, 1,           1
##FIRST=     3098.06263265759, 0,            0
##LAST=      -514.654130348189, 0,           0
##MIN=       -514.654130348189, -5830505,    0
##MAX=       3098.06263265759, 344466863,    0
$$ Real data points
##PAGE= N=1
##DATA TABLE= (X++(R..R)), XYDATA
$$ [...]
6960 1450676 869383 934355 1556445 1804834 1080783 907245 524144 513839 792216 639240
6950 639240 1094103 1640485 1227121 202546 718577 1252433 1262789 1559200 1694093 866635
6940 866635 894038 1081626 1625038 1702506 2328874 1455418 1633683 2194828 2499328 2008888
6930 2008888 169934 1141546 1242547 1390288 1728943 2765860 3116894 2269542 3015291
6921 3015291 3443246 3243006 3274383 4189296 2808228 1586845 2723848 1919639 2200233
6912 2200233 2276213 2309671 2183646 3783265 3173810 2399285 2626218 2638845 3066451 3332587
6902 3332587 3144661 4385698 3754805 3255354 2602494 3025129 2378953 2856256 3246500
6893 3246500 2796464 3389415 4173279 4761983 3052362 3220382 2073259 2933042 3401607
6884 3401607 4154011 3143614 2018863 1485176 2419308 3293613 3942956 3411364 3420636 2800718
6874 2800718 2722194 1682729 1598143 1866321 2577878 3256645 1988988 2939988 3689650 2763871
6864 2763871 2681146 2764327 2186275 1340574 1058964 1315711 1808478 2872680 2226186 2369103
6854 2369103 3592716 3338339 2174189 2466643 3010410 2218654 1914302 2871751 3403379
6845 3403379 3477979 2697344 2960275 2674300 2581330 3383750 2855427 2754417 2765398 2511966
6835 2511966 3163811 1880803 1936999 2079141 3139509 4201736 2966738 2783610 2881388
6826 2881388 2604814 3381365 3900226 4701826 4702560 4245997 4023700 4341035 3679307 4302153
6816 4302153 4372251 4335620 4932728 4707340 5306473 4063472 4061711 4862334 4323157 3243000
6806 3243000 3213416 3609405 3847013 4066543 4204381 3540997 2881250 2244738 3353036 2938184
6796 2938184 3255211 3322605 1932600 1920654 2104638 2635776 1711221 1856895 2857383 3666590
6786 3666590 3610401 3681689 3897816 4082418 3499364 3564567 3596082 3407278 2564578 2339299
6776 2339299 3577029 3822235 2792346 3287248 3187014 1681008 3032229 2960571 3566563
6767 3566563 3020297 4126062 3335460 4183221 3733963 2654405 2227064 1698143 2726872
6758 2726872 2925583 3521516 2754829 2357543 3101117 3422502 3628377 3658181 3354250 2696065
6748 2696065 4120615 4660804 3133615 3422599 3880339 4505393 3808241 3775463 3899088
6739 3899088 3480238 2887486 3891089 4065220 3703438 3767383 3455795 2727249 3232406 3728306
6729 3728306 3557234 3705339 2659101 2462046 3323716 4467915 4452220 3032695 3365543
6720 3365543 3648396 3499490 3582964 4292248 3608288 3779145 2802608 2645834 2211690 3228286
6710 3228286 5032913 4575562 3551330 3188276 3318149 3891257 3411408 3850315 3613772
6701 3613772 3675186 3264571 3885841 4628864 3566588 3846802 2937200 4685469 4324822
6692 4324822 3771117 4503131 5422539 5568989 5517742 4497038 4475806 4602891 4682221 5018997
6682 5018997 3987647 3846471 3061765 3016108 4092200 5014783 4967519 4521473 4370332 3636622
6672 3636622 4256350 4346105 5241361 5805385 4951837 4741741 4193752 3728893 4211946 4424422
6662 4424422 4546521 3606488 4389866 4778500 4883474 4277049 4275217 4920448 5733501 5788388
6652 5788388 6104669 5714235 4906086 5317002 5574581 5626872 4805216 4923088 5288596 5414404
6642 5414404 5444123 4648104 5138945 6346919 6267906 6680819 6543484 6845659 6358698 6338142
6632 6338142 6480715 5930398 4829718 5477060 6213298 6351128 5235216 6010779 7167865
6623 7167865 7078485 6280421 7739065 7533287 7491351 7760434 7216106 8182933 7932812 7312649
6613 7312649 7492012 8150417 8567054 8754676 7513220 8221015 9053394 9657010 7667191
6604 7667191 6679110 8319204 8710211 9292177 9274191 8980479 8706074 9482741 8928782 9336800
6594 9336800 9628991 8678581 9703938 10757477 11044952 10440225 11082739 11573823 11744538
6585 11744538 12715841 12928944 13150097 12177926 12607736 14210625 14226544 14142523 14847732 15338562
6575 15338562 14353536 13954347 13924435 14500113 14380459 14985132 15718964 15697441 15683179 15264935
6565 15264935 16482808 16692709 17073920 16808983 16401096 16735178 15645823 16566949 17212906
6556 17212906 16766149 16012215 16301435 16011188 15621077 15235242 15470066 15064702 14670540
6547 14670540 16170051 16534311 16432888 16420780 18123776 17813256 16551552 18124786 17998103
6538 17998103 17811521 17594969 16988894 17737362 17647900 17636885 19482220 19046761 19504659 19991747
6528 19991747 20324871 20277183 20145082 19799072 19042870 19738852 19631246 18582996 18492383 18884305
6518 18884305 19021227 18809041 18689572 19588399 19763840 19043846 19185516 19589228 19907321
6509 19907321 19771269 19005941 19324779 18352887 19037987 19202391 17510114 19242272 20839332
6500 20839332 19464687 19975939 19922885 19919285 19992489 20270637 21948237 22367329 21496992 20572437
6490 20572437 20086227 20735444 22009961 22357121 22454908 22691390 22725614 22422370 21764575 21928747
6480 21928747 21322199 22439960 21715947 21055837 21758863 21396031 20403328 20337381 19560144
6471 19560144 19125931 19368582 18576914 19503769 19206329 18137662 17716635 18505422 18555783
6462 18555783 18244055 17051042 16731737 17727884 17662398 15812044 14820281 14586399 14382892
6453 14382892 14556931 14389837 13961594 13535065 14439343 13762009 14185598 13950567 13341356
6444 13341356 13516786 13090846 12148516 11540529 12115425 13195370 13450567 13960022 15317599
6435 15317599 14462951 14923153 14093874 12539581 12732609 12344249 11960355 12359978 13465369
6426 13465369 13194039 12724660 11382214 10577918 11323357 11674993 12197397 11934233 11582212
6417 11582212 12292245 12018455 11181103 12110356 11917246 11428894 10829762 10800378 10485998 10041923
6407 10041923 10714932 10952213 12011648 11538839 10437472 10328399 11355950 11790668 10487787
6398 10487787 10699359 10503986 11075154 12134025 12174583 11351064 12410575 13058078 12647911
6389 12647911 12184910 12395050 12361216 11648012 11796911 11426605 11114255 12151636 12518311
6380 12518311 11582632 11116735 10564839 10111874 10875400 11601185 12395788 11912685 11989521 11511749
6370 11511749 10817244 10898038 11075272 12337154 11350490 10984741 10660562 10440366 12357268
6361 12357268 11978102 11791889 12122911 11676917 11847971 11218525 11908283 12403111 11060868
6352 11060868 11553753 12965561 12762851 11631176 11482159 11579752 11801801 11819302 11047394
6343 11047394 11793424 11633093 11862929 12296960 13023853 12676968 12576598 13062597 12036591
6334 12036591 11100544 11602758 12401454 13024315 12204210 13226403 13949632 12616017 12660816
6325 12660816 14041113 13417290 13361773 13687221 14250133 14374640 14489705 12932193 12889493
6316 12889493 13438826 13393730 12854510 13737599 14735640 14600901 14503857 14081609 14589002 13541539
6306 13541539 13539440 13933507 13651704 13756749 15097760 15114193 16493275 15821280 15710216 15808834
6296 15808834 14280460 14370109 15123080 14403006 14647832 13655110 13742909 15230193 15190245 14403620
6286 14403620 15832741 16935834 16178820 14770210 14854313 15172171 15276270 15111204 15358684
6277 15358684 15964720 15879273 16417913 16703709 17009325 16601046 15549258 16521725 17147101
6268 17147101 16949424 16895279 17741122 18823846 17883947 17033999 17415114 17070516 16789629
6259 16789629 17934198 17438117 17537142 17713310 18231745 17728736 18435774 17761742 17650048
6250 17650048 18289365 18377822 18028634 18336120 18628329 17648485 17564056 18475158 18506790 17090122
6240 17090122 17750784 18416376 18356500 18927846 19386918 19391882 18153629 18227596 19511496 19426972
6230 19426972 20188701 20346185 20266940 19658340 18354041 18777371 20086055 19812087 20095626
6221 20095626 20435601 19712731 19543234 19232961 19664241 20214756 20417264 21243380 22130066
6212 22130066 21629418 20931387 21019282 19991234 20636366 20534278 20930848 21884576 21685481
6203 21685481 22599243 22383579 21845272 21898019 21080651 21238853 21110168 20909272 20619172 21314117
6193 21314117 22094888 22279030 22925467 21990936 22928078 22674750 22925593 22593668 22968695
6184 22968695 23309762 21988148 22387632 23199108 23222050 23527010 23381684 23824789 23327015
6175 23327015 23579944 23785030 23871849 24543925 24965407 25599371 24871755 24665068 24865842 25306853
6165 25306853 24520637 24234206 25706580 25793806 24896143 25242359 26162939 26393076 26857463
6156 26857463 26748628 27015780 27720238 28740249 28851164 27992566 28881912 28535935 28357675
6147 28357675 29123719 29625421 28457459 29065480 29852679 30900241 30226869 30828840 30767086
6138 30767086 30395795 30280852 29745363 30255342 30931245 30855878 30256520 30951324 31548107 31775543
6128 31775543 32118273 32966236 32783195 32195148 30806616 31900637 33304982 32979836 33086521
6119 33086521 32734237 31775972 32190380 33049635 33338542 33116989 32662209 32222531 32612315
6110 32612315 32681516 32053828 32597982 33722788 33387185 32676266 33360588 34611974 34092782
6101 34092782 33412616 34123299 33697065 33051123 35184713 35092483 35036013 35650264 34822408 35638980
6091 35638980 34856348 33934476 34383224 34746926 35226027 35563628 35627886 36576560 36258225 36539488
6081 36539488 36893473 36770540 36978888 36306083 38119663 38993533 39060221 38703924 38902551
6072 38902551 39965780 40365562 40945906 41146713 41828702 41456312 41929786 42293498 42036329
6063 42036329 42817475 43741660 43494088 43615545 43721998 43288788 43963971 43348114 43408953 43359397
6053 43359397 43251245 43140848 42727902 43030738 42964960 43330933 44024422 44039529 43633482 43729569
6043 43729569 44459203 43650298 43421735 44084103 44743145 44979568 43989531 43359786 43489318
6034 43489318 42101348 44267842 46374906 46365629 45651944 44556474 45064151 46036321 45118610
6025 45118610 44702607 44247863 44138774 42762388 42965914 43670646 43571272 44712652 44152257
6016 44152257 43822242 43808890 44066749 43998060 43739677 43531838 45114695 44684495 45774176
6007 45774176 45724551 45018345 44873553 44140963 44134646 45763055 45532425 45177564 44112927 44306480
5997 44306480 44503451 44927825 44856062 44651706 44479576 44665749 44773091 43530321 43429691
5988 43429691 42956504 42646440 41843415 42214692 43330912 42544648 42370888 42772515 42289235
5979 42289235 41033264 40029660 39989557 40261905 39913174 39792515 39773830 40022772 39242912
5970 39242912 39925421 40277618 39210330 38965777 38816237 38943629 39292126 39500560 38714689
5961 38714689 37761798 38887475 39139351 38553384 39442507 39066786 39285159 40033077 39581587
5952 39581587 38697610 38842942 38918278 39136740 37064673 37641949 38321142 38000170 38571476
5943 38571476 38236291 37763882 37492226 38649358 38655026 39005077 38967002 38410520 38490561 38330264
5933 38330264 38967855 37237188 36408934 37296033 37319212 37075099 37436027 38639944 37657198
5924 37657198 37144729 36383503 35651165 37148755 36904443 36756221 36249310 37749208 37178060
5915 37178060 36317009 36937403 37698402 36481148 35864586 36523738 37150513 36690867 36340488
5906 36340488 36147265 36220053 36048097 36174564 35653769 35496769 36801884 36606106 35705060
5897 35705060 35451640 35506021 35645672 36365541 35174621 34349799 35085690 34374100 34939022
5888 34939022 36582772 36226268 36860226 35740359 35840837 36191629 35158361 35701318 35848823
5879 35848823 35768359 34878248 35900651 35497283 35133355 35872759 35600641 35423203 34977154
5870 34977154 35459314 36337203 35979197 35037289 35235973 34954998 35181384 34908260 34605183
5861 34605183 33786348 33671014 33652344 34444953 34502363 35969027 35891295 34771943 34965087 35251291
5851 35251291 35127973 35267365 34827737 35215619 35671717 35839865 36267685 35953320 35877983 35723694
5841 35723694 35998769 36538681 36415856 36513887 35212632 35177452 35598985 36132697 35356133 34635293
5831 34635293 35410879 35494951 36375833 36072413 35854845 36013925 36170701 35496185 35611434 36355897
5821 36355897 37146385 37461117 38316293 38245883 37974409 37739031 38557249 38971794 39089998 39476972
5811 39476972 39163258 38655219 38744685 39698098 38762552 39483945 38783756 39746349 40529946 40093817
5801 40093817 40235463 39308409 39514297 41052702 41369804 41789782 41268032 41414096 42630799
5792 42630799 42549503 42912458 42681143 43277113 43435681 43235892 42164652 42174587 43857799 45295987
5782 45295987 44517255 45507464 46397021 45486738 45487319 46933303 47059385 46701989 46238470 46388041
5772 46388041 47836009 47532097 46602375 46512281 48052243 49119330 49884295 50849415 52154093
5763 52154093 52482978 53731556 55170911 55905712 56405184 55956621 56726066 58289381 59699716
5754 59699716 60483083 62701735 65263802 66785527 69964720 71581470 73975501 76159173
5746 76159173 76106839 77114872 77792015 76348214 73497738 72153062 71128385 70264565 70490157
5737 70490157 71315751 72048736 71575141 72063481 72092024 72551673 74673850 76964837 78481025
5728 78481025 79966890 81532408 82812821 85902997 89523266 92422924 95677314 100189646
5720 100189646 105103728 110701444 117319257 124503427 130665182 135986200 137720642 136736792
5712 136736792 133008195 125839073 118463928 113591022 108599921 105064622 103696505 102132742
5704 102132742 100618390 100590749 99604868 100973841 101179826 101263277 103605715 104231617 105096401
5695 105096401 107094295 108363815 109375907 111450743 114502642 117125165 120161138 124650842
5687 124650842 129397283 134482272 141096353 147427415 151101545 151782059 149074885 144016009
5679 144016009 135059727 126176276 120018211 115070404 110878341 107595697 104128082 99790475
5671 99790475 97471960 96627628 96099362 94882080 93641486 91894001 91404394 90957496 90275273
5662 90275273 90211161 89851799 89568545 90855325 91620392 92155266 92543548 94864295 97480864
5653 97480864 98103415 99717006 100753181 100688945 98500556 96946781 92838764 89732116 88264694
5644 88264694 86691904 84986370 83697028 81857603 81033212 80136798 79705826 79441909 78978712
5635 78978712 78730953 77856623 77282655 76870752 76497910 75821527 75648091 74561520 74364417
5626 74364417 75147326 75366507 74980193 74230987 74389323 73872608 75527462 74779709 74382008
5617 74382008 74065533 75109314 74910023 74770458 74703614 74384790 74679709 75363479 75093176
5608 75093176 75194056 74778265 74415064 74870412 74601084 74466708 74673815 74755693 74853254 74251596
5598 74251596 73600513 74771166 74636248 74257997 73529851 74043966 74407597 75198562 75497108
5589 75497108 75643444 76015675 76319831 76067438 75490025 76491266 77187058 78028262 79275261
5580 79275261 78204755 77801765 77935031 77493206 77114977 77227075 77625515 77426958 76463456
5571 76463456 77544570 77263338 77109958 77135113 78079545 78630035 78085742 78024927 79677380
5562 79677380 79860941 79524579 79879094 80617460 81469630 80981205 80915096 81822872 82207536 82276934
5552 82276934 82686870 82678146 82975676 81437927 81376995 82345588 81888912 82862140 82286215 82260425
5542 82260425 83141717 82937225 82090277 82744096 82670836 82205315 81834210 81690449 81205990 80232911
5532 80232911 81433747 81024601 80432876 79285507 80170752 81021804 82157994 82416680 81255271
5523 81255271 80297512 80443107 81172543 80560057 80683939 81182338 81803150 81619521 81170771
5514 81170771 81169216 81172321 80607439 79719877 79956299 80647564 80172062 79806878 79714731 80493499
5504 80493499 80438411 81976654 82868169 82642950 81649815 80833252 81559716 81461325 81178011 81740471
5494 81740471 83174982 84096321 83813030 83154816 83967892 85554733 86720678 87360098 88153609
5485 88153609 89244154 90096226 91196977 92146639 94428238 96319944 99381424 100822988
5477 100822988 102963324 106939719 110645477 114728380 117281990 118361942 116171903 112592959
5469 112592959 108828488 103195353 98856689 96052867 93423560 90761161 87746552 86300828
5461 86300828 85448893 83685569 82576871 82754401 82652996 81588747 80410635 79625610 78883926
5452 78883926 79785119 79886613 77517221 76590204 77658020 77029793 76313345 76571686 76241145
5443 76241145 75226869 76294542 75969703 75970340 75046348 74121427 75139224 75119828 73644245
5434 73644245 74165975 74608022 74764245 74616338 74323906 73953397 73419689 72831402 73005680
5425 73005680 72996580 72802683 72226350 71563492 70761288 71227066 71938943 71711610 71554222 71152722
5415 71152722 71253882 71444697 71932435 71774034 70073331 68802942 69609737 69910217 69311131
5406 69311131 69353408 69176445 68763533 68169081 67243802 66766074 67284987 66965189 66979199 66951062
5396 66951062 66388179 67102770 68214378 69368923 68360044 67889227 67032072 66559616 67730853
5387 67730853 68123938 67778412 67473256 67184591 67688975 68007073 67253817 66800428 66378927
5378 66378927 67313682 66071846 66040043 66877283 67889521 66846199 66801765 66796758 65922460 65650433
5368 65650433 65504321 66510092 66415953 67494159 66954788 66341643 65330151 65952218 65693008
5359 65693008 65904916 66283192 66872775 67121933 67614524 67848559 67435110 66686817 66098143
5350 66098143 66561462 66363639 66866608 67082011 66611090 65941678 65466533 65324754 64591811
5341 64591811 64956261 65352836 65231892 64091443 63159654 63370897 63583039 63281022 63264928
5332 63264928 61922280 61718141 62622036 62786534 63223546 61958989 61746589 61396319 62040276
5323 62040276 62308392 61640536 61301075 62635482 62430216 61327698 61335691 60792995 61946365
5314 61946365 62229771 62659835 61651706 62145496 62079796 62287647 62833669 62505149 61913319
5305 61913319 62367500 62249493 61736115 61936397 63006314 63323554 63740824 63374626 62423067
5296 62423067 61496752 63323382 63080252 62511771 62515158 63288470 63903124 63522202 63938210 64457115
5286 64457115 64791991 64102873 64478427 64306154 64882498 63525110 63024556 63768400 64297416
5277 64297416 63768129 64698186 64270756 64573067 65059466 64486625 65092461 64754388 63794795
5268 63794795 62537869 62881618 63655149 64657747 65625034 64643270 65088727 65719663 65894360
5259 65894360 65773217 65483372 65390249 65376863 65553702 65402619 65889949 66711330 65933337 66902819
5249 66902819 66696366 67976307 67542644 67172759 65699879 64971238 66181652 65122342 64174234
5240 64174234 64960247 66250622 66166582 65793153 65764365 64866321 64964280 65300807 65332774 65197022
5230 65197022 65130315 64728974 65312864 65706227 65084880 64417204 64102321 64910725 65535178 64488057
5220 64488057 64279275 64480134 64776774 65064359 64707775 64615072 64744117 64538436 64820592 64852856
5210 64852856 63978405 64334495 63897893 65008527 64943002 63654882 64256967 64939718 63865947
5201 63865947 63453335 64235176 63605064 64084154 64830789 63816157 64565861 65410975 65001929
5192 65001929 64018930 63336488 63204080 63412373 63021941 63361457 64837294 65733094 65570939
5183 65570939 64980402 65178248 64989700 65157424 65168736 64494895 64869159 64325442 65324022 65628480
5173 65628480 64128742 64905884 64800473 65472337 66074478 65749025 66904690 66611080 65368007
5164 65368007 65316455 66512403 66626940 66714415 67267484 66922610 66389735 66849049 67016666 68419846
5154 68419846 68625360 68368744 67507853 67132293 67992722 68185897 68048135 67839232 66733574
5145 66733574 68030096 66983603 67817781 69161001 69430254 68671492 68604068 68466203 68326350
5136 68326350 68453708 68415525 68503086 68993795 69295467 68974003 68848524 69071277 69892136 69622434
5126 69622434 69498358 70496006 70346205 68661044 68565536 69101963 69811010 71232565 71871349
5117 71871349 70321718 71019436 70844388 70613124 69774021 70021125 70644382 70273780 70322873
5108 70322873 70265238 71418859 71640233 71668333 70597156 70381657 71059207 70567104 70555808 70590019
5098 70590019 70900978 70896430 71340964 71832461 71651572 70415491 71338753 72408635 72928096
5089 72928096 73779691 74183734 73007260 73490734 73264676 74527466 75151424 74550172 74081671
5080 74081671 74188028 75154668 75213989 74955671 74593199 75125624 74832408 76069193 76223992
5071 76223992 75313983 76051343 76507317 76548842 76305410 77652294 78616143 79064565 78116894
5062 78116894 78564841 78490944 78941884 79401210 79915019 81083149 81871796 81797689 81841194 79647430
5052 79647430 80175599 82742887 82948031 83652056 84610780 83901742 82967682 84032482 84608911
5043 84608911 84282429 84636523 85736455 85546737 85944824 84822357 85525529 86694005 86823471
5034 86823471 87795070 88453609 88018235 88152844 88505915 89114309 89434891 90055376 89475943
5025 89475943 88685961 88690622 88984316 88463531 89320081 89503183 89410756 90131331 90357222 90641112
5015 90641112 92548140 92944495 92238642 92297713 93118238 93614117 93229032 92842216 92281768
5006 92281768 92912305 93243465 93209319 93132755 94169587 95027742 95715831 95639088 95093095 95148069
4996 95148069 96038175 96256972 96332330 97506902 97353821 98270912 98987657 98540083 99150232
4987 99150232 99556058 100490874 100546031 100025543 100706631 100649006 101492633 102488990 102964573 103537048
4977 103537048 104111701 104303139 104202586 104713614 105630644 105391149 106472229 106369203 106416548
4968 106416548 107751781 107278882 107294784 107722949 108720149 108313642 108506778 110625627 111153658
4959 111153658 110463115 111848668 111671869 112418876 113794552 113398493 113004869 113016189 114413614
4950 114413614 115191011 115094849 115294950 116554969 116771293 117214830 118183042 118671837 118715687
4941 118715687 119209875 119708168 121492149 122414237 123455323 124298088 124050179 123863193 125410146
4932 125410146 127023185 127872007 128936707 130682933 132106314 131593128 131951628 132723362 134993169
4923 134993169 134877575 135528741 136854559 136760145 137654103 138055907 137349080 137083070 137316757
4914 137316757 137743601 137367692 136417336 136019628 136830670 136948512 136623978 137628752 136714280
4905 136714280 134812008 135710828 135746466 134207226 133765670 133789441 134185785 133562721 133969178
4896 133969178 134585914 133939952 133331090 134257338 133569684 134154480 133812974 132586795 133940108
4887 133940108 134083458 134237040 134222436 134203222 134704344 135705229 135779929 134607528 135359496
4878 135359496 136558487 137336972 138290862 138168667 138404835 138666671 140125397 140430839 140933491
4869 140933491 142251228 142851401 142978812 143895963 144777838 146205631 146306656 147107470 147955836
4860 147955836 147342585 148318232 149800356 149771110 149205999 149229624 150335683 150544734 149971489
4851 149971489 149521714 149206029 149218669 147960994 147503189 146738736 146105208 145931344 145879909
4842 145879909 146767498 145295257 144955079 143704034 143077564 142659611 141910766 140986693 140044503
4833 140044503 138201086 136172779 134884055 135329197 134212249 130864768 129933546 129732173
4825 129732173 128781472 126419439 126062758 124624077 123729022 121838335 120624915 119851632 117814739
4816 117814739 115514573 115862533 115667269 113922588 111967457 110271496 109410690 109661906 108535159
4807 108535159 107974243 106725335 105582310 105017449 104301613 103636594 102821452 102042972 100833142
4798 100833142 99749275 99697765 98845343 98747006 97754781 96946369 96321026 95342853 95636879
4789 95636879 94863406 94607036 93948401 93730132 92266653 93083205 93262853 93057763 92137462
4780 92137462 91891195 92177213 91318666 90445052 90798264 91023644 90465393 89546070 88591597
4771 88591597 89236483 89602045 89384413 90462650 90896063 89978930 89535545 88374515 88716049
4762 88716049 89240401 89217509 89179080 88109145 87157719 87268510 87123494 87448540 87001428 86180531
4752 86180531 86850450 88584730 88662941 88439438 89017787 89545839 89924456 89799974 90250372
4743 90250372 89648421 89426892 89079814 89506867 89914551 90058399 90235055 89267093 89895454
4734 89895454 90586772 90145781 90840237 91410290 90710592 91584053 92156311 92111611 91390779 91431841
4724 91431841 92390179 92598770 93103463 93887568 92924063 92152835 92795776 94186705 94053462
4715 94053462 93600832 94333381 94917820 96127818 96722814 96733962 97720276 98811583 98473673
4706 98473673 98767821 98957420 99681639 100179604 100829981 102082822 102597970 102701511 103385939
4697 103385939 102828549 102646170 103477882 102606302 102602894 102987022 102812405 103202026 103578520 103137697
4687 103137697 104836454 104604811 104045748 104863791 106631326 107540893 108374850 109024301 110015564
4678 110015564 110757299 111898817 113436438 112531275 114026154 115569396 116324733 116920285 118571408
4669 118571408 119845450 121780357 122922673 124104495 126365879 127365862 128836192 131011854
4661 131011854 132373629 134632622 135971874 137149069 138754891 140174158 140604135 141657673
4653 141657673 141767836 140526460 139398595 138265523 136611717 135256464 132827144 131813672
4645 131813672 131156610 129238975 126446639 125477307 125546577 124892682 125314450 124781447 124233105
4636 124233105 124651553 124966631 125618023 126026013 126975532 127375795 126806060 128172391 128956122
4627 128956122 128289966 127825310 128051247 128670050 129121387 130229260 130943459 132266145 134143340
4618 134143340 134355511 134364184 134236575 134835365 135132403 134799138 134513828 134368562 135446000
4609 135446000 136601243 136223803 136282682 135724938 135977524 135555331 135546873 136386891 135289937
4600 135289937 134919478 134635809 133748534 133222876 132875222 132868611 132857674 132217386 129202295 127993217
4590 127993217 128215655 128067779 126769124 124779992 124081833 124397839 124254383 123652173 124208431
4581 124208431 123347606 121597186 120685479 120115133 118515845 117529419 116748647 114926100 114170029
4572 114170029 113506378 113408203 111639353 110547084 108544548 107010261 106898101 106045738 105839825
4563 105839825 105154864 104533049 103902148 102564468 101805869 100926952 100401735 99336807 98129872
4554 98129872 97498010 96969110 96817790 95849187 94982908 94489731 93937495 93978804 92727612
4545 92727612 91847403 90725341 90871488 90999606 89403368 88223839 89157607 87803448 86967635
4536 86967635 87273926 86188428 86797585 85670958 84980756 84567880 84018367 83840991 83828640
4527 83828640 83767951 81799461 81715323 82053012 81464290 81711590 81139574 81109742 80922335 79829882
4517 79829882 79098208 79389457 80304963 80006347 80147831 79984327 79117447 79022609 78565358 78861288
4507 78861288 79273438 79149800 78273602 79912932 79424964 79038629 79846859 79571744 78531245
4498 78531245 77834052 77444925 76520954 76123758 76044498 75852462 75987548 75298428 74351985 73693763
4488 73693763 73608874 73202137 72303005 72511618 72655643 72487339 71741172 71704074 71666927 70939386
4478 70939386 70855350 70420148 71843924 72056010 71589245 71074028 70108731 69696294 69318768
4469 69318768 69119933 69298560 68599866 69164034 69797108 70090833 68889492 68728428 67496448
4460 67496448 67863787 68045680 68277087 69483329 68579278 67813062 67939907 67443741 67608155
4451 67608155 67433921 67025498 67379182 67505148 67503105 67386029 67597318 66712034 66805894 66966697
4441 66966697 66925592 67169505 67313930 66263980 66558588 65913419 66124916 66356575 65823799
4432 65823799 65261382 66505359 66631396 66355725 66337497 67060878 67009079 67421530 66567267 65629528
4422 65629528 67537994 68904663 66836441 66141385 66075708 67329767 66548904 64269830 64700217
4413 64700217 65698507 64631309 65109769 66566445 65284140 65770208 65908566 64596297 65032273
4404 65032273 65248481 64368044 65248956 64864695 64587136 66217185 66078355 65470184 65392478
4395 65392478 65328800 63906029 62961362 64058735 64276865 64669912 64363867 64492356 63634230
4386 63634230 63351424 63437678 63873923 63668245 64316972 63573179 62606469 62767892 62996947 63293153
4376 63293153 62507020 62802404 62873024 63113724 63005799 63356313 63104209 62316674 63058182 62001868
4366 62001868 62692737 63658743 65222773 65525036 64711012 65524598 65779764 66310207 65817862
4357 65817862 65740797 65032179 65796583 66731084 67428795 67819577 68120041 67879317 68031339 68573470
4347 68573470 67938655 67169336 66428020 65908655 65728516 65115065 65216095 65405720 66026383
4338 66026383 66079278 65552134 64228540 64745389 64299164 64115586 63534970 63613641 65077405
4329 65077405 63956088 64652632 64135192 63192757 63621305 63418297 63575294 63583429 62250463
4320 62250463 63182215 62933274 63877450 63749203 64064093 64723106 64569681 64719727 65110473
4311 65110473 64863376 64496100 65579042 65240819 64654560 64660729 65039797 65082132 63162975 63258557
4301 63258557 64384576 65112492 64895780 64211292 63560059 63232473 63013673 61356136 61310711
4292 61310711 62081155 62318621 62768373 62350043 61791364 60922090 60488598 60505352 59057533
4283 59057533 58771553 58743561 58699433 58102964 57659887 56816944 56723661 56591530 56826935 56198387
4273 56198387 55539414 55203311 54640453 55609383 57093214 55803382 54840866 54579175 53927578
4264 53927578 53509544 53946031 54264463 54219909 54192471 53962743 54256586 53238477 53358367 52648233
4254 52648233 52305759 52300100 52105449 52138424 51678789 51394503 50696021 50599614 50681461 52056839
4244 52056839 51689858 50684002 51590773 50376121 49970577 49864599 50142439 50074950 50728894
4235 50728894 50891102 49782776 50431082 51025156 50155267 49907605 49702984 49144255 49092893
4226 49092893 48843802 49056736 49927607 49837172 49446656 50558849 50266792 49368976 48792239
4217 48792239 47379834 47910319 48352019 47881537 47647153 46904010 47144136 47948644 47472005
4208 47472005 47886134 47535377 48681584 48182493 47987661 48233926 47663607 47293539 46232987
4199 46232987 46345451 46676513 48440701 47505162 46027482 45802766 45591888 45226142 45479267
4190 45479267 45430549 46014067 46163674 45750818 46223800 45553803 45793705 45794083 46430243 46519223
4180 46519223 46177133 46331539 45344387 45308585 44747188 46013243 45609066 44911173 45112327
4171 45112327 45595176 44877002 44387725 44447798 44825205 43592532 43720310 44262719 45013130
4162 45013130 44618996 45607744 45755246 45565166 45261032 43972822 44010669 44141803 44125893 43295305
4152 43295305 43257712 43776550 44528470 42958034 43650712 43173583 43125758 43172337 42892483 43069131
4142 43069131 43514267 43139834 43623344 44025967 43470263 43546095 42553015 43078852 42943589 41935529
4132 41935529 42570926 42852088 41870414 42726258 42206388 41568576 41666204 42498696 42601764 41852844
4122 41852844 43307263 43040384 42309232 40222468 39556110 39924571 40396525 40856756 40196501
4113 40196501 39117625 38943848 39915913 40271440 39655884 39728392 39871171 39935998 38852873
4104 38852873 39062111 39085094 39486893 39626817 38814000 38921175 39398183 39983826 40003715 39827473
4094 39827473 39016897 38373694 37652129 38510867 38302296 38042999 38439167 38563325 38255927
4085 38255927 37019847 39293678 38656471 37762650 36788605 37817257 37520510 37087902 37946050
4076 37946050 38007312 38067139 37503022 37146160 36521080 36699676 36929338 37781992 37882358 37616804
4066 37616804 37021665 37254874 36657978 38652129 38596734 37712923 37119921 36724275 36564299
4057 36564299 37063010 36835324 36281227 36382031 37232693 37589610 37379814 37928933 38086567
4048 38086567 38284838 37173586 36612017 37214472 36844706 36631002 36814326 37900958 37283271
4039 37283271 37505092 37676412 37920842 37195878 37243852 37793865 37975407 37008695 36484826 37178172
4029 37178172 36265576 36710797 36336786 35860899 35592493 35698692 36274369 35745807 35716346 36199260
4019 36199260 35904214 35536041 35711608 35633314 35692153 34966238 34143963 34734658 34542648 34911885
4009 34911885 34502898 34501448 35181912 35780174 35312080 35866749 36458434 37024178 35687260 35043849
3999 35043849 35334305 35926615 36504764 35269459 34620077 34930484 34695873 34413600 33873429
3990 33873429 33251557 33095319 33406346 33884389 33728281 34438085 34228791 34160618 33802882 33160092
3980 33160092 34012995 34097850 33771125 34131645 33333770 33111266 33199215 33184490 32953976 33949754
3970 33949754 34214514 34890872 34346089 33261094 33154045 31497632 32172560 33190704 33689445
3961 33689445 32839888 32770129 32716673 32969414 33017069 33000200 32686940 32408503 32771575 32428159
3951 32428159 32768139 32137967 31293080 31903508 31700505 31640184 32339625 31924192 31996139 31712124
3941 31712124 31247981 32332031 32072364 30375589 30551931 31444696 31581282 31384533 31162769
3932 31162769 30700771 31105805 32105261 31638089 30767948 31347196 31165947 31307534 32774974
3923 32774974 32599838 31411513 31750448 32203491 32249914 30707916 30081132 30289442 29979509
3914 29979509 30629771 30876800 30723788 30308625 29639273 29602398 29103391 29038426 30239861 30511073
3904 30511073 31554989 31961077 30979556 30967087 30648659 31521052 30958353 30256908 31216129
3895 31216129 30289917 29785139 29882230 31333560 30039221 30520634 31299156 31781013 31494328
3886 31494328 30710490 30946592 30732988 30705739 30353620 30925932 30421941 30387681 29981747 29346179
3876 29346179 29985131 29864908 29588953 29597244 29675224 30802397 30664081 30427884 31186837 31387522
3866 31387522 30791482 30953653 31172774 30521353 29400253 30512422 31235417 31395955 31180018
3857 31180018 30756643 31357423 31641927 31334344 31023169 30505838 30238534 29855587 29048795
3848 29048795 29475587 30775356 31690391 32327647 31205225 30440037 31057214 31162010 31759471
3839 31759471 32342562 31528764 30881971 30555573 30991178 31159774 31015333 31127030 30399628
3830 30399628 30310479 31570754 30894827 30342930 30130155 31375349 31217111 30911393 31295529
3821 31295529 31620863 32429349 31666083 31547949 31698772 31473770 30385487 30654563 31966997
3812 31966997 31833433 31615759 32182807 31469278 30341420 30713716 31681368 30878450 30992674
3803 30992674 31992579 32502508 31913022 32456403 32764425 32492665 32809647 33162307 32540189
3794 32540189 32867242 30686039 30994294 31389284 31541331 32928807 32744425 34038023 33574223
3785 33574223 32456939 31794892 31570709 31460884 31499979 32534410 33123848 33561726 34552228
3776 34552228 34149968 33555937 33289933 33130440 32728801 32327732 33078390 33059365 32733557 33607282
3766 33607282 33484616 33827629 33646527 32365579 32173216 32108620 33156116 32638425 32331540
3757 32331540 33111315 33141045 32595297 32115269 32592306 33376599 31633755 31628651 32788305 32571165
3747 32571165 32885367 32907238 33348181 33346441 33031820 33102930 33905180 32521227 33311430 34157042
3737 34157042 34579806 34435212 32981629 32711005 33569820 33514448 32948771 33602906 34479312
3728 34479312 34376207 33895825 34398587 34179746 32996585 32185572 32381865 32109112 32235901
3719 32235901 33063785 32882729 32589858 32328068 31414250 30692473 32032387 32546542 32873012
3710 32873012 33297711 33043348 32289889 31849747 31923474 32165582 32676493 32208416 32746654 32140654
3700 32140654 32261825 32426969 31575367 32172133 31309767 31177011 30995059 30572003 31256787
3691 31256787 31492406 31863858 31964465 32139489 32681428 31861441 30961078 31609872 31132270
3682 31132270 30745971 31406117 31921653 31191349 31103714 31167726 30896181 31138881 31309457 30759418
3672 30759418 30700692 30599717 29826670 30318979 30264923 29884751 30813459 30503484 30825745 31706916
3662 31706916 32293546 31699905 32077556 31820288 31842837 31846915 30474035 31710167 32020728 31754973
3652 31754973 31856124 31523859 32597752 32461333 31813107 32221894 30789541 30855038 31783453
3643 31783453 32598141 32782499 30852847 30933569 31883792 31351350 32145377 31781864 30538930
3634 30538930 30749811 30910681 31464442 32361514 33760041 32973511 32887484 33346118 32699888
3625 32699888 33191482 33478454 32699163 33080812 33003088 32603755 33485316 32361720 32037729
3616 32037729 32638068 33764036 33143651 33608462 33414740 33983298 34162626 33859171 34594372
3607 34594372 34949774 35725768 35632622 34585329 35106076 34461995 35606417 36362925 34815521
3598 34815521 34018950 34783474 35523486 35792361 35515699 36362380 36606526 36382467 36443090 36656404
3588 36656404 38336565 38102958 37523971 37819982 38234337 38622439 38335849 38506105 38871260
3579 38871260 39455706 39137545 39273908 40075239 40141972 39869263 40112439 40850569 40413488 41427561
3569 41427561 41352581 41375435 40827804 41492919 41032372 41900155 41399633 42228247 43418011 43415329
3559 43415329 43627506 43536185 43348385 44099728 43787809 44461087 45642864 46190430 45814720
3550 45814720 45170426 45792141 46044969 46446383 47512428 47511121 47819271 48782927 48922023 49100860
3540 49100860 49148994 50163303 50672302 50462110 50891006 51378528 51181622 51881857 53567393
3531 53567393 54035650 54526400 56192374 56683549 56371590 57655570 58593861 58549529 59811661
3522 59811661 60250651 61132498 61892524 62049418 61875841 62680684 64418096 64908229 64719522
3513 64719522 66132098 68632695 69528584 70091295 71155880 71842691 71990307 72894528 74366362
3504 74366362 77314445 80007133 81683262 81519931 83788719 86796054 89460173 91414628
3496 91414628 92946920 96286463 99183762 102703178 105976631 110381765 115627672 121725811
3488 121725811 127018707 134468361 142659011 151288292 159484232 167344009 172728445 175032024
3480 175032024 172567106 167385124 161702073 157484032 154893616 154647791 154138869 154458125
3472 154458125 154867666 153808441 153825655 154506742 154841668 154252592 153473769 154393654 153146348
3463 153146348 153787223 156533945 157336180 160076090 162432274 166309303 171595043 179186368
3455 179186368 188208437 197966004 210066167 222244432 230817865 232766958 228436720 216101266
3447 216101266 196505377 177393972 162758431 151901803 142974611 136472223 129900063
3440 129900063 124569771 120479208 117090252 114019168 111778343 110236707 109273502 107414233
3432 107414233 106484668 106727764 106624490 107251969 107925470 109819781 111818536 113360368 116650464
3423 116650464 120613691 126360032 131966260 136363571 139750565 139578238 136724465 129649515
3415 129649515 120787135 112000581 104509433 98879516 93552705 89897238 87077973 82348661
3407 82348661 80085839 78243829 76262652 74832041 74892076 72984127 69655414 68729789 67501389
3398 67501389 67175396 66412651 64978693 64903600 64270904 63669910 62613636 61511987 60892112
3389 60892112 59979846 60577593 59594476 58876180 57379320 56747951 56401393 55794674 54968104
3380 54968104 53794005 54552141 55562038 54478818 54124788 52642237 51966401 51371880 51034719
3371 51034719 50824758 49599930 49187250 48907136 48884403 48304643 48879520 49745126 49575517
3362 49575517 49648020 48737728 47523933 47342529 47069351 46872179 47523252 47671247 46570771
3353 46570771 45698351 45892693 45948071 45017144 44615544 44871985 45984325 44495906 43560301
3344 43560301 43476389 43043978 44367173 44412234 43609777 43769174 43158696 42443033 42603027 42711962
3334 42711962 43917105 43401934 42438833 41784678 42037815 41204679 41620019 41994183 41033315
3325 41033315 40429672 40748656 42019849 40296253 40099039 40222783 40368577 40438239 40595350
3316 40595350 39685246 40223112 39991045 39373121 38741811 38133472 38810285 39047090 39134698 37651617
3306 37651617 37146437 38313669 39505512 39421988 38789976 38291275 38225764 38121152 36229661
3297 36229661 36697492 37149949 36871051 37230237 36911002 37966956 39221236 39096841 38028165
3288 38028165 38658014 37929452 37214398 37610525 37299901 36718711 36639258 36718729 35492702 36369345
3278 36369345 36215960 35496523 36469734 35987863 35546060 36513195 35850441 36301442 36219769 36144080
3268 36144080 35784345 35907470 35303377 34545308 35112926 35121279 34582217 34463334 34134892 33628068
3258 33628068 34473039 35034416 35357131 33723791 33575143 32951531 33065727 33948079 35313708
3249 35313708 34371691 33477613 32860540 34095198 34743487 33866202 34339244 34163506 34919354
3240 34919354 33981815 33172937 33403726 32898664 33407814 35323539 35692673 36061956 35724956
3231 35724956 34303764 35553867 35505757 35006304 35032244 34280152 34061302 34998913 34233648
3222 34233648 34365485 34467690 34265778 33934813 34232126 33600789 33380721 34712631 34674728
3213 34674728 35097710 34474525 35433417 34838522 33803512 34929792 35512893 34990332 35211439
3204 35211439 34818830 34859296 34816563 35646220 35941149 35633617 36327782 36210994 36254550 36435391
3194 36435391 36638407 36273514 36313190 36376910 35872197 37651159 37527963 37113022 37652431 36693519
3184 36693519 36730370 37044463 38000169 38504244 39157472 38282006 37554319 38867574 39488130
3175 39488130 39815948 40316921 40448552 40857882 41380104 41215816 41237725 40876854 40880957 42022610
3165 42022610 42265145 42080468 42441899 42795420 42835838 42112843 42656762 43667975 45608373
3156 45608373 45201281 45343917 45764976 45423014 45425825 45645359 46359233 46303594 47030185 47496980
3146 47496980 47430922 46996711 47443672 46889180 46912183 48215677 49293032 50151856 49442392
3137 49442392 49515280 50994635 51324987 51178152 52119445 51647192 51361746 50938230 51201438
3128 51201438 50507167 50507118 50760148 50549992 51559776 50680889 50471477 51212417 52239521 51289676
3118 51289676 50805552 51240085 50794009 51119001 51898858 51802401 51542802 51465336 52681813 52172152
3108 52172152 51258976 51403480 51496684 52099257 52374135 53361056 52875157 51856004 50792631
3099 50792631 50087378 50539620 50642301 50269150 49120837 49008925 48443167 48302547 48590641
3090 48590641 49334857 49179124 49340244 49074809 48614302 49085333 48810981 48980600 48158438
3081 48158438 47229251 46534525 46566683 47593407 47849200 46746518 45278614 44902675 46111982
3072 46111982 46378808 45518106 45825107 44913876 44972034 45854952 45019286 44467972 43974000 41988272
3062 41988272 42403118 42795867 42425361 42815654 43282854 44034263 44048610 43576777 43466949 43632239
3052 43632239 43345271 43043042 43318840 43912087 43417005 42937112 41652520 41142282 42970167
3043 42970167 42510521 41997176 42266513 42243333 41634861 41916615 41153288 40525275 40392241 39000505
3033 39000505 38927009 39089764 40102651 39554737 37860926 38233327 37969283 37217184 36605382
3024 36605382 35991921 37070590 35879046 35439310 35466912 35180405 34884002 34615743 34269296
3015 34269296 35110949 35292920 34856648 35537501 34753164 33691211 34374302 33898972 32905675
3006 32905675 32221241 31972304 31459538 31796347 31314190 31499877 31351950 31010212 30997427 31148717
2996 31148717 31668998 31420379 30312464 31090375 29893232 30025041 30475336 30555122 30811861
2987 30811861 29369423 28305531 28265083 28295619 27154658 27864986 28221148 28161088 27481010
2978 27481010 27617627 27337222 27652801 26716650 26749082 26608431 25748086 25253823 26753169
2969 26753169 27204410 26005081 25600941 25354494 25268088 25605230 25865505 25363057 24761100
2960 24761100 23960535 23366752 23131533 23384651 23464754 23843218 23587738 22610104 21900118 22225696
2950 22225696 22698162 22913910 23184128 23611750 23353050 21962723 22536123 23043203 22985459
2941 22985459 22099838 22720733 23129370 22220918 21448963 21778430 21093270 21086898 21133362 20647325
2931 20647325 21250776 21098078 20953181 20245838 20496876 20990879 20971328 20881243 19849309 20119687
2921 20119687 18783832 18354614 19200066 19648487 18900669 18408947 20006106 19803245 19409018
2912 19409018 18405614 19065927 19384909 18269913 17677569 17715735 18478036 17927145 17537013
2903 17537013 17487630 16970963 17718901 17390037 17161090 17265552 17481875 16883814 15455446
2894 15455446 15610600 16566948 15941704 16123867 17082207 16293294 15674297 15199055 14499192
2885 14499192 14655357 14799653 14006463 14456723 15801627 16081401 15855862 16261366 15440870
2876 15440870 14153039 14753529 15856736 16269495 14900511 14474127 14399218 13704645 14599942
2867 14599942 14040336 13100547 13530347 12957528 12878865 12924218 12630135 12617177 13380959 13823701
2857 13823701 13699942 13362630 13050201 12648523 12377009 12255252 12149426 12546453 11857582
2848 11857582 12186843 12812890 12808281 12044987 11880132 11661470 11532956 11597484 11264739 12304274
2838 12304274 11691831 11831399 12001148 10981359 10530652 11643771 12030128 11307121 10500169
2829 10500169 10309036 10517215 10379624 9674053 10147929 9802425 10261392 9537686 9829662
2820 9829662 9766107 8702135 9088154 9236721 9040788 9476103 9953810 10187087 10599986 10280334
2810 10280334 9198536 8464844 8384770 7478752 8621046 8748027 8516726 8887378 9613979
2801 9613979 9118303 8549555 9668861 9721371 8680009 8867026 8674710 9021104 9928295
2792 9928295 9351650 8413543 8683351 8232806 8830616 7773271 8150532 8584928 8935626
2783 8935626 8879602 8827949 9034001 8306343 8521570 10391185 9331943 7692053 8458755
2774 8458755 7867652 8477832 8508261 7580167 8072257 7438856 6710582 6510033 7021466 6461574
2764 6461574 5922807 6207248 7544420 8703726 7536844 7352910 7551900 7412604 6954322
2755 6954322 6387460 7087549 7648303 6367341 6204647 5978716 5783754 6660940 7427972
2746 7427972 6863179 6590842 6012724 6013110 5615490 5100446 4354597 4291909 4571865 4740830
2736 4740830 4950738 5415392 5238718 4873206 5066490 5672622 7162594 5765913 5012811
2727 5012811 5802802 6786668 6567880 4975967 4902169 4777852 6143902 6026342 5475503
2718 5475503 4870813 4807592 5537771 4930520 4746475 5411334 4124692 4174216 5289840 5433391
2708 5433391 5125280 5043267 5475220 5738223 4487599 4396733 5187272 4915855 4725017 4338011
2698 4338011 4306782 4492758 4836791 5079560 6273628 5432349 4066332 4567872 3919895
2689 3919895 4873924 5380046 5112255 5903534 4670247 5233705 4684479 4965309 5345937
2680 5345937 4875303 3772404 2886035 3369683 3215356 3419568 3727034 4305280 4517862
2671 4517862 3499314 3614563 4123258 4476116 4299890 3690385 4563672 4925085 5551546
2662 5551546 4623801 3761540 4758202 4217531 4370195 4483400 3841936 3853754 4016248 4743081
2652 4743081 4893169 4336154 4297132 3974627 4421684 4755372 3803830 3847060 3838614 3763861
2642 3763861 3162840 3674118 2649896 2636864 3591526 3642037 3556758 3206785 3619361 3181220
2632 3181220 3291384 3348556 3002184 2608968 3549281 3644698 3334094 3854365 3795483 3654349
2622 3654349 4122381 4897266 4520030 4818062 4476735 4049229 5127912 6053458 6113869 4976565
2612 4976565 3894220 2949725 4100664 3261645 4046424 4052462 4641173 4003658 3829426 4763514
2602 4763514 5008489 6008124 5607960 6059789 5012065 5209859 4701313 4266165 3384248
2593 3384248 3433382 3404168 2913109 3779038 4169921 3310110 2495244 3154642 3772810 3195869
2583 3195869 4095027 3433723 2836286 2955047 3898096 4204186 3899728 3664087 2527204
2574 2527204 1940349 2612794 3282971 3666683 3080143 3353661 2952030 3182963 3446264 3301284
2564 3301284 3446266 4039033 3842066 2219482 3065492 2833755 3405503 3683790 4256542
2555 4256542 3123175 3101099 3708101 3647292 2948493 3830801 3421475 2353420 3068033 3986445
2545 3986445 3485109 3385511 3557124 2918120 3339520 3397835 3264314 2037689 3421620 4426210
2535 4426210 3677713 3621768 2841545 2843957 3339860 3875981 2842986 3404694 3918198 3877521
2525 3877521 2731884 2510001 3444506 2942131 2553149 2355601 2420290 2331573 2910484 3193670
2515 3193670 2835281 3158757 3832409 4311423 4784298 4620479 3443747 3561327 3370339
2506 3370339 2915860 3986773 3662914 4062744 3331569 3040454 1902563 2682234 4646838
2497 4646838 3777923 4281550 4831223 3108850 2218352 3829430 3046834 2352293 2433100
2488 2433100 3093064 4204204 3638788 3901187 2742949 3096319 3949522 4061233 3685568
2479 3685568 3974998 3883574 3705542 4528927 3971130 3348564 3366441 3486737 4645743 4850747
2469 4850747 4465972 3567535 4622825 5250837 4068887 4831368 4514712 4011880 4174101
2460 4174101 4378057 3960832 4383374 5009588 3939220 3571165 3415701 4070881 4277498
2451 4277498 3808053 4275035 5406374 5994544 4858311 4983714 5647536 6264899 6901436
2442 6901436 5741520 5048548 5471423 4900234 4725166 5947689 5633067 5604699 5613769 5536897
2432 5536897 6846164 7953235 6383360 7161870 7278476 6720839 6982741 7491879 7931653
2423 7931653 7462019 7716336 7687950 7698379 8467826 8787862 8342109 8837089 9288767 9340809
2413 9340809 9198750 9471435 10126061 10557012 10217906 9811353 9989873 10001689 10403701 11228780
2403 11228780 11574956 12064557 11324255 11211925 11010770 12024857 12481350 12857865 12363941
2394 12363941 11755848 12729017 13165447 12916360 12895346 13464364 15082071 16214041 16633888
2385 16633888 16738235 17195340 18158433 17540134 18624010 19770703 19535135 20876642 22077652
2376 22077652 23299010 23546210 24142562 25308461 25583215 25914415 27098279 29482489 31938280
2367 31938280 30934113 32036094 33726198 35045634 37218388 38772194 40580761 43821367
2359 43821367 45139272 46850730 50874117 55029512 58746153 63524881 68763105 73960292
2351 73960292 79161552 85840035 92145006 98930715 105733802 111644535 117978208 126992520
2343 126992520 137568033 149973100 164444480 183584163 208740829 238819599 269564849
2336 269564849 302411254 329003045 341934545 344466863 322495468 276656675 226435500
2329 226435500 191303072 167740249 148309700 131845012 118210323 104296850 92941681
2322 92941681 84233152 78201526 72649218 66804539 62660377 59342875 54728647 50370283
2314 50370283 45734159 42051192 38550012 35773318 33164494 32796946 31314680 28729388
2306 28729388 26712787 25061051 23776702 21512361 20224149 18553802 17906525 17251218
2298 17251218 16251292 15508260 14194873 13559447 13122154 13172953 12596016 11098831 10729987
2289 10729987 11686492 11165079 9712183 9161446 8167831 7199082 6533275 6539114 7404873 8239248
2279 8239248 8166224 6331818 6098121 6752926 6202892 5124254 4743586 6238523 5376245
2270 5376245 5328812 4731971 4103989 4227269 3784430 5383330 5361151 4533857 3215064 3343887
2260 3343887 4032186 4511833 3562459 3255853 2638643 3121051 3496413 3388697 2190260
2251 2190260 1565024 1591212 3008062 3647068 3742397 3377163 2830093 3519670 3395853 2610226
2241 2610226 3181441 3000089 1728023 1708359 859778 1516293 2321812 2130979 1896074 2202212
2231 2202212 2201544 2166620 861893 498348 1554896 1324346 1655161 3047250 2923637 2156170
2221 2156170 1477722 2060326 1253495 1995002 1420591 2324120 1829116 1566150 1958959 3052486
2211 3052486 2812557 2325506 1238873 1985678 2461257 2650364 1570509 1315279 2079039
2202 2079039 1960781 1568895 634325 1345576 1741155 2090404 998583 527558 2002680
2193 2002680 2392479 1693655 937592 167899 -97239 -305427 -528972 -46315 558385 1680420
2183 1680420 303435 80524 290536 815668 1570891 1654146 1310104 215478 1479489
2174 1479489 595345 428726 904342 221541 408865 1182516 152165 -35988 635665
2165 635665 1209528 505064 312584 628372 1689460 818302 359961 398871 438320 548219
2155 548219 2127 449325 596669 221850 -329408 -227126 529722 714081 -214961 -1009757
2145 -1009757 -540209 -501782 -319468 -288988 252262 -321160 246500 319841 442297 427800
2135 427800 -63287 60367 1256561 780132 376600 976458 581536 246195 513699 703125
2125 703125 -610832 219673 380847 -108479 236878 793582 1195836 1002978 564189 1018550
2115 1018550 715773 688102 888574 49593 127305 236507 356354 583759 1276739 666885
2105 666885 56364 410803 475032 -114989 -407974 -1529265 -900832 -78564 -637938 -783345
2095 -783345 -236990 -1108093 -138824 1140145 1300906 1722270 1536198 823443 205388 1628505
2085 1628505 1297270 190849 61104 1090823 1116626 621276 1800982 1958701 908780
2076 908780 551983 600887 175024 238142 1703750 1834557 1894692 465821 855393 627402
2066 627402 1056371 1683042 2515557 1360283 913849 1838630 809979 926915 921610 1642910
2056 1642910 984251 1151385 752215 125366 934132 200726 -457552 -382469 -545535 -565356
2046 -565356 491739 1023952 778437 1531817 1235018 546805 -106704 231075 854985 579656
2036 579656 1141641 779138 547290 35891 -376533 -1255750 -522100 355101 -719425 -150756
2026 -150756 -73827 -491486 -272054 -834137 903097 1725036 703237 -57921 -373390 -144281
2016 -144281 -401982 -1123339 -662663 -465311 358224 194498 -488617 -1023857 -652377 -1125353
2006 -1125353 -1508892 -457799 553292 207466 -475727 -453661 -884462 -1133412 -1293694
1997 -1293694 -1851580 -2233088 -1282095 -851843 352182 -221448 -1143929 62588 1730123
1988 1730123 1462441 1459712 1638711 463769 938982 687560 -1397704 -993566 -1444697 -1072818
1978 -1072818 -764089 -605941 -1763060 -1689498 -1283137 432102 619724 -39926 -427593
1969 -427593 208634 97754 -162198 -313705 -1151583 -910560 -920448 -280847 -638478 -724682
1959 -724682 -700908 -1767879 -1220603 -680128 -263924 109680 -1197212 -2387635 -1607589
1950 -1607589 -1437365 -600493 95245 -185662 -1111410 -1062948 -940917 -1530371 -1602793 -1049506
1940 -1049506 -153926 -960650 -621784 -286211 -773625 -435196 -372709 -324788 64706 24548
1930 24548 -24510 78686 -428301 -446666 675941 -32470 5912 -714204 -253936 65610
1920 65610 488744 1163975 682545 -246361 -44715 -351231 -921087 -509840 -185496 -541755
1910 -541755 473054 358301 -452217 -668048 -100850 -1423153 -1563249 -989219 -102015
1901 -102015 -271774 485406 88775 144041 450994 808073 -356062 -1222977 -233341 177143
1891 177143 476916 -722104 -214535 -774757 -1799753 -481599 -655476 -1308486 -1270493
1882 -1270493 -929356 -766270 30392 547642 -169084 276010 -121547 8223 -807499 -919610
1872 -919610 -25865 -1006343 -12616 874528 332691 303957 -732999 -509261 -1043851 -1325895
1862 -1325895 -1436679 -1044622 -858305 -698807 -370588 39001 -731660 -711881 -1527241 -1515017
1852 -1515017 -1089847 -192892 -967056 -864598 -634642 163642 462134 -598141 -530014 -1028251
1842 -1028251 -782580 -446672 -351047 -638646 -287205 -105255 -449504 -907072 -946171 53551
1832 53551 -814207 -625653 -182594 -382857 -1035761 -950228 -17553 1250940 1775650 559648
1822 559648 61385 -694480 -473207 55204 654436 195082 178365 184621 -1119226 -986398
1812 -986398 188664 -580641 -1022973 319573 1326953 403249 49100 -339700 -246824
1803 -246824 -666537 -1122956 -1090193 -1108395 -454565 -989811 -1473398 -1142644 -365111 253101
1793 253101 372382 33589 -319031 -81108 -323331 -1054543 -1410486 -1140190 -951926 -410630
1783 -410630 41602 318830 -548855 -1270508 -246844 -19134 241264 -123593 -20011 -40766
1773 -40766 -479218 -206048 -658388 -340554 -356540 -1223022 -1051015 17312 -997421 -1083647
1763 -1083647 -345313 -998816 -1469551 -1716022 -1759489 -1523807 -878292 -386178 -657438 -486437
1753 -486437 267310 -264977 -371356 -517182 -1281268 -1544524 -755081 -1069277 -823749 -788316
1743 -788316 -1386047 -1047844 -781973 467636 579076 -289016 382124 679225 896691 94539
1733 94539 631616 905253 -383706 -1848385 -1044724 -805880 -344154 89686 -759468 -788300
1723 -788300 -1312078 -2452793 -1335363 -335037 -742174 -384982 -702101 -261071 -576560
1714 -576560 -91439 -107102 458565 -668771 -424357 -591959 -744241 -930508 -1520873 -1720295
1704 -1720295 -1055049 -1296642 -1634394 -777075 -983107 159579 600669 57688 -327810
1695 -327810 287014 -120156 -598482 -379089 -104123 -1058503 -1100327 271091 -585940 -298736
1685 -298736 -304742 -723238 -1261252 -696786 -552266 -542749 -1227010 -1334438 -1694099 -1752965 -1723185
1674 -1723185 -731445 259192 455713 1122604 731310 282940 526395 482568 225477 -969321
1664 -969321 -1289243 -1072020 -739088 376164 772060 896964 268957 162261 -123906 -54412
1654 -54412 -844586 -1395346 -1494379 -397953 -432429 -261619 -1317160 -1598898 -971437 -165286
1644 -165286 -734126 415926 1095355 533301 88686 669290 388180 -418 632633 -245199
1634 -245199 -1435153 -499107 -96952 -79371 732809 58156 -358803 941240 576171 -125217
1624 -125217 370846 241739 909133 76470 654220 -137289 -1407057 -1562312 -115474
1615 -115474 -5469 -553294 -705205 -422628 -925956 -1014061 -691857 -398153 -127797 -371112
1605 -371112 -779356 -1212434 -141230 1062244 141289 -798837 -1432644 -764205 -798843 -741527
1595 -741527 23999 -239205 -266543 -457332 137831 40301 157608 -233728 -370176 -289355
1585 -289355 641478 670681 525813 -429432 -648507 -579197 -590845 -76209 -329493 -578029
1575 -578029 -747488 -419027 -60876 -456957 568645 -335301 -1661862 -2327199 -1976023
1566 -1976023 -2124301 -1438561 -1184183 -639474 -13336 85495 428429 356281 1017180 551357
1556 551357 440838 -734323 -841021 -796322 129638 212899 -1140608 -1491037 -551788 64521
1546 64521 -516827 -438228 790228 -219178 28774 1400062 136325 -344853 -228660
1537 -228660 -216431 522513 -12297 32884 -708376 -760499 -590338 -969768 -189168 542512
1527 542512 255408 -104720 -674933 -70615 1708100 945035 -410430 -1267342 -653872
1518 -653872 -1138616 -1262612 -758392 -991286 -267158 -217278 -608494 -792345 -1203029 -998780
1508 -998780 -528590 107731 329994 954222 668172 451637 155704 -82299 411471 379298
1498 379298 1070968 186630 -72687 -245241 -346501 -355661 226168 1204616 1038398 81051
1488 81051 -1399083 -1350083 -968077 -698229 -1326514 -1356441 -234367 -335175 -598263 -1759758
1478 -1759758 -798015 135325 35915 331790 -265993 -817298 -1723036 -666205 -334104 -529133
1468 -529133 -444058 246947 623527 -207389 936598 -378535 -559545 426613 -46324 18369
1458 18369 359372 60260 -318911 459369 294739 475989 156878 31457 -1023769 -1764451
1448 -1764451 -2618765 -2559141 -569109 -585034 -861958 -874700 -981261 -677726 -948285 -1994026
1438 -1994026 -937320 -1040002 -900345 716775 470838 -316471 -766184 -467340 -8451
1429 -8451 -583969 638494 1246067 84772 405910 86302 -873482 -638661 -300011 -1410736
1419 -1410736 -1875950 -852271 -1059678 -924173 -1334818 -255784 51132 -1131915 -1247281
1410 -1247281 -792208 -1516090 -905692 681023 277677 -538120 -1883486 -2250309 -1776783
1401 -1776783 -756118 914970 -73787 -202453 -482 -77541 692914 -75766 153845
1392 153845 -328812 33956 126100 396653 252016 -536031 -729233 -458889 -459700 345097
1382 345097 1717256 2264118 1339057 1024467 752139 -10940 -154936 593602 1035822 758980
1372 758980 95813 374749 42371 -876105 -914240 -216300 35185 -409866 113938 794350
1362 794350 869479 576329 -686149 -1370694 -1727185 -737616 -894118 -229964 198203 -801049
1352 -801049 -798070 -355861 -372567 -338361 -341528 1512848 1439364 192679 382840 -125356 -397948
1341 -397948 -490252 406327 431209 543269 -490568 -908589 -1061953 -282987 854540 1139085
1331 1139085 20876 -289534 -495711 -995978 -1503456 -1575710 -799686 -471993 -1198343 -1211346
1321 -1211346 502405 638040 -211445 -667514 -377016 -1392836 -1700904 -1110088 367296
1312 367296 378537 143282 -354972 -1169969 -740197 -1094400 -1048005 -1097201 -116702 -219035
1302 -219035 -1378230 -663940 621273 532651 -549253 231365 691646 769667 662673 -326822
1292 -326822 469457 -1126614 -659959 127467 856052 737440 590955 914594 820592 670993
1282 670993 141679 699685 1191430 1196140 572793 1262298 981518 639840 -144875 417999
1272 417999 540342 598557 1172243 872916 621966 33797 212666 -271413 -1079198 -1624421
1262 -1624421 -798333 -663388 786876 1560425 726112 72720 -936598 -1459707 -1064034
1253 -1064034 -740925 -105352 301786 291966 -30524 -796251 136982 215684 -685444 -536810
1243 -536810 -104766 893090 397619 -78495 335833 -38510 107072 442825 -128694 484488
1233 484488 -8970 -127473 1054617 1823203 689506 -17506 541035 144000 195754 -681283
1223 -681283 -345959 -353488 454829 631347 208961 -318863 -150769 110125 132115 -288818
1213 -288818 -264735 -62193 -12492 -39826 -336403 -243753 -441715 -464483 -1020557 303571
1203 303571 442321 491637 -388072 -1520853 -851564 422129 365685 -709970 -939080 -455859
1193 -455859 133943 -108298 597804 234319 -47491 -18094 -532881 -656093 -56688 533341
1183 533341 954278 364886 -408222 -686787 -2310933 -671610 83155 -280174 310513
1174 310513 736672 656268 592213 -239570 -399452 -574430 -1232793 -1210088 -388723 215522
1164 215522 -1228725 -1916656 -1327165 -872555 -2074823 -923143 249583 234253 -170032
1155 -170032 -799544 236778 673484 1052190 732861 -347409 -345402 -188830 -803525 -125017
1145 -125017 -71163 -771629 -157881 -666788 -38183 646367 481760 -1027071 -1254031 -209631
1135 -209631 47668 -760455 -208458 365058 101805 762730 1504809 269734 -668952 -703771
1125 -703771 68687 48862 875336 532399 411458 840183 614642 288248 651705 -396799
1115 -396799 593856 1180283 11760 -390139 -74321 -823451 -417052 -395285 -294847 343799
1105 343799 931484 675618 93105 104268 -565003 116601 -118932 -910777 -1315776 -1613003
1095 -1613003 -1263864 -987361 -760902 -532591 -178498 1194336 594647 771269 171853
1086 171853 -283265 284945 491043 595822 513094 -247279 -1371742 -1078359 -932058 -926910
1076 -926910 -89017 -886430 -124748 -14769 277158 -93111 190609 145685 -297990 -281367
1066 -281367 -265856 -95585 1021603 194724 -526384 -690108 -1246225 -897341 658827 151192
1056 151192 621848 1266407 1173056 -805363 -296059 42469 -176872 338802 270893 -24946
1046 -24946 -116941 -67060 -467930 -300857 316021 148804 -7130 -81090 260863 19679
1036 19679 -201557 308823 -267180 554447 -610988 -751819 -272206 89536 1383735 2656903
1026 2656903 1421977 322673 -407692 -622201 -425905 -1070683 -243635 417415 -430389
1017 -430389 -756121 -194161 1088527 -94561 -988566 -1487061 -464840 -362505 -1560860
1008 -1560860 -567368 -346762 -243752 -1255470 -413123 754413 -81251 -143831 -349114
999 -349114 -638944 -313337 -141324 1302962 1001403 817332 887180 32471 357180 361805
989 361805 -414572 456077 728975 37808 239825 -138812 819529 1237256 243305 1222923
979 1222923 1890901 1004606 794763 571558 607401 1071588 1197036 536213 824529 10620
969 10620 -487692 -606236 24953 242031 959893 907073 202841 -683651 -433128 495479
959 495479 858065 555779 854965 -4204 540238 -570398 -1061532 -146671 -635253 -987874
949 -987874 -491303 446486 -658879 -1162402 -140096 -268117 -550708 238107 78630 -401747
939 -401747 -605641 217907 758698 18085 632510 -114472 -753830 -293910 -239274 -96311
929 -96311 -673561 -391485 -421697 -287072 -165645 531099 897988 1718757 407277 -368020
919 -368020 370417 584551 -297973 -545928 916165 1311489 581410 299402 390558 -387529
909 -387529 -1234007 -718424 -44591 17651 -179652 95741 796530 985526 181066 520248
899 520248 680893 474859 717015 1582467 1038786 377575 1222884 -367472 -812878 -702850
889 -702850 -1046723 -532326 166001 913364 1118031 -292411 610279 1406802 -76308 289198
879 289198 851445 142083 1041127 534645 201246 -97972 -701810 342429 570878 -75074
869 -75074 502703 189650 -1150949 -1300952 -1539378 84852 118247 -813430 -1532824 -1362772
859 -1362772 -889812 -202557 -894979 -932332 -100698 -213292 486267 58012 -894488 -458939
849 -458939 -578051 -60759 574127 -53280 17993 377694 -65850 -211117 177548 376831
839 376831 255154 62383 -250712 885439 -45946 93308 -122274 -1472308 -737929 659612
829 659612 1342116 369601 957662 1571684 190181 -339932 344067 -961837 968491
820 968491 1451897 427126 -406926 -679541 -570751 -127726 185712 -311757 129104 -1041264
810 -1041264 -277020 369848 666793 312213 634840 777249 87072 -648231 -306840 464974
800 464974 1389057 312633 242701 318890 -120922 -50088 -368743 109101 231500 130
790 130 -447979 -160063 599467 390685 837335 666762 329624 733637 -10103 -517687
780 -517687 69228 391657 -545276 -34378 188707 -380194 -699061 608875 -48703 -47285
770 -47285 591338 566446 -100039 609206 1191377 1344173 2029626 495856 10798 318063
760 318063 1163596 1779822 936396 1313973 874472 -724777 18753 -382904 -583349 41805
750 41805 -342391 139786 569740 832204 278062 772832 481139 80544 -213530 -992227
740 -992227 225603 948140 374359 377025 396769 1320517 1368486 637608 1176272 872246
730 872246 61504 927788 1534186 1058616 684223 58396 283706 -83508 -80446 -274999
720 -274999 -399217 -1039067 -1387365 319684 138914 790995 904472 751290 1197588 1360053
710 1360053 448717 207095 1325316 1393783 1285371 974046 486507 1400989 667286 -452953
700 -452953 -1091559 -602879 544989 526332 598777 1199490 911633 657376 316085 875903
690 875903 138993 -797380 -315816 -98312 389142 -683523 -96060 -442846 -430219 612111
680 612111 306696 573285 -494157 -121817 163859 99075 202064 153497 915132 -151403
670 -151403 -147227 219010 -201452 -1269530 -666061 -317650 60530 -157901 489713 855767
660 855767 305952 -562283 50007 -279122 -1010337 -1055134 -369384 423841 577418 -385848
650 -385848 -497798 -1082355 -318169 412822 -769198 -416327 218469 1045304 500480 548098
640 548098 -301405 -353878 -65688 -922773 -973516 66408 -311770 -111497 -353707 146266
630 146266 32929 389157 705939 1315062 1187677 1024738 1193771 -214167 -350256 -74541
620 -74541 -502436 -1081725 -755268 114207 536522 -96623 651946 -277127 -119278 226500
610 226500 -306452 170705 896654 1027786 325117 16422 265947 937001 953959 350807
600 350807 678512 916755 588974 -681622 -681066 167586 451198 252582 227685 894795
590 894795 1522175 578907 311635 688291 904784 533649 -463414 -1621179 52184 25627
580 25627 -344889 99113 -492486 -84923 222059 94399 218510 187753 228628 627088
570 627088 -668670 -1014289 -241669 1600078 762971 181599 336533 1322647 792422 844786
560 844786 581859 -297162 -499290 -588020 963726 810854 694292 470393 -407780 -52224
550 -52224 -449340 -358968 575142 1309154 906048 628619 934455 229884 524777 1143159
540 1143159 -437374 176980 986677 675925 343516 384588 110565 109757 -84457 91978
530 91978 854212 990437 1207848 448411 -237988 -324986 -528718 -808611 -904927 502514
520 502514 2312379 1526335 1008036 1068871 419903 -617097 541405 -266822 -400283 397482
510 397482 656480 351538 -460996 -1056970 243565 1202724 -211601 678767 1168727 818580
500 818580 1091966 1274078 1298424 381018 253860 2176277 2007243 1639979 1459415 524403
490 524403 1533037 1082944 1239929 900199 1621653 1374569 -347541 34619 401995 1034267
480 1034267 1010350 -524484 -307921 691906 562588 1188557 916020 560742 -84031 29701
470 29701 1123354 1234007 280312 79485 898426 683115 220830 160042 115188 -305782
460 -305782 -65435 -232782 708998 2105903 1590327 1042837 548318 1020369 844316 513366
450 513366 719416 892651 -755581 -609104 46893 304642 -144376 736015 799443 -40722
440 -40722 310813 82901 -642957 -606511 -956813 -236550 518006 -369810 -131318 112691
430 112691 -512562 -12546 222042 119528 55131 -183172 -452004 -63560 -1236370 -207697
420 -207697 323171 -69718 48083 606822 1023902 366048 1184819 429263 299819 -448790
410 -448790 -319809 951468 1663502 890453 252851 725487 773599 624177 -373681 284849
400 284849 893661 668614 655198 399562 872947 183332 269764 812426 1195617 -306966
390 -306966 671572 49419 1294592 1021056 652371 1143693 851533 1229530 -505020 -434616
380 -434616 1300622 1170038 102254 425575 -387871 -394838 -176982 -498136 -651250 -1270538
370 -1270538 -1083537 -464139 935907 1710898 1739312 963615 -194118 -601042 137128 -104167
360 -104167 88908 374147 -591621 200739 21031 45280 -10081 737307 1375108 722247
350 722247 1173375 432152 255266 657565 1864597 1854236 1024527 416565 525235 758331
340 758331 -122135 735115 1075181 668580 269572 901556 604652 -427813 534370 935158
330 935158 1213324 721451 -295515 -840235 495215 1125172 804756 601560 -570137
321 -570137 671971 1025395 1210480 1833578 919920 1130466 1347502 1030545 1614673 1843259
311 1843259 1035073 1014931 869586 522668 477175 577710 1017050 699173 -333492 -1102227
301 -1102227 -395224 675062 1739031 2002665 906288 598469 509351 266475 448149
292 448149 -329204 -274871 67782 2324068 1766353 179145 180701 1197518 1217599 -458451
282 -458451 -133722 1279377 1677420 967913 362067 180856 -177433 -201140 145950 1314450
272 1314450 487281 125572 283240 1404013 1773292 800149 1357319 2315561 1809975 1242585
262 1242585 974976 705491 688140 92686 -220570 -47981 -397470 -685491 -1017558 -402873
252 -402873 -75006 -113274 -549664 -480167 872231 983652 -50446 -833991 233197 695777
242 695777 588851 1392200 787192 440511 680537 -324030 -211450 -14487 587134 693296
232 693296 1138435 837740 -205767 -707500 -806163 -679546 -54298 404419 389946 715844
222 715844 831819 531795 337665 560408 1392276 661852 484934 1362021 1534931 831783
212 831783 349797 638268 697821 1335505 535303 -220147 574167 1692516 1091137 650958
202 650958 1237727 822351 900692 1456868 1364243 1578916 1505358 871071 354329 328750 632509
191 632509 -159090 43292 -686360 308867 1134104 820078 290025 428674 1764974 2320534
181 2320534 914647 631894 718646 732975 465208 45810 -70020 825430 625335 221482
171 221482 492753 515854 483587 761674 527330 290287 816266 -23764 499599 -149069
161 -149069 119508 647210 -212448 512641 1155534 1102690 1164053 1144279 1290361 385055
151 385055 679707 674312 1065795 663348 5824 -112346 357460 587512 1056188 1334491
141 1334491 816987 250311 692165 898569 231518 178952 323638 885409 1028344 1428306
131 1428306 850310 551003 793745 428324 267645 937708 24716 832972 1303507 1667953
121 1667953 699322 1219426 1246791 1039947 783841 755442 1512501 253213 -6768 15199
111 15199 606983 1467785 1870643 1036941 922626 328325 568 -106960 -219651 -145897
101 -145897 -268124 204146 110966 -186708 -399038 -143269 246226 862741 775704 253344
91 253344 -239013 -109072 526238 1018714 358255 969840 1432142 260688 550667 413428
81 413428 243312 -90305 327756 531431 986849 728144 637706 958650 1191496 962692
71 962692 255907 177769 979518 1525971 280491 154086 1022003 -22970 1246508 1477494
61 1477494 811612 548491 1060838 1254859 911080 990279 1437973 1036595 638878 811364
51 811364 777534 651129 688556 700183 -4346 -310484 482655 798765 524529 920713 1445913
40 1445913 212179 -109463 403366 1060964 945963 912677 811334 676601 284436 138719
30 138719 1158596 1253719 1002685 753579 1002948 902821 684822 1105838 1582468 1259273
20 1259273 823990 758503 225449 408063 603853 -344131 123151 -311092 -479663 349600
10 349600 281138 703721 1035144 942209 629596 406945 909172 583431 832083 1358386
0 1358386
$$ Imaginary data points
##PAGE= N=2
##DATA TABLE= (X++(I..I)), XYDATA
16383 -5058214 -5053449 -5278970 -5012526 -4947486 -3741066 -4326336 -4361811 -4188308 -3571986 -3930476
16373 -3930476 -3728155 -4481072 -3748163 -3297239 -3261682 -2763002 -2724201 -3148045 -2715621 -2919954
16363 -2919954 -3293503 -2868825 -2114638 -1914797 -2616584 -2055992 -1505025 -1143618 -1070395 -1370915
16353 -1370915 -2445174 -1979642 -2138208 -1930897 -1868226 -2130191 -1255043 -487815 145356
16344 145356 -223603 -232043 -690682 -658376 51247 -54321 -98366 -160968 253873 -199701
16334 -199701 -278700 -475940 75690 -439281 -380308 -366669 61513 761344 481321 115213
16324 115213 581123 979220 1798210 1313691 1496174 1248291 1222313 1558517 2655098 2463105
16314 2463105 1615607 2026835 2709358 2245509 1448648 2333619 3067048 2927332 2555117
16305 2555117 2458961 3079510 3136206 2191616 2119888 2898594 3170705 3005260 2929444 2662151
16295 2662151 2761548 3318751 3378121 2980292 3699610 4374759 4764589 5088513 4297480 4084444
16285 4084444 4177056 4338211 3622397 4519494 5098306 4921496 4513060 5486608 4937095 4059510
16275 4059510 5845765 5675751 5495558 5069301 5658755 4953854 5051645 5648680 6240207
16266 6240207 6511341 5506697 5778207 6625394 6607984 5981282 5631218 5402411 5224055
16257 5224055 6197947 6659105 6890931 6846546 7133418 7466082 6953178 6464995 6649434 6477990
16247 6477990 5882751 5478702 5667643 6862902 6626868 7101530 7598668 6822148 6995684
16238 6995684 7633769 8323201 8357543 7629560 7795441 7050179 7125101 8126952 8278284 7392495
16228 7392495 7375332 7920417 7534986 8742933 9529598 8236851 8190960 9416100 8866798
16219 8866798 9089984 8880799 8863895 8944231 8400834 8600078 8922819 8210164 8566826 9299516
16209 9299516 9163897 7875403 8639854 9629513 8130730 8790166 8989099 8287049 7689358
16200 7689358 7894319 8702745 8820212 9421906 8184263 9513823 10107084 8987752 8027497
16191 8027497 8418466 9281429 9191990 9408308 9781016 9152178 9461047 10393374 10344166 9691249
16181 9691249 9588108 9804146 9438868 8775985 8812800 10239223 10371490 10654750 10086639
16172 10086639 9234538 9988443 9434787 9622918 10076767 9486446 9553351 9573920 9801606 10380003
16162 10380003 10099978 9518840 9019816 8828914 10045357 10390076 10565243 10745961 10462212
16153 10462212 9880433 9039185 9286624 10277495 10274518 10954589 11272679 11396212 10924930 10512771
16143 10512771 10965623 10419031 10405106 10096088 10010433 11039303 10760604 11184128 10839168
16134 10839168 10041718 10626906 10983233 10714757 10327600 9811517 10236121 9483182 9871988
16125 9871988 9576006 9769799 9436123 9585293 9981681 9957275 9640116 10417172 11474228
16116 11474228 11515657 11001608 9635173 11289232 11646991 11107805 11450701 11968268 11288180
16107 11288180 10256297 11066707 12381160 13752277 13169288 12126818 11300885 10968867 11690554
16098 11690554 11312602 10615728 10232164 10347051 10522625 10693345 10464929 11126228 12259949
16089 12259949 11705461 11165089 11472283 12051725 12101048 11397149 11492035 11473932 9748531 10686148
16079 10686148 11923065 11299398 10899442 11327271 11305165 11610777 11511207 10733372 11248930
16070 11248930 11487567 11467797 11505987 11867774 11633829 11462844 10648558 10311034 11361520
16061 11361520 12699836 12381449 11976602 11745986 10949188 10746265 10194710 10018180 10534503
16052 10534503 10407160 11298872 11791277 11363838 11147763 11498978 12054905 12428982 11942143
16043 11942143 10897176 10567973 11984014 12637681 12820597 12181605 11027994 11392624 12571208
16034 12571208 12726118 12751829 11988760 12195012 12740951 12877453 12587321 11651122 11422409
16025 11422409 12205923 12613907 11526960 11325877 12307723 12096408 11494366 11167731 10773456
16016 10773456 10504928 11434096 11207632 11123731 11298061 11135880 11957647 12559511 12052734
16007 12052734 11719896 11859502 12004327 11637985 11981513 11878816 11519777 12058148 12491202
15998 12491202 12430044 11759367 11338367 12126740 12022388 11247630 10622375 10118967 11965882
15989 11965882 12855497 12840480 11652419 12365443 11939658 11621424 11055231 11388169 12356085
15980 12356085 11374969 11444855 10980574 10963978 12013238 11910770 11212616 11025017 11585457
15971 11585457 11631694 10786472 11568368 11392013 11537880 12239561 11808154 11808895 11148152 12314655
15961 12314655 11781278 12181081 13128599 13125934 12316693 11294295 11557161 11897832 12403492
15952 12403492 12632226 12439007 10968178 10992786 10938548 12683469 13285128 12627568 11379129
15943 11379129 11070043 11854410 10876501 11008523 12495508 11412227 11119178 12687335 10966307
15934 10966307 10981829 11503260 11796620 11690845 11373010 10922967 10450958 11604890 12190521
15925 12190521 11976937 11969997 11963353 12286157 11733188 11992278 11446563 12069699 11070903 11795676
15915 11795676 11343611 10923457 12782771 13186847 12760986 11999769 11723650 12672391 11254552
15906 11254552 11217504 11110352 10735491 11371298 10842418 11594575 11160889 12290153 11564647
15897 11564647 11781411 12625959 11904023 12433000 12410203 11465874 11653822 11992440 11962673 12326858
15887 12326858 12232657 11588963 11274953 11455521 11685986 11335362 11117930 11945356 12821283
15878 12821283 11747282 12067902 11782493 12093764 13088384 12930422 13171794 13239968 13530905
15869 13530905 14118289 12869147 12743310 13164560 12887986 12511692 11710034 11728116 11740288
15860 11740288 12161075 11957181 12541434 12223268 11608266 12168116 11667040 12008721 11854541
15851 11854541 12117345 11517691 12069686 11596153 12056112 12005271 11936307 12246361 12669271 12315442
15841 12315442 12410335 12304931 11126781 10869282 12461210 12107854 12807748 12279855 11299906
15832 11299906 11444398 10941098 10876987 11554342 11873840 11403691 12296521 12043884 11134710
15823 11134710 10979486 11750156 12660939 12604759 12355540 11912361 12343407 11643736 11056359
15814 11056359 12039417 11380321 11602192 11578687 11797295 11162845 11685097 12525928 12266421
15805 12266421 13086185 12872717 11198951 10991912 10147620 10681099 12340699 11779782 11602898
15796 11602898 11715301 10924276 11307581 11832933 11976969 11828318 12105653 11557395 10682009
15787 10682009 11137163 12029206 11635494 11339390 11779912 11554155 11908626 12748763 12309882
15778 12309882 12305226 11672471 11365532 10336748 11279336 12318903 11903536 10875506 11076617
15769 11076617 12189785 11639948 11177122 10914126 10617836 12302039 12481282 11965333 10745788
15760 10745788 9714370 10369309 11713903 12471894 12408115 12107609 11807523 11200075 11738427
15751 11738427 12776745 13106151 11886321 11884105 11633678 11186099 11250174 11755140 11201966
15742 11201966 11697205 12705957 12445975 11587218 10230989 10744692 10732231 10624206 11224430
15733 11224430 11510933 11698610 11328982 11443620 11301617 11149436 10596480 10319814 10459392
15724 10459392 11244246 10986942 11072133 11889106 12207913 12187444 11588612 12121616 12463299 12143330
15714 12143330 12019527 12271117 11514435 11886162 10986243 11250205 10505315 10833609 11367164
15705 11367164 10997806 11941242 12380270 12839774 13217239 12244322 12759792 12050317 11453385
15696 11453385 12266217 13144859 12032787 12320509 11983667 12501888 11622589 11378154 11925292
15687 11925292 11409277 12356820 13124785 13406781 12461032 12761000 12671117 12282909 12164610
15678 12164610 11897696 12256458 12542357 11977180 11668355 12085689 11825939 12442818 12337823
15669 12337823 11974680 12359346 12731778 12407223 12577866 12081720 11566420 10801916 11108214
15660 11108214 11491168 11816004 11953060 11964020 12462806 13128441 11950938 11384334 12394980
15651 12394980 12465022 12656985 11962561 12047629 12628216 12753430 12517453 12455352 12375352 12396623
15641 12396623 11446828 11736680 11898896 12047324 10747697 11339766 11571073 10675738 10836278
15632 10836278 11023935 11126200 11070437 11072960 12592956 12962850 12398696 12062382 11599840 11330043
15622 11330043 12151993 11536314 10732209 11676594 12768101 13389449 13285179 12814876 11310117
15613 11310117 10730718 12245683 12487023 11364729 11723329 11163730 11009760 11316264 11882104
15604 11882104 12099527 11969442 12506270 12180267 12039041 12693507 11603706 11313773 11254867
15595 11254867 12106323 12962213 12210958 11370702 11638986 11474238 10960158 11983247 12803658
15586 12803658 12830224 12245149 12711252 12788310 11952880 13182467 13411868 12495836 12110047
15577 12110047 11784406 12216498 11554426 11678566 12335491 12864716 13401716 13866893 13067874
15568 13067874 12168769 11585863 12357614 13236671 12862238 11971786 10785154 11807749 11698378
15559 11698378 11785515 11702225 11013913 11537064 11095270 12098769 12737720 12334954 12184087
15550 12184087 12270504 11713841 12099218 11595206 13068090 13602923 12376177 12751250 12896658
15541 12896658 11971674 11964631 12527034 11827152 11077752 12818140 12795699 12238894 12658073 12683316
15531 12683316 12185673 13070825 13018056 13143661 12704133 11352980 11513997 11855237 12287955
15522 12287955 11605727 12021230 11888125 12842323 12370044 11575943 11226794 11578765 12358740
15513 12358740 13239716 11804692 11235071 11879353 11028477 11112825 10924874 10550549 10153939
15504 10153939 10758724 11541778 12074250 11981472 12054110 11596064 12140113 12361784 12412375 13720421
15494 13720421 13447028 12288862 11834699 12269195 12200359 12897404 13016629 13028204 12820671
15485 12820671 12100193 11558640 12296537 11680105 13053836 13607379 12599032 12083411 12699832
15476 12699832 13175582 12798219 12091955 12032659 12061361 11995815 12024327 12261981 12262983 11484590
15466 11484590 12436293 12186491 11069356 11325606 11273408 11960169 12109331 12060163 11970479 11453644
15456 11453644 11764080 12171470 12234929 12691844 11695474 11033240 12801696 12555519 11621699
15447 11621699 12274321 12320522 10961238 11289264 11836668 13387938 13197746 12663048 12900678
15438 12900678 13412132 13491184 13671723 13102045 13060869 13566764 12877653 13197932 13134864 13381990
15428 13381990 12190023 11166942 12280419 12300060 12035677 11190061 10751854 11615668 12372312
15419 12372312 13132015 12340000 12189002 12153650 12413303 11833217 11367332 11468803 12043708
15410 12043708 11220862 11035668 11716941 11571977 11656454 12140504 12134272 11944618 11105632 11526265
15400 11526265 12532932 11882368 11743941 11498071 12720852 12690870 11473875 12040903 12742943
15391 12742943 12426004 12028959 12469008 12702217 13375046 13819607 13492030 13458186 13528284 13006668
15381 13006668 12728037 13051906 12426486 13189654 12852798 12346668 12535472 12826517 12138289
15372 12138289 12303711 12714369 13343454 13493252 12793762 12903422 11825958 12526695 13475922
15363 13475922 12437261 13169927 14005369 13596436 12411033 11754197 11313569 11875350 11350663
15354 11350663 11584450 11104077 12215217 13629492 13880669 14281306 13304860 13254346 13124050
15345 13124050 13622137 13399372 13156287 13195172 12626119 12580125 12577877 12794823 12792923 12234438
15335 12234438 12834540 12197121 12686834 12348173 12130091 13022004 14181646 14022052 14359190
15326 14359190 13997365 13052992 12766710 12867263 11890730 10628777 10704989 11321702 12571653
15317 12571653 12663001 12473655 11927823 12182918 12682141 12299454 11385081 11798694 11843800 12128824
15307 12128824 12158742 12554453 13551960 13194820 12679682 13447570 13006843 13251694 13693708
15298 13693708 13271565 12746297 11640085 12016795 12077121 11595654 11548370 12337851 13097781
15289 13097781 12473073 11400917 11033115 11946736 12113331 11992976 12330460 11909022 12852681
15280 12852681 12230663 11831383 12495140 12489178 11510920 11539566 12645195 12345322 12512600 12404847
15270 12404847 12332425 13410181 13932677 13041745 13119094 12832981 12208222 12808218 12928546
15261 12928546 12316842 12177095 12125148 11907453 11681959 13066677 13334581 13390212 13123949
15252 13123949 13029139 12296587 12892817 12729361 12999516 12842670 12831797 14024044 12887281
15243 12887281 12953111 13206855 12782017 12491203 13495495 13510020 13297723 13532425 12337581
15234 12337581 12186607 12389111 12358174 12226891 11654741 11776327 12126807 12857426 12387295
15225 12387295 11693863 11805282 12713718 13006410 12064040 11913793 11973622 12202264 12655213
15216 12655213 12848470 13565872 13265218 12739442 11926586 12171347 12636617 13668479 13487365
15207 13487365 12362192 11546074 12813795 13221137 14356002 14453694 13434533 12352468 12142165
15198 12142165 11839820 11689552 12584304 13835864 12835895 13162096 13089763 13653573 13533622
15189 13533622 12012456 12608032 12575618 11771172 10798400 12521438 13452991 13299512 13351896
15180 13351896 12915563 12818133 13174066 13171296 12100296 13133654 12911991 11964433 11579424
15171 11579424 11779764 10852791 11162398 12007188 11098733 12412776 12263159 12856740 13554838
15162 13554838 13658154 12320711 12018824 11307885 12988827 13084757 12675636 13394576 12743824
15153 12743824 13057040 13384708 13567043 13894602 13347066 12555887 12779669 12697799 12166512
15144 12166512 12895417 14074678 13703855 12077449 12290809 13447118 14354492 14429748 14128757
15135 14128757 13258707 14005138 14875013 14435608 12558214 12470853 13442734 14122221 14042444
15126 14042444 14500620 14436017 13810267 13506130 13132399 13747310 13293306 13088254 13027179 14305115
15116 14305115 14711097 13581354 13377165 13626815 13864211 12813712 11752537 12598743 13118232
15107 13118232 13658907 12767439 12563043 13551427 13450661 12794980 12007801 12108156 12659144
15098 12659144 12063722 11935442 12723263 12834813 12959479 13397008 12582058 12749166 13218990
15089 13218990 13692141 13334608 12990608 13543834 12581081 12146748 12068135 12992859 12853119
15080 12853119 12270761 12560692 12262582 11925387 12045748 11436494 12280563 12666147 12423264
15071 12423264 12078860 12888110 12442524 13070987 13879729 12710718 11670551 11974221 12488066
15062 12488066 12196592 11848406 12851515 12726788 12980130 13475908 12743559 12209315 12098717
15053 12098717 13158271 12802824 11785056 11816361 12272226 12956712 13278388 13777609 12645196
15044 12645196 12106706 13585226 13429361 13291787 13362937 13153171 12594608 12818548 12750068
15035 12750068 12950452 13307322 12994951 13194951 13545691 12723576 13286235 11624057 12451143
15026 12451143 13510874 13655241 13978095 14030346 12875932 13155318 13438533 12423405 13024321
15017 13024321 12028373 12133947 12663220 13443442 14293379 13382252 13208379 12872285 14006824
15008 14006824 14468949 13648406 13239040 13681729 13704057 14203867 13691568 12829354 13627047
14999 13627047 14607558 13808336 13367655 12670057 13031198 12966783 12691089 13823202 14110465
14990 14110465 13110958 13723289 14078886 13523177 13967589 13746278 13397435 14067427 13984717
14981 13984717 13074319 13181702 13261736 12590398 12490824 13161648 13374708 12569283 13076975 14280132
14971 14280132 13901122 12705991 12777887 13253291 12934462 11944764 12169206 12446072 11847799
14962 11847799 12852235 13005351 13127326 13023891 12599702 13419723 12984817 12343903 13422741
14953 13422741 12408306 12059008 11990012 12295788 12258292 11795875 11578070 12341554 12885687
14944 12885687 12219646 12774893 13413243 12807820 13034869 12378182 12952240 14215510 13497138
14935 13497138 14449550 13943533 12785252 13726514 13951021 14471461 13523065 13395969 13539370
14926 13539370 13557957 13000402 12346763 12351644 13461808 13015457 13896918 12926093 12942953 13418092
14916 13418092 12758993 12768126 13398570 12535744 12918203 14283216 13256180 11923053 11356551
14907 11356551 11437654 12739758 12706415 13716538 13418805 12784039 13443020 13274333 12977898
14898 12977898 13540660 13205932 13705235 14553319 13478384 12537498 12654341 13144996 12389364
14889 12389364 12477906 12839865 13848116 13375078 12866361 12029086 12861330 12918011 13949673
14880 13949673 14101564 13648953 14118901 13585609 13286139 12630118 13004956 13849004 13596834
14871 13596834 14572654 13739006 13793376 12647108 12135309 12248046 13422757 12855799 12815102
14862 12815102 13703992 12516471 13459833 13412775 13065082 12537715 11303775 12098308 12143661
14853 12143661 12916600 14115941 15073525 13541746 12390572 13183708 12375829 12927055 13644000
14844 13644000 14550781 14144019 14080320 14561516 14096401 12793659 12590098 13149149 13668917
14835 13668917 13485592 12495929 12962840 13841248 13862710 13705602 12850503 12772316 13700133 13615626
14825 13615626 13159172 12993546 12782573 12483419 13162963 14555955 14277907 14654453 15060522
14816 15060522 13979721 13906015 12315015 13153577 12964639 12032260 13648245 13338718 13792102
14807 13792102 13944151 13271432 13578580 13453763 14142105 14130484 13299703 13875444 13596067
14798 13596067 12620381 12361732 13494256 13458900 12921303 13150552 13164513 13449299 13465557 13433889
14788 13433889 13114204 11795701 12104092 11961736 12581499 13444610 13191007 13198423 14295536
14779 14295536 14370982 13749960 13615576 13168168 12649525 12540198 12857478 13244016 13476882
14770 13476882 13855891 14657172 14057665 13640202 11889902 12602708 13544334 13372401 13220583
14761 13220583 13714176 14007434 14278693 13589915 12405901 12301995 12814631 14633784 15370812
14752 15370812 13798117 13616503 12980091 12696725 13679344 14425083 14586916 13454885 13121023
14743 13121023 13342127 13413436 12408534 11934629 12765681 13014727 12962078 12986589 13011446 13803711
14733 13803711 13920178 13308451 13387117 14007420 13769800 12959279 12406949 13295619 13347944 13708002
14723 13708002 13213868 13781382 14334741 14453141 13969418 13691902 12495416 12126149 13773407
14714 13773407 13718597 13733751 14197114 13937043 13578233 13109798 12984312 13293682 12413193 13463895
14704 13463895 14801722 13778990 13303904 14090494 13367397 12927795 13656620 13401643 12469763
14695 12469763 13857788 14029181 12713878 13484319 14523109 14188371 13312545 13504803 13946955
14686 13946955 13820184 13213080 13733820 13391461 13061008 12715515 13296313 14056607 14949615
14677 14949615 14869442 15514934 15068809 13323184 13520442 13336101 12598119 12401067 13574059
14668 13574059 13513282 12927314 11752368 13156771 13294570 13033882 14425104 14632928 14572079
14659 14572079 13514479 13099405 14078867 14705259 14655184 15408481 14991722 14346941 12883358
14650 12883358 12521395 13512602 14607498 14350808 14315553 14741821 14681396 14177572 13827446
14641 13827446 13974011 14278277 14008948 14510956 13907074 13404413 14268931 13231679 13634227
14632 13634227 13801879 14085207 13372643 13046592 12998858 13113327 13084232 13142775 13378127 13237752
14622 13237752 13239286 13914359 13062518 12502946 13379322 13897066 13983249 13680594 13605897 13407451
14612 13407451 13909066 13749433 12694015 13321332 13808844 13785260 14034948 13280091 13427091
14603 13427091 13702230 13589165 12944836 12853592 12447197 12406940 12644391 13622479 14023124 13997799
14593 13997799 13645002 12933357 13584587 13527643 13388616 13243195 13199789 12947614 13350113 13211235
14583 13211235 14090558 14088018 14070939 13642605 13548376 13471603 13582808 14666084 15709700 15379614
14573 15379614 14106866 13996532 13951797 13828875 13129578 13166013 12818047 13217122 13938137
14564 13938137 13441220 13209965 13075802 12880656 13057129 12850996 12890779 12484400 13655393
14555 13655393 13451690 13844869 14360869 13958909 13372986 13100822 13413174 13090413 13369813
14546 13369813 13716448 14581015 13418682 13564337 13697456 12603459 12376223 11912205 12194394
14537 12194394 13291319 13585808 14373266 14301620 14018727 13040888 12978763 13994568 13918415
14528 13918415 14020492 14193678 13777108 14365453 13521869 12085675 12855568 12967658 14084027
14519 14084027 14295036 14705772 15295842 14224255 13861905 12863252 13519224 14103543 14113499
14510 14113499 14005185 12910478 14220411 13893809 12993766 13632380 14017995 14173866 14800770
14501 14800770 15482925 14763532 15263315 15104256 14248127 13284548 12899761 13940894 14184250
14492 14184250 13273948 13485036 13592309 13414087 13744230 13870739 15124011 15071792 14758546
14483 14758546 14755041 13636829 13472791 13911683 12965960 12753367 14472828 15011790 14422398
14474 14422398 14563123 13692697 14047118 14113079 15540438 15813515 14362210 13967144 13877249
14465 13877249 13116707 12381622 13388763 13949827 14492375 12816221 13228883 14104651 13387106
14456 13387106 13120910 12992147 14038746 14433699 14126014 14062930 14343673 14087515 13637566
14447 13637566 13035366 14116578 13619739 13846032 13719923 13581017 13909641 13836131 13115439
14438 13115439 13358431 15046124 14651034 14812886 14992836 14323240 14318041 14237740 13685756 13325764
14428 13325764 13954876 14151781 13725915 13325961 14102245 13986467 14384957 14965523 14601086
14419 14601086 14684811 13901768 14362129 14555498 14375025 13619956 13664959 14014048 13416597 14473663
14409 14473663 15755653 15234156 15070806 14529113 15036647 14786746 14423423 14201475 13904341
14400 13904341 13650609 14199958 15182830 14541210 14057961 13498522 15262062 15997746 15239832
14391 15239832 14910204 14636071 13479215 13898089 14731578 14105878 13570146 14361039 15382863
14382 15382863 14497127 13156908 13166713 14629236 14643243 15537583 14241357 13010752 14110582
14373 14110582 14312221 14301895 13577555 14144839 13540047 12437092 13286044 14217875 14853873
14364 14853873 14307470 14384237 14213218 13999937 14366348 13582075 13728224 13412030 14170724
14355 14170724 14049916 13857199 13828098 13785969 14189785 14458476 14531993 14990297 15747959 14840928
14345 14840928 14221397 13944073 14318500 15081027 15816444 14575777 14760142 14015292 14295830
14336 14295830 14652482 14996238 15453067 14567317 13987444 15408451 15510043 14688607 14423927
14327 14423927 14745572 14092006 13800594 15681436 15977705 14958608 13915375 13873046 13672018
14318 13672018 14596197 15293244 14939238 14925596 13965514 13426658 14002795 14790225 15197679
14309 15197679 14794862 14569307 14372548 14042154 14233396 13772821 14882872 14656764 14585496
14300 14585496 14871188 14769490 14746116 15216578 14370408 15243855 15347236 14104722 14710016
14291 14710016 14252783 14629701 14748817 14635815 14501652 14618734 13387308 14361529 13375880
14282 13375880 13378851 14084419 14557706 14185517 13712386 14284557 14278163 14005654 12815360 13103144
14272 13103144 13603589 13788792 14910399 15761751 14950450 14310679 14005451 14400780 14485556
14263 14485556 13440379 12447530 13659324 14701302 13952405 14489046 13672994 12949692 13331625
14254 13331625 13754494 14327191 13955177 14173379 14042493 13300321 13482532 13784869 14737239
14245 14737239 15467768 14654968 14916194 15000808 15137203 14806785 13895854 13258393 13028165
14236 13028165 14358419 14897364 15042829 14887150 15250097 14669223 13459519 12693063 14145379
14227 14145379 15026480 15385107 14899312 13819862 13505135 13793559 13550712 14290902 14352871
14218 14352871 14414626 14288388 15482162 15489713 14594427 14632236 12896460 13123161 14785881
14209 14785881 14675896 14985726 14390121 13729893 14586232 14701058 14419030 14742336 13642952
14200 13642952 13513316 13908435 14126654 14340763 14171804 14821723 15467701 14870217 14035977
14191 14035977 13934057 14211766 15413166 14523599 14065275 15414293 15914490 15409309 15782404
14182 15782404 15508943 14660727 15303877 15182692 14558308 13863873 14419433 15114020 14852406
14173 14852406 14558478 13592576 14617281 14420726 14261689 14737889 15370649 14510351 14137958
14164 14137958 13916744 14019553 13419314 13804201 14842924 15198341 15411832 13965875 13817696
14155 13817696 14379295 14025274 14409394 13757483 14321106 14230884 15094670 15739870 14243122
14146 14243122 14492649 15191589 15239140 15456573 14109014 13561853 13966599 14502053 14753700
14137 14753700 14850815 15231460 16044287 15311885 15162923 14592455 13963156 13395719 13711105
14128 13711105 13591873 14197132 14256766 14454741 15374628 14614361 15045360 14090018 13678458
14119 13678458 14609217 13712108 13503439 14109970 14013850 14220414 14062600 13787864 13407354
14110 13407354 13701484 14692598 15077762 14774088 15172712 14292121 14659268 14920710 14788935
14101 14788935 14636230 14868816 14964571 14470021 14248687 14414182 13279534 14325707 15101895
14092 15101895 15720443 15303553 14875893 15008524 13751130 14492085 15084595 14137985 14467189
14083 14467189 15840470 15284445 15064220 15332525 15590786 14753241 14228110 14422082 13984704
14074 13984704 14695332 14594990 15057741 14981841 14170678 14598842 14306650 14409337 14710993
14065 14710993 14151533 13366991 13240160 13922826 14874836 15970428 15326285 15169194 14721777
14056 14721777 14891793 14961946 14662150 14896204 15242093 15106969 14202174 14196770 14175326 14830035
14046 14830035 14790627 15048096 14978906 14481251 13885438 15011713 15710662 14811104 14563452
14037 14563452 15888011 15271700 14934031 15691275 14911112 16477076 15732939 14898463 15245480
14028 15245480 15133444 13862940 14788666 15087759 14256191 14772691 14815788 14859980 14635204
14019 14635204 14821611 14416196 14075336 13735408 14200450 14441408 13914961 14580111 14532003
$$ [...]
##END NTUPLES=NMR SPECTRUM
##END=
