##TITLE=1H_DE-80H_X3
 200.13MHz, d2o
 8 sc
 
 19ns.26.2.2025
##JCAMPDX= 6.0         $$ Bruker NMR JCAMP-DX V2.0
##DATA TYPE= NMR SPECTRUM
##DATA CLASS= NTUPLES
##ORIGIN= UXNMR, Bruker Analytische Messtechnik GmbH
##OWNER= pz
$$ XWIN-NMR		Version 3.5
$$ Wed Jun 11 11:25:18 2025 Russian Standard Time (UT+4h)  Yarkov@DPX200
##.OBSERVE FREQUENCY= 200.1313
##.OBSERVE NUCLEUS= ^1H
##.ACQUISITION MODE= SIMULTANEOUS
##.ACQUISITION SCHEME= undefined
##.AVERAGES= 8
##.DIGITISER RES= 18
##SPECTROMETER/DATA SYSTEM= spect
##.PULSE SEQUENCE= zg30
##.SOLVENT NAME= CDCl3
##.SHIFT REFERENCE= (INTERNAL, CDCl3, 0, 15.423)
##AUDIT TRAIL= $$ (NUMBER, WHEN, WHO, WHERE, WHAT)
$$ ##TITLE= Audit trail, XWIN-NMR		Version 3.5
$$ ##JCAMPDX= 5.01
$$ ##ORIGIN= Bruker BioSpin GmbH
$$ ##OWNER= Yarkov
$$ C:/Bruker/XWIN-NMR/data/yarkov2/nmr/H-C/1/pdata/1/auditp.txt
$$ ##AUDIT TRAIL=  $$ (NUMBER, WHEN, WHO, WHERE, WHAT)
(   1,<2025-06-11 11:24:30.96 +0400>,<Yarkov>,<DPX200>,
      <created by zg, POWCHK disabled, PULCHK disabled
       configuration hash MD5:
       00 E9 B6 7A A2 85 ED C7 34 08 36 98 17 FE 4E 26
       data hash MD5: 16K
       86 5A 57 6D 40 05 16 09 33 FE F0 6F 58 B2 2B 43>)
(   2,<2025-06-11 11:24:36.70 +0400>,<Yarkov>,<DPX200>,
      <Start of raw data processing
       efp BC_mod = 2 LB = 0.25 FT_mod = 6 PKNL = 1 PHC0 = -1710.501 PHC1 = 9.76656 SI = 16K 
       data hash MD5: 16K
       3D A9 00 30 5C 43 8E B1 47 0C 1E 40 95 C3 5A FD>)
(   3,<2025-06-11 11:24:42.01 +0400>,<Yarkov>,<DPX200>,
      <abs ABSG = 5 
       data hash MD5: 16K
       7F C6 5C EE 12 ED 4F 69 3B 8B 7A D0 8B 31 E4 A1>)
$$ ##END=
$$ 
$$ hash MD5
$$ 50 21 1D 1B FD 46 31 AB 1D 88 59 52 2C 3B 3B B2
##$RELAX= 
##$RELAX= 
##$RELAX= 
##$RELAX= 
##$RELAX= 
##$RELAX= 
$$ Bruker specific parameters
$$ --------------------------
##$DU= <C:/Bruker/XWIN-NMR>
##$EXPNO= 1
##$NAME= <H-C>
##$PROCNO= 1
##$TYPE= <nmr>
##$USER= <yarkov2>
##$AMP= (0..31)
100 100 100 100 100 100 100 100 100 100 100 100 100 100 100 100 100 100 
100 100 100 100 100 100 100 100 100 100 100 100 100 100 
##$AQSEQ= 0
##$AQ_mod= 1
##$AUNM= <au_zg>
##$AUTOPOS= <>
##$BF1= 200.13
##$BF2= 200.13
##$BF3= 200.13
##$BF4= 200.13
##$BF5= 200.13
##$BF6= 200.13
##$BF7= 200.13
##$BF8= 200.13
##$BYTORDA= 1
##$CFDGTYP= 0
##$CFRGTYP= 5
##$CHEMSTR= <none>
##$CNST= (0..31)
1 1 145 1 1 1 1 1 1 1 1 1 1 1 1 1 1 1 1 1 1 1 1 1 1 1 1 1 1 1 1 1 
##$CPDPRG= <>
##$CPDPRG1= <>
##$CPDPRG2= <>
##$CPDPRG3= <>
##$CPDPRG4= <mlev>
##$CPDPRG5= <mlev>
##$CPDPRG6= <mlev>
##$CPDPRG7= <mlev>
##$CPDPRG8= <mlev>
##$CPDPRGB= <>
##$CPDPRGT= <>
##$D= (0..31)
0 0.7 0 0 0 0 0 0 0 0 0 0.03 0 0 0 0 0 0 0 0 0 0 0 0 0 0 0 0 0 0 0 0 
##$DATE= 1749626670
##$DBL= (0..7)
120 120 120 120 120 120 120 120 
##$DBP= (0..7)
150 150 150 150 150 150 150 150 
##$DBP07= 0
##$DBPNAM0= <>
##$DBPNAM1= <>
##$DBPNAM2= <>
##$DBPNAM3= <>
##$DBPNAM4= <>
##$DBPNAM5= <>
##$DBPNAM6= <>
##$DBPNAM7= <>
##$DBPOAL= (0..7)
0.5 0.5 0.5 0.5 0.5 0.5 0.5 0.5 
##$DBPOFFS= (0..7)
0 0 0 0 0 0 0 0 
##$DE= 6
$$ [...]
##$SUBNAM3= <"">
##$SUBNAM4= <"">
##$SUBNAM5= <"">
##$SUBNAM6= <"">
##$SUBNAM7= <"">
##$SUBNAM8= <"">
##$SUBNAM9= <"">
##$SW= 18.0517328524113
##$SWIBOX= (0..15)
0 0 2 0 0 0 0 0 0 0 0 0 0 0 0 0 
##$SW_h= 3612.71676300578
##$TD= 16384
##$TD0= 1
##$TE= 0
##$TE2= 300
##$TE3= 300
##$TEG= 300
##$TL= (0..7)
0 120 120 120 120 120 120 120 
##$TP= (0..7)
150 150 150 150 150 150 150 150 
##$TP07= 0
##$TPNAME0= <>
##$TPNAME1= <>
##$TPNAME2= <>
##$TPNAME3= <>
##$TPNAME4= <>
##$TPNAME5= <>
##$TPNAME6= <>
##$TPNAME7= <>
##$TPOAL= (0..7)
0.5 0.5 0.5 0.5 0.5 0.5 0.5 0.5 
##$TPOFFS= (0..7)
0 0 0 0 0 0 0 0 
##$TUNHIN= 0
##$TUNHOUT= 0
##$TUNXOUT= 0
##$USERA1= <user>
##$USERA2= <user>
##$USERA3= <user>
##$USERA4= <user>
##$USERA5= <user>
##$V9= 5
##$VALIST= <valist>
##$VCLIST= <CCCCCCCCCCCCCCC>
##$VD= 0
##$VDLIST= <DDDDDDDDDDDDDDD>
##$VPLIST= <PPPPPPPPPPPPPPP>
##$VTLIST= <TTTTTTTTTTTTTTT>
##$WBST= 1024
##$WBSW= 4
##$XGAIN= (0..3)
0 0 0 0 
##$XL= 0
##$YL= 0
##$YMAX_a= 263909
##$YMIN_a= -204229
##$ZGOPTNS= <>
##$ZL1= 120
##$ZL2= 120
##$ZL3= 120
##$ZL4= 120
##$ABSF1= 15.41745
##$ABSF2= -2.634398
##$ABSG= 5
##$ABSL= 3
##$ALPHA= 0
##$AQORDER= 0
##$ASSFAC= 0
##$ASSFACI= 0
##$ASSFACX= 0
##$ASSWID= 0
##$AUNMP= <proc_1d>
##$AZFE= 0.1
##$AZFW= 0.1
##$BCFW= 0
##$BC_mod= 2
##$BYTORDP= 0
##$COROFFS= 0
##$CY= -3
##$DATMOD= 1
##$DC= 0
##$DFILT= <>
##$DTYPP= 0
##$F1P= 0
##$F2P= 0
##$FCOR= 1
##$FTSIZE= 16384
##$FT_mod= 6
##$GAMMA= 0
##$GB= 0
##$INTBC= 1
##$INTSCL= 3.241238e-09
##$ISEN= 128
##$LB= 0.25
##$LEV0= 0
##$LPBIN= 0
##$MAXI= 10000
##$MC2= 0
##$MEAN= 0
##$ME_mod= 0
##$MI= 1.114404
##$NCOEF= 0
##$NC_proc= -8
##$NLEV= 6
##$NOISF1= 3.799351
##$NOISF2= 2.8
##$NSP= 0
##$NTH_PI= 0
##$NZP= 0
##$OFFSET= 15.42296
##$PC= 1
##$PHC0= -1710.501
##$PHC1= 9.76656
##$PH_mod= 1
##$PKNL= yes
##$PPARMOD= 0
##$PSCAL= 0
##$PSIGN= 0
##$REVERSE= no
##$SF= 200.130019761214
##$SI= 16384
##$SIGF1= 3
##$SIGF2= 2
##$SINO= 0.751879
##$SIOLD= 32768
##$SREGLST= <19F.Aceton>
##$SSB= 0
##$STSI= 16384
##$STSR= 0
##$SW_p= 3612.71676300578
##$SYMM= 0
##$S_DEV= 0
##$TDeff= 16384
##$TDoff= 0
##$TI= <>
##$TILT= no
##$TM1= 0
##$TM2= 0
##$TOPLEV= 0
##$USERP1= <user>
##$USERP2= <user>
##$USERP3= <user>
##$USERP4= <user>
##$USERP5= <user>
##$WDW= 1
##$XDIM= 16384
##$YMAX_p= 463482529
##$YMIN_p= -906783
$$ End of Bruker specific parameters
$$ ---------------------------------
##NTUPLES= NMR SPECTRUM
##VAR_NAME=  FREQUENCY,     SPECTRUM/REAL,   SPECTRUM/IMAG
##SYMBOL=    X,             R,               I
##VAR_TYPE=  INDEPENDENT,   DEPENDENT,       DEPENDENT
##VAR_FORM=  AFFN,          ASDF,            ASDF
##VAR_DIM=   16384,         16384,           16384
##UNITS=     HZ,            ARBITRARY UNITS, ARBITRARY UNITS
##FACTOR=    0.220516191357247, 1,           1
##FIRST=     3086.59734588741, 0,            0
##LAST=      -526.119417118369, 0,           0
##MIN=       -526.119417118369, -906783,     0
##MAX=       3086.59734588741, 463482529,    0
$$ Real data points
##PAGE= N=1
##DATA TABLE= (X++(R..R)), XYDATA
$$ [...]
7377A796002J17419o50m3462j08484m252M8884J7960J16846J44219n1049j74865
7366A858568J1324J02688m3894K53559J11516l76631j69956P8850M6495l43108
7356A529411j24640N11498K52511L268R9827K17085j05496N8974R982j26277m8914
7345B277229P7963j31610M2023j02334j64102j3436R9512J07105J82232j052L2929
7334B406459k83348M9520J78886J044k4502R3417J90979q8020K45717J10937j25719
7323B755370k47316J53558J77247J12662k02602j82463n0225J9243j0643p2236
7313B452595J45931L157M1171p524Q3464j66829k66063K76326J61162J13411J5131
7302B851932m6545l764o9954N0231M37220R2865J00353j19069j82448k23103L7719
$$ y = [1796002, 1913421, 1912771, 1869309, 1760825, 1756573, 1805457, 1823417, 1940263, 2084482, 2033433, 1858568, 1869892, 1972580, 1928686, 2182245, 2293761, 1917130, 1747174, 1826024, 1872519, 1529411, 1404771, 1916269, 2168780, 2172048, 2271875, 2488960, 2383464, 2442438, 2452420, 2326143, 2277229, 2355192, 2223582, 2265605, 2163271, 1999169, 1985733, 2085245, 2192350, 2374582, 2373530, 2406459, 2123111, 2172631, 2351517, 2352561, 2328059, 2421476, 2612455, 2524435, 2770152, 2881089, 2755370, 2508054, 2661612, 2838859, 2951521, 2748919, 2566456, 2516231, 2535474, 2524831, 2452595, 2598526, 2601683, 2642854, 2635330, 2718794, 2551965, 2285902, 2562228, 2723390, 2836801, 2851932, 2805387, 2801623, 2731669, 2781900, 3219120, 3311985, 3412338, 3293269, 3110821, 2887718, 2925437]
7291B925437M00958J13734l48209J88722J1805R515L92059j05052j28022J74711
7281C635658J0309o6331k83033J01594P0547J28442L14348j07918k82414k10298
7271C310904P0880K51211j62468L5591M31178j21521j10145k04109l9587J43293
7261C605227J46006O0508K67821l4939r942O7725J8772L8885J61916N3110P5636
7250D450725n2449j57961O9009J68869N4289l4745j21686J02623K39101q3969
7240D633806j03459N8156k76625j03945L594K92392K34188j4365o3375N0800K3853
7229D735020r6270J83501J3367j34419K74200k7791J21421J41343J0573J97512
7219E418457m8694J51285Q5176j26726K1744J13668K72010J34313J44946K95780
$$ y = [2925437, 3326395, 3440129, 3091920, 3280642, 3292447, 3301962, 3694021, 3588969, 3460947, 3635658, 3645967, 3579636, 3296603, 3398197, 3468744, 3597186, 3911534, 3803616, 3521202, 3310904, 3381784, 3632995, 3470527, 3506118, 3937296, 3815775, 3705630, 3501521, 3461934, 3605227, 3751233, 3811741, 4079562, 4044623, 4034681, 4102406, 4121178, 4160063, 4321979, 4375089, 4450725, 4398276, 4240315, 4309324, 4478193, 4532482, 4497737, 4376051, 4478674, 4717775, 4633806, 4530347, 4588503, 4311878, 4207933, 4211527, 4503919, 4738107, 4723742, 4660367, 4711167, 4735020, 4638750, 4822251, 4835618, 4701199, 4975399, 4947608, 5069029, 5210372, 5220945, 5418457, 5369763, 5521048, 5606224, 5479498, 5501242, 5614910, 5886920, 6021233, 6166179, 6461959]
7209F461959J86774l2979Q3478K50081J00826K43755n7287L26103J77304O9397
7199G809411M8585j09078j73713k83782J66969j52234m7692j76683k37963P383
7189F851203j38192k16012J27172P0371l36417O2901K5116l08677p0185k58071
7179E809209k71829J35352l31771J29063J43489J67322l86730m96997j71182l7812
7169D688114J3129R9260J97908J06786j07325l8698j2342k83466o4721N164J36351
7158D740160P0534m1281N5922K21635k30878j64319K36814q1613J28061K39957
7148E174992R6745r4665j70020J54235J77388j14138J32444Q3945J11052j21363
7138E430615k31394J83732N5521o8622l6899m4844L719J33910M9055j77699L3991
$$ y = [6461959, 6648733, 6615754, 6699232, 6949313, 7050139, 7293894, 7236607, 7562710, 7740014, 7809411, 7857996, 7748918, 7575205, 7291423, 7458392, 7306158, 7258466, 7081783, 6843820, 6851203, 6713011, 6496999, 6624171, 6694542, 6358125, 6421026, 6446142, 6137465, 6067280, 5809209, 5537380, 5672732, 5340961, 5470024, 5613513, 5780835, 5394105, 4897108, 4725926, 4688114, 4701243, 4800503, 4998411, 5105197, 4997872, 4959174, 4946832, 4663366, 4598645, 4603809, 4740160, 4810694, 4769413, 4825335, 5046970, 4816092, 4651773, 4888587, 4806974, 4935035, 5174992, 5271737, 5177072, 5007052, 5161287, 5338675, 5224537, 5356981, 5440926, 5551978, 5430615, 5199221, 5382953, 5438474, 5369852, 5332953, 5288109, 5291828, 5425738, 5474793, 5297094, 5331085]
7127E331085J10498J65027m4052j11266k8271Q008M6143p3069Q6311l6675Q6127
7116E539866j41843J1862J09085K7989J81061p1271j10174L55764Q8206j26800
7106E863745l71321L7191J80592O7950m4443J67241j1385J65135L3903j56655
7096E931953j2791j99711O9111o140Q1693J49195K965J18252J71172K16933k6531
7085F496101k47164k49775J40596N2936L18196J11806j98583k90438K55703K29423
7075F618801j86487O4076j61304k9619K26468J50952q4152Q7209J45930J0322
7065F842196p8655P2819M3175R9112j46877M884J71651l80724o9418J66172k44573
7054F479762K78148O344J5778J36361J81114R7652Q990k56789Q3763J71742j3477
$$ y = [5331085, 5441583, 5606610, 5562558, 5451292, 5423021, 5431029, 5477172, 5404103, 5490414, 5453739, 5539866, 5398023, 5409885, 5518970, 5546959, 5728020, 5656749, 5546575, 5902339, 5990545, 5863745, 5492424, 5529615, 5710207, 5778157, 5733714, 5900955, 5889570, 6054705, 6088608, 5931953, 5919162, 5719451, 5788562, 5782422, 5864115, 6013310, 6016275, 6134527, 6305699, 6522632, 6496101, 6248937, 5999162, 6139758, 6192694, 6510890, 6622696, 6424113, 6133675, 6389378, 6618801, 6432314, 6496390, 6335086, 6305467, 6531935, 6682887, 6598735, 6685944, 6831874, 6842196, 6763541, 6836360, 6879535, 6978647, 6831770, 6836654, 7008305, 6627581, 6558163, 6724335, 6479762, 6757910, 6764254, 6780032, 6916393, 7097507, 7195159, 7204149, 6947360, 7031123, 7202865, 7189388]
7043G189388l1760l5049P8875j29235k56434K7769L42762J13773l03315L25660
7033G322434L35299j86427j83607j9439L636J28358J01015J15639k70372m0258
7023G306278K32486M1933k19539J31634J33797k62920P9718j6660J58408K907
7013G588042k18894K09086l9645q0569j7449j38013M23960J18724j05756R5542
7003G835028n7386q7502o5409k3038R059P0002k15824m0724J30187p6088J98476
6992G676781R9328O2563j61625R0681j68308J2231J67690j78868j15054j3575
6982G471844j74559J50521j67061M3027J85872P7384r3400j18852K28954P5172
6972G678902k09435r2547K23294J49440J20946l36774j35062J38440q6941J7924
$$ y = [7189388, 7157628, 7122579, 7201454, 7072219, 6815785, 6843554, 7186316, 7300089, 6996774, 7322434, 7657733, 7471306, 7287699, 7268260, 7271896, 7400254, 7501269, 7616908, 7346536, 7306278, 7538764, 7580697, 7361158, 7492792, 7626589, 7363669, 7443387, 7426727, 7585135, 7588042, 7369148, 7578234, 7538589, 7458020, 7440571, 7302558, 7726518, 7845242, 7739486, 7835028, 7777642, 7690140, 7624731, 7601693, 7610752, 7680754, 7464930, 7424206, 7554393, 7478305, 7676781, 7776109, 7838672, 7677047, 7767728, 7599420, 7611651, 7779341, 7600473, 7485419, 7471844, 7297285, 7447806, 7280745, 7323772, 7509644, 7587028, 7493628, 7374776, 7603730, 7678902, 7469467, 7376920, 7600214, 7749654, 7870600, 7533826, 7398764, 7537204, 7450263, 7468187]
6962G468187K97260K43589N1470k62894j1000K09061k16033K28637K89877M3149
6952H341303J45870j02797p1928J17371J18610p0028K34986M05214K14750L66026
6942I699377L39365K74293P5397M05103Q5826L82535L66861K90629J82511r861
6932A2092036K30069m26873k72951K67389k80918m66115m24297l56794k56715
6923A0104831o75130k17561l60783q524l07252l35360R9993r6832l06099j41602
6913G755681p5298k09477j77906j26871j72905r0001K60753j57722l13904p4863
6903F617487j81632j26781K60645j33195j43037L9522j41279Q7517M8197k2870
6893F304574K9370J34193o5236j27921j83646o0265j58351j28054k6728j15867
$$ y = [7468187, 7765447, 8009036, 8060506, 7797612, 7786612, 7995673, 7779640, 8008277, 8298154, 8341303, 8487173, 8384376, 8312448, 8429819, 8548429, 8478401, 8713387, 9118601, 9333351, 9699377, 10038742, 10313035, 10388432, 10793535, 10879361, 11261896, 11628757, 11919386, 12101897, 12092036, 12322105, 11895232, 11622281, 11889670, 11608752, 11142637, 10718340, 10361546, 10104831, 9429701, 9212140, 8851357, 8842833, 8535581, 8200221, 8300214, 8203382, 7897283, 7755681, 7680383, 7470906, 7293000, 7166129, 6993224, 6903223, 7163976, 7006254, 6692350, 6617487, 6435855, 6309074, 6569719, 6436524, 6293487, 6333009, 6191730, 6279247, 6327444, 6304574, 6333944, 6468137, 6402901, 6274980, 6091334, 6031069, 5872718, 5744664, 5717936, 5602069]
6883E602069J66547p771j76224k97798k45385q3479J79625K20500N1042l22714
6873E086412j87501K3508j90268J00227J27411p2467R5759J39143j15870p7413
6863D928941j08499J9196k19544L3770P1487l47768J53084K01041j16849j94410
6853D420449p2725J88787m35375K15406L4903j31851K88345j46507M2057j13760
6843D289729m9731j9093m7508J28500L51946k70955l96172Q9659l40875J46940
6833C882440M71001N8660P2840m3974P4766l13968M0465k6135j16684R6616J85993
6822D382020J55169k45846j15483j23535R8858K17553O768o8358L14876L44597
6812D966619l80693O2076J1299j88945J39249J47364j30222M7962j74023k57603
$$ y = [5602069, 5768616, 5760845, 5584621, 5286823, 5041438, 4957959, 5137584, 5358084, 5409126, 5086412, 4898911, 4922419, 4732151, 4832378, 4959789, 4887322, 4983081, 5122224, 5006354, 4928941, 4820442, 4839638, 4620094, 4653864, 4725351, 4377583, 4530667, 4731708, 4614859, 4420449, 4347724, 4536511, 4101136, 4316542, 4351445, 4219594, 4507939, 4361432, 4403489, 4289729, 4239998, 4220905, 4173397, 4301897, 4653843, 4382888, 3986716, 4076375, 3735500, 3882440, 4353441, 4412101, 4484941, 4440967, 4515733, 4201765, 4242230, 4216095, 4099411, 4196027, 4382020, 4537189, 4291343, 4175860, 4052325, 4151183, 4368736, 4375504, 4307146, 4622022, 4966619, 4585926, 4648002, 4659301, 4470356, 4609605, 4756969, 4626747, 4674709, 4500686, 4243083]
6802D243083O0260p834l61348l10478J30210O3346q6831m1445q9523j61254o9971
6791C368215P5291J60971o0150O712j92183k45330n0694J21253r9717j3837J14351
6780C184882K37863L4935j36091O3902j3886n2588J94465l13077o0064j9533K10874
6769C331682K9993k62558q9008J18426J79433j54387J8357p9882k24675K6010
6759B893391L3846K2215j51758j88572L53063P2345p568K78505j18824O8182k2247
6748C232578l41687k46114J03868J16514k55543R6394o9558R2013J01612r7567
6738B732510l142J69063N7613j70714k34425q2962O0736J00077K12592L120k93432
6727B551036l03096O9745K18633j60346K35484j97678q4793N862K11577R4950
$$ y = [4243083, 4303343, 4295509, 3934161, 3623683, 3753893, 3817239, 3730408, 3688963, 3599440, 3438186, 3368215, 3443506, 3604477, 3544327, 3551039, 3358856, 3113526, 3062832, 3184085, 3084368, 3070531, 3184882, 3422745, 3457680, 3321589, 3385491, 3371605, 3319017, 3513482, 3200405, 3140341, 3120808, 3331682, 3361675, 3099117, 3010109, 3128535, 3307968, 3153581, 3171938, 3092056, 2867381, 2893391, 2927237, 2949452, 2797694, 2609122, 2962185, 3034530, 3026962, 3305467, 3186643, 3254825, 3232578, 2890891, 2644777, 2748645, 2865159, 2609616, 2706010, 2636452, 2728465, 2830077, 2732510, 2729368, 2898431, 2956044, 2785330, 2550905, 2467943, 2528679, 2628756, 2841348, 2844468, 2551036, 2247940, 2317685, 2536318, 2375972, 2611456, 2413778, 2328985, 2334847, 2546424, 2641374]
6717B641374q4512K60331q4580j71273R4826Q8997j05564R328j31672Q312l34350
6706B191217J48808J77330J12262L03045q1350k07351k06334J26535K35306J26139
6696B925607N5308j67363j78796K01308n9450o0216j36547L28599R2998j54845
6686B846603j29107J57633J3416q2487r1167j99766K15377j7050k11236J51515
6676B653731r496M7402K37048m2282J75853m3619j91491J88836J87047j44315
6666C058714j52041L07508J33326l7877R3202N0070J06038k47056p0488O0966
6656C302362J19391j14578m0177r6442K9423J26098Q7798J09675K00053j57416
6646C566187k00998M9001J96978p7658P8590N4059L04731J8596j14708J05883
$$ y = [2641374, 2556862, 2817193, 2732613, 2561340, 2656166, 2745163, 2639599, 2648927, 2517255, 2525567, 2191217, 2340025, 2517355, 2629617, 2932662, 2851312, 2643961, 2437627, 2564162, 2799468, 2925607, 2980915, 2813552, 2634756, 2836064, 2776614, 2716398, 2579851, 2908450, 3001448, 2846603, 2717496, 2875129, 2888545, 2806058, 2714891, 2515125, 2730502, 2713452, 2502216, 2653731, 2644235, 2691637, 2928685, 2886403, 3062256, 3018637, 2827146, 3015982, 3203029, 3058714, 2906673, 3214181, 3347507, 3309630, 3402832, 3452902, 3558940, 3311884, 3241396, 3302362, 3421753, 3307175, 3266998, 3170556, 3199979, 3326077, 3413875, 3523550, 3723603, 3566187, 3365189, 3414190, 3611168, 3533510, 3612100, 3666159, 3970890, 3989486, 3874778, 3980661]
6636C980661K72803M1847j99101J85423Q0834J57894r351K71498L48364L75105
6626E505977J58711N251J80542L91236p549R5218J02983K63462M87143J6370J85491
6615G384835L03053L16165N13207K84847L81981L57661K36554N52719M74042N55667
6605A1360731Q23047M53060N62899J012980N93234O74954Q67937Q32523Q31090
6596A8012455J185178J322658J443105J453214J897000J724705J688250K380906
6588C1107471K469384K126823K579437K160502J679855J311130N02921L62034
6580D4299557l42204o37435j283491j763754j840017j945471k141548k341982
6572C2003655k246534k046911j776590j463855j198991j074831j085785r88261
$$ y = [3980661, 4253464, 4295311, 4096210, 4281633, 4362467, 4520361, 4511010, 4782508, 5130872, 5505977, 5664688, 5669939, 5850481, 6241717, 6234168, 6329386, 6432369, 6695831, 7182974, 7199344, 7384835, 7687888, 8004053, 8517260, 8802107, 9184088, 9541749, 9778303, 10331022, 10805064, 11360731, 12183778, 12636838, 13199737, 14212717, 14805951, 15480905, 16348842, 17181365, 18012455, 19197633, 20520291, 21963396, 23416610, 25313610, 27038315, 28726565, 31107471, 33576855, 35703678, 38283115, 40443617, 42123472, 43434602, 43937523, 44299557, 43957353, 43319918, 42036427, 40272673, 38432656, 36487185, 34345637, 32003655, 29757121, 27710210, 25933620, 24469765, 23270774, 22195943, 21110158, 20121897]
6564B0121897j017612o59482p35523n25102n56926l36661j52147l88391k46664
6555A5503389n3330j61902k62546k07459m45537m20276m63684k00090n88021q92582
6545A1807962m59917m19926m82048m59230k46025n28097n71337k57771J05507
6536H489118k46107m27872k25556m23232l10757j35046l61683k20755O3973k03294
6526E998789j33533R5415k26647j69115J58747k44393k78064j41761L9112k27119
6516D871431q8606j75744M7271k48909j09724L50159j26346l30569J15973r1966
6506D212970l1765j38108k92741J94411Q0122K8129j53165j47614p0210k32667
6496C449362m14437K25906R0291R9092j9884k00238p8006O4928j2294j50961q648
$$ y = [20121897, 19104285, 18444803, 17709280, 17184178, 16627252, 16290591, 16138444, 15750053, 15503389, 15450059, 15288157, 15025611, 14818152, 14372615, 13952339, 13488655, 13288565, 12700544, 11807962, 11348045, 10928119, 10446071, 9986841, 9740816, 9212719, 8641382, 8383611, 8489118, 8243011, 7815139, 7589583, 7166351, 6855594, 6720548, 6358865, 6138110, 6202083, 5998789, 5865256, 5960671, 5734024, 5564909, 5723656, 5479263, 5201199, 5059438, 5098550, 4871431, 4782825, 4607081, 4654352, 4405443, 4295719, 4645878, 4519532, 4188963, 4304936, 4212970, 4181205, 4043097, 3750356, 3944767, 4024889, 4053018, 3899853, 3752239, 3682029, 3449362, 3034925, 3260831, 3351122, 3450214, 3430330, 3230092, 3152086, 3217014, 3204720, 3053759, 3045111]
6485C045111J31065k32202k3249N3712M0420O113j54568j48401K7063j1869J22324
6474B855519J92904J59473k62044p1617J46050j21009j64896J04396O1952l74962
6464B525766k24809K77326P481J29652L8224j14027J37914Q8516o5388k77628
6454B523027l64571J24134L31766j38893k17921N6121L9078J30800j57930o9638
6444B255973R6872O8358P1060j57091J86599l48377K08071j69901J42792Q5889
6434B440245j47495J07931o7944j3085K08390j14286p6079K63349O0810M7854
6424B709690k88781m2685K26528j44595J08801q3871q9170j91295q1916K37426
6414B360132N569l7131j48411q0473K60529n6045j05622N4736J58382k5964j95728
$$ y = [3045111, 3176176, 2943974, 2920725, 2974437, 3014857, 3020970, 2866402, 2718001, 2745064, 2733195, 2855519, 3048423, 3207896, 2945852, 2874235, 3020285, 2899276, 2734380, 2838776, 2900728, 2525766, 2300957, 2578283, 2585764, 2715416, 2753640, 2639613, 2777527, 2866043, 2800655, 2523027, 2158456, 2282590, 2614356, 2475463, 2257542, 2313663, 2352741, 2483541, 2325611, 2255973, 2352845, 2421203, 2492263, 2335172, 2521771, 2173394, 2381465, 2211564, 2354356, 2440245, 2292750, 2400681, 2332737, 2319652, 2528042, 2413756, 2337677, 2601026, 2661836, 2709690, 2420909, 2378224, 2604752, 2460157, 2568958, 2485087, 2395917, 2204622, 2122706, 2360132, 2365701, 2328570, 2180159, 2099686, 2360215, 2304170, 2198548, 2253284, 2411666, 2385702, 2189974]
6403B189974q4527J03792j76921J73354O7908N6442O2051j42742J7609Q4787J6706
6392B368433J4980J16790L0035R5380k11265k14877N9306M0003j06939N6902l2988
6381B215760l7086R6897J56591m8055k41708k6553R4414J17184J40902k48318
6371B220028J82680L5462J5032N3439k48893O5677j5275K02442r6461K55714l1014
6360B638831m53624l2626J98162L21652j37538k05094K29132J53389p3085q8301
6350B550898j23200L0540p4883K29794K28520J23062j21896j59365L447m9911
6340B637006L42698M7029p7587K06340j53400O6503o7664J78596j23532K8669
6330C084658O9927M0791j72237o604o0331m0665K45077O5340N2089J50822k52748
$$ y = [2189974, 2105447, 2209239, 2032318, 2205672, 2273580, 2330022, 2392073, 2249331, 2266940, 2351727, 2368433, 2383413, 2500203, 2530238, 2625618, 2414353, 2199476, 2258782, 2298785, 2191846, 2248748, 2215760, 2178674, 2275571, 2432162, 2384107, 2142399, 2115846, 2210260, 2327444, 2468346, 2220028, 2402708, 2438170, 2453202, 2506641, 2257748, 2323425, 2308150, 2510592, 2414131, 2669845, 2638831, 2185207, 2152581, 2350743, 2672395, 2534857, 2329763, 2558895, 2712284, 2639199, 2550898, 2427698, 2458238, 2383355, 2613149, 2841669, 2964731, 2842835, 2683470, 2686917, 2637006, 2979704, 3026733, 2949146, 3155486, 3002086, 3068589, 3000925, 3179521, 3055989, 3084658, 3154585, 3195376, 3023139, 3016535, 2956204, 2915539, 3160616, 3225956, 3278045, 3428867, 3176119]
6319C176119P6452J42795L6781j8409l901q8740j34138J71753K2005K49489k34730
6308C395476N5975J75829j3030j08614k95917K73916J88417j30517M3061j16423
6298C468173J06277J62216j20864j8405O6592J30739l2109P9224l0834j64888
6288C646121p522j21726R0359p5663j34816K91022N5194K28097l5851l34457j25340
6277C475418J70302L4133J38998K31597j00689P1830J40231j736J40275j7781
6267D282578p9218P9815r0193J71627q0708K6857K4402K3604L5333j65305k28204
6256D000588Q8014J64299N08085j55459K2507k95238l9891K32647J12205K14103
6246D851860j1242l27908J31465J4872P7571N5146n1317K38214j01394k816j68108
$$ y = [3176119, 3252571, 3395366, 3432147, 3413738, 3409837, 3321097, 3186959, 3358712, 3380717, 3630206, 3395476, 3451451, 3627280, 3614250, 3505636, 3209719, 3483635, 3672052, 3541535, 3584596, 3468173, 3574450, 3736666, 3615802, 3597397, 3663989, 3794728, 3762619, 3841843, 3811009, 3646121, 3638599, 3516873, 3607232, 3531569, 3396753, 3687775, 3742969, 3971066, 3935215, 3600758, 3475418, 3645720, 3679853, 3818851, 4050448, 3949759, 4021589, 4161820, 4160084, 4300359, 4282578, 4203360, 4283175, 4192982, 4364609, 4283901, 4310758, 4335160, 4358764, 4394097, 4228792, 4000588, 4088602, 4252901, 4760986, 4605527, 4628034, 4332796, 4292905, 4525552, 4637757, 4851860, 4840618, 4512710, 4644175, 4659047, 4736618, 4791764, 4740447, 4978661, 4877267, 4874451, 4706343]
6235D706343O1485J48711J55568j31250L84592L4044k83080J72767Q0380p5669
6225E253891k06169r6504J09412M8951L43056K33272j18410J52285O6340R5401
6215E881525l4170n2673J92124Q9375K09530j58941j15620J00364J05123K04354
6205F420991N6045J6625J65213K67641J82294k71366j88435O3169O22149M05632
6195G739958k04862J65539K82535k09452L85976Q7599N0309N72263K21086K39202
6185I330153K51333J96348L72835L98814M56721N03945K25779K10249N27534N32174
6175A3005885L20312M68058K74081P98784O03388P11590Q86851Q70343O09065
6166A8548357Q57510Q95406R13220Q75427P06521L24108N28456Q99906N00032
$$ y = [4706343, 4767828, 4916539, 5072107, 4940857, 5325449, 5359493, 5076413, 5249180, 5329560, 5253891, 5047722, 4951218, 5060630, 5109581, 5452637, 5685909, 5567499, 5719784, 5786124, 5881525, 5847355, 5794682, 5986806, 6076181, 6285711, 6126770, 6011150, 6111514, 6216637, 6420991, 6477036, 6493661, 6658874, 6926515, 7108809, 6837443, 6649008, 6712177, 7334326, 7739958, 7535096, 7700635, 7983170, 7773718, 8159694, 8247293, 8297602, 8869865, 9090951, 9330153, 9581486, 9777834, 10150669, 10549483, 11006204, 11510149, 11735928, 11946177, 12473711, 13005885, 13326197, 13794255, 14068336, 14867120, 15470508, 16182098, 17068949, 17939292, 18548357, 19405867, 20301273, 21214493, 22089920, 22796441, 23120549, 23649005, 24548911, 25048943]
6157B5048943Q50810M47587N84912L95382N53031N59777P32987Q05424N69669
6148C0548522Q85600R19887R42506R48059J046716J430697J332937J282082J536854
6139D0873860J430777J276857N52997J032387J003022Q15927N57235N72796N95897
6130D8711755N98110J58181N53037P73221P38319R38907O72749R29710J036152
6121E5110141R43668J065353J269094J494251J798401J572371J735782K011508
6113F7000569J872390J402185J896422J307361Q28822Q73564L9142m04467o75225
6104G4140763q39009q39418j043657j807487j924851j715987k037434k291374
6096F1641546k254460j769797j883916j432643j154289j032761j370890r58228
$$ y = [25048943, 25899753, 26347340, 26932252, 27327634, 27880665, 28440442, 29173429, 29978853, 30548522, 31434122, 32354009, 33296515, 34244574, 35291290, 36721987, 38054924, 39337006, 40873860, 42304637, 43581494, 44134491, 45166878, 46169900, 46985827, 47543062, 48115858, 48711755, 49309865, 49468046, 50021083, 50794304, 51532623, 52471530, 53144279, 54073989, 55110141, 56053809, 57119162, 58388256, 59882507, 61680908, 63253279, 64989061, 67000569, 68872959, 70275144, 72171566, 73478927, 74307749, 75181313, 75220455, 74815988, 74140763, 73301754, 72462336, 71418679, 69611192, 67686341, 65970354, 63932920, 61641546, 59387086, 57617289, 55733373, 54300730, 53146441, 52113680, 50742790, 49784562]
6088D9784562p48192o22808p51292r82727p83402r51114r40061r67033j024215
6079D2013718j115028j133796j336160j242119r74117j395248p06629q40933r65925
6070C2303763r15470r77660r41344q81931l72535l59626n78109l92680j89348
6061B6695060l05021o43861n44909p42733o28253p48820q36451j168390j004855
6052B0071767m23353o75497n72883q16824j56582n64725l48001j26302m35910
6043A5951690l75121k01129k39227l65068k46747j94454K03263L78124k53695
6034A4657636j37025J9749P2132J64057M84462j6374L02610M36540L40348M27416
6024A6751551Q3777K77186M47056M75660K08464O94687L46586M3127K71904K56771
$$ y = [49784562, 49036370, 48413562, 47662270, 46679543, 45896141, 44945027, 44004966, 43037933, 42013718, 40898690, 39764894, 38428734, 37186615, 36212498, 34817250, 34110621, 33269688, 32303763, 31388293, 30410633, 29469289, 28587358, 28214823, 27855197, 27277088, 26884408, 26695060, 26390039, 25746178, 25201269, 24458536, 23830283, 23081463, 22245012, 21076622, 20071767, 19648414, 18972917, 18400034, 17583210, 17426628, 16861903, 16513902, 16387600, 15951690, 15576569, 15375440, 15136213, 14771145, 14524398, 14329944, 14533207, 14911331, 14657636, 14520611, 14540360, 14612492, 14776549, 15261011, 15244637, 15547247, 15983787, 16324135, 16751551, 16835328, 17112514, 17559570, 18035230, 18243694, 18938381, 19284967, 19328094, 19599998, 19856769]
6014A9856769L49828M12075k21306q7959k2549m92248j84108k5024M5717l0732
6004A9600463J63890K56482K58329O60452N13560P34952M81165P17569O75985
5995B4062847P42998P79283O57825O60221O59943K02318l4097J59262r30864n61620
5985B6398116p73925n43018p50164p70151r50045m92357p50614m18703o14159
5976B0334980m06236j41317m09196K4979r1161j46962o7582L44197j642j2258
5966A9427802P8480r7607k65022o4517O248o88965o64085j53094k45763p49548
5956A6583929n73158o52345m05994m70126m89481l18375o31289p0911k56946m64316
5946A2250988k49970k40828k82529q8775k31766n0993k00242k74623O8746k0126
$$ y = [19856769, 20206597, 20618672, 20397366, 20309407, 20286858, 19794610, 19610502, 19585478, 19631195, 19600463, 19764353, 20020835, 20279164, 20939616, 21453176, 22188128, 22669293, 23386862, 24062847, 24805845, 25585128, 26242953, 26903174, 27563117, 27765435, 27731338, 27890600, 26959736, 26398116, 25624191, 25081173, 24331009, 23560858, 22610813, 22118456, 21367842, 20949139, 20334980, 19928744, 19787427, 19378231, 19403210, 19312049, 19165087, 19097505, 19441702, 19440060, 19427802, 19506282, 19408675, 19143653, 19079136, 19085384, 18396419, 17732334, 17579240, 17333477, 16583929, 16010771, 15358426, 14952432, 14482306, 13992825, 13674450, 13043161, 12972250, 12715304, 12250988, 12001018, 11760190, 11477661, 11388886, 11157120, 11106127, 10905885, 10631262, 10700008, 10679882]
5936A0679882j18840j46987K12285m8919j24104k13726p2678L6835J54775r8718
5926A0259805M8864J94479k12668k17173k99350L6333L6104K17096l93952J42918
5916I812456L6554N7385j39426p0826k88045K099L13022J79956j11847L03486
5906A0094814m8980k63765J08050l6443j99103K04959l39077j49228L94167r4548
5896I670846j03657R9115J72132r1352M6947l8945m7787k1409P8349j6669R3358
5885I840928m1091n8221J63327j26519p9992j81056j95178L5450L73627j1908
5875I719367n3482R8813O2973K04785Q7882R5138K7725j09783j32660j09622j91526
5864I699610J19421K63601J25441o7368L50908j39291k02587K3405j3243J95424
$$ y = [10679882, 10561042, 10414055, 10626340, 10577421, 10453317, 10239591, 10166913, 10203748, 10358523, 10259805, 10308669, 10503148, 10290480, 10073307, 9773957, 9810290, 9846394, 10063490, 9669538, 9812456, 9849010, 9906395, 9766969, 9696143, 9408098, 9410197, 9723219, 9903175, 9791328, 10094814, 10045834, 9782069, 9890119, 9853676, 9654573, 9859532, 9520455, 9371227, 9765394, 9670846, 9567189, 9666304, 9838436, 9747084, 9794031, 9755086, 9707299, 9685890, 9764239, 9747570, 9840928, 9799837, 9741616, 9904943, 9778424, 9698432, 9517376, 9322198, 9357648, 9731275, 9719367, 9665885, 9764698, 9827671, 10032456, 10120338, 10215476, 10243201, 10133418, 10000758, 9891136, 9699610, 9819031, 10082632, 10208073, 10140705, 10491613, 10352322, 10149735, 10173140, 10159897, 10355321]
5854A0355321r3418P8812J59268R3045k21400N728o1927J25541J84714j6145j85177
5843A0424362J63219L21369l67673m5171O3873K46719j53101j17173L6284l9650
5833A0533058J8248M44358o8436p4106J34290L45163P9109k75850J51005K92204
5823A1579043p5068J13418R1538L4493J95818J01502J68688K7874l24642J15884
5813A2028548J00896N3416J57965M02422K18417j84275J83637P8239n9790N0865
5803A3030340R9908L1393k416K65251j57497m0445L99757J52046K25860M02763
5793A4406960N2952K62276K27592J51028Q2123n8463J57625K40464N8525R9114
5783A5680196K06716N18234L61016L12077L03914M89174K18569L22603L82842
$$ y = [10355321, 10261903, 10340715, 10499983, 10593028, 10371628, 10377356, 10315429, 10440970, 10625684, 10609539, 10424362, 10587581, 10908950, 10541277, 10496106, 10559979, 10806698, 10653597, 10536424, 10572708, 10533058, 10551306, 10995664, 10927228, 10853122, 10987412, 11332575, 11411684, 11135834, 11286839, 11579043, 11503975, 11617393, 11708931, 11743424, 11939242, 12040744, 12209432, 12237306, 11912664, 12028548, 12129444, 12182860, 12340825, 12743247, 12961664, 12777389, 12961026, 13039265, 12979475, 13030340, 13130248, 13161641, 13159225, 13424476, 13266979, 13226534, 13626291, 13778337, 14004197, 14406960, 14459912, 14722188, 14949780, 15100808, 15182931, 15124468, 15282093, 15522557, 15581082, 15680196, 15886912, 16405146, 16766162, 17078239, 17382153, 17871327, 18089896, 18412499, 18795341]
5774A8795341O39853N30450L77841M54122L72487N66085P45031Q35463K17733
5765B3534406M81455Q32847M70064P65805Q69459Q41744R34056M45718R01657
5756C0077211Q11684R16149J272454J218714Q49886J050738J027743J543026J307228
5747D0074833J810503J530237J649879J594249J969716K098642K229720K475405
5739E5433184K731245K639235K929029L245299K811237L182344L059635L201300
5731G9232508L067954L274938L593203L328489L314597L266271L463104L384576
5723A05925640L531741L481338L310138L353940L408149L332966L188546L321462
5715A32853920L069445L140518L286943L400321L416394L397289M121287M118000
$$ y = [18795341, 19435194, 19965644, 20343485, 20797607, 21170094, 21736179, 22481210, 23316673, 23534406, 24015861, 24848708, 25318772, 26084577, 26954036, 27795780, 28729836, 29175554, 30077211, 30888895, 31805044, 33077498, 34296212, 35146098, 36196836, 37224579, 38767605, 40074833, 41885336, 43415573, 45065452, 46659701, 48629417, 50728059, 52957779, 55433184, 58164429, 60803664, 63732693, 66977992, 69789229, 72971573, 76031208, 79232508, 82300462, 85575400, 89168603, 92497092, 95811689, 99077960, 102541064, 105925640, 109457381, 112938719, 116248857, 119602797, 123010946, 126343912, 129532458, 132853920, 135923365, 139063883, 142350826, 145751147, 149167541, 152564830, 156686117, 160804117]
5707A60804117M597528M985349M787413N595360O247306O367543O707841P513489
5699B07605946P868387P776326P993426Q001395P572296P227683O384170N389200
5691B65818829L696052J847951M4763j533405l334357n135906o280967p599839
5683B47523121q519334r336708j0137129j0486907r942124r353263r353696q655706
5675A71738254q446588p834672o755676o295018n475339m636599m791508m384283
5667A23118571l713880l879427l796183l483214l796289l978657m087655l618680
5659I2764586l403836l189550l592666l126519k514872k434400j948598j623705
5651G0930440j689644j599803r65174r96927j078334n82081n61778m45889q9808
$$ y = [160804117, 165401645, 170386994, 175174407, 180769767, 187017073, 193384616, 200092457, 207605946, 215474333, 223250659, 231244085, 239245480, 246817776, 254045459, 260429629, 265818829, 269514881, 271362832, 271407595, 269874190, 266539833, 261403927, 255122960, 247523121, 239003787, 229667079, 219529950, 209043043, 199100919, 189747656, 180393960, 171738254, 163291666, 155456994, 148701318, 142406300, 136930961, 132294362, 127502854, 123118571, 119404691, 115525264, 111729081, 108245867, 104449578, 100470921, 96383266, 92764586, 89360750, 86171200, 82578534, 79452015, 76937143, 74502743, 72554145, 70930440, 69240796, 67640993, 66675819, 65678892, 64600558, 64018477, 63456699, 63010810, 62921002]
5642F2921002l77300p35447o06269p49499q08752r80499r17276r53494j078795
5633E5713671o57315o84981j152073j530280j367409r39899j151810j297988q33650
5624D6098266n86751r28973q18650o83874q17362p61690o84679o1626l4233m39165
5614D0281263n31994l34278m63598o24568n05179k75473l59465o02099l34147
5605C6250462m08330o81778l48992l28615o96122j75353m07724k86322k48781
5596C2668445n13766l35458m97459n26159l41233k73712o01543k27112N2292K9970
5586B9434265l37099k67152m32051k38507J52422O4929k20714m5048K10544p8464
5576B8243125k31116L40769k3690q0557K79359j04057m87146K13316Q0387m928
$$ y = [62921002, 62543702, 61808255, 61201986, 60452487, 59643735, 58663236, 57745960, 56792466, 55713671, 55056356, 54371375, 53219302, 51689022, 50321613, 49381714, 48229904, 46931916, 46098266, 45511515, 44582542, 43763892, 43080018, 42262656, 41500966, 40816287, 40754661, 40720428, 40281263, 39749269, 39414991, 38951393, 38326825, 37821646, 37546173, 37186708, 36584609, 36250462, 35842132, 35160354, 34811362, 34482747, 33786625, 33611272, 33203548, 32917226, 32668445, 32154679, 31819221, 31321762, 30795603, 30454370, 30180658, 29579115, 29352003, 29404295, 29434265, 29097166, 28830014, 28397963, 28159456, 28311878, 28376807, 28156093, 28111045, 28321589, 28243125, 28012009, 28352778, 28329088, 28248531, 28527890, 28423833, 27936687, 28150003, 28230390, 28225462]
5566B8225462k1687J29385j09927m6019o7303q8461M37671k97839j23112J77156
5556B8215326R3061J71608J85720l4M45166M04490J31463K54033Q998Q9476M64284
5545C0463591L23792L52174L40975M82234J64254K50943N61733O57434M53154
5536C4050284M72201L76598N07617M88250K75153J88915J61075p7741l25924q9885
5526C6026543l6773K4351k35251j78281r8236J64150K90540K09169N94185O22676
5516C7383073O85422J059291P18952Q66658J399446J576482J556069J451475J200087
5507D7896955J376239P07959N82183N67225q3437k25769m68762o42426q22797
5498D8887370q54791o85874o04084n35584k51524l76432m32741K2790o0275j01735
$$ y = [28225462, 28203775, 28333160, 28223233, 28177214, 28109911, 28021450, 28459121, 28161282, 28038170, 28215326, 28308387, 28479995, 28665715, 28665681, 29110847, 29515337, 29646800, 29900833, 29909831, 29999307, 30463591, 30787383, 31139557, 31480532, 31962766, 32127020, 32377963, 32939696, 33597130, 34050284, 34522485, 34899083, 35406700, 35894950, 36170103, 36359018, 36520093, 36442352, 36116428, 36026543, 35989770, 36014121, 35778870, 35600589, 35502353, 35666503, 35957043, 36166212, 36760397, 37383073, 38068495, 39127786, 39846738, 40713396, 42112842, 43689324, 45245393, 46696868, 47896955, 49273194, 49981153, 50563336, 51130561, 51047124, 50821355, 50352593, 49710167, 48887370, 48032579, 47346705, 46742621, 46207037, 45955513, 45579081, 45146340, 45169130, 45108855, 45007120]
5488D5007120L38026M16017M26833N12353M77353p1331R4013O7341J64766k26104
5478D7206387l85276m11583q35546q86170j019828q50261j043622r20966n64040
5469D0289095p20272o69563m51636l50268j63665j10669m83811q00508n76307
5460C5962396l94926m27231l01480r36791r32699n13382p13433o45384m81517
5451C0615553n64879p01136m46869m43004r4589n546j52533l2846j23758J32494
5441B8182887K68114K76314J64791j8267O0291R9230J80315k6125K13275J17194
5431B9518019k03698k55479J3565K0974k70514K98854J52117J30516J25180M14681
5421B9944215M46642J13554M83681M30271K12411M73111M55705J29603o4015j05183
$$ y = [45007120, 45345146, 45761163, 46187996, 46700349, 47177702, 47106371, 47200384, 47267725, 47432491, 47206387, 46821111, 46409528, 45573982, 44687812, 43667984, 42817723, 41774101, 40853135, 40289095, 39568823, 38899260, 38447624, 38097356, 37933691, 37823022, 37339211, 36538703, 35962396, 35567470, 35140239, 34838759, 33901968, 32969269, 32455887, 31742454, 31097070, 30615553, 30050674, 29349538, 28902669, 28459665, 28365076, 28359530, 28206997, 28174151, 28050393, 28182887, 28451001, 28727315, 28892106, 28873839, 28934130, 29033360, 29213675, 29187550, 29400825, 29518019, 29314321, 29058842, 29072407, 29093381, 28822867, 29121721, 29273838, 29404354, 29529534, 29944215, 30390857, 30504411, 30988092, 31418363, 31630774, 32103885, 32559590, 32689193, 32625178, 32519995]
5411C2519995r9676L4739j55222m69064p8844n62004o25276m32271o53490l40085
5401B9138802l64834k19930j58507r7882k50665j33510L77481L03518L1622j62764
5391B8463331l16205j45331k70086k65789n13350n07114n39452m26301m00524
5382B5079179o05812k45585p20093l75695m77030m23493m45041n67137l02854
5373B0916439m48843l69082j67790n34139k86879p0303L6531m8582j22375J75399
5363A9080376J76299O6875j20925j13349L4136L9941K43520K67282J56126L29813
5353B0160094O03174K88558L14752L52421L35590n1305L6175M6916k15818j99217
5343B1671340k19289j50723k41080k8995o7901k17576j02380L79055J4277j53611
$$ y = [32519995, 32420319, 32455058, 32299836, 31830772, 31751928, 31189924, 30564648, 30132377, 29478887, 29138802, 28773968, 28554038, 28395531, 28297649, 28046984, 27913474, 28290955, 28594473, 28626095, 28463331, 28147126, 28001795, 27731709, 27465920, 26952570, 26445456, 25906004, 25479703, 25079179, 24473367, 24227782, 23507689, 23131994, 22654964, 22231471, 21786430, 21219293, 20916439, 20467596, 20098514, 19930724, 19396585, 19109706, 19039403, 19075934, 19027352, 18904977, 19080376, 19256675, 19323550, 19202625, 19089276, 19123412, 19163353, 19406873, 19674155, 19830281, 20160094, 20763268, 21051826, 21366578, 21718999, 22054589, 22003284, 22039459, 22086375, 21870557, 21671340, 21452051, 21301328, 21060248, 21031253, 20963352, 20745776, 20643396, 21022451, 21036728, 20883117]
5333B0883117K83622N40861K27419K21481J04144j45895k27407j58718l68582
5324B1360042p7377j01749k00388m79042m23715K037m55755j39054N0418k21228
5314A9314189l3874j88704r3639O3599k29294j31053J33468J18388k81846k78909
5304A8392325m39515o7592k13467n68069j39580j98802R801k21759l93867n55
5294A6158920m1118j48666j27107k14763k67897J55635K41484j72653L8853j57947
5284A5464741j42903R9704j59233O6370j41188j31731J88394m8464L05818k67363
5274A5234145j81801K10757N2926p0977k0167K7442K10646J30664O7660J1721
5264A5673016j54071J13635L87557k712j15703q2155j35188K0936j62044R1627
$$ y = [20883117, 21166739, 21707600, 21935019, 22156500, 22260644, 22114749, 21887342, 21728624, 21360042, 21282665, 21180916, 20980528, 20501486, 20077771, 20079808, 19624053, 19484999, 19535417, 19314189, 19280315, 19091611, 18997972, 19061571, 18832277, 18701224, 18834692, 18953080, 18671234, 18392325, 17952810, 17885218, 17671751, 17103682, 16964102, 16765300, 16775101, 16553342, 16159475, 16158920, 16117802, 15969136, 15842029, 15627266, 15359369, 15515004, 15756488, 15583835, 15622688, 15464741, 15321838, 15421542, 15262309, 15328679, 15187491, 15055760, 15244154, 15195690, 15501508, 15234145, 15052344, 15263101, 15316027, 15245050, 15224883, 15252325, 15462971, 15593635, 15661295, 15673016, 15518945, 15632580, 16020137, 16017425, 15901722, 15819567, 15684379, 15705315, 15543271, 15634898]
5254A5634898m3176J55976k85473j84815J48834J14547J91228q3110m1426O9775
5244A5677258r7012l8999j6317l34840j80157R1595n6851L9283m3930K7814K80344
5233A5348188j09884n3105J42776K24544O9708R4398J34757J48481K58130J36346
5223A6394339Q8813J81060K10898J52102J79207K0727j40303q1860k4503J40024
5213A7120504K47477P3528k11547j04100n1904K55143n17787j4870R9503J37347
5203A7033294k25080j62867J11133l01019l84219m34262J26980j38142R2470m11165
5193A5307123k63982K13862J37249l69568r2709o394Q7308P3477K12846J89613
5183A5488825j09933k58123K91570O8296l7182Q3787J61330P004r8416N5323P9647
$$ y = [15634898, 15591722, 15747698, 15462225, 15277410, 15426244, 15540791, 15732019, 15648909, 15607483, 15677258, 15580246, 15541247, 15524930, 15190090, 15009933, 15101528, 15044677, 15083960, 15040030, 15067844, 15348188, 15238304, 15185199, 15327975, 15552519, 15622227, 15716625, 15851382, 15999863, 16257993, 16394339, 16483152, 16664212, 16875110, 17027212, 17206419, 17227146, 17086843, 17004983, 16980480, 17120504, 17367981, 17441509, 17229962, 17125862, 17073958, 17329101, 16811314, 16796444, 16895947, 17033294, 16808214, 16645347, 16756480, 16455461, 16071242, 15636980, 15763960, 15625818, 15718288, 15307123, 15043141, 15257003, 15394252, 15024684, 14931975, 14925581, 15012889, 15086366, 15299212, 15488825, 15378892, 15120769, 15412339, 15480635, 15443453, 15527240, 15688570, 15695574, 15597158, 15652481, 15732128]
5172A5732128Q3603K1618j25090j34548r3318p057p9931J68292N2660j78385q7261
5161A5352711j43509n26632j19040J01628J68997K83266k35205n12842R4339J51903
5151A4615616Q8262J05173k34187j3930J92234L05819k25218l04465J29767n1260
5141A4607811O2226M15345j51558l99134M12514L80611j32038j5270k08334n512
5131A4966661m4368l4748j18843R1820j40151J65271Q9236k2102Q3841J1462K9969
5120A5078048R1405K19354n9250j37538P0596M347J71375J32151k7262J2101K82484
5109A5837811L7248N7321J39202K2957J24684L7346j65051J88883o8169k18479
5099A5993753J00801M17150J87833R2228k99156N6396k12279M12448L82920k4452
$$ y = [15732128, 15815731, 15837349, 15712259, 15577711, 15484393, 15477336, 15397405, 15565697, 15618357, 15439972, 15352711, 15209202, 14682570, 14563530, 14665158, 14834155, 15117421, 14882216, 14369374, 14463713, 14615616, 14703878, 14809051, 14574864, 14560934, 14753168, 15058987, 14833769, 14529304, 14659071, 14607811, 14670037, 15085382, 14933824, 14534690, 14947204, 15327815, 15195777, 15180507, 14972173, 14966661, 14922293, 14887545, 14768702, 14860522, 14720371, 14885642, 14974878, 14952776, 15036617, 15048079, 15078048, 15169453, 15388807, 15329557, 15192019, 15262615, 15266962, 15438337, 15570488, 15543226, 15555327, 15837811, 15875059, 15932380, 16071582, 16094539, 16219223, 16256569, 16091518, 16280401, 16212232, 15993753, 16094554, 16511704, 16699537, 16791765, 16492609, 16549005, 16336726, 16749174, 17132094, 17107642]
5089A7107642k48315J48647L26371l0720J01462L55528p607l57039K60744K06302
5079A7863015J38020l49089K25304J95589M55669q4869N260K15074J53957J17708
5069A8935638L09937J03025O6811l0631J22187J30181J78602P9725k7806L92858
5059B0260527J38139m3312L12266J0990L90590p3028j24721J52923J3354J82186
5049B1219914J02324R9041K39909N8705P1655K89036K49176L6423o2144K68906
5039B2572945L03845M81834P0853O05534j37039J31136O66466P7376J45428M82046
5029B5400424L24300L69136L90018M56866J63945M60100N64931N06799M45217
5020B9081736N15607M09060N07258P67202M93525O29674P28522R25925Q01518
$$ y = [17107642, 16859327, 17007974, 17334345, 17303625, 17405087, 17760615, 17753008, 17395969, 17656713, 17863015, 18001035, 17651946, 17877250, 18072839, 18528508, 18443639, 18448899, 18663973, 18817930, 18935638, 19245575, 19348600, 19415411, 19384780, 19506967, 19637148, 19815750, 19895475, 19867669, 20260527, 20398666, 20355354, 20667620, 20678610, 21069200, 20996172, 20871451, 21024374, 21037728, 21219914, 21322238, 21421279, 21661188, 21719893, 21791548, 22080584, 22329760, 22366183, 22304039, 22572945, 22876790, 23358624, 23429477, 24035011, 23897972, 24029108, 24695574, 24772950, 24918378, 25400424, 25724724, 26093860, 26483878, 26940744, 27104689, 27564789, 28129720, 28636519, 29081736, 29597343, 30006403, 30513661, 31280863, 31774388, 32404062, 33132584, 34058509, 34860027]
5011C4860027P19869R06260R43877Q80669Q65466J184019J247386J026684J326611
5002D3960868Q83490J570376J498852J392707J681111J786544K019384J779134
4994E6572466J998191K441021K460479K450069K579070L098702L560353L372338
4986G8532689L428667L326530L181651L436301L015262L158280K585460K650006
4978A03314846K337123J403142J173029Q62447N20978j15761o86152r36502q69917
4969A07003233j121870j459799j301143j493415j125739q91272q01642o04973
4961I8203380p37055m01805p1649m43143l64451l7769j77777P1336K02276N0910
4951I6294253N44654N74857R99992J148579J307459J580042J772653K392716K390924
$$ y = [34860027, 35579896, 36486156, 37430033, 38310702, 39176168, 40360187, 41607573, 42634257, 43960868, 44844358, 46414734, 47913586, 49306293, 50987404, 52773948, 54793332, 56572466, 58570657, 61011678, 63472157, 65922226, 68501296, 71599998, 75160351, 78532689, 81961356, 85287886, 88469537, 91905838, 94921100, 98079380, 100664840, 103314846, 105651969, 107055111, 108228140, 109090587, 109611565, 109495804, 108809652, 107873150, 107003233, 105881363, 104421564, 103120421, 101627006, 100501267, 99609995, 98808353, 98203380, 97466325, 97064520, 96992871, 96549728, 96185277, 96147508, 95969731, 96041067, 96243343, 96294253, 96838907, 97413764, 98413756, 99562335, 100869794, 102449836, 104222489, 106615205, 109006129]
4942A09006129K259339K487977K808121K509590K781303K842716K679292K665969
4934A30040436K682393J744576J784811J499495J020562R25678L13116m02729
4926A39608338j99846m69217l51511k56450j12592k58744m11616N1390L4748r8907
4916A37535593J74347J71888M8442M88971J74523m54138m12848j49336j76559
4907A37400883n60087m88176l54070l80229n61049K41383L86909L38048R77934
4898A37001546J238445J692651J556532K121770K494649K310494K606347K726105
4890A53748539K796128K823692K594679K419490K655691K771162K674202K639420
4882A75123003K616070K709287K545615K751215K773629L066164K914619K997522
$$ y = [109006129, 111265468, 113753445, 116561566, 119071156, 121852459, 124695175, 127374467, 130040436, 132722829, 134467405, 136252216, 137751711, 138772273, 139697951, 140011067, 139608338, 139408492, 138939275, 138587764, 138331314, 138218722, 137959978, 137548362, 137599752, 137634500, 137535593, 137709940, 137881828, 137930270, 138419241, 138593764, 138139626, 137726778, 137577442, 137400883, 136840796, 136352620, 135998550, 135618321, 135057272, 135298655, 135685564, 136023612, 137001546, 138239991, 139932642, 141489174, 143610944, 146105593, 148416087, 151022434, 153748539, 156544667, 159368359, 161963038, 164382528, 167038219, 169809381, 172483583, 175123003, 177739073, 180448360, 182993975, 185745190, 188518819, 191584983, 194499602, 197497124]
4874A97497124L500610L407239L580185L683263L708615L638766L426686L263236
4866B25705724L198109K404247K623643K304155K067853K001325J784013J482401
4858B43571470J208556J230401O81542N69698j154977l208460m729063n534865
4850B32634302o716548o708733o740619o555860o156947n253239m576803l220936
4842A86704617k561907j963222j106935j293683p89070j042307j376694k166318
4834A74404481k892431l258597l736677m184869m550876m560912m451688m847779
4826A41920652m525610m471794m022992l867976l633376k973385k841597k302682
4818A13281240k062372j652118j301740j204945p70653n47320k69985K12477K51843
$$ y = [197497124, 200997734, 204404973, 207985158, 211668421, 215377036, 219015802, 222442488, 225705724, 228903833, 231308080, 233931723, 236235878, 238303731, 240305056, 242089069, 243571470, 244780026, 246010427, 246691969, 247261667, 246106690, 242898230, 238169167, 232634302, 225917754, 219209021, 212468402, 205912542, 199755595, 194502356, 189925553, 186704617, 184142710, 182179488, 181072553, 179778870, 178989800, 177947493, 176570799, 174404481, 171512050, 168253453, 164516776, 160331907, 155781031, 151220119, 146768431, 141920652, 137395042, 132923248, 128900256, 125032280, 121398904, 118425519, 115583922, 113281240, 111218868, 109566750, 108265010, 107060065, 106289412, 105742092, 105472107, 105684584, 105936427]
4809A05936427P53591J058091J252234J673735K004467K130520K246846K903796
4801A19959707K653984K550364K841014K843873K723027K771668K705880K392723
4793A41442240J839475J694205J338232J010511P76783L75194J78044j74702r3942
4784A48386040j41907r9744j7431L154K17941M12242M56849K88237N64766M70356
4774A50540503K50807L58519K85404k58586m86044n00667j136150j583010k018226
4765A45452550k113148k301287k181711k160733k200861k377383k586263k339059
4757A27192105k469495k392187k307383k182892j988109j850804j830852j625293
4749A10545090j425685j342960j142091q17545o43831q73182r57044q05549q95659
$$ y = [105936427, 106690018, 107748109, 109000343, 110674078, 112678545, 114809065, 117055911, 119959707, 122613691, 125164055, 128005069, 130848942, 133571969, 136343637, 139049517, 141442240, 143281715, 144975920, 146314152, 147324663, 148101446, 148476640, 148654684, 148479982, 148386040, 148244133, 148144389, 148126958, 148130112, 148348053, 148760295, 149217144, 149505381, 150070147, 150540503, 150791310, 151149829, 151435233, 151176647, 150690603, 150189936, 149053786, 147470776, 145452550, 143339402, 141038115, 138856404, 136695671, 134494810, 132117427, 129531164, 127192105, 124722610, 122330423, 120023040, 117840148, 115852039, 114001235, 112170383, 110545090, 109119405, 107776445, 106634354, 105816809, 105172978, 104299796, 103342752, 102537203, 101641544]
4740A01641544n64607k54368m23234n12643k79284l044k49917K05627L49333M5165
4730I9954572J31292L2485K80441L62588J95020L52681K86411K56673K32481M69583
4720A02554227J010688J437869J528129K002745K547238L060192L328262L544649
4712A21013999M009723M777157M917074M960077N374450N555433O398628O974937
4704A63981478P493761P721256P324258O960935O247511N916083N368291M119769
4696B15133342L892980L902306L208273L301966L668471L771944M445578M860631
4688B46185491N167656N580855O110751N787858N703825N711364N964957O343975
4680B92556732O103791O782763P878475R473647J1094434J3118474J5560315J7682197
$$ y = [101641544, 101076937, 100822569, 100399335, 99886692, 99607408, 99604364, 99354447, 99560074, 99909407, 99954572, 100085864, 100118349, 100398790, 100761378, 100956398, 101309079, 101595490, 101852163, 102084644, 102554227, 103564915, 105002784, 106530913, 108533658, 111080896, 114141088, 117469350, 121013999, 125023722, 129800879, 134717953, 139678030, 145052480, 150607913, 157006541, 163981478, 171475239, 179196495, 186520753, 193481688, 199729199, 205645282, 211013573, 215133342, 219026322, 222928628, 226136901, 229438867, 233107338, 236879282, 241324860, 246185491, 251353147, 256934002, 263044753, 268832611, 274536436, 280247800, 286212757, 292556732, 298660523, 305443286, 313321761, 322795408, 333889842, 347008316, 362568631, 380250828]
4672C80250828J8858260J9069485J7566860J3887383R535844M313869j388377
4665D62094152o317780j0385043j3872897j6802129j9047668j9885399j9592610
4658C56190626j8410608j6884361j5818752j4461575j3673497j2527185j1114905
4651B53299743j0301018r428608q701103p545243o072534n073068m523751l619324
4643A98035094k403255j336264p91985k00513k73177n26718r15734j749999k559502
4634A87277947l380077m396662n083949n419339n754605o145474n970587n796046
4626A45331208n187474m954771m682561m196523l822055l727223l233349l097838
4618A12429414k973217k640469k595455k080913j704171j523973j893288j684889
$$ y = [380250828, 399109088, 418178573, 435745433, 449632816, 459168660, 463482529, 462094152, 455776372, 445391329, 431518432, 414716303, 395668635, 375783236, 356190626, 337780018, 320895657, 305076905, 290615330, 276941833, 264414648, 253299743, 242998725, 233570117, 224869014, 217323771, 211251237, 206178169, 201654418, 198035094, 195631839, 194295575, 193503590, 193303077, 193029900, 192503182, 191587448, 189837449, 187277947, 183897870, 179501208, 174417259, 168997920, 163243315, 157097841, 151127254, 145331208, 140143734, 135188963, 130506402, 126309879, 122487824, 118760601, 115527252, 112429414, 109456197, 106815728, 104220273, 102139360, 100435189, 98911216, 97017928, 95333039]
4610I5333039j421228r56658r82935q26151j063906j050572r85541j077650q17162
4601H6151236j138094p62150q73761r69512q64603q76946m09911l71295j81073
4592G9703891m94904k84323O3564L6734K46649L10172J78778L7287J34288K9747
4582G9961883l85907l10623n25879l00974q0087k58503n85334n77430j03558k87586
4572G6546002j19561k53968K7528k04944l77399j83058l23900j81363q2651m4651
4562G4802035N22666L49878K79399J115646Q73144Q28231P76032N93114O49126
4553H0789271M71009K65898K08144k51221j61477J54516j5862J32504Q01211R47798
4543H3341791J256646J093383J015527P73714k09202j456544j569091k478564
$$ y = [95333039, 93911811, 92955153, 91972218, 91146067, 90082161, 89031589, 88046048, 86968398, 86151236, 85013142, 84250992, 83377231, 82407719, 81543116, 80666170, 80256259, 79884964, 79703891, 79208987, 78924664, 78988228, 79024962, 79271611, 79581783, 79760561, 79797848, 79932136, 79961883, 79575976, 79265353, 78739474, 78438500, 78358413, 78099910, 77514576, 76937146, 76833588, 76546002, 76426441, 76172473, 76200001, 75995057, 75617658, 75434600, 75110700, 74929337, 74846686, 74802035, 75324701, 75674579, 75953978, 77069624, 77942768, 78770999, 79547031, 80140145, 80789271, 81260280, 81526178, 81734322, 81483101, 81321624, 81476140, 81460278, 81592782, 82393993, 83341791, 84598437, 85691820, 86707347, 87481061, 87271859, 85815315, 84246224, 81767660]
4535H1767660l058099l263450l971664l764175l327843l239310l025810k474077
4527E5643232k400630k033019j909979j443694j488790j160988j375218j155615
4519D2675299p08855q96274q59371o48805r27274q28768k61470k98542n09985
4510C6735955j85575l14652l40829k10070l54830j88159k29269j7430j07147p1914
4500C4716080p640j31080q2231k73150k8639j7J56083k96516p5138J127r1424
4489C3887455L4226j86161q2347l13222n58717l79596j59002L81101k34372l72282
4479C2017083r3250j75532r0861j50772K850l65441k27745J1468J96767l70142
4469C0754425j40952M70o2558R5223k21008q2708M7959J09767J70370p9006M76526
$$ y = [81767660, 78709561, 75446111, 71474447, 67710272, 64382429, 61143119, 58117309, 55643232, 53242602, 51209583, 49299604, 47855910, 46367120, 45206132, 43830914, 42675299, 41966444, 41070170, 40210799, 39561994, 38634720, 37805952, 37544482, 37245940, 36735955, 36550380, 36235728, 35894899, 35684829, 35329999, 35141840, 34912571, 34895141, 34787994, 34716080, 34708440, 34577360, 34495129, 34221979, 34193340, 34193323, 34349406, 34052890, 33977752, 33978879, 33887455, 33921681, 33735520, 33653173, 33339951, 32781234, 32401638, 32242636, 32623737, 32389365, 32017083, 31923833, 31748301, 31657440, 31506668, 31509518, 31144077, 30916332, 30927800, 31124567, 30754425, 30613473, 30613943, 30551385, 30646608, 30425600, 30342892, 30390851, 30500618, 30670988, 30591982, 31068508]
4458C1068508K48253J52186K65849N28376L41594N26341M97123K72255K48675
4449C4149160J87427p8824k4910o3494k32005j95600j17927o55l8475P4513N7794
4438C3717004K51056l51620J579O38289K45827J90252L80249L96400J53793N39541
4428C6162370K52877J88775K87599l3242k61316o0786O868n32729J33845o1627
4418C6082634l71986k09942K09387N344j60808L43246K85570J28936M09937M80971
4408C7203289M03363P31396O93005N74332P37804J062454J238387P66726R74964
4399D4385720P69445J032692R72109O55848O67116O30063P44112N99103K14802
4390E0671010K07108l3787K26250N86282M79626O21651R70434R74789Q22897J338655
$$ y = [31068508, 31316761, 31468947, 31734796, 32263172, 32604766, 33131107, 33628230, 33900485, 34149160, 34336587, 34257763, 34232853, 34169359, 33937354, 33741754, 33623827, 33623172, 33584697, 33659210, 33717004, 33968060, 33616440, 33618019, 34256308, 34502135, 34692387, 35072636, 35469036, 35622829, 36162370, 36415247, 36604022, 36891621, 36858379, 36597063, 36536277, 36543145, 36010416, 36144261, 36082634, 35710648, 35500706, 35710093, 35715437, 35554629, 35897875, 36183445, 36312381, 36722318, 37203289, 37606652, 38338048, 39031053, 39605385, 40343189, 41405643, 42644030, 43410756, 44385720, 45155165, 46187857, 47159966, 47815814, 48482930, 49112993, 49857105, 50456208, 50671010, 50878118, 50844331, 51070581, 51656863, 52136489, 52758140, 53728574, 54703363, 55526260, 56864915]
4380E6864915J765653J652436K012045J855947K293490K166829J939027K450335
4372G3000677K018847K241715K188293J845927J629648J021325L05422l32602
4364H3919252j206181j509408j962406k441288k879916k739053k689704k600156
4356F5891140k264903k251517k090751j925882j878273k109263k012517j887327
4348D9470707j924075j875220j457186j656703j763487j003021r91599j127024
4340C7672392r70688j070982p43642m15150p64827p10065n42828p43023m00517
4331C1310670k96584o74697l51292l88396l57523n54448k84246l08835m13178
4322B7681471k49591J07250j01387n45927k27573m418q22595l24422r9959l38911
$$ y = [56864915, 58630568, 60283004, 62295049, 64150996, 66444486, 68611315, 70550342, 73000677, 75019524, 77261239, 79449532, 81295459, 82925107, 83946432, 84251854, 83919252, 82713071, 81203663, 79241257, 76799969, 73920053, 71181000, 68491296, 65891140, 63626237, 61374720, 59283969, 57358087, 55479814, 53370551, 51358034, 49470707, 47546632, 45671412, 44214226, 42557523, 40794036, 39791015, 38799416, 37672392, 36701704, 35630722, 34887080, 34471930, 33707103, 32997038, 32454210, 31711187, 31310670, 31014086, 30339389, 29988097, 29599701, 29242178, 28687730, 28403484, 28094649, 27681471, 27431880, 27539130, 27437743, 26891816, 26664243, 26659825, 25837230, 25512808, 25412849, 25073938]
4312B5073938L49l35726l25037l85000o8076q6000r4337N0222l82063n7613K0055
4301B3410712j41480m22730m57351j03577l21668o8632k91219l31010j73670J25103
4291B1224478j03937j14036l88344k8583K24564p2095k57305k05720p9554j44115
4281B0055353P7243j04445j99949j01185j65282K4699P8599j52131J93256k09547
4271A9496611n1863r5772l6748j89696K7357k51664j23946R5546J50023m0095
4261A8979753J44629n4748m62540J21802j84585R7422k02255k74895k87631K06512
4251A8083464K86672k50422j94021K02494R3477o001l16303o5363k8425J34007
4241A7939579K13896l11677O5776K29711Q4247k27803M0088L42506k84339J05294
$$ y = [25073938, 25074287, 24738561, 24413524, 24028524, 23960448, 23874448, 23780111, 23830333, 23448270, 23390657, 23410712, 23269232, 22846502, 22389151, 22285574, 21963906, 21895274, 21604055, 21273045, 21099375, 21224478, 21120541, 21006505, 20618161, 20589578, 20814142, 20742047, 20484742, 20279022, 20199468, 20055353, 20132596, 20028151, 19828202, 19727017, 19561735, 19586434, 19665033, 19512902, 19706158, 19496611, 19444748, 19348976, 19312228, 19122532, 19149889, 18898225, 18774279, 18869825, 19019848, 18979753, 19124382, 19069634, 18607094, 18728896, 18544311, 18641733, 18439478, 18164583, 17876952, 18083464, 18370136, 18119714, 17925693, 18128187, 18221664, 18215663, 17899360, 17833997, 17805572, 17939579, 18153475, 17841798, 17907574, 18137285, 18221532, 17993729, 18033817, 18376323, 18091984, 18197278]
4231A8197278L46311M5166j80158N2897R5663k33677N0695J34401K86502k19471
4221A8575607Q3502L9507k51841k39683Q0339J03263n09717j17698Q7240j83950
4211A7666569L5158J18174k01504k65372r7971P6825L4754N6433r6755K61100
4201A7587411l1287J38585r558J1779K31589m9440M39180O39937K05070J34284
4191A9297550j45008K20124m5780j45641j1701k58233L05598j64526m58667m23846
4181A8169870m3921Q3000j37665l35988j41009J26408n5882j42654q2650J07749
4171A7547258N374R4454J42520J41104J34597q8402k9711l2798j53397r4755N9224
4160A7725468j87586l2182q524r5921l3907J80400j52758Q0615O4494j75587J1620
$$ y = [18197278, 18543589, 18588755, 18408597, 18461494, 18557157, 18323480, 18374175, 18508576, 18795078, 18575607, 18659109, 18698616, 18446775, 18207092, 18287431, 18390694, 17880977, 17763279, 17850519, 17666569, 17701727, 17819901, 17618397, 17353025, 17255054, 17331879, 17366633, 17423066, 17326311, 17587411, 17556124, 17694709, 17685151, 17696930, 17928519, 17879079, 18318259, 18958196, 19163266, 19297550, 19152542, 19372666, 19326886, 19181245, 19169544, 18911311, 19216909, 19052383, 18593716, 18169870, 18125949, 18208949, 18071284, 17735296, 17594287, 17720695, 17664813, 17522159, 17439509, 17547258, 17552632, 17647086, 17789606, 17930710, 18065307, 17976905, 17947194, 17914396, 17760999, 17666244, 17725468, 17537882, 17505700, 17497176, 17401255, 17367348, 17547748, 17394990, 17475605, 17540099, 17364512, 17376132]
4149A7376132k6843k13716m42932J52548j06095J00493J4168j54483J60976m2744
4139A6817504L6574j37247K28892K20840m9282O7655j22155N8084n9048Q216P8550
4128A7148583r3238L6718r4496j06701j54508k25854k84530J2930j57174j62702
4118A5919028j22812P3883j12146k43212J96537J7647r6828k5170n2484k13820
4108A5340623J05226R0496j82337J82812J70223r9300j7124K69257J27319J6332
4098A6003527J19721j0827m19045k6166J30152L40700L20993k99216j9740J41091
4088A6281190k9507l05099n8014P2103j951j02919q8436P1648J04132j72543n4827
4077A5715777k49383m3935j15488j68759K36166K07461J94992l2476k5748k52398
$$ y = [17376132, 17349289, 17135573, 16692641, 16845189, 16739094, 16839587, 16853755, 16699272, 16860248, 16817504, 16854078, 16716831, 16945723, 17166563, 17117281, 17184936, 17062781, 17120865, 17061817, 17070033, 17148583, 17055345, 17092063, 16997567, 16890866, 16736358, 16510504, 16225974, 16238904, 16081730, 15919028, 15796216, 15870099, 15757953, 15514741, 15711278, 15728925, 15632097, 15606927, 15554443, 15340623, 15445849, 15536345, 15354008, 15536820, 15707043, 15607743, 15590619, 15859876, 15987195, 16003527, 16123248, 16112421, 15693376, 15667210, 15797362, 16138062, 16459055, 16159839, 16140099, 16281190, 16251683, 15946584, 15888570, 15960673, 15958722, 15855803, 15767367, 15839015, 15943147, 15770604, 15715777, 15466394, 15422459, 15306971, 15138212, 15374378, 15581839, 15776831, 15744355, 15718607, 15466209]
4067A5466209o0367J1917K67088m8997n96113l1152K12054J04339j82935J27618
4057A5269661M0031r8597J31067j37006L6481P3897p056k74934q5366l00381j01507
4046A4546290J21123J97445n3652j54585j59431M1084j26613j02495K61303l78400
4036A4192069K9298j12506l5613k99486j09756o9448j98688K40981K75400m35984
4026A3476267n7456O1746o6090K27505J30891k3135l93801j05951j40557L65304
4016A3474723j97900k90252K28670l59100m7670m6712j40525p7307J7894K15470
4006A2777291L870J2133k06214p2359r3377k40229J50196j75678j36141J44331
3996A2163823N0923O8790j33854o2975l50653R999J2365o1994j52352K86394j63105
$$ y = [15466209, 15405842, 15417759, 15684847, 15635850, 15039737, 15008585, 15220639, 15324978, 15142043, 15269661, 15309692, 15211095, 15342162, 15205156, 15241637, 15315534, 15308478, 15033544, 14948178, 14647797, 14546290, 14667413, 14864858, 14811206, 14656621, 14497190, 14538274, 14411661, 14309166, 14570469, 14192069, 14221367, 14108861, 14073248, 13773762, 13664006, 13594558, 13395870, 13636851, 13912251, 13476267, 13418811, 13480557, 13414467, 13641972, 13772863, 13749728, 13355927, 13249976, 13109419, 13474723, 13276823, 12986571, 13215241, 12856141, 12808471, 12761759, 12621234, 12543927, 12561821, 12777291, 12781161, 12793294, 12587080, 12514721, 12421344, 12181115, 12331311, 12155633, 12019492, 12163823, 12214746, 12283536, 12149682, 12086707, 11736054, 11746053, 11758418, 11696424, 11544072, 11830466, 11667361]
3985A1667361j23081K16454m03000J4338Q9243j81278M3545K61224l13930R3793
3975A1364669j20954Q6537M8301k14283j65071l6277k24159o7560p6003R3367
3965A0688567K22801j41254J33029K0661K24966M2165n34265r352r7682R88K10454
3954A0761078q986m09311O2315j37371M41939K58368j90287r0226j78942n331
3944A0503246r1566N3188n3082k2798J63259r1757j09984J0830j77229K03756
3934A0387863J22326J46367J11119L2769l56818m3197K4105J73907J7925K75260
3924A0891626J51716J47344l44594k2730r943K1111M3856j57692M9670K85251
3914A1055615J38406j67401l2626j79927J96508R2946j09483Q904j08951J55782
$$ y = [11667361, 11544280, 11760734, 11357734, 11372072, 11461315, 11280037, 11323582, 11584806, 11270876, 11364669, 11243715, 11330252, 11378553, 11164270, 10999199, 10962922, 10738763, 10671203, 10595200, 10688567, 10911368, 10770114, 10903143, 10923804, 11148770, 11190935, 10656670, 10647318, 10549636, 10550624, 10761078, 10752092, 10342781, 10405096, 10267725, 10709664, 10968032, 10777745, 10687519, 10508577, 10503246, 10411680, 10464868, 10411786, 10388988, 10552247, 10460490, 10350506, 10361336, 10184107, 10387863, 10510189, 10656556, 10767675, 10800444, 10443626, 10400429, 10424534, 10598441, 10616366, 10891626, 11043342, 11190686, 10846092, 10823362, 10813419, 10834530, 10878386, 10720694, 10770364, 11055615, 11194021, 11026620, 10993994, 10814067, 11010575, 11103521, 10994038, 11002942, 10893991, 11049773]
3904A1049773j38311L5987o0163J92681n7933p9419l02447N4427M28769j07248
3894A1016116J57237K2618J87597j95994M9597j8742p0374J29356j36288J65436
3884A1306559L82676l55452J2924L18701Q3203J1176J89694Q3965K82861J18194
3874A2434501k59718J06520Q0068p385K01253o3163j06504L78478k05218J44521
3864A2703353M19681K96888J62804J13221Q3063k59964R7309j165O9287R8229
3854A3782706L34806J42591j52695K8547n6P0315k2486L53883J18724k5258r1561
3843A4539516P4171K09149j37753K7820p0652r6665M2465M9510R8468J26557j8961
3832A4843625M15378k0364n916J71757N5110j19561J54849j700N7313J64996j44037
$$ y = [11049773, 10911462, 10947449, 10887286, 11079967, 11022034, 10942615, 10640168, 10694595, 11123364, 11016116, 11173353, 11195971, 11383568, 11187574, 11237171, 11218429, 11148055, 11277411, 11141123, 11306559, 11689235, 11333783, 11346707, 11665408, 11748611, 11759787, 11949481, 12033446, 12316307, 12434501, 12174783, 12281303, 12361371, 12353986, 12555239, 12492076, 12385572, 12764050, 12558832, 12703353, 13123034, 13419922, 13582726, 13695947, 13779010, 13519046, 13616355, 13615190, 13684477, 13782706, 14117512, 14260103, 14107408, 14135955, 14135899, 14206214, 14183728, 14537611, 14656335, 14631077, 14539516, 14613687, 14822836, 14685083, 14712903, 14642251, 14545586, 14588051, 14637561, 14736029, 14862586, 14843625, 15259003, 15238639, 15232723, 15404480, 15459590, 15340029, 15494878, 15493178, 15550491, 15715487, 15571450]
3821A5571450J0863j11339J82230l6755n6536n887j90289J4289J48844J14078
3811A5640948j12524k5735k02826J00514M4200m0026j40415k77556r780J01425
3801A5078225j39341K79052j14602o5254j20180k16272J43065M1568o2731J71004
3791A4994534M8132k62047P5914O9993l03944j13119K1990q3811L506r8381m0131
3780A4312636n7600j33203k99244o5789R2643j07735L8679j6716j26980j63787
3770A3472904M9904j44435r6844J73155l18004J77016j75731J33051O6249l5768
3760A3301497j46372M2829j71333j68296K26956J36970J93159J20911l09779M5599
3750A3272141o0638o3938k1150k02041o5263k694L2663K4268K0406k44736K2997
$$ y = [15571450, 15582313, 15470974, 15653204, 15616449, 15559913, 15554026, 15363737, 15378026, 15526870, 15640948, 15528424, 15502689, 15299863, 15400377, 15444577, 15404551, 15264136, 14986580, 14976800, 15078225, 14938884, 15217936, 15103334, 15038080, 14917900, 14701628, 14844693, 14886261, 14823530, 14994534, 15042666, 14780619, 14856533, 14926526, 14622582, 14509463, 14531453, 14447642, 14451148, 14352767, 14312636, 14255036, 14121833, 13822589, 13756800, 13849443, 13741708, 13780387, 13763671, 13636691, 13472904, 13522808, 13378373, 13281529, 13454684, 13136680, 13313696, 13137965, 13271016, 13337265, 13301497, 13155125, 13197954, 13026621, 12858325, 13085281, 13222251, 13415410, 13536321, 13226542, 13272141, 13211503, 13147565, 13126415, 12924374, 12859111, 12856417, 12889080, 12913348, 12933754, 12689018, 12712015]
3739A2712015K19962k82801j53151J10089L57738r3297j23359L7006m1520r8895
3729A2643787L02962J12693j62279m18463j4860M1559p4637O8444J13918J43866
3719A2756990p7983j03192k99815q5763J22462K23744P1424J3841K29414p1014
3709A2780108O3110J77703M9362r5418l4485L19321j27895K2701k44369K43969
3699A3154107o9311K13429K2969k6736o1668O9052K13247L5196J07024J07709
3689A3765018N58098j26910M6879J44668J5378J17090j63298Q6837k1812K37135
3679A4659083J53438L6940j70251J04129J65675J31831l4301N486K07092K00712
3669A5459834J08296K0505K0464m405M0616J27307j27531J81963J21890K44194
$$ y = [12712015, 12931977, 12649176, 12496025, 12606114, 12963852, 12870555, 12747196, 12784202, 12742682, 12643787, 12946749, 13059442, 12897163, 12478700, 12463840, 12505399, 12430762, 12499206, 12613124, 12756990, 12679007, 12575815, 12276000, 12190237, 12312699, 12536443, 12607867, 12621708, 12851122, 12780108, 12843218, 13020921, 13070283, 12974865, 12940380, 13259701, 13131806, 13154507, 12910138, 13154107, 13084796, 13298225, 13321194, 13294458, 13232790, 13301842, 13515089, 13550285, 13657309, 13765018, 14323116, 14196206, 14243085, 14387753, 14403131, 14520221, 14356923, 14443760, 14421948, 14659083, 14812521, 14849461, 14679210, 14783339, 14949014, 15080845, 15046544, 15052030, 15259122, 15459834, 15568130, 15588635, 15609099, 15604694, 15645310, 15772617, 15645086, 15827049, 15948939, 16193133]
3659A6193133Q563p1626J90745K53587R8170k2867J09546K20343J06048J06613
3649A7192255L36573K26671K4652j13786L89254M56505r9809N1433J4613M9326
3639A8527687N12308j62832L07293k489R9186M73186m047O0668J27326J70923
3629B0109209o2805K6346L23640K06816p2928k51059M00870L06108M2570n0903
3619B0977864r7859J45501l6811M073K49750M13787J14693k6358K6767L5391P1267
3608B1878065J43898K36422L03133R3741J33700O8995n5799K64128N18122K78210
3598B3862615J65341q9002J64768M40945K07242J05998K22349L29271K96897K17087
3588B5923511K76002M03924J14129L42935J92791N14216L78868M53246N36936
$$ y = [16193133, 16201696, 16130070, 16320815, 16574402, 16672572, 16649705, 16759251, 16979594, 17085642, 17192255, 17528828, 17755499, 17780151, 17666365, 18055619, 18512124, 18412315, 18463748, 18478361, 18527687, 19039995, 18877163, 19184456, 19181967, 19281153, 19754339, 19750292, 19810960, 19938286, 20109209, 20046404, 20072750, 20396390, 20603206, 20530278, 20279219, 20680089, 20986197, 21028767, 20977864, 20880005, 21025506, 20988695, 20992768, 21242518, 21656305, 21770998, 21744640, 21771407, 21806798, 21878065, 22021963, 22258385, 22561518, 22655259, 22788959, 22857954, 22802155, 23066283, 23584405, 23862615, 24027956, 23938954, 24103722, 24544667, 24751909, 24857907, 25080256, 25409527, 25706424, 25923511, 26199513, 26603437, 26717566, 27060501, 27253292, 27767508, 28146376, 28599622, 29136558]
3579B9136558O78586L52231L26090N40258O27930N26058P51766P58600P06513
3570C4404590M73393P18320L91580M92070O94806Q00763P96325N91161O23187
3561C9986195P92939Q22656R63105Q32997R88107J211106R59986J127041J157024
3552D8841156J111053J514963J801272J263673J411872J739366K034383J937599
3544F1655337J936249J777714K305358K743706K684835K734243K876570L018410
3536H1732422L289169L509428L486537L902954L997358M316521M911257M718180
3528A13863826M769372M372125M414714L930809L940776L700061K769450K122467
3520A43883600J765662J172346P84041K07565m08197q55404j133282j495718j561851
$$ y = [29136558, 29815144, 30167375, 30493465, 31033723, 31661653, 32187711, 32939477, 33698077, 34404590, 34877983, 35596303, 35987883, 36479953, 37174759, 37975522, 38771847, 39363008, 39986195, 40779134, 41601790, 42564895, 43397892, 44385999, 45597105, 46557091, 47684132, 48841156, 49952209, 51467172, 53268444, 54532117, 55943989, 57683355, 59717738, 61655337, 63591586, 65369300, 67674658, 70418364, 73103199, 75837442, 78714012, 81732422, 85021591, 88531019, 92017556, 95920510, 99917868, 104234389, 109145646, 113863826, 118633198, 123005323, 127420037, 131350846, 135291622, 138991683, 141761133, 143883600, 145649262, 146821608, 147605649, 147813214, 147405017, 146549613, 145416331, 143920613, 142358762]
3511A42358762j669214j600132j253301j502233j739818j393873j610408j485930
3503A30103853j119404j526588j851850j580476j885783k306828k216005k973712
3495A14643207l217998l086361l541190l210927l686247l875218l785023l683770
3487H6556473l462651l396895l163590l138489l112861k895388k216906k751351
3479F2418342k394761j750184j870891j642187j516232j724750j242456j311393
3471D8965488j255358j038504j307783r20190p41631q48363n31381m17193k72283
3462D1632802n20422m20952m65704n48325n41112q86740p74206r97863o53443
3453C5824035p64342r02977j014715m64861k76131q72864l03642j53686K0193
$$ y = [142358762, 140689548, 139089416, 137836115, 136333882, 134594064, 133200191, 131589783, 130103853, 128984449, 127457861, 125606011, 124025535, 122139752, 119832924, 117616919, 114643207, 111425209, 108338848, 104797658, 101586731, 97900484, 94025266, 90240243, 86556473, 83093822, 79696927, 76533337, 73394848, 70281987, 67386599, 65169693, 62418342, 60023581, 58273397, 56402506, 54760319, 53244087, 51519337, 50276881, 48965488, 47710130, 46671626, 45363843, 44443653, 43702022, 42853659, 42322278, 41905085, 41632802, 41112380, 40691428, 40225724, 39677399, 39136287, 38249547, 37475341, 36477478, 35824035, 35059693, 34156716, 33142001, 32677140, 32401009, 31528145, 31224503, 31070817, 31091010]
3444C1091010n28868l95295k72756j82164K7205j3586O1764r3980J94824K12611
3434C0100765Q3575L41657L67246P18952N91514M38857M40837j64092j39099j24618
3424C2655594m77628o66254o07445q85148j012992r20773n86018m80115k49785
3415B6769436n51709m20965l25652k41901k82334k62419k99426l27133j53907
3406B3903990k51123j59325k48571J11873J63068O5146K96217L94022l46207l00897
3396B3628193J4968N01o8514l06680k73902k70546l41439n43791m64936l68985
3386B1004869n1378l1422n45115j65553m39237m09461q7763n5630m1956K13684
3376A9391038M1827j23095j42950j55803k04288R7753P6801R0896J73437k1209
$$ y = [31091010, 30562142, 30166847, 29894091, 29711927, 29739132, 29725546, 29787310, 29693330, 29888154, 30100765, 30184340, 30525997, 30893243, 31612195, 32203709, 32642566, 33083403, 32919311, 32780212, 32655594, 32177966, 31511712, 30904267, 30019119, 29006127, 28085354, 27499336, 27019221, 26769436, 26217727, 25796762, 25471110, 25229209, 24946875, 24684456, 24385030, 24057897, 23903990, 23652867, 23493542, 23244971, 23356844, 23519912, 23585058, 23881275, 24275297, 23929090, 23628193, 23643161, 23643662, 23575148, 23268468, 22994566, 22724020, 22382581, 21838790, 21373854, 21004869, 20953491, 20922069, 20376954, 20211401, 19772164, 19362703, 19274940, 19219310, 19177354, 19391038, 19432865, 19309770, 19166820, 19011017, 18806729, 18904482, 18981283, 19072179, 19245616, 19224407]
3366A9224407m0317l5518L5087J12791J66294l8521j5618O8719j71798j15192
3356A9190334k0210m14963m52705r1429k28248j12498k31935k9193j64103k34137
3346A7210913Q2320j7781M2101l28740J4522J29211K03273j3345K93453J54710
3336A7770637K13957L69582J23838J32129J55469N15154M02534K12358J9846k03368
3326A9712136K7888K57314j57230m42489k88987m39918l68787m4799m47163m79095
3316A7328870j0709j83838m04926k59333j9519J72340o1346k58399R2541k23140
3306A6172541l45945j94690L61889j3036N192P3126K0015L60489K7146n2743o4984
3295A6349000n4105j35163j75291Q0374j14700K1376l54655j22030J00880k88083
$$ y = [19224407, 19184090, 19148572, 19183659, 19296450, 19462744, 19424223, 19408605, 19477324, 19305526, 19190334, 19170124, 18755161, 18302456, 18211027, 17982779, 17870281, 17638346, 17609153, 17445050, 17210913, 17293233, 17275452, 17317553, 16988813, 17003335, 17132546, 17335819, 17322474, 17615927, 17770637, 17984594, 18354176, 18478014, 18610143, 18765612, 19280766, 19683300, 19895658, 19915504, 19712136, 19740024, 19997338, 19840108, 19397619, 19108632, 18668714, 18299927, 18255128, 17807965, 17328870, 17318161, 17134323, 16729397, 16470064, 16450545, 16622885, 16561539, 16303140, 16395681, 16172541, 15826596, 15631906, 15993795, 15980759, 15985951, 16059077, 16079092, 16439581, 16466727, 16413984, 16349000, 16294895, 16159732, 15984441, 16064815, 15950115, 15971491, 15616836, 15494806, 15595686, 15307603]
3285A5307603j46214j00895l68549m79119q1248j15680J94332n3407l17862k4860
3275A3814101J30788J21237l72399j01669m9443k22098j22114J02800K4407k12569
3265A3113041J47602J00717k51313j92493L01360L79550m2713j86040j90196P2914
3255A3252429j57851R9499K95507m0322K12686M31336J11819l92452J34197J92640
3245A4139488j43737K35402L31923p256K44883N3426o0053O8942O03872L25077
3235A5791967K35755J90534L27692L64315l8582o6313L16471L28925L03274M60212
3225A8214250J56386L02466L28147M50756L57150N14860P41432O15834L57991
3216B2039272L08523P29057M83683L93244N19751P13132P08915N75758j0056L74975
$$ y = [15307603, 15161389, 15060494, 14691945, 14212826, 14131578, 14015898, 14210230, 14156823, 13838961, 13814101, 13944889, 14066126, 13693727, 13592058, 13542615, 13320517, 13198403, 13301203, 13325610, 13113041, 13260643, 13361360, 13110047, 12917554, 13218914, 13598464, 13555751, 13369711, 13179515, 13252429, 13094578, 13194077, 13489584, 13449262, 13661948, 14093284, 14205103, 13812651, 13946848, 14139488, 13995751, 14231153, 14563076, 14555820, 14800703, 14854129, 14794076, 14863018, 15466890, 15791967, 16027722, 16218256, 16545948, 16910263, 16871681, 16805368, 17121839, 17450764, 17754038, 18214250, 18370636, 18673102, 19001249, 19452005, 19809155, 20324015, 21065447, 21681281, 22039272, 22347795, 23076852, 23560535, 23953779, 24473530, 25186662, 25895577, 26471335, 26461279, 26836254]
3206B6836254J82851K62759M80015J19159P2859K86210l7875J87750K94746l1423
3196B8653305M07933M27219R2684J4123M55032N49215L59705P80942N87293O79138
3186C3006589O85525O02250J013600K50247K02254L98264K79471m0729k62887
3177C6134584l51373j03446o39121o50100o35958m84764r52734p25537m81452
3168C1110099l54312m19464j84920l49521j24538l63167n57096k00339j87204
3159B8369538J26830j72291j46762r2840o2441m5231J91109j10196J75770m8220
3149B8185266j41292k70326j84395q3185m8925l41174o12498n04715n40032m25004
3139B5033720n68840o02074m06194o00332j35961m87085o48318n84982n44182
$$ y = [26836254, 27019105, 27281864, 27761879, 27881038, 27953897, 28240107, 28202232, 28389982, 28684728, 28653305, 29061238, 29488457, 29581141, 29595264, 30050296, 30599511, 30959216, 31740158, 32327451, 33006589, 33692114, 34294364, 35307964, 35558211, 35760465, 36158729, 36438200, 36397471, 36134584, 35783211, 35679765, 35040644, 34390544, 33754586, 33269822, 32317088, 31591551, 31110099, 30755787, 30336323, 30151403, 29801882, 29677344, 29314177, 28757081, 28556742, 28369538, 28496368, 28324077, 28177315, 28084475, 28022034, 27976803, 28167912, 28057716, 28233486, 28185266, 28043974, 27773648, 27589253, 27506068, 27457143, 27115969, 26503471, 25998756, 25458724, 25033720, 24464880, 23862806, 23456612, 22856280, 22720319, 22233234, 21584916, 20999934, 20455752]
3130B0455752l19511j07674q5715l29630l43981l27530j24656k52025O9823l00693
3120A8334160m7736k68857k27481j04188j2767j90018l72943J24978n1942R0239
3110A7273445J93727q7171j75327k38738J50205r9923m052N4598m5700j44807
3100A6876257K64480J30418J78236P4223R109q6805O9838N18389J32908L42764
3090A8509817M09160L86619O64796M68070M37151K82821M40335N70791J36884
3081B2306444k28219O0495r0712l54536l07542q56191p21250p09177p07095m40559
3071A7951658o61577p83189k76089l55965m56264n48278k19004n44963j85567
3062A3920762n3918p5589l44410m38649m23253l34779n2191q9648j71885O7678
$$ y = [20455752, 20136241, 20028567, 19942852, 19613222, 19269241, 18941711, 18817055, 18565030, 18634853, 18334160, 18286424, 18017567, 17790086, 17685898, 17673131, 17483113, 17110170, 17235148, 17183206, 17273445, 17467172, 17380001, 17204674, 16965936, 17116141, 17016218, 17012166, 17066764, 17021064, 16876257, 17140737, 17271155, 17449391, 17523614, 17532723, 17445918, 17515756, 18034145, 18167053, 18509817, 18918977, 19305596, 19970392, 20438462, 20875613, 21158434, 21598769, 22169560, 22306444, 22078225, 22138720, 22048008, 21693472, 21385930, 20529739, 19808489, 19099312, 18392217, 17951658, 17290081, 16506892, 16230803, 15874838, 15418574, 14870296, 14651292, 14106329, 13920762, 13866844, 13791255, 13446845, 13008196, 12584943, 12250164, 12197973, 12108325, 11936440, 12004118]
3052A2004118j24810q0276m7051q1441l12952j37468k3959J5720J258k32812j40531
3041A0839796O1442l5354l04357J9567j36946l12262r1163k43042n5383k6146
3031I716152j28688R5371J40374P3829j55590j82677l99845r1419j50276l37526
3021H579705L47902K4206O1154j28395j96033j53724j55303m3477k29706K8418
3011H134747Q2836k15766n0180J71496o8029r6649q545R8620l00088o2131p6512
3000G609799r3239N150j03003n5999J78683j98411k55087O5927K7530r2860K5433
2989G113923N2726k14949n7813K07559J7466m8290j98444K5249Q3660l2671j24256
2978F824160m49617j50337r8243j19077J20788K70008M6547n3139j93982r3323
$$ y = [12004118, 11879308, 11799032, 11751981, 11670540, 11357588, 11220120, 11196161, 11211881, 11213139, 10980327, 10839796, 10901238, 10865884, 10561527, 10581094, 10444148, 10131886, 10040723, 9797681, 9742298, 9716152, 9587464, 9682835, 9823209, 9897038, 9741448, 9558771, 9158926, 9067507, 8917231, 8579705, 8927607, 8951813, 9012967, 8884572, 8688539, 8534815, 8379512, 8336035, 8106329, 8134747, 8217583, 8001817, 7951637, 8123133, 8055104, 7958455, 7949910, 8048530, 7748442, 7686311, 7609799, 7516560, 7521710, 7418707, 7362708, 7541391, 7342980, 7087893, 7153820, 7181350, 7088490, 7113923, 7166649, 6951700, 6893887, 7101446, 7118912, 7070622, 6872178, 6897427, 6981087, 6948416, 6824160, 6374543, 6224206, 6125963, 6006886, 6127674, 6397682, 6444229, 6391090, 6197108, 6103785]
2968F103785k18958K96997J74047j94402j42335q5997J17685l56895j66868k23472
2958E303587L62071J84290m8026l25202J4153L58603K90309j57639l69585j96388
2948E416173k12429j04947J20429k9574J25969J95832l26931j48681j8278M1151
2938E058714j42948m1650K13852j14062o1892O7894m494q4766j18299K08380j60350
2927D820379k31310K25605k00395k82705Q7356K17106n4060P7521l78546l0183
2917D250768J77412m0124J83512n2190k35443k91209k82956K46954J30423n2344
2907D034803K94362K79182l85943j60688O3146j22650n3622j63899K38827J34105
2897D157623j30002j10573j51611l19148p9121K80180j0294R1671L68597m18270
$$ y = [6103785, 5884827, 6181824, 6355871, 6161469, 6019134, 5933137, 6050822, 5693927, 5527059, 5303587, 5665658, 5849948, 5801922, 5476720, 5490873, 5849476, 6139785, 5982146, 5612561, 5416173, 5203744, 5098797, 5219226, 5189652, 5315621, 5511453, 5184522, 5035841, 5017563, 5058714, 4915766, 4874116, 5087968, 4973906, 4912014, 4979908, 4975414, 4890648, 4772349, 4980729, 4820379, 4589069, 4814674, 4614279, 4331574, 4418930, 4636036, 4581976, 4659497, 4280951, 4250768, 4428180, 4388056, 4571568, 4519378, 4283935, 3992726, 3709770, 3956724, 4087147, 4034803, 4329165, 4608347, 4222404, 4061716, 4124862, 4002212, 3948590, 3784691, 4023518, 4157623, 4027621, 3917048, 3765437, 3446289, 3367168, 3647348, 3637054, 3728725, 4097322, 3679052]
2887C679052J35606j51272J27978l00072l2514J12204J40534k5260k31789P1304
2877C525771q4465r466j3321r5270J34825N1408j7226m5857r0610j06403k06185
2866C043201L01596r8614j25147j48645k5344K19449j27179O7301R1364J77686
2856C375668J73228k01401j54925J3734O6201l43309J3695l1187k16998J40618
2846B835324l3534Q0996J70733j22970r8795p6457p514J42077j09044K18093k9540
2835B969369j63642J6977R6161k06167n9419k15370K45183J8757k18895J08852
2825B591806p6394j86039J28959o9833j40340J86070K02052j05764O8101K3773
2815B622391j50921J3555j42823K4343J6096M1106K48225l0315j94980j31865
$$ y = [3679052, 3814658, 3663386, 3791364, 3491292, 3458778, 3570982, 3711516, 3686256, 3454467, 3525771, 3441306, 3431840, 3418519, 3323249, 3458074, 3509482, 3492256, 3446399, 3355789, 3249386, 3043201, 3344797, 3246183, 3121036, 2972391, 2947047, 3166496, 3039317, 3106618, 3197982, 3375668, 3548896, 3347495, 3192570, 3206304, 3272505, 2929196, 2942891, 2911704, 2694706, 2835324, 2801790, 2882786, 3053519, 2930549, 2831754, 2755297, 2747783, 2889860, 2780816, 2998909, 2969369, 2805727, 2822704, 2918865, 2712698, 2653279, 2437909, 2683092, 2701849, 2482954, 2591806, 2515412, 2329373, 2458332, 2388499, 2248159, 2434229, 2636281, 2530517, 2598618, 2622391, 2471470, 2485025, 2342202, 2366545, 2382641, 2423747, 2671972, 2641657, 2446677, 2314812]
2805B314812l4707J39787L1677j64638j55097j66389O8708Q4180q2827K71523
2795B307029n5575n4152K23686J67865k03485j71064l91427j21334P7268m1682
2785A737129J71250L44835k91757l1394o2643j08561j81900O41M8360J94269Q5036
2774A905265J81170p9377O7009j2058M0685j62952R6088J90479Q1450L213j89661
2763B121311p426K73146j71526M4392r9504k00490n3265J8460j60172k01293K10518
2752A774151r4283Q5686K18680j43742J77508N4708R9969J71043n34322Q0943
2742A890341Q3616O9575L3096r3116J71191j42591k28500j48567j98280K69302
2732A706067N1774n4764K8276l6231J82484l08725M2288J9378r748L02553j34897
$$ y = [2314812, 2280105, 2419892, 2451569, 2286931, 2131834, 1965445, 2034153, 2118333, 2035506, 2307029, 2251454, 2197302, 2420988, 2588853, 2385368, 2214304, 1822877, 1701543, 1778811, 1737129, 1908379, 2253214, 1961457, 1930063, 1867420, 1758859, 1576959, 1577600, 1625960, 1820229, 1905265, 2086435, 2007058, 2074067, 2062009, 2102694, 1939742, 2035830, 2226309, 2307759, 2310972, 2121311, 2113885, 2387031, 2215505, 2259897, 2160393, 1959903, 1906638, 1925098, 1764926, 1563633, 1774151, 1679868, 1765554, 1984234, 1840492, 2018000, 2072708, 2172677, 2343720, 1809398, 1890341, 1973957, 2043532, 2076628, 1983512, 2154703, 2012112, 1783612, 1635045, 1436765, 1706067, 1757841, 1703077, 1731353, 1695122, 1877606, 1568881, 1611169, 1630547, 1620799, 1923352, 1788455]
2721A788455J24475o6623j24714J13593j42130k33240K55024J77321K722P59j66635
2710A729007j30338J15010O7285K26101p3692j23115j0662j31433l4317R85k55496
2699A379335K62012o1237k92372P3364K12472J9817j73154J21737o7872l65309
2689A108793K07355J21809J33013K5249P4064M2582j88023j61450J59406r2927
2679A429871m1942o493M07670r303k2688o0698r7823J23655M7914p6654P6754
2668A770263j89290k03552J50237K89764k63603k57312L0398J57067k44394K12365
2658A451943n6697k47395L91926J32874J81598k41137J28365K0295k910J2589
2648A771451j81921J06038k06884j27858P5574j61879n7585O0385K48398n4436
$$ y = [1788455, 1912930, 1846307, 1721593, 1835186, 1693056, 1459816, 1714840, 1892161, 1894883, 1895642, 1729007, 1598669, 1713679, 1780964, 2007065, 1933373, 1810258, 1799596, 1668163, 1633846, 1634831, 1379335, 1641347, 1580110, 1287738, 1361102, 1573574, 1593391, 1420237, 1541974, 1474102, 1108793, 1316148, 1437957, 1570970, 1596219, 1670283, 1712865, 1524842, 1363392, 1522798, 1429871, 1387929, 1381436, 1789106, 1779803, 1757115, 1696417, 1598594, 1722249, 1770163, 1693509, 1770263, 1580973, 1377421, 1527658, 1817422, 1553819, 1296507, 1326905, 1483972, 1239578, 1451943, 1395246, 1147851, 1539777, 1672651, 1854249, 1613112, 1741477, 1761772, 1758862, 1771451, 1589530, 1695568, 1488684, 1360826, 1436400, 1274521, 1216936, 1277321, 1525719, 1471283]
2638A471283j88732J18576q3274j81462K16082K81289o0200j46911j32196j38591
2628A155864K90649M2352q3605j4310P2607k97818L94216Q9525M8372j89557k9760
2617A478535r22j40235p1955O9854p8081k5106j75787M26488p9889k96583J6384
2606A122703j01927K58247j34443J41128j71504j00124J24947j45073K68003M5295
2596A307252J07129j92696J63565j70019p890n0924j46526K626M8711Q4837q1166
2585A064899K36346m5438j37587K1869r4832M0270K24563j70705n1394J86113
2575A274104J10185l3132k5532j73076J92204j03148k77791J47035N30639k26025
2565A415463l01655J9733J69481N3985m66907L2794K57559K07218p1877l13901
$$ y = [1471283, 1282551, 1401127, 1317853, 1136391, 1352473, 1633762, 1573562, 1426651, 1294455, 1155864, 1446513, 1488865, 1405260, 1390950, 1463557, 1165739, 1559955, 1649480, 1697852, 1508295, 1478535, 1477613, 1337378, 1265423, 1335277, 1257196, 1232090, 1056303, 1482791, 1402902, 1106319, 1122703, 1020776, 1279023, 1144580, 1285708, 1114204, 1014080, 1139027, 993954, 1261957, 1307252, 1414381, 1221685, 1385250, 1215231, 1207341, 1156417, 1009891, 1012517, 1061228, 1146065, 1064899, 1301245, 1255807, 1118220, 1140089, 1045257, 1085527, 1310090, 1139385, 1087991, 1274104, 1384289, 1351157, 1325625, 1152549, 1344753, 1241605, 963814, 1110849, 1641488, 1415463, 1113808, 1133541, 1303022, 1357007, 890100, 922894, 1180453, 1387671, 1315794, 1001893]
2555A001893J24520j02207o3955K12793j06359j06298Q5866J42322m890J41558
2545A325243J22247j1300L8736l59966K3849N5701l15842M0173R2142L10812l5420
2534A286375l08103R7904j7337M0042j24684j25109O029j26194J83148K84256
2524A196327j45969J40420j55827J59978l03095j62620j8901N0576L71181j3074
2514A118996J8615K02636j91689r6251k7603J59999J06856k49512L2195K70503
2504A344745m0944k92642q7793j59741O7069J1879j09445k2287L28146Q4498n8181
2493A065304M2680k0287J89740P7084j39086j86589j07886J35997O4553N2685
2483A174195q2447K2060j00678j16310J56969K33837K64556k82701R7421K40360
$$ y = [1001893, 1126413, 1024206, 960251, 1173044, 1066685, 960387, 1046253, 1188575, 1183685, 1325243, 1447490, 1436190, 1474926, 1114960, 1138809, 1194510, 878668, 918841, 1010983, 1321795, 1286375, 978272, 1076176, 1058839, 1098881, 974197, 849088, 855117, 728923, 912071, 1196327, 1050358, 1190778, 1034951, 1194929, 891834, 729214, 710313, 760889, 1132070, 1118996, 1137611, 1340247, 1148558, 1052307, 1024704, 1184703, 1291559, 1042047, 1074242, 1344745, 1303801, 1011159, 923366, 763625, 830694, 842573, 733128, 710841, 1038987, 1123485, 1065304, 1107984, 1087697, 1277437, 1354521, 1215435, 1028846, 920960, 1056957, 1121510, 1174195, 1091748, 1113808, 1013130, 896820, 1053789, 1287626, 1552182, 1269481, 1366902, 1607262]
2473A607262l09836n2585O718J43004j8835p3999l7138j17736J45710Q4562O0882
2462A438009M1290o9629k54021j32678M45662L68262o6792N2901j97403J24943
2452A750544L0371j28159J42994m5516P2250J10548j20545O5791j05880M8389
2442A820787j30682o9686L28402J50229K93055j9489N3507o5168J44697O3422
2432B569074J76406J84140L2065K2931J58931l1895m2958M56599J03852j50245
2422C478900L70747L16413K46976K7958K32224N70881J66357J46021L30993L39570
2412F227040L93047M25953M13292J80765Q09381P00266N11849N45628P40653Q97633
2402A1845507Q65755R36911J179596J209727J279921J429826J290952J416048
$$ y = [1607262, 1297426, 1244841, 1251559, 1394563, 1375728, 1301729, 1264591, 1146855, 1292565, 1377127, 1438009, 1479299, 1409670, 1155649, 1022971, 1468633, 1836895, 1770103, 1823004, 1625601, 1750544, 1780915, 1652756, 1795750, 1750234, 1822484, 1933032, 1812487, 1878278, 1772398, 1820787, 1690105, 1620419, 1948821, 2099050, 2392105, 2372616, 2426123, 2360955, 2505652, 2569074, 2745480, 2929620, 2961685, 2984616, 3143547, 3111652, 3068694, 3525293, 3629145, 3478900, 3849647, 4166060, 4413036, 4440994, 4673218, 5244099, 5410456, 5556477, 5887470, 6227040, 6620087, 7046040, 7459332, 7640097, 8449478, 9149744, 9661593, 10207221, 10947874, 11845507, 12711262, 13648173, 14827769, 16037496, 17317417, 18747243, 20038195, 21454243]
2394B1454243J641499K474144L204806L847952L673368L003313J889169J651904
2386D2840398J424535J33647r35607k302846k302486j861612k380875l664469
2378C0950685m038625l274825k995907k381637j808664j458058j405617j097421
2370A2489931p51838j032369j053825m07072n87314l42229o31409m82970m46850
2361F754055l83808l60786j94317j98129l71462l49959j80370N0116l47660k53470
2351D164210j98585k37750k51874N9594J05423j60905m32453m5538j15553P3292
2341B959861L0337m59016r1841k7188k21886J23703P0457m0198j5724j1690j94444
2330B122371j1377j98633k45671l3850L9917J27724j02675O8213L8993j60799
$$ y = [21454243, 23095742, 25569886, 28774692, 32622644, 36296012, 39299325, 41188494, 42840398, 44264933, 44398580, 43462973, 41160127, 38857641, 36996029, 34615154, 30950685, 26912060, 23637235, 20641328, 18259691, 16451027, 14992969, 13587352, 12489931, 11738093, 10705724, 9651899, 9244827, 8657513, 8315284, 7683875, 7200905, 6754055, 6370247, 6009461, 5815144, 5617015, 5245553, 4895594, 4715224, 4765340, 4417680, 4164210, 3965625, 3727875, 3476001, 3535595, 3641018, 3480113, 3047660, 3002122, 2886569, 2959861, 2990198, 2531182, 2439341, 2412153, 2190267, 2313970, 2384427, 2344229, 2328505, 2316815, 2122371, 2110994, 1912361, 1666690, 1632840, 1672757, 1800481, 1697806, 1766019, 1805012, 1644213]
2320A644213O5687K8132l99090K34026p6943K9352j28636k59433J97564J26818
2310A461690K9085j44167J33872J274k51928j83612K03523j07629J84966r091
2300A317983k1231l7948k8675M6797j50394j36709L086J90228R7266j03589p0529
2289A106285K01432k27293N433J95503O0536J9700j16704j41617J57872k31676
2279A029471J16224j69690j98412J66748j51855J39835Q5850J0503O9393n9694
2269A038373j04133J4005K3597m3670O7929l45679P5342M74545k73862j34663
2259G91784K50269j89000q2323Q4276r285o6128J09899j09633j46909K29886J08569
2248I71405l008K4425j08079j25731k34162r0652O9792M6531O5070J48136L17265
$$ y = [1644213, 1709900, 1738032, 1338942, 1572968, 1496025, 1525377, 1396741, 1137308, 1334872, 1461690, 1490775, 1346608, 1480480, 1481754, 1229826, 1046214, 1249737, 1142108, 1327074, 1317983, 1296752, 1258804, 1230129, 1276926, 1126532, 989823, 992909, 1183137, 1280403, 1176814, 1106285, 1307717, 1080424, 1085857, 1281360, 1341896, 1361596, 1244892, 1103275, 1261147, 1029471, 1145695, 976005, 777593, 944341, 792486, 932321, 1018171, 1028674, 1098067, 1038373, 934240, 948245, 971842, 928172, 996101, 650422, 725764, 1200309, 926447, 791784, 1042053, 853053, 770730, 855006, 845721, 779593, 889492, 779859, 632950, 862836, 971405, 968397, 992822, 884743, 759012, 524850, 434198, 503990, 550521, 615591, 763727, 1080992]
2237A080992m23287J50243j19272J37557J636q1426j74523j22061k68354J77260
2227C58765K34105j69162K23348R2056j09574K13555j08808k08610R4275L9647
2217F59597J51232J68844k30027k40263L617j83565K53889N3153j0675j03777
2207E22025k8000L01066o0915l28718L08804M1627j8787k03787J46587L23089
2197A002991j18451l53467l8476j77044O6765Q4153L7002Q8460J53923k39327
2187E06529J57826j41313o3988K84095k81851K25354K21794j14344m5181r2503
2177F56418L5268n9191r7584k13162K62270j49634k25158L89727j09665J34109
2167F23398M8485j17075l82480J42015m4280O2472p2930j30884K23063J25827
$$ y = [1080992, 657705, 807948, 688676, 826233, 827869, 746443, 571920, 449859, 181505, 358765, 592870, 423708, 647056, 739112, 629538, 843093, 734285, 525675, 619950, 659597, 810829, 979673, 749646, 509383, 513000, 329435, 583324, 636477, 625802, 522025, 494025, 795091, 734176, 405458, 714262, 755889, 737102, 533315, 679902, 1002991, 884540, 531073, 492597, 315553, 382318, 466471, 503473, 591933, 745856, 506529, 664355, 523042, 459054, 743149, 461298, 686652, 908446, 794102, 748921, 656418, 691686, 632495, 534911, 321749, 584019, 434385, 209227, 598954, 489289, 623398, 671883, 554808, 172328, 314343, 270063, 332535, 259605, 128721, 351784, 477611]
2157D77611k17744J3593Q9073J27716J79372r7498K49824k4237j17128Q944J02923
2146G92449l25493K8259k4533q2523K84859j33711r156P372J76980k66490k06394
2135B41619r6101J21681K40292J01095N6095k04541j40447M07489j01952k85156
2125C40074r830K718K03774j25294L1495J04758K8472L77925j31918o3842n0022
2114G08310n96J14806j02171j9033O3739l16201j80111J20785q8474j7978K06943
2103D90019q7280q4607L47185J17927j36740K6502O0350k40337q2178j7404J54869
2092E48306k6081k44741q0256J34861k0376j8917k4029L4736m2833K32202j27832
2081C65040K54072O1443k05028p9971q2803p4928K38785L20038n6652J50899j27208
$$ y = [477611, 259867, 273460, 362533, 490249, 669621, 572123, 821947, 797710, 680582, 689526, 792449, 466956, 495215, 470682, 388159, 673018, 539307, 530151, 537523, 714503, 448013, 241619, 145518, 267199, 507491, 608586, 664681, 460140, 319693, 727182, 625230, 340074, 330244, 332962, 536736, 411442, 442937, 547695, 576167, 954092, 822174, 758332, 708310, 707714, 822520, 720349, 701316, 765055, 448854, 268743, 389528, 301054, 283076, 490019, 402739, 318132, 665317, 783244, 646504, 673006, 733356, 493019, 410841, 393437, 548306, 522225, 277484, 197228, 332089, 311713, 292796, 268767, 303503, 260670, 492872, 365040, 619112, 680555, 475527, 395556, 312753, 237825, 476610, 796648, 739996, 890895, 763687]
2070G63687n4700j11742O8559n406K01586k38425J97932j24035k75128J61633
2060E83961N3258J1425k55729N5093L2083j11883L7663j08323j53625J10386m1079
2049B13230k5817J75850K33212j63201j54375J29564j61431J60088R9549j74465
2039C32204j0539J35607k9920P2917J67981l09666p3311K9354m8735k81583L1
2028a5660J11879K95756R9521M8515k88603J58875P7785r3163j30498k51948J32210
2017A44669M0358l7956m3719j71916q3400K86543O6335K36738K6166k57400R4522
2006C00940l82863J12324K82336K06273j72645m9953K09323P6927o9245j64338
1996C49079N0565q4576L7494L0306N7618q4939Q2482j13930j28089L24718j1065
$$ y = [763687, 708987, 597245, 665804, 660398, 861984, 623559, 821491, 697456, 422328, 583961, 637219, 648644, 392915, 448008, 480091, 368208, 405871, 297548, 143923, 254309, 213230, 187413, 363263, 596475, 433274, 278899, 408463, 247032, 407120, 506669, 332204, 321665, 457272, 427352, 500269, 668250, 358584, 285273, 314627, 265892, -15691, -15660, 96219, 391975, 491496, 540011, 251408, 410283, 488068, 394905, 264407, 12459, 144669, 185027, 147071, 103352, -68564, -151964, 134579, 200914, 437652, 463818, 206418, 300940, -81923, 30401, 312737, 519010, 346365, 296412, 505735, 582662, 513417, 349079, 399644, 315068, 352562, 382868, 440486, 355547, 438029, 324099, 196010, 520728, 509663]
1985E09663k44536n6876k873k62657J26892P4851M3080K46860k97540M8021l7739
1974A47146O4542J60915J83800l02420k27105K20122J82386j93088L3720k87872
1964a7854J1553K47081J69261j05570j584r450j0466K9715k1217J27372k61505
1953A57336J01814K38677j9641j72733j80279J93848l5165N1317O4205j80641
1943B18738J75779O1998k89522m0101K05566J00506N9603n7355J26829k16253
1933C45788k19131J2560o4180N9583O0181N195r1532J81249J11337j32216M2661
1922C11495J4124J45267j71589j06854L2258L9401q7980J03204J11157P8849K0974
1911D90306j37256j01848N3092J9541j31197O1499n167j35084K4208J22107k48943
$$ y = [509663, 265127, 208251, 205378, -57279, 69613, 144464, 187544, 434404, 136864, 184885, 147146, 211688, 372603, 556403, 253983, 26878, 247000, 429386, 236298, 270018, -17854, -6301, 240780, 410041, 304471, 302887, 293437, 282971, 312686, 291469, 418841, 157336, 259150, 497827, 478186, 305453, 125174, 319022, 283857, 335174, 399379, 218738, 394517, 456515, 166993, 126892, 332458, 432964, 492567, 435212, 562041, 345788, 126657, 139217, 75037, 134620, 194801, 199996, 108464, 289713, 401050, 268834, 311495, 325619, 470886, 299297, 192443, 224701, 264102, 176122, 279326, 390483, 469332, 490306, 353050, 251202, 304294, 323835, 192638, 254137, 248970, 113886, 138094, 260201, 11258]
1900A1258K87091M66785j54727j77774J03969j37230j11786j4777k3542j87991
1890F1276K41651J85757k23612r8804j59512J8459J10602n8673n2336J21710p91
1879A45727L1150j38052Q6339M32296j91122j03647K14136r0277q4370J91626
1869D93806j86034r163j54666m03855J05279k2028J50704J93576J09099l681R715
$$ y = [11258, 298349, 765134, 610407, 432633, 536602, 399372, 287586, 272809, 249267, 61276, 302927, 488684, 265072, 166268, 6756, 25215, 135817, 77144, 24808, 146518, 145727, 176877, 38825, 125164, 557460, 366338, 262691, 476827, 386550, 302180, 493806, 307772, 298609, 143943, -259912, -154633, -176661, -25957, 167619, 276718, 273037, 282752]
$$ [...]
##END NTUPLES=NMR SPECTRUM
##END=
