##TITLE=1H_DE-80H_X3
 200.13MHz, d2o
 8 sc
 
 19ns.26.2.2025
##JCAMPDX= 6.0         $$ Bruker NMR JCAMP-DX V2.0
##DATA TYPE= NMR SPECTRUM
##DATA CLASS= NTUPLES
##ORIGIN= UXNMR, Bruker Analytische Messtechnik GmbH
##OWNER= pz
$$ XWIN-NMR		Version 3.5
$$ Wed Jun 11 11:31:24 2025 Russian Standard Time (UT+4h)  Yarkov@DPX200
##.OBSERVE FREQUENCY= 200.1313
##.OBSERVE NUCLEUS= ^1H
##.ACQUISITION MODE= SIMULTANEOUS
##.ACQUISITION SCHEME= undefined
##.AVERAGES= 8
##.DIGITISER RES= 18
##SPECTROMETER/DATA SYSTEM= spect
##.PULSE SEQUENCE= zg30
##.SOLVENT NAME= CDCl3
##.SHIFT REFERENCE= (INTERNAL, CDCl3, 0, 15.4747)
##AUDIT TRAIL= $$ (NUMBER, WHEN, WHO, WHERE, WHAT)
$$ ##TITLE= Audit trail, XWIN-NMR		Version 3.5
$$ ##JCAMPDX= 5.01
$$ ##ORIGIN= Bruker BioSpin GmbH
$$ ##OWNER= Yarkov
$$ C:/Bruker/XWIN-NMR/data/yarkov2/nmr/H-C/1/pdata/1/auditp.txt
$$ ##AUDIT TRAIL=  $$ (NUMBER, WHEN, WHO, WHERE, WHAT)
(   1,<2025-06-11 11:30:38.45 +0400>,<Yarkov>,<DPX200>,
      <created by zg, POWCHK disabled, PULCHK disabled
       configuration hash MD5:
       00 E9 B6 7A A2 85 ED C7 34 08 36 98 17 FE 4E 26
       data hash MD5: 16K
       65 63 69 00 7A C5 46 80 72 56 52 9D 5B 00 4E 39>)
(   2,<2025-06-11 11:30:41.71 +0400>,<Yarkov>,<DPX200>,
      <Start of raw data processing
       efp BC_mod = 2 LB = 0.25 FT_mod = 6 PKNL = 1 PHC0 = -1710.501 PHC1 = 9.76656 SI = 16K 
       data hash MD5: 16K
       66 D3 40 05 7A C0 1D A6 C5 B8 E7 0A C0 81 34 20>)
(   3,<2025-06-11 11:30:49.07 +0400>,<Yarkov>,<DPX200>,
      <abs ABSG = 5 
       data hash MD5: 16K
       46 65 C3 89 22 8D 79 05 22 EC 22 86 8F 67 34 D8>)
$$ ##END=
$$ 
$$ hash MD5
$$ 94 F9 5D 2D 38 A5 89 A4 B3 6C 8D 79 86 6B 92 BD
##$RELAX= 
##$RELAX= 
##$RELAX= 
##$RELAX= 
##$RELAX= 
##$RELAX= 
$$ Bruker specific parameters
$$ --------------------------
##$DU= <C:/Bruker/XWIN-NMR>
##$EXPNO= 1
##$NAME= <H-C>
##$PROCNO= 1
##$TYPE= <nmr>
##$USER= <yarkov2>
##$AMP= (0..31)
100 100 100 100 100 100 100 100 100 100 100 100 100 100 100 100 100 100 
100 100 100 100 100 100 100 100 100 100 100 100 100 100 
##$AQSEQ= 0
##$AQ_mod= 1
##$AUNM= <au_zg>
##$AUTOPOS= <>
##$BF1= 200.13
##$BF2= 200.13
##$BF3= 200.13
##$BF4= 200.13
##$BF5= 200.13
##$BF6= 200.13
##$BF7= 200.13
##$BF8= 200.13
##$BYTORDA= 1
##$CFDGTYP= 0
##$CFRGTYP= 5
##$CHEMSTR= <none>
##$CNST= (0..31)
1 1 145 1 1 1 1 1 1 1 1 1 1 1 1 1 1 1 1 1 1 1 1 1 1 1 1 1 1 1 1 1 
##$CPDPRG= <>
##$CPDPRG1= <>
##$CPDPRG2= <>
##$CPDPRG3= <>
##$CPDPRG4= <mlev>
##$CPDPRG5= <mlev>
##$CPDPRG6= <mlev>
##$CPDPRG7= <mlev>
##$CPDPRG8= <mlev>
##$CPDPRGB= <>
##$CPDPRGT= <>
##$D= (0..31)
0 0.7 0 0 0 0 0 0 0 0 0 0.03 0 0 0 0 0 0 0 0 0 0 0 0 0 0 0 0 0 0 0 0 
##$DATE= 1749627038
##$DBL= (0..7)
120 120 120 120 120 120 120 120 
##$DBP= (0..7)
150 150 150 150 150 150 150 150 
##$DBP07= 0
##$DBPNAM0= <>
##$DBPNAM1= <>
##$DBPNAM2= <>
##$DBPNAM3= <>
##$DBPNAM4= <>
##$DBPNAM5= <>
##$DBPNAM6= <>
##$DBPNAM7= <>
##$DBPOAL= (0..7)
0.5 0.5 0.5 0.5 0.5 0.5 0.5 0.5 
##$DBPOFFS= (0..7)
0 0 0 0 0 0 0 0 
##$DE= 6
$$ [...]
##$SUBNAM3= <"">
##$SUBNAM4= <"">
##$SUBNAM5= <"">
##$SUBNAM6= <"">
##$SUBNAM7= <"">
##$SUBNAM8= <"">
##$SUBNAM9= <"">
##$SW= 18.0517328524113
##$SWIBOX= (0..15)
0 0 2 0 0 0 0 0 0 0 0 0 0 0 0 0 
##$SW_h= 3612.71676300578
##$TD= 16384
##$TD0= 1
##$TE= 0
##$TE2= 300
##$TE3= 300
##$TEG= 300
##$TL= (0..7)
0 120 120 120 120 120 120 120 
##$TP= (0..7)
150 150 150 150 150 150 150 150 
##$TP07= 0
##$TPNAME0= <>
##$TPNAME1= <>
##$TPNAME2= <>
##$TPNAME3= <>
##$TPNAME4= <>
##$TPNAME5= <>
##$TPNAME6= <>
##$TPNAME7= <>
##$TPOAL= (0..7)
0.5 0.5 0.5 0.5 0.5 0.5 0.5 0.5 
##$TPOFFS= (0..7)
0 0 0 0 0 0 0 0 
##$TUNHIN= 0
##$TUNHOUT= 0
##$TUNXOUT= 0
##$USERA1= <user>
##$USERA2= <user>
##$USERA3= <user>
##$USERA4= <user>
##$USERA5= <user>
##$V9= 5
##$VALIST= <valist>
##$VCLIST= <CCCCCCCCCCCCCCC>
##$VD= 0
##$VDLIST= <DDDDDDDDDDDDDDD>
##$VPLIST= <PPPPPPPPPPPPPPP>
##$VTLIST= <TTTTTTTTTTTTTTT>
##$WBST= 1024
##$WBSW= 4
##$XGAIN= (0..3)
0 0 0 0 
##$XL= 0
##$YL= 0
##$YMAX_a= 102527
##$YMIN_a= -73654
##$ZGOPTNS= <>
##$ZL1= 120
##$ZL2= 120
##$ZL3= 120
##$ZL4= 120
##$ABSF1= 15.42296
##$ABSF2= -2.628887
##$ABSG= 5
##$ABSL= 3
##$ALPHA= 0
##$AQORDER= 0
##$ASSFAC= 0
##$ASSFACI= 0
##$ASSFACX= 0
##$ASSWID= 0
##$AUNMP= <proc_1d>
##$AZFE= 0.1
##$AZFW= 0.1
##$BCFW= 0
##$BC_mod= 2
##$BYTORDP= 0
##$COROFFS= 0
##$CY= -3
##$DATMOD= 1
##$DC= 0
##$DFILT= <>
##$DTYPP= 0
##$F1P= 0
##$F2P= 0
##$FCOR= 1
##$FTSIZE= 16384
##$FT_mod= 6
##$GAMMA= 0
##$GB= 0
##$INTBC= 1
##$INTSCL= 3.241238e-09
##$ISEN= 128
##$LB= 0.25
##$LEV0= 0
##$LPBIN= 0
##$MAXI= 10000
##$MC2= 0
##$MEAN= 0
##$ME_mod= 0
##$MI= 1.114404
##$NCOEF= 0
##$NC_proc= -10
##$NLEV= 6
##$NOISF1= 3.799351
##$NOISF2= 2.8
##$NSP= 0
##$NTH_PI= 0
##$NZP= 0
##$OFFSET= 15.47474
##$PC= 1
##$PHC0= -1710.501
##$PHC1= 9.76656
##$PH_mod= 1
##$PKNL= yes
##$PPARMOD= 0
##$PSCAL= 0
##$PSIGN= 0
##$REVERSE= no
##$SF= 200.130009397687
##$SI= 16384
##$SIGF1= 3
##$SIGF2= 2
##$SINO= 0.751879
##$SIOLD= 32768
##$SREGLST= <19F.Aceton>
##$SSB= 0
##$STSI= 16384
##$STSR= 0
##$SW_p= 3612.71676300578
##$SYMM= 0
##$S_DEV= 0
##$TDeff= 16384
##$TDoff= 0
##$TI= <>
##$TILT= no
##$TM1= 0
##$TM2= 0
##$TOPLEV= 0
##$USERP1= <user>
##$USERP2= <user>
##$USERP3= <user>
##$USERP4= <user>
##$USERP5= <user>
##$WDW= 1
##$XDIM= 16384
##$YMAX_p= 463888327
##$YMIN_p= -3361683
$$ End of Bruker specific parameters
$$ ---------------------------------
##NTUPLES= NMR SPECTRUM
##VAR_NAME=  FREQUENCY,     SPECTRUM/REAL,   SPECTRUM/IMAG
##SYMBOL=    X,             R,               I
##VAR_TYPE=  INDEPENDENT,   DEPENDENT,       DEPENDENT
##VAR_FORM=  AFFN,          ASDF,            ASDF
##VAR_DIM=   16384,         16384,           16384
##UNITS=     HZ,            ARBITRARY UNITS, ARBITRARY UNITS
##FACTOR=    0.220516191357247, 1,           1
##FIRST=     3096.95986730672, 0,            0
##LAST=      -515.756895699058, 0,           0
##MIN=       -515.756895699058, -3361683,    0
##MAX=       3096.95986730672, 463888327,    0
$$ Real data points
##PAGE= N=1
##DATA TABLE= (X++(R..R)), XYDATA
$$ [...]
7066B711967P68893p76639N5233m21069k79803n58844M80250J143448o49709j70524
$$ 2711967 3480860 2704221 2759454 2338385 2058582 1499738 1979988 3123436 2473727 2303203
7056B303203K42399j81771J7480J492437j7811q39585m24861p44882j33457p6106
$$ 2303203 2545602 2363831 2381311 3873748 3855937 3016352 2591491 1846609 1713152 1637046
7046A637046J113855K7404p77535L5265N27179K17552K66494L72631n4080j031529
$$ 1637046 2750901 2778305 2000770 2036035 2563214 2780766 3047260 3419891 3365811 2334282
7036B334282J04855l08021q03555j57946K81893N83695n44073J92908r8534J357336
$$ 2334282 2439137 2131116 1327561 1169615 1451508 2035203 1491130 1684038 1585504 2942840
7026B942840l12786k44817J81247o0784Q41964l19549l3178L98089O34400J072889
$$ 2942840 2630054 2385237 2566484 2505700 3347664 3028115 2994937 3393026 4027426 5100315
7016E100315J552806p55614n9101j144476j414138j224322O01382J098187o12370
$$ 5100315 6653121 5897507 5838406 4693930 3279792 2055470 2656852 3755039 3142669
7007C142669q90605P03962M94932j110283P12620M24310L82846l12690q76805
$$ 3142669 2252064 2956026 3450958 2340675 3053295 3477605 3860451 3547761 2670956
6998B670956m74953J55148J33181l37838K16462K78150p20764k34804Q29739l56860
$$ 2670956 2196003 2351151 2484332 2146494 2362956 2641106 1920342 1685538 2515277 2158417
6988B158417J37061J10786o69454R50105m16941j80109o94997n58239P04782J9055
$$ 2158417 2295478 2406264 1736810 2686915 2269974 2089865 1394868 836629 1541411 1560466
6978A560466Q84610L2137M3207J025620j27440k47823m30697o16605j422619r67809
$$ 1560466 2445076 2477213 2520420 3546040 3418600 3170777 2740080 2123475 700856 -266953
6968b66953Q62812O54373P87713K09130k754l26096o4758M16158k96462m80926
$$ -266953 595859 1250232 2037945 2247075 2244321 1918225 1853467 2269625 1973163 1492237
6958A492237P47866P90902R30760n09939p16757Q31030m51761N27141J016158
$$ 1492237 2240103 3031005 3961765 3451826 2735069 3566099 3114338 3641479 4657637
6949D657637O32498n95823l97759R51364j06991n07619k8954J20056P53550q53097
$$ 4657637 5290135 4694312 4296553 5247917 5140926 4633307 4604353 4724409 5477959 4624862
6939D624862r53690N2383j265006L015Q33893l69908j37929O94882j44420l61769
$$ 4624862 3671172 3723555 2458549 2461564 3295457 2925549 2787620 3482502 3338082 2976313
6929B976313J565646j41697N41902l03864j4264R39179Q61887J32167J276520
$$ 2976313 4541959 4400262 4942164 4638300 4624036 5563215 6425102 6557269 7833789
6920G833789R42281P5918j87992n68078j050227k52372O99230P5348r28183r88681
$$ 7833789 8776070 8851988 8663996 8095918 7045691 6793319 7492549 7567897 6639714 5651033
6910E651033m73046k17739k19236j27176K06415p51320k24372n02004J099852
$$ 5651033 5177987 4960248 4741012 4613836 4820251 4068931 3844559 3342555 4442407
6901D442407N2500n1939o06952o84052m98310M51904J193346L04847N2577n08940
$$ 4442407 4494907 4442968 3836016 3151964 2653654 3105558 4298904 4603751 4656328 4147388
6891D147388j41623o36125j198791J61686L56996k28361K30623M70833O45298
$$ 4147388 4005765 3369640 2170849 2332535 2689531 2461170 2691793 3162626 3807924
6882C807924p20497Q12549N72543j593544n53322l35577k917j29646L56163l10439
$$ 3807924 3087427 3899976 4472519 2878975 2325653 1990076 1987159 1857513 2213676 1903237
6872A903237J82747J161213m3307L1452N34807K93827N9383l44669o63224J62866
$$ 1903237 2085984 3247197 3203890 3235342 3770149 4063976 4123359 3778690 3115466 3278332
6862C278332l25523O1333J063780j26830P75084K02846n12891j059116k97947
$$ 3278332 2952809 3014142 4077922 3951092 4726176 4929022 4416131 3357015 3059068
6853C059068O85627n27362j86834P30610j46496j329713n29938R48676K99035
$$ 3059068 3744695 3217333 3030499 3761109 3614613 2284900 1754962 2703638 3002673
6844C002673m67589j239220J103606P04843J8116p93630k60112l41758M4099o09144
$$ 3002673 2535084 1295864 2399470 3104313 3122429 2328799 2068687 1726929 1771028 1161884
6834A161884n52796P31382J011590j60119J86610j4311p76560m12592M80631L49724
$$ 1161884 609088 1340470 2352060 2191941 2378551 2364240 1587680 1175088 1655719 2005443
6824B005443q53749n75695L11219Q56365K40986o16326k96855Q64891l1916k45753
$$ 2005443 1151694 575999 887218 1743583 1984569 1368243 1071388 1936279 1904363 1658610
6814A658610J681408J20119j109656K23564k36248j774696q08910J917321m44029
$$ 1658610 3340018 3460137 2350481 2574045 2337797 563101 -245809 1671512 1227483
6805A227483O12242m21596R26841M69974j332256J266948O10068j236219M93273
$$ 1227483 1839725 1418129 2344970 2814944 1482688 2749636 3359704 2123485 2616758
6796B616758k96330N59381J065359q35472l00968j346444r61882J76565R69935
$$ 2616758 2320428 2879809 3945168 3109696 2808728 1462284 500402 676967 1646902
6787A646902P63125p54462k79072K5043K75082q29867l93825Q8949j1322O0103
$$ 1646902 2410027 1655565 1376493 1401536 1676618 846751 452926 541875 530553 590656
6777E90656J319182P15837L66985p56394N13022r20678o29785L16142K69554P36443
$$ 590656 1909838 2625675 2992660 2236266 2749288 1828610 1198825 1514967 1784521 2520964
6767B520964j810406R55644P83037k18265O8712j10498J51578p6892k03705k36472
$$ 2520964 710558 1666202 2449239 2230974 2299686 2189188 2340766 2263874 2060169 1823697
6757A823697N46041n00553J02703j344459Q74635N42315m37995K44448J71390
$$ 1823697 2369738 1869185 1971888 627429 1502064 2044379 1606384 1850832 2022222
6748B022222q87340l78632P97062L03335O20322j361340P26898J128973K16614
$$ 2022222 1134882 756250 1553312 1856647 2476969 1115629 1842527 2971500 3188114
6739C188114j098310L45813J203193L491P20432L44069l84754j680283j301733
$$ 3188114 2089804 2435617 3638810 3642301 4362733 4706802 4322048 2641765 1340032
6730A340032L79592J409120m7270N70055L97541j500749L12136P34747P27939
$$ 1340032 1719624 3128744 3081474 3651529 4049070 2548321 2860457 3595204 4323143
6721D323143m60564j184602m21329K56385o03658k4024M08551p519m10591N97343
$$ 4323143 3862579 2677977 2256648 2513033 1909375 1885351 2293902 2286383 1875792 2473135
6711B473135O26349M28733k33409P06259r21182J9457r6519m69707N49526R3513
$$ 2473135 3099484 3528217 3294808 4001067 3079885 3099342 3002823 2533116 3082642 3176155
6701C176155n46388n52424O38929M6000p92873o10776J049374Q12963n84609J153935
$$ 3176155 2629767 2077343 2716272 2762272 1969399 1358623 2407997 3220960 2636351 3790286
6691C790286j14633l1776m56537P1958N84412k02844Q9662k43667j36869O85620
$$ 3790286 3675653 3643877 3187340 3259298 3843710 3640866 3730528 3486861 3349992 4035612
6681D035612L35462o18797N97774l81366j295949m18274J410678J07380M53929
$$ 4035612 4371074 3752277 4350051 3968685 2672736 2254462 3665140 3772520 4226449
6672D226449l00304M73031p26219P19243O71477o13696P08815k52258n29589j70265
$$ 4226449 3926145 4399176 3672957 4392200 5063677 4449981 5158796 4906538 4376949 4206684
6662D206684j7082k02712O00674o06610M56215K31805O85945m48331j08554R10826
$$ 4206684 4189602 3986890 4587564 3980954 4437169 4668974 5354919 4906588 4798034 5708860
6652E708860k95257J2330j2429N48688n4546M24590l64758p38944N91760P28554
$$ 5708860 5413603 5425933 5413504 5962192 5907646 6332236 5967478 5228534 5820294 6548848
6642F548848K41789l04174J63274M25065K4110J00525Q06747M95802N34700r75390
$$ 6548848 6790637 6486463 6649737 7074802 7098912 7199437 8006184 8501986 9036686 8061296
6632H061296m89711R4880N13624m14863j00690O7425j76142P59259O94959N09862
$$ 8061296 7571585 7666465 8180089 7765226 7664536 7731961 7555819 8315078 9010037 9519899
6622I519899M28927L46268n1529O02591K36224R1590K62859M17954J420072P68250
$$ 9519899 9948826 10295094 10243565 10846156 11082380 11173970 11436829 11854783 13274855 14043105
6612A4043105o03170J001710J660896N88852J138939K030783J068151N70083J426511
$$ 14043105 13439935 14441645 16102541 16691393 17830332 19861115 20929266 21499349 22925860
6603B2925860L050580J398715K734198K251579L050754L009878J704783M49603
$$ 22925860 25976440 27375155 30109353 32360932 35411686 38421564 40126347 40575950
6595D0575950P98720J67057q21896j784226k673330j317536M3698L15457J71463
$$ 40575950 41374670 41541727 40719831 38935605 36262275 34944739 34988437 35303894 35475357
6586C5475357M27510J106310K868889J627429J003605K642143K610438K912610
$$ 35475357 35902867 37009177 39878066 41505495 42509100 45151243 47761681 50674291
6578E0674291M372667M097731L525100L633557K656564Q45095p90099k534689
$$ 50674291 55046958 59144689 62669789 66303346 68959910 69805005 69014906 66480217
6570F6480217l805101m892009m216303l604481m152849k978641k132901k064173
$$ 66480217 62675116 57783107 53566804 49962323 45809474 42830833 40697932 38633759
6562C8633759k175920p99983q01657k777020n29068Q8337j231566j016013p23754
$$ 38633759 36457839 35657856 34856199 32079179 31550111 31638448 30406882 29390869 28667115
6553B8667115L9290J329005N4070K33422J768397K233997J042878J573302J053060
$$ 28667115 28706405 30035410 30089480 30322902 32091299 34325296 35368174 36941476 37994536
6544C7994536J004173K990857J377011P97660o92081j356886j323754k410127
$$ 37994536 38998709 41989566 43366577 44164237 43472156 42115270 40791516 38381389
6536C8381389l019963k817687j364711j850442j767503k373571j429329j026374
$$ 38381389 35361426 32543739 31179028 29328586 27561083 25187512 23758183 22731809
6528B2731809j363589j135755j812011j152071k43603k308m29433r42084j536469
$$ 22731809 21368220 20232465 18420454 17268383 17024780 17022472 16593039 15650955 14114486
6519A4114486K95581k89855j025995J181252M39465p29478k033143r46131k9445
$$ 14114486 14410067 14120212 13094217 14275469 14714934 13985456 11952313 11006182 10976737
6510A0976737j190359Q09565P73150j47869n91632O3212q41613J22313o8101J03804
$$ 10976737 9786378 10595943 11369093 11221224 10629592 10692804 9851191 9973504 9905403 10009207
6500A0009207L64753O1449M93131j052495l93308j57019k12227p33670K66172
$$ 10009207 10373960 10435409 10928540 9876045 9482737 9325718 9113491 8379821 8645993
6491H645993J84725O54036j571400n62373P8614J93655m6003O12692j66642j71675
$$ 8645993 8830718 9484754 7913354 7350981 7429595 7623250 7577247 8189939 8023297 7851622
6481G851622J88780l80318J50998J00529n83964r2987N63912J50802R3528j91173
$$ 7851622 8040402 7660084 7811082 7911611 7327647 7234660 7798572 7949374 8042902 7851729
6471G851729O81004k38149p56687m05555k07462J43424O54999k25258m9844j249826
$$ 7851729 8532733 8294584 7537897 7132342 6924880 7068304 7723303 7498045 7448201 6198375
6461F198375L87447J062400p61007j687827K65531m24037R16114R19259l47839
$$ 6198375 6585822 7648222 6887215 5199388 5464919 5040882 5956996 6876255 6528416
6452F528416o28115L35884J279730o85705J079059j430917j960363J061117N83153
$$ 6528416 5900301 6236185 7515915 6830210 7909269 6478352 4517989 5579106 6162259
6443F162259j97394n27469J64603m73078m45003P18993Q02979M42912j99248n59665
$$ 6162259 5964865 5437396 5601999 5128921 4683918 5402911 6205890 6648802 6449554 5889889
6433E889889j143038R80121P72690j191777j67264P16115r80253R4730Q26959
$$ 5889889 4746851 5726972 6499662 5307885 5140621 5856736 4876483 4971213 5798172
6424E798172r690o55939Q68061K1962j341959N92488P06048M11795p98239L80656
$$ 5798172 5788482 5132543 6000604 6022566 4680607 5273095 5979143 6390938 5592699 5973355
6414E973355P79544Q1236p21382p28079M17292L67889m76645J0872P3733N45292
$$ 5973355 6752899 6834135 6112753 5384674 5801966 6169855 5693210 5704082 5777815 6323107
6404F323107Q78941m7470m3789L49326m95522j723880l78343P64427k40925j511332
$$ 6323107 7202048 7154578 7110789 7460115 6964593 5240713 4862370 5626797 5385872 3874540
6394C874540M1670O72621O22821Q31574p64700j9469P5212P26075K80474N03535
$$ 3874540 3916210 4588831 5211652 6043226 5278526 5259057 5334269 6060344 6340818 6844353
6384F844353k00184q79820M48414J037895K63469n59275m2814l42110L31309o24315
$$ 6844353 6644169 5764349 6212763 7250658 7514127 6954852 6912038 6569928 6901237 6276922
6374F276922L06445K96276r0302J525635N72950j172850m5289J261665p27550
$$ 6276922 6583367 6879643 6789341 8314976 8887926 7715076 7669787 8931452 8203902
6365H203902j103949M77163l36727m10246J74899J142342O8827m32598J513672
$$ 8203902 7099953 7577116 7240389 6830143 7005042 8147384 8216211 7783613 9297285
6356I297285M29039n24724p22487l51260K3128J464912L22057q66730j84217M46343
$$ 9297285 9726324 9201600 8479113 8127853 8150981 9615893 9937950 9071220 8887003 9333346
6346I333346k33067j101407j82096N99984P22459J43419l18378m96408q90810
$$ 9333346 9100279 7998872 7816776 8416760 9139219 9282638 8964260 8467852 7577042
6337G577042J249611L34422r37609J1334K92752J76686l89298J102727k95525
$$ 7577042 8826653 9161075 8223466 8234800 8527552 8704238 8314940 9417667 9122142
6328I122142L50647Q3491j14798J576667o76598l31569K5384M51479K959p99349
$$ 9122142 9472789 9556280 9441482 11018149 10341551 10009982 10035366 10486845 10489804 9690455
6318I690455P32764K51337K81649j85137R141l30056J221422l5502K22273j054082
$$ 9690455 10423219 10674556 10956205 10771068 10780209 10450153 11671575 11636073 11858346 10804264
6308A0804264K3237k63917J78703J142686l61948o44841j30013k61071j29797
$$ 10804264 10827501 10563584 10742287 11884973 11523025 10878184 10748171 10487100 10357303
6299A0357303R91808m96049N57655j18904P0484J458416J62002n51881r52406
$$ 10357303 11349111 10853062 11410717 11291813 11362297 12820713 12982715 12430834 11478428
6290A1478428l44331O67409k1211k76472Q20761m36476n05927J655030q88242
$$ 11478428 11134097 11801506 11780295 11503823 12324584 11888108 11382181 13037211 12148969
6281A2148969r5207J375551M20081q32286N82868n78111R68703l65150p92474
$$ 12148969 12053762 13429313 13849394 13017108 13599976 13021865 13990568 13625418 12832944
6272A2832944J025464n49513r33418N73611L23013k56400M57782m31506j55984
$$ 12832944 13858408 13308895 12375477 12949088 13272101 13015701 13473483 13041977 12885993
6263A2885993k93276k42082R0268Q14983L33302j83035J191592k58067J05673
$$ 12885993 12592717 12350635 12440903 13255886 13589188 13406153 14597745 14339678 14445351
6254A4445351l41686R46230P49405p39121j08255O12176O52810M48427L58904
$$ 14445351 14103665 15049895 15799300 15060179 14951924 15564100 16216910 16665337 17024241
6245A7024241o23134M47230L89709N33809o85585O45749O17667J37933J064964
$$ 17024241 16401107 16848337 17238046 17771855 17086270 17732019 18349686 18487619 19552583
6236A9552583o77907O27173M18222p91933Q60446q22990m64969n80091O15327
$$ 19552583 18874676 19501849 19920071 19128138 19988584 19165594 18700625 18120534 18735861
6227A8735861J734236k8227N55928K75496l11584J96478q43160r8691J426878
$$ 18735861 20470097 20441870 20997798 21273294 20961710 21158188 20315028 20216337 21643215
6218B1643215M49975N43498J24995K22257O30696J041387O16611O31561Q52985
$$ 21643215 22093190 22636688 22761683 22983940 23614636 24656023 25272634 25904195 26757180
6209B6757180J547130K003019n76890k22819K381323J122859k84111K149427J723279
$$ 26757180 28304310 30307329 29730439 29507620 31888943 33011802 32727691 34877118 36600397
6200C6600397K015102J874253J729202K430672K206735K068287K899040M151508
$$ 36600397 38615499 40489752 42218954 44649626 46856361 48924648 51823688 55975196
6192E5975196L678627K601396M079022M177346N535257M113324M516246L490461
$$ 55975196 59653823 62255219 66334241 70511587 76046844 80160168 84676414 88166875
6184H8166875K843058M459031L185985K020542P53987k00872m94522p11811q46197
$$ 88166875 91009933 95468964 98654949 100675491 101429478 101228606 100734084 100022273 99176076
6175I9176076O8129r02597P7996J968410M380789M741572M900588O062164O133683
$$ 99176076 99244205 98341608 98419604 100388014 104768803 109510375 114410963 120473127 126606810
6166A26606810O349582N443880O949159O806421N501478M356389L98626j278128
$$ 126606810 132956392 138400272 145349431 152155852 157657330 162013719 162412345 161134217
6158A61134217l193436p732799n937518n582550o456800n027547m374699l508887
$$ 161134217 157940781 150207982 144270464 138687914 132231114 127203567 122828868 119319981
6150A19319981m206101k494287l020647j475727j152775o1018N09908K717428
$$ 119319981 115113880 112619593 109598946 108123219 106970444 106909426 107419334 110136762
6142A10136762M328871M281614L725479K242565l50482j151945m106843m300535
$$ 110136762 114465633 118747247 122472726 124715291 124364809 123212864 119106021 114805486
6134A14805486n433902n370706n655705n975263n618785o908222m386235m317635
$$ 114805486 109371584 104000878 98345173 92369910 86751125 79842903 75456668 71139033
6126G1139033m650863l419734l001748k418359k611283j773368k453234k905822
$$ 71139033 66488170 63068436 60066688 57648329 55037046 53263678 50810444 47904622
6118D7904622j266388j770501j588727o35073L7077m40113o07625n21446N66673
$$ 47904622 46638234 44867733 43279006 42643933 42681010 42240897 41633272 41111826 41678499
6109D1678499j379839m05655Q8962p46384K96884N91761m28671O56680j186595
$$ 41678499 40298660 39893005 39981967 39235583 39532467 40124228 39695557 40352237 39165642
6100C9165642p28293m05812K7071j35662K17078J59697j005091J185004Q59244
$$ 39165642 38437349 38031537 38058608 37922946 38140024 38299721 37294630 38479634 39338878
6091C9338878L24440J117788O35134J663629J543964J480770J510832J373184
$$ 39338878 39663318 40781106 41416240 43079869 44623833 46104603 47615435 48988619
6083D8988619K084390K291443J198969L93215q51733q03308j352355j322066k343022
$$ 48988619 51073009 53364452 54563421 54956636 54104903 53301595 51949240 50627174 48284152
6074D8284152j320299q49402k829308j161294m58210p96062j861647p72427r04354
$$ 48284152 46963853 46114451 43285143 42123849 41665639 40869577 39007930 38235503 37331149
6065C7331149j472445j216542m06657o74511o45233J93685K26165J97991m31959
$$ 37331149 35858704 34642162 34235505 33560994 32915761 33109446 33335611 33533602 33101643
6056C3101643O5971J764492m61455O68514L46830j45123q32403o92809q93572
$$ 33101643 33167614 34932106 34470651 35139165 35485995 35340872 34508469 33815660 32922088
6047C2922088k72125j812469n33835n52846p14498j069817p37054l15734q96228
$$ 32922088 32649963 30837494 30303659 29750813 29036315 27966498 27229444 26913710 26017482
6038B6017482o6711j019718l41321O76163j125630l63591l15713r36389R4379
$$ 26017482 25950771 24931053 24589732 25265895 24140265 23776674 23460961 22524572 22618951
6029B2618951N51720M02762n63263M02501k74707P40257j61528o50930r21627
$$ 22618951 23170671 23573433 23010170 23412671 23137964 23878221 23716693 23065763 22144136
6020B2144136J586003N84728J798131j66250j42894L31924j130510m78834j007325
$$ 22144136 23730139 24314867 26112998 25946748 25803854 26135778 25005268 24526434 23519109
6011B3519109q08582r15290L07684r23777j177856o78025R58145J70021p1222
$$ 23519109 22710527 21795237 22102921 21179144 20001288 19323263 20281408 20451429 20380207
6002B0380207N6846q19949P37385K71874j06257k043135M49740Q76055p3575k30840
$$ 20380207 20437053 19617104 20354489 20626363 20520106 18476971 18926711 19802766 19729191 19498351
5992A9498351n41992m16550M89592J280417N85537k91449K66993n57847j153034
$$ 19498351 18956359 18539809 19029401 20309818 20895355 20603906 20870899 20313052 19160018
5983A9160018N05776O22025J62038K40244j67136j068430n55746r2431J01563
$$ 19160018 19665794 20287819 20449857 20690101 20522965 19454535 18898789 18806358 18907921
5974A8907921N37986K89116J88979o2230p1688l535o83757p51243j109738J5134
$$ 18907921 19445907 19735023 19924002 19861772 19790084 19786549 19102792 18351549 17241811 17256945
5964A7256945L9330Q278Q60296k15245M7416O0325j681301M73307k13148P40215
$$ 17256945 17296275 17304553 18164849 17949604 17997020 18057345 16376044 16849351 16636203 17376418
5954A7376418K42564l83466L22785M45721k16926j72425K08096r9718o98162L52574
$$ 17376418 17618982 17235516 17558301 18004022 17787096 17614671 17822767 17723049 17024887 17377461
5944A7377461r95829j384789J151850L51305l38006L40026l96623p36974O53752
$$ 17377461 16381632 14996843 16148693 16499998 16161992 16502018 16105395 15368421 16022173
5935A6022173J16335k22288r28202J442336Q9124m71039O79829M44494J61817
$$ 16022173 16138508 15916220 14988018 16430354 16519478 16048439 16728268 17172762 17334579
5926A7334579l60010p8487m42119J373798j61075n17029O71090K93731l60209
$$ 17334579 16974569 16896082 16453963 17827761 17666686 17149657 17820747 18114478 17754269
5917A7754269l87337n1674K03575J32967m16611N91683j25846p13142M13783N81365
$$ 17754269 17366932 17315258 17518833 17651800 17235189 17826872 17701026 16987884 17401667 17983032
5907A7983032o61465m27674M1575O77638M80808P07605l2784q81364p71838k22129
$$ 17983032 17321567 16893893 16935468 17613106 18093914 18801519 18768735 17887371 17115533 16893404
5897A6893404N05457K30106j21753j519O01083j07506L11899J604445r6686j647409
$$ 16893404 17398861 17628967 17507214 17505695 18106778 17999272 18311171 19915616 19818930 18171521
5887A8171521J16860J50733J39680O52786k93973Q21143l38070l79745M569o29406
$$ 18171521 18288381 18439114 18578794 19231580 18937607 19758750 19420680 19040935 19045504 18416098
5877A8416098Q31916O26404m64591j42010J191690j69175l81328L27048m6382
$$ 18416098 19248014 19874418 19409827 19267817 20459507 20290332 19909004 20236052 20189670
5868B0189670k76747l22888n91121J20820K62661R76356o67479K434k25073K15794
$$ 20189670 19912923 19590035 18998914 19119734 19382395 20358751 19691272 19693706 19468633 19684427
5858A9684427k31923P48022L33381n36781j90317N82609O58009O0225O15040J48529
$$ 19684427 19452504 20200526 20533907 19997126 19806809 20389418 21047427 21107652 21722692 21871221
5848B1871221L02602j56944O44535L93859K25034r40518n27359k09125J052086
$$ 21871221 22173823 22016879 22661414 23055273 23280307 22339789 21812430 21603305 22655391
5839B2655391R25513j45279l75810L97802n33571Q67079n77427K73264m83138
$$ 22655391 23580904 23435625 23059815 23457617 22924046 23791125 23213698 23486962 23003824
5830B3003824J72987O5414Q28115J007422m38982P29777P18329J129205j209950
$$ 23003824 23176811 23242225 24070340 25077762 24638780 25368557 26086886 27216091 26006141
5821B6006141k67544P13308O29397l35935l11600r56296J78745L22173k66129
$$ 26006141 25738597 26451905 27081302 26745367 26433767 25477471 25656216 25978389 25712260
5812B5712260M59950J41156j7574J414222n41361m06345M63885m64338m99061
$$ 25712260 26172210 26313366 26295792 27710014 27168653 26762308 27226193 26761855 26262794
5803B6262794K77070k0994J233703J652081J58234O30841m53252P98095N4557
$$ 26262794 26539864 26518870 27752573 29404654 29562888 30193729 29740477 30538572 30593129
5794C0593129j003930j073127O86574m59964J499247J202478O49354P06124m77878
$$ 30593129 29589199 28516072 29202646 28742682 30241929 31444407 32093761 32799885 32322007
5785C2322007J040094r06399J899248J351195k45750O41866K91332J317017Q43999
$$ 32322007 33362101 32455702 34354950 35706145 35460395 36102261 36393593 37710610 38554609
5776C8554609Q75851J036263K389454J442798J370547J655111O47695J681240
$$ 38554609 39430460 40466723 42856177 44298975 45669522 47324633 47972328 49653568
5768D9653568K634315K720403L073616M365027K843348L331061M732375N065161
$$ 49653568 52287883 55008286 58081902 62446929 65290277 68621338 73353713 78418874
5760G8418874M526774K414451J53288J234291l01887k115138k699546j623331
$$ 78418874 82945648 85360099 85513387 86747678 86445791 84330653 81631107 80007776
5752H0007776j505026r60646j208481j614621O52818N97368K327463J102580R15391
$$ 80007776 78502750 77542104 76333623 74719002 75371820 75969188 78296651 79399231 80314622
5743H0314622L150343M690920L577978M334724N291998O963770Q244048P171819
$$ 80314622 83464965 88155885 91733863 96068587 101360585 108324355 116568403 123740222
5735A23740222O219066L972712K206049j198632k723032k655814m410137n746502
$$ 123740222 129959288 133932000 136138049 134939417 132216385 129560571 125150434 119403932
5727A19403932m837309m079316l261982l552269k373367j851076m94726O42954
$$ 119403932 114566623 110487307 107225325 103673056 101299689 99448613 98953887 99596841
5719I9596841L82144K45505J096978P07334J057897K698344L469185K894187K099587
$$ 99596841 99978985 100224490 101321468 102028802 103086699 105785043 109254228 112148415 114248002
5710A14248002J473527J106800K497548O15300p40887q22892m70277j064856k578912
$$ 114248002 115721529 116828329 119325877 119941177 119200290 118377398 117907121 116842265 114263353
5701A14263353j743426k38709j197350m13330p04661R10594J138251J7753M07513
$$ 114263353 112519927 112281218 111083868 110670538 109965877 110876471 112014722 112032475 112439988
5692A12439988P00217J976555J069926o287j79037R41701K054922K203551L969293
$$ 112439988 113140205 115116760 116186686 116180399 116001362 116943063 118997985 121201536 125170829
5683A25170829L175763K467155L273757L522330K834439L313059L517170L699654
$$ 125170829 128346592 130813747 134087504 137609834 140444273 143757332 147274502 150974156
5675A50974156M077776K667648L164872M900530N854940N186148M440754M723139
$$ 150974156 155051932 157719580 160884452 165784982 171639922 176826070 181266824 185989963
5667A85989963O509090P205843N813797M699727M952406M647244M121097J558048
$$ 185989963 192499053 199704896 205518693 210218420 215170826 219818070 223939167 225497215
5659B25497215p7094j176548l362814n920973o740338o517205p516215q588926
$$ 225497215 225420121 224243573 220880759 214959786 208219448 201702243 194186028 185597102
5651A85597102r102201p198861p132577p616902p019439o787697m326982m598273
$$ 185597102 176494901 169296040 162163463 154546561 147527122 140739425 136412443 131814170
5643A31814170m237618m205382l200773l331001j554971j192486j581745j682204
$$ 131814170 127576552 123371170 120170397 116839396 115284425 114091939 112510194 110827990
5635A10827990j317560m12143m91669M21408M33294j624975j49864q39623r92979
$$ 110827990 109510430 109098287 108606618 109028026 109461320 107836345 107686481 106846858 105853879
5626A05853879j72486j918320q52870k714131j481667j487617l212287k643576
$$ 105853879 105681393 103763073 102910203 100196072 98714405 97226788 94014501 91370925
5618I1370925k082391n42058p89901k88842N18373k31508j50867Q57328P07357
$$ 91370925 89288534 88746476 87956575 87667733 88186106 87954598 87803731 88661059 89368416
5609H9368416o97341N86850J472144N09928J038103J009492N14317j00670Q95459
$$ 89368416 88671075 89257925 90730069 91239997 92278100 93287592 93801909 93701239 94596698
5600I4596698J004051n97276K65498n16040J286460J940399J588520J024198J544348
$$ 94596698 95600749 95003473 95268971 94752931 96039391 97979790 99568310 100592508 102136856
5591A02136856J418616L296877L444679N584508M562854M647808L430706J313894
$$ 102136856 103555472 106852349 110297028 115881536 120444390 125092198 128522904 129836798
5583A29836798O44869L3534j338896l550677j947851j184239j59827L53209J514399
$$ 129836798 130481667 130515201 129176305 125625628 123677777 122493538 122333711 122686920 124201319
5574A24201319J528404P65095q11948M83594J165472J249128K241559K269338
$$ 124201319 125729723 126494818 125682870 126166464 127331936 128581064 130822623 133091961
5566A33091961J731506J465705K36765j228724p97883k477576r90848j920598
$$ 133091961 134823467 136289172 136525937 135297213 134499330 132021754 131030906 129110308
5558A29110308k069319j190344k092309j472867o56068j504299j156930r47217
$$ 129110308 127040989 125850645 123758336 122285469 121629401 120125102 118968172 118020955
5550A18020955N14102O17297P14089J228163J101317p25390j717592k350780l782393
$$ 118020955 118535057 119152354 119866443 121094606 122195923 121470533 119752941 117402161 113619768
5541A13619768l415624m962682l918524m003345l956489l830041l280083k163637
$$ 113619768 110204144 105241462 101322938 97319593 93363104 89533063 86252980 84089343
5533H4089343k666550k001148j847381k309663j754581p92407r88415j127814
$$ 84089343 81422793 79421645 77574264 75264601 73510020 72717613 71729198 70601384
5525G0601384N55689k68716l59829R6675J715317n52409R88345j130405j132999
$$ 70601384 71157073 70888357 70528528 70625203 72340520 71788111 72776456 71646051 70513052
5516G0513052j092165j7862j894144j629366j986759j800031p82140r63030j872607
$$ 70513052 69420887 69403025 67508881 65879515 63892756 62092725 61310585 60347555 58474948
5507E8474948q32448j154690q97611L9911p52597j428754J38947L66966j268343
$$ 58474948 57642500 56487810 55590199 55630110 54877513 53448759 53587706 53954672 52686329
5498E2686329L10729q79922j541327n9076Q06716j082707r08611j52401j64841
$$ 52686329 52997058 52117136 50575809 50516733 51323449 50240742 49332131 49179730 49014889
5489D9014889l20505J31126r4057J024142M31294j3658n87588L22581j166675
$$ 49014889 48694384 48825510 48731453 49755595 50186889 50173231 49585643 49908224 48741549
5480D8741549j214776o69949K70090p89095j91750j388720j242694j012018J373729
$$ 48741549 47526773 46856824 47126914 46337819 46146069 44757349 43514655 42502637 43876366
5471D3876366r6894r76048m77171N4861m18286j492469l55504m3100j63049k48373
$$ 43876366 43779472 42803424 42326253 42381114 41962828 40470359 40114855 40071755 39908706 39660333
5461C9660333k31333P79931J50335L10980j088847j276405P10556m59053j242790
$$ 39660333 39429000 40208931 40359266 40670246 39581399 38304994 39015550 38556497 37313707
5452C7313707J0315j88816p0R47994q72111Q42187K10871j082169L90694M89229
$$ 37313707 37324022 37135206 37135136 38083130 37211019 38053206 38264077 37181908 37572602 38061831
5442C8061831n04296q07279r101O83064n9252N5825j047947j1587M52187J43925
$$ 38061831 37557535 36750256 36741155 37424219 37364967 37420792 36372845 36361258 36813445 36957370
5432C6957370l53542j062268l04865J175824J37063l23240K2882J484922j429758
$$ 36957370 36603828 35541560 35236695 36412519 36549582 36226342 36249224 37734146 36304388
5423C6304388j61588m48980r39045J86416M04162K85933k55825j92515k79149
$$ 36304388 36142800 35693820 34754775 34941191 35345353 35631286 35375461 35182946 34903797
5414C4903797n00503M40866P09968O90132j073848o11167R04185r83226j21952
$$ 34903797 34403294 34844160 35554128 36244260 35170412 34559245 35463430 34480204 34358252
5405C4358252k88611M13567m218j021678N32433m46838j127018J226953r6500
$$ 34358252 34069641 34483208 34478990 33457312 33989745 33542907 32415889 33642842 33546342
5396C3546342k76078k9258J053286k01034o70773n57852k57770j346870l18529
$$ 33546342 33270264 33241006 34294292 34093258 33422485 32864633 32606863 31259993 30941464
5387C0941464Q76067M04241K35195J94528R24086R3973r86265o50409k67600J229396
$$ 30941464 31817531 32221772 32456967 32651495 33575581 33669554 32683289 32032880 31765280 32994676
5377C2994676l67759m76359R15541L51456k421801m77581Q84709m4015j093861
$$ 32994676 32626917 32150558 33066099 33417555 30995754 30518173 31402882 31358867 30265006
5368C0265006O14351Q29725k41453L32345L6579M53581o2096n15248r11692Q71724
$$ 30265006 30879357 31709082 31467629 31799974 31836553 32290134 32228038 31712790 30801098 31672822
5358C1672822L28161r69738j066246K19605j379188N8601R26714J423860O51610
$$ 31672822 32000983 31031245 29964999 30184604 28805416 28864017 29790731 31214591 31866201
5349C1866201p38405j520434j244725O12415Q09164j46671M51537J89834K80384
$$ 31866201 31127796 29607362 28362637 28975052 29784216 29637545 30089082 30278916 30559300
5340C0559300Q0827J33249J43098j832433J14236N49004P94201J19507k33648
$$ 30559300 30640127 30773376 30916474 29084041 29198277 29747281 30541482 30660989 30427341
5331C0427341q45545q29807O89297N21166L82233j65131J08679p20875N74720
$$ 30427341 29581796 28751989 29441286 29962452 30344685 30179554 30288233 29567358 30142078
5322C0142078L81420j79423L30669J59506j602307N21429l5822M7243Q27486P87682
$$ 30142078 30523498 30344075 30674744 30834250 29231943 29753372 29717550 29764793 30592279 31379961
5312C1379961L13435k28047j45257l63567n97956K75457k1828q90983R43335j73079
$$ 31379961 31693396 31465349 31320092 30956525 30358569 30634026 30612198 29721215 30664550 30491471
5302C0491471m99625J4755j95669M0677l27805j43425N41704j422017J33605J232835
$$ 30491471 29991846 30006601 29810932 29851609 29523804 29380379 29922083 28500066 28633671 29866506
5292B9866506l51940L42635M02154j087726m10731N6727n05077Q26163N85976
$$ 29866506 29514566 29857201 30259355 29171629 28760898 28817625 28312548 29138711 29724687
5283B9724687k35336Q68060j27551R8782J031637L00076j294060P3293J83784
$$ 29724687 29489351 30357411 30229860 30328642 31360279 31660355 30366295 30439588 30623372
5274C0623372M32215Q16100N59917q14390p7198J27458m82850N09648J11028O54378
$$ 30623372 31055587 31871687 32431604 31617214 31540016 31667474 31184624 31694272 31805300 32459678
5264C2459678M1947L10328r04046j30077J410640k99988Q58498N9722J78903M46718
$$ 32459678 32501625 32811953 31907907 31777830 33188470 32888482 33746980 33806702 33985605 34432323
5254C4432323R1004q17136O8714m63011j360985L88514J90510N58103R35306J202234
$$ 34432323 34523327 33706191 33774905 33311894 31950909 32339423 32529933 33088036 34023342 35225576
5244C5225576l61204j205319K79302Q40820K41662N13541M95649Q23209R49330
$$ 35225576 34864372 33659053 33938355 34779175 35020837 35534378 36030027 36853236 37802566
5235C7802566J168934q4070o74512Q37761J032356K130192J551610M26342Q30635
$$ 37802566 38971500 38887430 38212918 39050679 40083035 42213227 43764837 44191179 45021814
5226D5021814J70211Q11411J219924R92129O85520l05563p48541Q92170J253929
$$ 45021814 45192025 46003436 47223360 48215489 48901009 48595446 47846905 48739075 49993004
5217D9993004J89047j419380M27623J242793L66840J275006L12983J16746Q6549
$$ 49993004 50182051 48762671 49190294 50433087 50799927 52074933 52387916 52504662 52591211
5208E2591211P26492K1913k98084p74488k410064j563915m46040k49045r73673
$$ 52591211 53317703 53339616 53041532 52267044 49856980 48293065 47847025 47597980 46624307
5199D6624307j024877l90947N86849K9703R97642q78596J832181J658648L48654
$$ 46624307 45599430 45208483 45795332 45825035 46822677 45944081 47776262 49434910 49783564
5190D9783564K097819N14759N92137J882787J331077M66386P05114O78143J498175
$$ 49783564 51881383 52396142 52988279 54871066 56202143 56668529 57373643 58051786 59549961
5181E9549961K16515Q5506J524796P61138O31106K857370J738112P71854J014461
$$ 59549961 59766476 59851982 61376778 62137916 62769022 65626392 67364504 68136358 69150819
5172F9150819J909234p90714r88941m53803j837719k390353j480693k175419j970080
$$ 69150819 71060053 70269339 69280398 68826595 66988876 64598523 63117830 60942411 58972331
5163E8972331j953169k899646p00648O19722j368871j85525M73270q76975J42222
$$ 58972331 57019162 54119516 53418868 54038590 52669719 52484194 52957464 52080489 52222711
5154E2222711J586650J332177J055240J118522O04240K275066J245356J528424
$$ 52222711 53809361 55141538 56196778 57315300 57919540 60194606 61439962 62968386
5146F2968386K93714p51991k63368k270929j202533j589468j647507j661249j495865
$$ 62968386 63262100 62510109 62246741 59975812 58773279 57183811 55536304 53875055 52379190
5137E2379190p47227k126580j672453J95114r60044j224261O56383J04793j040212
$$ 52379190 51631963 49505383 47832930 48028044 47068000 45843739 46500122 46604915 45564703
5128D5564703l04847N81297K57883K88559L12920J07107j327673J894726J872908
$$ 45564703 45259856 45841153 46099036 46387595 46700515 46807622 45479949 47374675 49247583
5119D9247583J717268J025653K262754O22126p16465L08451M99035J016389N42721
$$ 49247583 50964851 51990504 54253258 54875384 54158919 54467370 54966405 55982794 56525515
5110E6525515j88281J089810J303123J33452L64615J936786P76028k00499N38073
$$ 56525515 56337234 57427044 58730167 58863619 59228234 61165020 61941048 61740549 62278622
5101F2278622P0733K2886j281413j180894q95152M31082j097013j160061M47125
$$ 62278622 62349355 62372241 61090828 59909934 59014782 59445864 58348851 57188790 57635915
5092E7635915M30874j122273Q43173J412811J516460j2550J953608J003199K61220
$$ 57635915 58066789 56944516 57787689 59200500 60716960 60704410 62658018 63661217 63922437
5083F3922437J670816J507862J625401J042407o40625j92704M53613j223137m78140
$$ 63922437 65593253 67101115 68726516 69768923 69128298 68935594 69389207 68166070 67687930
5074F7687930O65833K46143N10958O18371k09683j20326J066695J262119K19335
$$ 67687930 68353763 68599906 69110864 69729235 69519552 69399226 70465921 71728040 71947375
5065G1947375J86855K37549K91956Q88177J763273J943942K068616K653757K559881
$$ 71947375 72134230 72371779 72663735 73551912 75315185 77259127 79327743 81981500 84541381
5056H4541381J516091J913876K849752K716756J046921J068861K73609P17556
$$ 84541381 86057472 87971348 90821100 93537856 94584777 95653638 95927247 96644803
5048I6644803l31564j415121j225284k188937k680829j305111k125622j737022
$$ 96644803 96313239 94898118 93672834 91483897 88803068 87497957 85372335 83635313
5040H3635313j462808j419286K49989M34950p91329j195987m59392k20293n79636
$$ 83635313 82172505 80753219 81003208 81438158 80646829 79450842 78991450 78771157 78191521
5031G8191521m61081j030734j099709p00879o71540J591394N38483m41868N30350
$$ 78191521 77730440 76699706 75599997 74899118 74227578 75818972 76357455 75915587 76445937
5022G6445937N00222P67993P33762N4870P63853K65262M03152J146086m4756M37820
$$ 76445937 76946159 77714152 78447914 78502784 79266637 79531899 79935051 81081137 81036381 81474201
5012H1474201O48996k47776K21258O12107J66545Q54226j03848P76701j22550
$$ 81474201 82123197 81875421 82096679 82708786 82875331 83729557 83625709 84402410 84279860
5003H4279860J13336L083397J461473N8952J157304J349277K128443J812082J784082
$$ 84279860 84393196 87476593 88938066 88997018 90154322 91503599 93632042 95444124 97228206
4994I7228206J753962J549458K502722R38222J706925L402784K144152J564647
$$ 97228206 98982168 100531626 103034348 103972570 105679495 109082279 111226431 112791078
4986A12791078K837529L329629K078880K045263J922807L161870L341441J924775
$$ 112791078 115628607 118958236 121037116 123082379 125005186 128167056 131508497 133433272
4978A33433272K961976L021570L256128L557759M174677M132892L512081M453255
$$ 133433272 136395248 139416818 142672946 146230705 150405382 154538274 158050355 162503610
4970A62503610O760161N276443L092920L164105L950399M140387K365944J764462
$$ 162503610 169263771 174540214 177633134 180797239 184747638 188888025 191253969 193018431
4962A93018431K097755J148992j45451J159935K953792J209982L334007L228384
$$ 193018431 195116186 196265178 196119727 197279662 200233454 201443436 204777443 208005827
4954B08005827L923050L848885K472515K705536J453976K885714L662239K961480
$$ 208005827 211928877 215777762 218250277 220955813 222409789 225295503 228957742 231919222
4946B31919222J511105K744161L825137L344359K220246L037983M484465L278553
$$ 231919222 233430327 236174488 239999625 243343984 245564230 248602213 253086678 256365231
4938B56365231N043274N395635L555682L823470K305344J972085L20482l63581
$$ 256365231 261408505 266804140 270359822 274183292 276488636 278460721 278781203 278417622
4930B78417622l99645j994728j517242n02863j280857K52568J400984J604753
$$ 278417622 278017977 276023249 274506007 274003144 272722287 272974855 274375839 275980592
4922B75980592K868322N421854M886543L920047K130501J050754J703798j193953
$$ 275980592 278848914 284270768 289157311 293077358 295207859 296258613 297962411 296768458
4914B96768458l150508m907840m381048n960135n026634n813642n035399n209213
$$ 296768458 293617950 288710110 284329062 278368927 273342293 267528651 262493252 257284039
4906B57284039p384524n761385o854815o993355m989177m466988n207009m987771
$$ 257284039 249899515 244138130 237283315 230289960 225300783 220833795 215626786 210639015
4898B10639015k542227j616809k212170j457352j047716o20203m87314m2443q63525
$$ 210639015 208096788 206479979 204267809 202810457 201762741 201142538 200655224 200612781 199749256
4889A99749256j034140P42352M26944J173100L269898M491121M661315P406520
$$ 199749256 198715116 199457468 199884412 201057512 204327410 208818531 213479846 220886366
4881B20886366P974123J0552541J4454669J8278013K5261330L1920307L6133739
$$ 220886366 228860489 239413030 253867699 272145712 297407042 329327349 365461088
4874C65461088K9794548Q852650q349646j5742426j5647178k1713363l0970018
$$ 365461088 395255636 404108286 395758640 380016214 364369036 342655673 311685655
4867C11685655k9172445k4300148j9460215j8300297j3835754j1555908j0544538
$$ 311685655 282513210 258213062 238752847 220452550 206616796 195060888 184516350
4860A84516350q933265q133092p304533o901884o849266n594920l555633l893362
$$ 184516350 175583085 167449993 160145460 153243576 146394310 140799390 137243757 133350395
4852A33350395l832981k004489j667870k451312l415572k390851j113115o23162
$$ 133350395 129517414 127512925 125845055 123393743 119978171 117587320 116474205 115851043
4844A15851043j268709l73334m24335j971871k177435j506557M49291l25003k281940
$$ 115851043 114582334 114209000 113784665 111812794 109635359 108128802 108578093 108253090 105971150
4835A05971150N1049j644920j635144p27909j504548j040157o94194j350051n13957
$$ 105971150 106022199 104377279 102742135 102014226 100509678 99469521 98775327 97425276 96911319
4826I6911319q34987j496885r97800l26604l78779j651357m54332p22430n8303
$$ 96911319 96076332 94579447 93581647 93255043 92876264 91224907 90770575 90048145 89989842
4817H9989842n04223j166186L14941k4361j057389q83105O08192o88022n05903
$$ 89989842 89485619 88319433 88634374 88610013 87552624 86669519 87277711 86589689 86083786
4808H6083786j46725K92970N47255J56669n16346l48412N46750J1012j79974P52208
$$ 86083786 85937061 86230031 86777286 86933955 86417609 86069197 86615947 86626959 86446985 87199193
4798H7199193r8779k157960r19607o39546o25281j58672K5588l94919M01529n34633
$$ 87199193 87100414 84942454 84022847 83383301 82758020 82599348 82624936 82230017 82631546 82096913
4788H2096913N06947K6338M33722P28111O09450K3010K89308P05293J42158O54596
$$ 82096913 82603860 82630198 83063920 83792031 84401481 84424491 84713799 85419092 85561250 86215846
4778H6215846m20818R90592P29737Q12096N53045k49664O18916j07303O20551
$$ 86215846 85795028 86785620 87515357 88327453 88880498 88630834 89249750 89142447 89762998
4769H9762998j127768m39687M66136J36750K39188p0965M06845J784951J389048
$$ 89762998 88635230 88195543 88661679 88798429 89037617 88966652 89373497 91158448 92547496
4760I2547496O25651P40689N49553K265602K229540K947998J869376J412491N42398
$$ 92547496 93173147 93913836 94463389 96728991 98958531 101906529 103775905 105188396 105730794
4751A05730794J97302M12964J0617L27034q0367j024332n64918j696688q60238
$$ 105730794 105928096 106341060 106351677 106678711 106598344 105574012 105009094 103312406 102452168
4742A02452168R83833l4513M79553k70824Q5217j77014J84789Q88432J662093
$$ 102452168 103436001 103401488 103881041 103610217 103695434 103518420 103703209 104591641 106253734
4733A06253734L24429P02628Q8674K15913P17638L11263n83572O49009K93917
$$ 106253734 106578163 107280791 107369465 107585378 108303016 108614279 108030707 108679716 108973633
4724A08973633m20956j619449j234210K91864j173905o28854j67956Q73213m12095
$$ 108973633 108552677 106933228 105699018 105990882 104816977 104188123 104020167 104893380 104481285
4715A04481285l3703j070978O07467J220683J96837Q19263J675589K210271J989337
$$ 104481285 104447582 103376604 103984071 105204754 105401591 106220854 107896443 110106714 112096051
4706A12096051J631269P57870J516849K025009J468904K001351K324795L242185
$$ 112096051 113727320 114485190 116002039 118027048 119495952 121497303 123822098 127064283
4698A27064283K649867n08980P62953O56179L29294Q93350P24676O07401J816313
$$ 127064283 129714150 129205170 129968123 130624302 130953596 131846946 132571622 133179023 134995336
4689A34995336M575866K416189K779839O322438N669296N716334Q199026R190809
$$ 134995336 139571202 141987391 144767230 151089668 156758964 162475298 170674324 179865133
4681A79865133R515488P645302O878775N811674K545054K903359R18730J414897
$$ 179865133 189380621 197025923 203904698 209716372 212261426 215164785 216083515 217498412
4673B17498412J690787K005895N274462N453171M987564N299777N997939O347454
$$ 217498412 219189199 221195094 226469556 231922727 236910291 242210068 248208007 254555461
4665B54555461P932728Q501886P941426P859025J0735949J4095359J6028373J7866304
$$ 254555461 262488189 270990075 278931501 286790526 297526475 311621834 327650207 345516511
4657C45516511K2246731K0448660J7562284J1609110K158605n550176j1532203
$$ 345516511 367763242 388211902 405774186 417383296 419541901 413991725 402459522
4650D02459522j4913422j6803463j9493712j9482730j6721382j2629909q712473
$$ 402459522 387546100 370742637 351248925 331766195 315044813 302414904 293702431
4643B93702431q117883m533819l432358j742296k815349k428522l357708m775512
$$ 293702431 285584548 281050729 277618371 275876075 273060726 270632204 267274496 262498984
4635B62498984m923817m219110o376150p222167p078860n285857l757487m946818
$$ 262498984 257575167 253356057 246979907 239757740 232678880 227393023 223635536 218688718
4627B18688718k104590j387919m18563J430770L105666L390376M084962M578604
$$ 218688718 216584128 215196209 214777646 216208416 219314082 222704458 226789420 231368024
4619B31368024M933979M971090M856354J692270j270730m751714n878673q561405
$$ 231368024 236302003 241273093 246129447 247821717 246550987 241799273 235920600 227359195
4611B27359195q850249r850352r530622q879104q096784o200837m923771m810970
$$ 227359195 218508946 208658594 199127972 190248868 182152084 175951247 171027476 166216506
4603A66216506m296071l625284j598637k219004k196845j467215j904692k14393
$$ 166216506 161920435 158295151 156696514 154477510 152280665 150813450 148908758 148694365
4595A48694365M57424j87881l40280K71435l01766n92963Q93472J406446K52786
$$ 148694365 149151789 148963908 148623628 148895063 148593297 148000334 148893806 150300252 150553038
4586A50553038N95540R60984K040892M58136J695122P09747J747724J439408L03103
$$ 150553038 151148578 152109562 154150454 154608590 156303712 157013459 158761183 160200591 160503694
4577A60503694O76319j45195j027786j336531k519907k998453j974541j983474
$$ 160503694 161180013 161034818 160007032 158670501 156150594 153152141 151177600 149194126
4569A49194126l238182k788080j643818j180372j493784o50330P67577Q47840
$$ 149194126 145955944 143167864 141524046 140343674 138849890 138199560 138967137 139814977
4561A39814977l54895k31094R994J090244j08618k95315J443834L031514K459420
$$ 139814977 139460082 139228988 139238982 140329226 140220608 139925293 141369127 144400641 146860061
4552A46860061K613070K091116J613775L187842J603439K631329K085486L722830
$$ 146860061 149473131 151564247 153178022 156365864 157969303 160600632 162686118 166408948
4544A66408948K796804K380918L223224K247595K038085J542584R89511K599202
$$ 166408948 169205752 171586670 174809894 177057489 179095574 180638158 181627669 184226871
4536A84226871L747745J142124K681858K652422K755168N310774M334522M068650
$$ 184226871 187974616 189116740 191798598 194451020 197206188 202516962 206851484 210920134
4528B10920134N131979M390325N518370O754674P989292R954490J2842189J3077837
$$ 210920134 216052113 220442438 225960808 232715482 240704774 250659264 263501453 276579290
4520B76579290J5878130J5432690J6594268J8447500J9505014K4382378K8485154
$$ 276579290 292457420 307890110 324484378 342931878 362436892 386819270 415304424
4513D15304424K9039554J7895817J648532j3515864k3011507k6192163l1779778
$$ 415304424 444343978 462239795 463888327 450372463 427360956 401168793 369389015
4506C69389015l7398852l4428982k9290913k3748818j8140558j4209018j2196897
$$ 369389015 331990163 297561181 268270268 244521450 226380892 212171874 199974977
4499A99974977j0078163q500498p252783o089093n307756n601393m644393l643885
$$ 199974977 189896814 181396316 174143533 168054440 162746684 157145291 152500898 148857013
4491A48857013k590914l416103l694877k166792j254881p07261k567930j023273
$$ 148857013 146266099 142849996 139155119 136988327 135733446 135026185 132458255 131434982
4483A31434982p37925k80911J210667M66815R61027N16914J467957J07740o80391
$$ 131434982 130697057 130416146 131626813 132093628 133054655 133571569 135039526 135147266 134466875
4474A34466875k345932j899150k048287l385306k512246j143003j626294j054256
$$ 134466875 132120943 130221793 128173506 124788200 122275954 121132951 119506657 118452401
4466A18452401n69421J560213L90457J70353m7661k52589j784467k975106j194184
$$ 118452401 117882980 119443193 119833650 120004003 119956342 119703753 117919286 114944180 113749996
4457A13749996j223243j848642l269700j438890j349361r73639o20125k87770
$$ 113749996 112526753 110678111 107408411 105969521 104620160 103646521 103026396 102738626
4449A02738626m07354J246615j363423r09546K762519J795087O51551K036483
$$ 102738626 102331272 103577887 102214464 101304918 104067437 105862524 106514075 108550558
4441A08550558O79349K392389K633328K515871M468076K989115M157359M784978
$$ 108550558 109229907 111622296 114255624 116771495 121239571 124228686 128386045 133171023
4433A33171023K950374K625516J408552j055775k515992k124999m142130m110343
$$ 133171023 136121397 138746913 140155465 139099690 136583698 134458699 130316569 126206226
4425A26206226l159134j563842j313696j494186q52839r70969L2196M24027J106000
$$ 126206226 123047092 121483250 120169554 118675368 117822529 116851560 116883756 117307783 118413783
4416A18413783K58436k450107k939745k904509k929055k047753k657430l147922
$$ 118413783 118672219 116222112 113282367 110377858 107448803 105401050 102743620 99595698
4408I9595698k726298j756357j208169n79926p44697j272108j60040N61185O45883
$$ 99595698 96869400 95113043 93904874 93324948 92580251 91308143 91148103 91709288 92355171
4399I2355171J27515o95579m78466l08956M05474O14148J268484J436162L68530
$$ 92355171 92482686 91787107 91308641 90999685 91405159 92019307 93287791 94723953 95092483
4390I5092483m81180r21679j141990n57005k108138k607243j198654j499782j633967
$$ 95092483 94611303 93689624 92547634 91990629 89882491 87275248 86076594 84576812 82942845
4381H2942845j402022k354583p24253l72983m54639r02812j264191k34651j40957
$$ 82942845 81540823 79186240 78461987 78089004 77634365 76731553 75467362 75232711 75091754
4372G5091754O5928J11500j84517Q80153k93076k1311r50212q50586m25295j129803
$$ 75091754 75157682 75269182 75084665 75964818 75671742 75650431 74700219 73849633 73424338 72294535
4362G2294535M75936o0279j869651Q8715n84427m64802o66850J05875M04388k14412
$$ 72294535 72770471 72710192 70840541 70929256 70344829 69880027 69213177 69319052 69723440 69509028
4352F9509028m1358o57460R38099j268878q3092P23000M07684J708544Q65415
$$ 69509028 69467670 68810210 69748309 68479431 68396339 69119339 69527023 71235567 72100982
4343G2100982L73030R62747J865636J172882J587311K904250J931680Q95152Q52738
$$ 72100982 72474012 73436759 75302395 76475277 78062588 80966838 82898518 83793670 84646408
4334H4646408J209315j511738k352407j302155k364389l126430k688493k701424
$$ 84646408 85855723 84343985 81991578 80689423 78325034 75198604 72510111 69808687
4326F9808687j374360j397408k956467l2365m13317k339170j113604k45911k61512
$$ 69808687 68434327 67036919 64080452 64048087 63634770 61295600 60181996 59936085 59674573
4317E9674573k43501n24213J92906l5729Q0415j012992j492965J0017n8941M80308
$$ 59674573 59431072 58906859 59099765 59064036 59144451 58131459 56638494 56648511 56589570 57069878
4307E7069878n34634p79371J09409L11708j819957q15568Q8693j21319N10732
$$ 57069878 56535244 55755873 55865282 56176990 54357033 53541465 53630158 53508839 54019571
4298E4019571L81818j587811J03676L72023p7959j24703L4429m89582K57078m10864
$$ 54019571 54401389 52813578 52917254 53289277 53211318 53086615 53121044 52631462 52888540 52477676
4288E2477676m69737m13443l93074K9132r84646P36047r44301j39931K50947k81179
$$ 52477676 52007939 51594496 51201422 51230554 50245908 50981955 50037654 49897723 50148670 49867491
4278D9867491j05359q23944N7057k6683N08842o40108l46656K58297O44271k39952
$$ 49867491 49762132 48938188 48995245 48968562 49477404 48837296 48490640 48748937 49393208 49153256
4268D9153256j390545m84315j94810k89153k67843J0848K88231n82367J054053
$$ 49153256 47762711 47278396 47083586 46794433 46526590 46537438 46825669 46243302 47297355
4259D7297355K43352j074029N0729Q08245o17579K92542l49447j036550J48412
$$ 47297355 47540707 46466678 46517407 47325652 46708073 47000615 46651168 45614618 45763030
4250D5763030O0725r01509n59022L10482J137438M34132k96837L43523K34221
$$ 45763030 45823755 44922246 44363224 44673706 45811144 46245276 45948439 46291962 46526183
4241D6526183K72313p71787Q29678M47526N00051N6335J41351L0147J099142r95822
$$ 46526183 46798496 46026709 46856387 47303913 47803964 47860299 48001650 48031797 49130939 48135117
4231D8135117O23952Q83427r63324p07189K04584J134471l89877j162801n35033
$$ 48135117 48759069 49642496 48679172 47971983 48176567 49311038 48921161 47758360 47223327
4222D7223327l29773J5096j280707q48555j81832Q88155J028714p35327J13021
$$ 47223327 46893554 46908650 45627943 44779388 44597556 45485711 46514425 45779098 45892119
4213D5892119m79581j024759J256737m6101Q79098o33133K19661O46112J7868
$$ 45892119 45412538 44387779 45644516 45598415 46477513 45844380 46064041 46710153 46728021
4204D6728021O01857m50843N79021Q31264k826j46763R74004K41920J520553J372262
$$ 46728021 47329878 46879035 47458056 48289320 48286494 48139731 49113735 49355655 50876208 52248470
4194E2248470J90421n09972j4624R56108O74269k70210L69891K34052m46827k79097
$$ 52248470 52438891 51928919 51914295 52870403 53544672 53274462 53644353 53878405 53431578 53152481
4184E3152481k99916l23995J476094J61192o7832M94103P11277M97549J641878
$$ 53152481 52852565 52528570 54004664 54165856 54098024 54592127 55303404 55800953 57442831
4175E7442831J329825J288882J618636N09897K290809J263472J207635J155035
$$ 57442831 58772656 60061538 61680174 62190071 64480880 65744352 66951987 68107022
4167F8107022J58714j401895j732106k328774k605201j193084j384707j712454
$$ 68107022 68265736 66863841 65131735 62802961 60197760 59004676 57619969 55907515
4159E5907515j548282o04550k336006n01971P90719O8552J0983M45402J149973
$$ 55907515 54359233 53754683 51418677 50916706 51707425 51775977 51786960 52232362 53382335
4150E3382335K8768J053418P16730R58634p33087j71865j99607J0514J69041j66983
$$ 53382335 53411103 54464521 55181251 56139885 55406798 55234933 55035326 55045840 55214881 55047898
4140E5047898K48689o57259J81381O67776R77140J96055J40212p87747m11569
$$ 55047898 55296587 54639328 54820709 55488485 56465625 56661680 56801892 56014145 55602576
4131E5602576R992M9483n55365k027449p3187j008156j310169j603144j272879
$$ 55602576 55612568 55662051 55106686 53079237 53006050 51997894 50687725 49084581 47811702
4122D7811702r09470q77443j030416N08466P14317J15780n01654l42310J77791
$$ 47811702 46902232 46024789 44994373 45502839 46217156 46332936 45831282 45488972 45666763
4113D5666763R87601J792880L95615k89475n61066n38213j020142o45484q11912
$$ 45666763 46654364 48447244 48842859 48553384 47992318 47454105 46433963 45788479 44976567
4104D4976567j06043p16633k078767j436723l97236j26255o02119K81357m29729
$$ 44976567 44870524 44153891 42075124 40638401 40241165 40114910 39512791 39794148 39364419
4095C9364419J60430l9481n17280N79640o44872O50072j78150M60707k1482L82114
$$ 39364419 39524849 39485368 38968088 39547728 38902856 39552928 39374778 39835485 39814003 40196117
4085D0196117j69616n00254R3713O15757J021n78184K64945J514487p37982j58211
$$ 40196117 40026501 39526247 39619960 40235717 40236738 39658554 39923499 41437986 40700004 40541793
4075D0541793N76418M54231P2049j716358o72853k97601r14090k337873j558663
$$ 40541793 41118211 41572442 41644491 39928133 39255280 38957679 38043589 35705716 34147053
4066C4147053M65553J80181K07892J90684o16655j382576M13083j27883j091254
$$ 34147053 34612606 34792787 35000679 35191363 34574708 33192132 33605215 33477332 32386078
4057C2386078J7242o07236L11439J154289k08330L37912j293465o61597P40120
$$ 32386078 32403320 31796084 32107523 33261812 33053482 33391394 32097929 31436332 32176452
4048C2176452j28619j738898Q34400M82222j13059K29045n41192M24415m30810
$$ 32176452 32047833 30308935 31143335 31625557 31512498 31741543 31200351 31624766 31193956
4039C1193956m41774k70012P21260J126085r03235q09919j17058k14302n66543
$$ 31193956 30752182 30482170 31203430 32329515 31426280 30616361 30499303 30285001 29718458
4030B9718458P7231Q50862K6728J74324l16893m59087J5309j22740q58421R69568
$$ 29718458 29795689 30646551 30673279 30847603 30530710 30071623 30086932 29964192 29105771 30075339
4020C0075339L69026L13199L767J87204k64133K38262N8987k32029k82401N28656
$$ 30075339 30444365 30757564 30761331 30948535 30684402 30922664 30981651 30749622 30467221 30995877
4010C0995877Q40415O66838J27484r97921q68548Q14913o56947j5096M79646r3795
$$ 30995877 31836292 32503130 32630614 31632693 30764145 31579058 30922111 30907015 31386661 31292866
4000C1292866N69369j55858l26125L7116p66671L28048N36475L37555L60992J5546
$$ 31292866 31862235 31706377 31380252 31417368 30650697 30978745 31515220 31852775 32213767 32229313
3990C2229313l07822O57710j11523l75080m32478K5187k8460n20100r34690J406317
$$ 32229313 31921491 32579201 32467678 32092598 31660120 31685307 31656847 31136747 30202057 31608374
3980C1608374r463L14856O4277j094477q08480M09725j58376P58800J33029o00815
$$ 31608374 31598911 31913767 31978044 30883567 30075087 30484812 30326436 31085236 31218265 30617450
3970C0617450j1458j12197l28721m32754l30591j455684R72704q38638L80515
$$ 30617450 30605992 30493795 30165074 29732320 29401729 27946045 28918749 28080111 28460626
3961B8460626L96028m77062n16203Q44009J737433j76600o15235j001289j228200
$$ 28460626 28856654 28379592 27863389 28707398 30444831 30268231 29652996 28651707 27423507
3952B7423507R177l9061K72536q94331M77172M09443P67471P4996J65678k50758
$$ 27423507 27432684 27393623 27666159 26771828 27249000 27658443 28425914 28500910 28666588 28415830
3942B8415830k31801p3720n35988J23769K784m95481M9847m99936J18703N64812
$$ 28415830 28184029 28110309 27574321 27698090 27700874 27205393 27255240 26755304 26874007 27438819
3932B7438819l34155J51642l62160k85914K39710m53221k54244N20763O1382l013
$$ 27438819 27104664 27256306 26894146 26608232 26847942 26394721 26140477 26661240 26722622 26719609
3922B6719609O05909q12594r46348N67667R0695q82594J159649K78921K54529
$$ 26719609 27325518 26512924 25566576 26134243 26224938 25342344 26501993 26780914 27035443
3913B7035443j082591m46537M14388j013802Q37274J35776M31097J07819n46774
$$ 27035443 25952852 25506315 25920703 24906901 25744175 25879951 26311048 26418867 25872093
3904B5872093l27748p10149m73962J475068J179024k49732p88091k36172k80295
$$ 25872093 25544345 24834196 24360234 25835302 27014326 26764594 25976503 25740331 25460036
3895B5460036m5261l4853l31587L87469r70576J075850J113916j367844J173870
$$ 25460036 25414775 25379922 25048335 25435804 24465228 25541078 26654994 25287150 26461020
3886B6461020J70961j30682k38833q20772J252066m58391k32255M46012K44212
$$ 26461020 26631981 26501299 26262466 25441694 26693760 26235369 26003114 26449126 26693338
3877B6693338n58954R92997N17391j258549J85849k9900J53336J87683K53019
$$ 26693338 26134384 27127381 27644772 26386223 26572072 26542172 26695508 26883191 27136210
3868B7136210M4324K50264m28292j128958l35988J163669L26375j72786l00283
$$ 27136210 27180534 27430798 27002506 25873548 25537560 26701229 27027604 26854818 26554535
3859B6554535l035J099680J07203j552816K82907k83937P43900M25361k6259j51258
$$ 26554535 26551500 27651180 27758383 26205567 26488474 26204537 26948437 27373798 27347539 27196281
3849B7196281q32521P99521N7135p50581O77282L47258q45251m92016O91155P61426
$$ 27196281 26363760 27163281 27220416 26469835 27147117 27494375 26649124 26157108 26848263 27609689
3839B7609689o07433o94992M84797M79440m78304p73722k7617n6712o36955J275806
$$ 27609689 27002256 26307264 26792061 27271501 26793197 26019475 25991858 25935146 25298191 26573997
3829B6573997P80497j4634p00668O99202J158860q58787n72960O6938L28188m30139
$$ 26573997 27354494 27339860 26639192 27338394 28497254 27638467 27065507 27132445 27460633 27030494
3819B7030494j119576Q08972J175041k43488l62742l70761L08057L97801j47906
$$ 27030494 25910918 26719890 27894931 27651443 27288701 26917940 27225997 27623798 27475892
3810B7475892Q6006p29185O70823n42028J105301J522264q40165j187107k55596
$$ 27475892 27561898 26832713 27503536 26961508 28066809 29589073 28748908 27561801 27306205
3801B7306205J1284K41836Q76012k12431J69731l09975J05025m54984n10322J187477
$$ 27306205 27317489 27559325 28435337 28222906 28392637 28082662 28187687 27732703 27222381 28409858
3791B8409858p87654m30388J386672J110101k80888o01416j034397J14445M64873
$$ 28409858 27622204 27191816 28578488 29688589 29407701 28806285 27771888 27886333 28351206
3782B8351206p32493l13384l43623O46526O39033K78361J88566k75682j459760
$$ 28351206 27618713 27305329 26961706 27608232 28247265 28525626 28714192 28438510 26978750
3773B6978750o76583N24350k17298J500974O251m09675j34445k65823M03574m48281
$$ 26978750 26302167 26826517 26609219 28110193 28116444 27706769 27572324 27306501 27710075 27261794
3763B7261794L86066l11853J005811O55744o06542j795658q98635K027449l13075
$$ 27261794 27647860 27336007 28341818 28997562 28391020 26595362 25696727 27724176 27411101
3754B7411101j1199Q00393m84116j06284L45444j06840J19779k0130p12794m40613
$$ 27411101 27399902 28200295 27716179 27609895 27955339 27848499 27968278 27948148 27235354 26794741
3744B6794741J02765J243801R16102K04411L7643o0209o46806Q4670L0595l87454
$$ 26794741 26897506 28141307 29057409 29261820 29299463 29239254 28592448 28677118 28707713 28320259
3734B8320259j218059M40615k37196R25265K10788k30423K09397q03786j63693
$$ 28320259 27102200 27542815 27305619 28230884 28441672 28211249 28420646 27616860 27453167
3725B7453167k13975P64061n08668r78612J461042P1345j116979K44982P79517
$$ 27453167 27239192 28003253 27494585 26515973 27977015 28048360 26931381 27176363 27955880
3716B7955880Q84116R09464k183053O74194K28695q50690r8845K74099o8553j85692
$$ 27955880 28839996 29749460 27566407 28240601 28469296 27618606 27519761 27793860 27725307 27539615
3706B7539615P81917k17480j673510p22408L45159J543456P7254o2341j01027
$$ 27539615 28321532 28104052 26430542 25708134 26053293 27596749 27674003 27611662 27510635
3697B7510635L73659N92516m98903K38429k10500k91081J60382n88832p9724K33655
$$ 27510635 27884294 28476810 27977907 28216336 28005836 27714755 27875137 27286305 27206581 27440236
3687B7440236m11540j5778R90633K19493o28726N50238q30563J7130N23820l64906
$$ 27440236 27028696 27012918 28003551 28223044 27594318 28144556 27313993 27331123 27854943 27490037
3677B7490037l55418O28481L55452k97685r63502J34859p19192J754984j197129
$$ 27490037 27134619 27763100 28118552 27820867 26857365 26992224 26273032 28028016 26830887
3668B6830887J62409J493063L55680k003853O89206P94730L05440M26485J11284
$$ 26830887 26993296 28486359 28842039 26838186 27527392 28322122 28627562 29054047 29165331
3659B9165331k58503Q71865p7939j355345L14102L59640J79481p4983o28487O99049
$$ 29165331 28906828 29778693 29700754 28345409 28659511 29019151 29198632 29123649 28495162 29194211
3649B9194211J380357n70717n67161K93827j49144l73772M03621P54456m59040
$$ 29194211 30574568 30003851 29436690 29730517 29581373 29207601 29611222 30365678 29906638
3640B9906638Q45066q00448j910871P48619M38401L72473Q44961L417o29706L76384
$$ 29906638 30751704 29951256 28040385 28789004 29227405 29599878 30444839 30448256 29818550 30194934
3630C0194934N99117J98758N45734L620q75305k79846j88037R01394n11577j25594
$$ 30194934 30794051 30992809 31538543 31542163 30666858 30387012 30198975 31100369 30588792 30463198
3620C0463198Q65599P96227P5735P7134k01292K83396L25599m35891j6487L84512
$$ 30463198 31328797 32125024 32200759 32277893 32076601 32359997 32685596 32249705 32233218 32617730
3610C2617730R12758k18873o16552Q29478P52678n0031K76452N84231r32516M89056
$$ 32617730 33530488 33311615 32695063 33524541 34277219 34227188 34503640 35087871 34155355 34644411
3600C4644411O3395n03309R0423M55337j71674P82640M94649L65783J235962j665319
$$ 34644411 34707806 34204497 34294920 34750257 34578583 35361223 35855872 36221655 37457617 35792298
3590C5792298m78960J820775o37668N45212J73846k37355L15288j10727o61882
$$ 35792298 35313338 37134113 36496445 37041657 37215503 36978148 37293436 37182709 36520827
3581C6520827R82682N72415m61394q44238M03783Q28729J873925N68710l84293
$$ 36520827 37503509 38075924 37614530 36770292 37174075 38002804 39876729 40445439 40061146
3572D0061146K59674p5963L32898J260408J262193M40373L39803J25524J338348
$$ 40061146 40320820 40244857 40577755 41838163 43100356 43540729 43880532 44006056 45344404
3563D5344404M59650J427902P90610Q07111J167977k34545n6224j146894k66665
$$ 45344404 45804054 47231956 48022566 48829677 49997654 49763109 49706885 48559991 48293326
3554D8293326k67344k42129o57326j06070J60163M39394K17962L28715J052864
$$ 48293326 48025982 47783853 47126527 47020457 47180620 47620014 47837976 48166691 49219555
3545D9219555j26136p08717J151527J171524K26088R80911Q66833N11646J75289
$$ 49219555 49093419 48384702 49536229 50707753 50933841 51914752 52781585 53293231 53468520
3536E3468520M06061n35919L054447Q12679O18295J379199J011539K493920K320860
$$ 53468520 53874581 53338662 56393109 57205788 57824083 59203282 60214821 62708741 65029601
3527F5029601K73119O28242l2450K85197m56738q75962j282182M64351K97198
$$ 65029601 65302720 65930962 65898512 66183709 65726971 64851009 63568827 64033178 64330376
3518F4330376o43096m86173j42994K32205L52129k54059L93954J251408M84325
$$ 64330376 63687280 63201107 63058113 63290318 63642447 63388388 63782342 65033750 65518075
3509F5518075O01089J18193J098870R20081N54683J491806m19389J013319K106304
$$ 65518075 66119164 66237357 67336227 68256308 68810991 70302797 69883408 70896727 73003031
3500G3003031O41246R27790J429557K778021J635428J941811N80060J988958J493242
$$ 73003031 73644277 74572067 76001624 78779645 80415073 82356884 82936944 84925902 86419144
3491H6419144J587337K191209J065462K052072K349866K440121K137190K147924
$$ 86419144 88006481 90197690 91263152 93315224 95665090 98105211 100242401 102390325
3483A02390325L074843L259296K803337K299010L718138J830721R75046N00986
$$ 102390325 105465168 108724464 111527801 113826811 117544949 119375670 120350716 120851702
3475A20851702j670286l547150l783861m478675n258274m383729l284100l981344
$$ 120851702 119181416 115634266 111850405 107371730 102113456 97729727 94445627 90464283
3467I0464283m102833j737790k426117l115134j574755j154807k059604j238324
$$ 90464283 86361450 84623660 82197543 79082409 77507654 76352847 74293243 73054919
3459G3054919q43027j157870m79194m36112L92020r30234l43563j263586j831832
$$ 73054919 72211892 71054022 70574828 70138716 70530736 69600502 69256939 67993353 66161521
3450F6161521q93810j019306l89472p17416k187124j42858N87198o81086o15620
$$ 66161521 65267711 64248405 63858933 63141517 60954393 60811535 61398733 60717647 60102027
3441F0102027j505644j54824p27497j443915l93947n82924M03814m46432n23934
$$ 60102027 58596383 58441559 57714062 56270147 55876200 55293276 55697090 55250658 54726724
3432E4726724m62993l46253o18283O44619J089646p51076p77137o84991J677733
$$ 54726724 54263731 53917478 53299195 53943814 55033460 54282384 53505247 52820256 54497989
3423E4497989J050935o90857n9283P312p80941J8660J10605p13590R99367m36297
$$ 54497989 55548924 54858067 54798784 54806096 54025155 54043815 54154420 53440830 54440197 54003900
3413E4003900j775153L26132N17224M26973L96526q99078n08991j38752r94685
$$ 54003900 52228747 52554879 53072103 53499076 53895602 52996524 52487533 52348781 51354096
3404E1354096O4762o09050o92550k05443r37602J30227L28819j22401p20873m4763
$$ 51354096 51418858 50809808 50117258 49911815 48974213 49104440 49433259 49310858 48589985 48545222
3394D8545222L90501k595p3345j94015K11750P78886o18625j738655O23718P23404
$$ 48545222 48935723 48933128 48859783 48665768 48877518 49656404 49037779 47299124 47922842 48646246
3384D8646246K91346j535344r92492P14958Q26662k132389m7088o21645q80497
$$ 48646246 48937592 47402248 46409756 47124714 47951376 45818987 45771899 45150254 44269757
3375D4269757M44757n97392r52016J490171n30918j224260Q2670M5828M84647
$$ 44269757 44714514 44117122 43165106 44655277 44124359 42900099 42982769 43028597 43513244
3366D3513244J229439p40253O53972j951886j141083M29599q63929P10762N14572
$$ 43513244 44742683 44002430 44656402 42704516 41563433 41993032 41129103 41839865 42354437
3357D2354437o05306j48937k99174R186P40305r23172p05922N05146L9673m86957
$$ 42354437 41749131 41600194 41301020 41310206 42050511 41127339 40421417 40926563 40966236 40479279
3347D0479279L86987p16835q5935l8810M50877J25984q33164j101077n75229m68000
$$ 40479279 40866266 40149431 40063496 40024686 40475563 40601547 39768383 38667306 38092077 37624077
3337C7624077M95679n66246O62097K91090m06530o25283m68124k54342J66699
$$ 37624077 38119756 37553510 38215607 38506697 38100167 37474884 37006760 36752418 36919117
3328C6919117J40786M49883k74462q5357P6760j040801p48748L49578K42262n65008
$$ 36919117 37059903 37509786 37235324 37149967 37226727 36185926 35437178 35786756 36029018 35464010
3318C5464010n25663M68236P6909l21939P1374q90923L63066J370839J34999j094233
$$ 35464010 34938347 35406583 35483492 35161553 35232927 34342004 34705070 36075909 36210908 35116675
3308C5116675o40879k1584M79587l4962k6236o6621j183790K40862L39958j51982
$$ 35116675 34475796 34454212 34933799 34898837 34872601 34805980 33622190 33863052 34203010 34051028
3298C4051028m98706J67296j253977K83447Q7256O93657R52263p30496j064395
$$ 34051028 33552322 33719618 32465641 32749088 32836344 33530001 34482264 33751768 32687373
3289C2687373k75433k31143n30477m49867J041355j83170M13962n85950r01967
$$ 32687373 32411940 32180797 31650320 31200453 32241808 32058638 32472600 31886650 30984683
3280C0984683L60152N75355K7061l7441o0894P4401q22335P93250J4409j285507
$$ 30984683 31344835 31920190 31947251 31909810 31848916 31923317 31100982 31894232 31908641 30623134
3270C0623134l0814M63696R7489m09819p71387L44603R51509R6864n87040K75100
$$ 30623134 30592320 31056016 31153505 30743686 29972299 30316902 31268411 31365275 30778235 31053335
3260C1053335J68319q64625L87899q39650L49179L41829n0985m28446j70131n70419
$$ 31053335 31221654 30357029 30744928 29905278 30254457 30596286 30545301 30116855 29946724 29376305
3250B9376305Q46013l80597j02958P58556l15160M4292n82520K73094M06280r61294
$$ 29376305 30222318 29841721 29738763 30497319 30182159 30226451 29643931 29917025 30323305 29362011
3240B9362011J25554K86037q3178k68717J17751J98678J09085M53495r74086j43663
$$ 29362011 29487565 29773602 29690424 29421707 29539458 29738136 29847221 30300716 29326630 29182967
3230B9182967M70847N51166k72391M1333L16374j059354O94464Q12373k90099
$$ 29182967 29653814 30204980 29932589 29973922 30290296 29230942 29925406 30737779 30447680
3221C0447680m64574O81662P16342M9709q70022M79197m26893N12287O06801m63141
$$ 30447680 29983106 30664768 31381110 31430819 30560797 31039994 30613101 31125388 31732189 31269048
3211C1269048l96841p87505P580R51528o00380R26662O77891o58378k94407J083265
$$ 31269048 30872207 30084702 30092282 31043810 30443430 31370092 32047983 31389605 31095198 32178463
3201C2178463O58087M35862k37770o52019N3136J550798n87682J19291N88129
$$ 32178463 32836550 33272412 33034642 32382623 32435759 33986557 33398875 33518166 34106295
3192C4106295J149131J270159k67167N17576N95215m85880p61400J536591o51049
$$ 34106295 35255426 36525585 36258418 36775994 37371209 36885329 36123929 37660520 37009471
3183C7009471r3446J036590j26735J898685J477370l35443n55132M55619L80492
$$ 37009471 36916025 37952615 37825880 39724565 41201935 40866492 40311360 40766979 41147471
3174D1147471O99933J418988l27094k70579K75394o3855j95371k08245Q63486
$$ 41147471 41847404 43266392 42939298 42668719 42944113 42880258 42684887 42476642 43340128
3165D3340128L6856O94268J190901P36268k1915k6306J056492q07801M48979R27984
$$ 43340128 43376984 44071252 45262153 45998421 45976506 45950200 47006692 46198891 46647870 47575854
3155D7575854n13807M19178M13116Q3182J38123J277198M64921O46954J789763
$$ 47575854 47062047 47481225 47894341 47977523 48115646 49392844 49857765 50504719 52294482
3146E2294482p2371j21952r2968K381294k87319Q6922K89506o16453L98665k16997
$$ 52294482 52222111 52100159 52007191 54388485 54101166 54188088 54477594 53861141 54259806 54042809
3136E4042809r29852J128187Q77004j461000o16418n80187q07261p12439J80032
$$ 54042809 53112957 54241144 55118148 53657148 53040730 52460543 51653282 50940843 51120875
3127E1120875m33429r94294M99103M01755n60617n62586N97475j0827j702761
$$ 51120875 50687446 49693152 50192255 50594010 50033393 49470807 50068282 50057455 48354694
3118D8354694n54099N3176O60312P88831M91333l19863M8814K57137N2574Q60128
$$ 48354694 47800595 47853771 48514083 49302914 49794247 49474384 49523198 49780335 49832909 50693037
3108E0693037q76068j456187J047299N52095r03981j287843j239699L14800m05927
$$ 50693037 49816969 48360782 49408081 49960176 49056195 47768352 46528653 46843453 46437526
3099D6437526Q73195j453321l92468k92889r08105O73438Q56596o75144K68302
$$ 46437526 47310721 45857400 45464932 45172043 44263938 44937376 45793972 45118828 45387130
3090D5387130m36908o19069j30573q60647l22014j004549J329512M80004o63491
$$ 45387130 44950222 44331153 44200580 43339933 43017919 42013370 43342882 43822886 43159395
3081D3159395K29250j41274j073111n54288r34841Q82192M07026k61946p93840
$$ 43159395 43388645 43247371 42174260 41619972 40685131 41567323 41974349 41712403 40918563
3072D0918563m05792R17706q70902j57598q32771k52150j53637k3857J048945
$$ 40918563 40512771 41430477 40559575 40401977 39569206 39317056 39163419 39139562 40188507
3063D0188507r68258j025476J309981L33514L30955n70691r38408j640446o61895
$$ 40188507 39220249 38194773 39504754 39838268 40169223 39598532 38660124 37019678 36357783
3054C6357783l24677N18463k69753P93716q40720k024440J158967O63325P09964
$$ 36357783 36033106 36551569 36281816 37075532 36234812 34210372 35369339 36032664 36742628
3045C6742628j011753r60139m91905m23358J51717m2498O15063q33882p81572
$$ 36742628 35730875 34770736 34278831 33855473 34007190 33964692 34579755 33745873 32964301
3036C2964301n59041n6251Q20975k37132o202J07828P42443j84258p48780j197095
$$ 32964301 32405260 32349009 33169984 32932852 32926650 33034478 33776921 33592663 32843883 31646788
3026C1646788N17805L49387k34359j132309K02594J411797n60477j131386J46773
$$ 31646788 32164593 32513980 32279621 31147312 31349906 32761703 32201226 31069840 31216613
3017C1216613j140555K49293k94124j539299L2621n5659q86043k26355K1904M71629
$$ 31216613 30076058 30325351 30031227 28491928 28524549 28468890 27582847 27356492 27378396 27850025
3007B7850025j61924M06005P45889O74906j238126p19890J080307J43729o30217
$$ 27850025 27688101 28094106 28839995 29514901 28276775 27556885 28637192 28780921 28150704
2998B8150704r58395p21674N71943m7037J06522m60935j133889J366292l85804
$$ 28150704 27192309 26470635 27042578 26995541 27102063 26641128 25507239 26873531 26487727
2989B6487727n97412n36945j064899N02698N11714j203167R8225o63989J28091
$$ 26487727 25890315 25353370 24288471 24791169 25302883 24099716 24197941 23533952 23662043
2980B3662043k43945j86401l1630l15159R79097Q78p21404j84329P41331k46107
$$ 23662043 23418098 23231697 23200067 22884908 23864005 23864883 23143479 22959150 23700481 23454374
2970B3454374q55612l62907J63830p05651K42555k26342j72052J61257r98361
$$ 23454374 22598762 22235855 22399685 21694034 21936589 21710247 21538195 21699452 20701091
2961B0701091p9237R37556m08179n16056m10680p30796O23237p24657q97455O34126
$$ 20701091 20621854 21559410 21151231 20635175 20224495 19493699 20116936 19392279 18494824 19128950
2951A9128950n93542O84071j7679L8337J98358j98984n81701o72928j209456P96070
$$ 19128950 18535408 19219479 19201800 19240137 19438495 19239511 18657810 17984882 16775426 17571496
2941A7571496m59289j006524j04690M01206P81085n33812J03379k12227q77218
$$ 17571496 17112207 16105683 16000993 16402199 17183284 16649472 16752851 16540624 15663406
2932A5663406n24595p89914J346694o47685o04444L53459Q03545n9332l22132
$$ 15663406 15138811 14348897 15695591 15047906 14443462 14796921 15600466 15541134 15219002
2923A5219002k74631q74745K05076J63651p62670l1756J352527j857308j58979
$$ 15219002 14944371 14069626 14274702 14438353 13675683 13643927 14996454 13139146 12980167
2914A2980167J26756Q46715J82328j70355m2002L21682j193977O76852N94022
$$ 12980167 13106923 13953638 14135966 13965611 13923609 14245291 13051314 13728166 14322188
2905A4322188j484857j17908k01256l89296J98683k45645o2929p01298L27486
$$ 14322188 12837331 12719423 12518167 12128871 12327554 12081909 12018980 11317682 11645168
2896A1645168n06655J66070J64830M07917m62020r98764N775k69839L42660J046992
$$ 11645168 11138513 11304583 11469413 11877330 11415310 10416546 10422321 10152482 10495142 11542134
2886A1542134M1101k55666j26845k69504n74992k78065l25846L36291J2766j286287
$$ 11542134 11583235 11327569 11200724 10931220 10356228 10078163 9752317 10088608 10101374 8815087
2876H815087N28956J77307L07668p50770k19969M56584p2301R49806M24938o8377
$$ 8815087 9344043 9521350 9829018 9078248 8858279 9314863 9242562 10192368 10617306 10548929
2866A0548929n13482m57025M637M0536o31915k8380r16190M93841r6106n1217
$$ 10548929 10035447 9578422 9583059 9623595 8991680 8963300 8047110 8540951 8444845 8393628
2856H393628q48310L81520L82181k594j59704l9540J100299q35756r35788k85984
$$ 8393628 7545318 7926838 8309019 8306425 8146721 8107181 9207480 8371724 7435936 7149952
2846G149952J404454j74245o73424L27085o65725l22680K24136L5482P22740K73012
$$ 7149952 8554406 8380161 7706737 8033822 7368097 7045417 7269553 7305035 8027775 8300787
2836H300787j23654R18352q66483j535723q45229R92025J563797r18252m66095
$$ 8300787 8177133 9095485 8229002 6693279 5848050 6840075 8403872 7485620 7019525
2827G019525J79238L21618Q53073j032090r72220j2186r78728O50100M77550O15713
$$ 7019525 7198763 7520381 8373454 7341364 6369144 6356958 5378230 6028330 6505880 7121593
2817G121593J41386k87314J88963L7613m74827j005662m3490K76460m20369R63433
$$ 7121593 7262979 6975665 7164628 7202241 6727414 5721752 5678262 5954722 5534353 6497786
2807F497786m07065q49735L97481N62795q77674M83637p09733R1711N36418J8214
$$ 6497786 6090721 5240986 5638467 6201262 5323588 5807225 5097492 5189203 5725621 5743835
2797E743835P7587K4462O76502l25328m83239M11868m46628L06528L71658p65689
$$ 5743835 5821422 5845884 6522386 6197058 5713819 6125687 5679059 5985587 6357245 5591556
2787E591556K67138o56037K00883j079781m0922J006613k04355P28113m07045
$$ 5591556 5858694 5202657 5403540 4323759 4282837 5289450 5085095 5813208 5406163
2778E406163r12715k13693O37045J245851J60835n18474j28323j306630n6452
$$ 5406163 4493448 4279755 4916800 6162651 6323486 5805012 5676689 4370059 4313607
2769D313607K76618N91251J64653K18415l96810l43537n87385Q09471J32588L46346
$$ 4313607 4590225 5181476 5346129 5564544 5167734 4824197 4236812 5046283 5178871 5525217
2759E525217l40426r20806R38575J57193K46434j573084L3662O92857k53303p53952
$$ 5525217 5184791 4263985 5202560 5359753 5606187 4033103 4066765 4759622 4506319 3752367
2749C752367Q15423P44277n41406O02056q37988j77968R759J188598J170203j468319
$$ 3752367 4567790 5312067 4770661 5372717 4534729 4356761 4366520 5555118 6725321 5257002
2739E257002L3459M07393p06518k90631p22216J237511k98278o82141R61300l69879
$$ 5257002 5290461 5697854 4991336 4700705 3978489 5216000 4917722 4235581 5196881 4827002
2729D827002J124491L20919j035433j181093N92476L66933j196732K06417L7337
$$ 4827002 5951493 6272412 5236979 4055886 4648362 5015295 3818563 4024980 4062317
2720D062317j00091K22392k85478n20581j57531O77276k39831k93096J40099P33485
$$ 4062317 3962226 4184618 3899140 3378559 3221028 3898304 3658473 3365377 3505476 4238961
2710D238961l18118P13378j397614n96422O94319m54466M24428k87072K01616
$$ 4238961 3920843 4634221 3236607 2640185 3334504 2880038 3304466 3017394 3219010
2701C219010J17390L90355J332216j116811N57118l87272j565475k04440M11027
$$ 3219010 3336400 3726755 5058971 3942160 4499278 4112006 2546531 2342091 2753118
2692B753118Q87525l3863m91543J291608J20345m17807k34972j13308O68156P2169
$$ 2753118 3640643 3606780 3115237 4406845 4527190 4109383 3874411 3761103 4429259 4501428
2682D501428m88915m69595o53976k63581R21030M7450p18315m75328J373475k48421
$$ 4501428 4012513 3542918 2888942 2625361 3546391 3593841 2875526 2400198 3773673 3525252
2672C525252L59690k82358J11344n29803N13165n23747m4096M46816j13313n58191
$$ 3525252 3884942 3602584 3713928 3184125 3697290 3173543 3129447 3576263 3462950 2904759
2662B904759K20800O14526p94765K30242L06275j93030j06282N0640m08327m36998
$$ 2904759 3125559 3740085 2945320 3175562 3481837 3288807 3182525 3233165 2824838 2387840
2652B387840N39667J341458o84845r8864j8162K16335r60415N46227k05884n36928
$$ 2387840 2927507 4268965 3584120 3485256 3467094 3683429 2723014 3269241 3063357 2526429
2642B526429N702R15687M09796j2357p15997l99205p56692J396705J046106o44112
$$ 2526429 2532131 3447818 3857614 3845257 3129260 2730055 1973363 3370068 4416174 3772062
2632C772062k0355J93056r4907J29700m36623k77928m56527m27923P48752M8527
$$ 3772062 3751707 3944763 3849856 3979556 3542933 3265005 2808478 2380555 3129307 3177834
2622C177834P82838R6515p02036q92419J91322M36710n33863o86846J90127l48857
$$ 3177834 3960672 4057187 3355151 2462732 2654054 3090764 2556901 1870055 2060182 1711325
2612A711325Q48059p5907M48317R01694K25619J469732K38131j139698q50633
$$ 1711325 2559384 2483477 2931794 3833488 4059107 5528839 5766970 4627272 3776639
2603C776639J31524o81891k68340M79213n73869O12046L69925q67726j480183
$$ 3776639 3908163 3226272 2957932 3437145 2863276 3475322 3845247 2977521 1497338
2594A497338P33387N64847J79763j185122N45299P88658r20985R15799M01132
$$ 1497338 2230725 2795572 2975335 1790213 2335512 3124170 2203185 3118984 3520116
2585C520116j313718K51683Q29736M67754k4343k80705k1751L55786K41358k41851
$$ 3520116 2206398 2458081 3287817 3755571 3731228 3450523 3428772 3784558 4025916 3784065
2575C784065O2218k09038J92335p80201n53922J56978j18268M56396n28853j101710
$$ 3784065 3846283 3637245 3829580 3049379 2495457 2652435 2534167 2990563 2461710 1360000
2565A360000n7931J32510O65092M41234M59429N7678k65386k01842l06533R65834
$$ 1360000 1302069 1434579 2099671 2540905 3000334 3058012 2792626 2590784 2284251 3250085
2555C250085m03511r41823R99806O30209l08339L90089O93941j247643o65554
$$ 3250085 2846574 1904751 2904557 3534766 3226427 3616516 4310457 3062814 2397260
2546B397260k37065N66852K17799O95899P23187j240168q10390j222l04929J26279
$$ 2397260 2160195 2727047 2944846 3640745 4363932 3123764 2313374 2312152 2007223 2133502
2536B133502N22302Q45143n15153l01298p32867P3500L52103o79948R41600n98384
$$ 2133502 2655804 3500947 2985794 2684496 1951629 2025129 2377232 1697284 2638884 2040500
2526B040500M56980P90444j69277J26910M3689m32554N10271P51630l93380j226046
$$ 2040500 2497480 3287924 3118647 3245557 3289246 2856692 3366963 4118593 3725213 2499167
2516B499167k14496L03374l76177M06258k54535n20582J132431l16089r30294
$$ 2499167 2284671 2588045 2211868 2618126 2363591 1843009 2975440 2659351 1729057
2507A729057o63945J495429Q10179M71458m55411r1761Q76817r98761J384413
$$ 1729057 1065112 2560541 3370720 3842178 3386767 3295006 4171823 3173062 4557475
2498D557475M92407j240561M53771j663076q54259J114307Q77204m47480N5114
$$ 4557475 5049882 3809321 4263092 2600016 1745757 2860064 3737268 3289788 3344902
2489C344902M71752M45968k7611q85822k46713O63892n73040l15269J019363j385824
$$ 3344902 3816654 4262622 4235011 3349189 3102476 3766368 3193328 2878059 3897422 2511598
2479B511598j61818k56074K19026L94136L87171m15503J061159O89165o9669j040123
$$ 2511598 2349780 2093706 2312732 2706868 3094039 2678536 3739695 4428860 4359191 3319068
2469C319068k16431Q15289K29856K37961j008263K48457J18034j20143m45196
$$ 3319068 3102637 3917926 4147782 4385743 3377480 3625937 3743971 3623828 3178632
2460C178632J95600R60885P27363o11665j089851Q77858Q77978K32865l28246
$$ 3178632 3374232 4335117 5062480 4450815 3360964 4238822 5116800 5349665 5021419
2451E021419q73653l96796J342258P35246j213424N63719L16441R3599M3543m62096
$$ 5021419 4147766 3750970 5093228 5828474 4615050 5178769 5495210 5588809 5632352 5170256
2441E170256j24940o48387J014055J03669m28636k0925l51850N91191O94339J00130
$$ 5170256 5045316 4396929 5410984 5514653 5086017 5065092 4713242 5304433 5998772 6098902
2431F098902n66147q64902m47992M37870M46204R17936r7961n1305K61217l51472
$$ 6098902 5532755 4667853 4219861 4657731 5103935 6021871 5923910 5872605 6133822 5782350
2421E782350k27765j73123J63610Q2748k59192Q70698P7834p791L60559J207685
$$ 5782350 5554585 5381462 5545072 5627820 5368628 6239326 6317160 6309369 6669928 7877613
2411G877613m64775o1386Q44445K88372j46065m12456J42052P37260O89800j72339
$$ 7877613 7412838 7351452 8195897 8484269 8338204 7925748 8067800 8805060 9494860 9322521
2401I322521P28962K71160R27278K3228O73209m91749J52521L05207J465412K94692
$$ 9322521 10051483 10322643 11249921 11273149 11946358 11454609 11607130 11912337 13377749 13672441
2391A3672441J5941m67571L26321J005408k64751J09596J4799Q62843J004376
$$ 13672441 13688382 13220811 13547132 14552540 14287789 14397385 14412184 15275027 16279403
2382A6279403r35621J695195J586869R00874l41822Q09960J02631J254569M59266
$$ 16279403 15343782 17038977 18625846 19526720 19184898 19994858 20097489 21352058 21811324
2373B1811324J521637J832170L27578J126308P67242K198158K346956M69780K242077
$$ 21811324 23332961 25165131 25492709 26619017 27386259 29584417 31931373 32401153 34643230
2364C4643230K498276K050401K367748J812216L843431L568270M401386M485760
$$ 34643230 37141506 39191907 41559655 43371871 47215302 50783572 55184958 59670718
2356E9670718N222762N536398N316991N619075O015073Q251838Q220845J0846278
$$ 59670718 64893480 70429878 75746869 81365944 87381017 95632855 103853700 114699978
2348A14699978J3329486J5278481J7295454K3021298L1176795M4739955N6888433
$$ 114699978 128029464 143307945 160603399 183624697 214801492 259541447 316429880
2341C16429880N3812053L7134128m438684k3016150k6044382k6560608m3731272
$$ 316429880 370241933 407376061 402937377 379921227 353876845 327316237 283584965
2334B83584965n0204291m0704496l1347552k2326516j7513455j3869049q955088
$$ 283584965 233380674 192676178 161328626 139002110 121488655 107619606 98664518
2327I8664518p554614o436105m921182n821933n658421n422189m265183m652097
$$ 98664518 91109904 84673799 79752617 73930684 68272263 62850074 58584891 53932794
2319E3932794l375298m231595k522644l061331j672205k189228j725515j577433
$$ 53932794 50557496 46325901 43803257 40741926 39069721 36880493 35154978 33577545
2311C3577545k540788m14273j656847j672539j982053o44246j560338q32225o24823
$$ 33577545 31036757 30622484 28965637 27293098 25311045 24666799 23106461 22274236 21649413
2302B1649413p16977j067247j157633j26289o86214o24936j292609j068467p55989
$$ 21649413 20932436 19865189 18707556 18581267 17895053 17270117 15977508 14909041 14153052
2293A4153052n977j049030p28092j08540m90011N3863P74942j15436p96136r2293
$$ 14153052 14147075 13098045 12369953 12261413 11771402 11825265 12600207 12484771 11688635 11596342
2283A1596342j04775k151988j322005P5942K03985K90990J41502J23276m18063
$$ 11596342 11491567 9339579 8017574 8093516 8297501 8588491 8729993 8853269 8435206
2274H435206j177505N69741n0710q89776q17547J12118o47330J116027P3094n21705
$$ 8435206 7257701 7827442 7776732 6886956 6069409 6181527 5534197 6650224 6723318 6201613
2264F201613M25572O82488j0317p20154j049361L07596j98336l94920j35044o14962
$$ 6201613 6627185 7309673 7299356 6579202 5529841 5837437 5639101 5244181 5109137 4494175
2254D494175M64636r5379P16459l14354o99550O23526J63595k88064J217658J150739
$$ 4494175 4958811 4863432 5579891 5265537 4565987 5189513 5353108 5065044 6282702 7433441
2244G433441j738108o04031J03455o07138K84385N28688j040746L76827J49931
$$ 7433441 5695333 5091302 5194757 4587619 4872004 5400692 4359946 4736773 4886704
2235D886704l4979r36562p93172J029849k95845k7616M51791n62178L29814q3220
$$ 4886704 4851725 3915163 3121991 4151840 3855995 3828379 4280170 3717992 4047806 3964586
2225C964586L85337l06174p17357N50971K11172J86324n8237P61335m14609J9206
$$ 3964586 4349923 4043749 3326392 3877363 4088535 4274859 4216622 4977957 4563348 4582554
2215D582554n0153n50951j88838j74945p67630r84803p40266J489131O13020M1825
$$ 4582554 4532401 3981450 3792612 3617667 2850037 1865234 1124968 2614099 3227119 3268944
2205C268944K43764j109774n57029k38256o3706M91822L3616m77579O63289J02991
$$ 3268944 3512708 2402934 1845905 1607649 1543943 2035765 2069381 1591802 2255091 2358082
2195B358082o31623l51106q6138N33510J880082n03069j36102k21601l17040k02280
$$ 2358082 1726459 1375353 1289215 1822725 3702807 3199738 3063636 2842035 2524995 2322715
2185B322715N88685L33998m54408o13475m5845L39185M91819J95844j268141J014439
$$ 2322715 2911400 3245398 2790990 2177515 2131670 2470855 2962674 3158518 1890377 2904816
2175B904816j06987p47905O57657M5196p42838l77467R4049P01963J78037j83862
$$ 2904816 2797829 2049924 2707581 2752777 2009939 1632472 1726521 2428484 2606521 2422659
2165B422659j040784k02217M5320Q44450J93597m0767J37862O6091m1442N09097
$$ 2422659 1381875 1179658 1224978 2069428 2263025 2222258 2360120 2426211 2384769 2893866
2155B893866l26873o88386j76641Q85202J99160l656q72937j096578J31801K5756
$$ 2893866 2566993 1878607 1701966 2587168 2786328 2782672 1909735 813157 944958 970714
2145I70714P67376J88521n98j134049m179J123527M64597o59990l94887Q0877
$$ 970714 1738090 1926611 1926013 791964 787785 1911312 2375909 1715919 1321032 1401909
2135A401909K97376M39489K74877J166529k29430M73840n83045n01961k94964
$$ 1401909 1699285 2138774 2413651 3580180 3350750 3824590 3241545 2739584 2444620
2126B444620p08850L88184M0426r48995P8692J107917O32402j57566p28333Q4363
$$ 2444620 1735770 2123954 2164380 1215385 1294077 2401994 3034396 2876830 2148497 2232860
2116B232860o92458p84341j61639M60696N38084L5845j151264R43435J426316
$$ 2232860 1540402 756061 594422 1055118 1593202 1629047 477783 1421218 2847534
2107B847534M874r27811L9306O06886k91358j215853L09125q72235J97345k07780
$$ 2847534 2852408 1924597 1963903 2570789 2279431 1063578 1372703 500468 697813 490033
2097D90033j99682J535475r44308j37686P6381J206556o68918K27445M87925K43640
$$ 490033 290351 1825826 881518 743832 820213 2026769 1357851 1585296 2073221 2316861
2087B316861l61551N04186l11695j316235k37480O10096K04211J197007O33426
$$ 2316861 1955310 2459496 2147801 831566 594086 1204182 1408393 2605400 3238826
2078C238826l95360K33276L30327O27549o17924m9391J94079P31425k67558m57675
$$ 3238826 2843466 3076742 3407069 4034618 3416694 3367303 3561382 4292807 4025249 3567574
2068C567574J0975J56061q75293r64672j05070l1234M103m98315m00781m1755
$$ 3567574 3578549 3734610 2859317 1894645 1789575 1758341 1762444 1264129 863348 821593
2058H21593k54258J313726k15645n90187k16384J70384K31533j9034k19121N0820
$$ 821593 567335 1881061 1665416 1075229 858845 1029229 1260762 1241728 1022607 1073427
2048A073427J049314o01582j475115Q5865P60143R5797o55514K09561m66823l07536
$$ 1073427 2122741 1521159 46044 131909 892052 987849 332335 541896 75073 -232463
2038b32463Q15416P44972J055333j433483j142125R20793J153358N4664r78130
$$ -232463 582953 1327925 2383258 949775 -192350 728443 1881801 1936465 958335
2029I58335m98381K52939N50604M70685k47972J06695Q04113m69910n01656O5041
$$ 958335 459954 712893 1263497 1734182 1486210 1592905 2397018 1927108 1425452 1490493
2019A490493j24122r06450R89334K83574j791055j4835J380754l16634k79034
$$ 1490493 1366371 459921 1449255 1732829 -58226 -73061 1307693 991059 712025
2010G12025O39167k4907L91867o73171O20365J83562L18725M86158n17r0566o16145
$$ 712025 1351192 1326285 1718152 1044981 1665346 1848908 2167633 2653791 2653274 2562708 1946563
1999A946563q14779J61134p18903l01477N80566p07536P07878K82169o43583L44427
$$ 1946563 1131784 1292918 574015 272538 853104 145568 853446 1135615 492032 836459
1989H36459m80930k62576J34598j3313P9007J98786l46162K1059J57038J172o54762
$$ 836459 355529 92953 227551 214238 293245 492031 145869 166928 323966 325138 -329624
1978c29624R7149L73695k76427J270874Q76430L39831r29112J28896L83227R48564
$$ -329624 -232475 141220 -135207 1135667 2012097 2351928 1422816 1551712 1934939 2883503
1968B883503l95152r73402M61611L13270l59410k17669n96244P6607O8309m66011
$$ 2883503 2488351 1514949 1976560 2289830 1930420 1712751 1116507 1193114 1261423 795412
1958G95412q6932p24130p85526O64496L48848p2302M05230P64851j63351l08999
$$ 795412 708480 -15650 -801176 -136680 212168 139866 545096 1309947 1146596 837597
1948H37597M42278o64808l86128K33851O8268k98176J28814k412p7989O41719
$$ 837597 1279875 615067 228939 462790 531058 232882 361696 359284 281295 923014
1938I23014N99407n64847o42258k70631l57648P40549n0143k0585m41389P41413
$$ 923014 1522421 957574 315316 44685 -312963 427586 377443 356858 -84531 656882
1928F56882L21469n05806K5416l90157n90P57299n11632J09090k00488p85340
$$ 656882 978351 472545 497961 107804 107214 864513 352881 461971 261483 -523857
1918e23857K65581m80726L80174n14602Q92471M7385m48213M30441K43262o1271
$$ -523857 -258276 -739002 -358828 -873430 19041 66426 -381787 48654 291916 230645
1908B30645k29072m5769j40505Q14922p25390m48571O54624M28291n82479J99286
$$ 230645 1573 -44196 -184701 630221 -95169 -543740 110884 539175 -43304 155982
1898A55982N03502j376040k71538N33636J09225L84969N07674o2041J08165q01215
$$ 155982 659484 -716556 -988094 -454458 -345233 39736 547410 485369 593534 -207681
1888b07681O76470j70841j94210m74885R59892j67694q38754J616470J83907j252803
$$ -207681 468789 297948 103738 -371147 588745 421051 -417703 1198767 1382674 129871
1878A29871k80199K68997q65855J510924K45315j275942J43569j5457j12965P48937
$$ 129871 -150328 118669 -747186 763738 1009053 -266889 -123320 -138777 -251742 497195
1868D97195J032028l18226N33899j017501P856K31795o27923Q29221j97852q6447
$$ 497195 1529223 1210997 1744896 727395 735251 967046 339123 1168344 970492 884045
1858H84045m89346o33452M41137o50578k5502M76972o38365M76364Q09753j30040
$$ 884045 394699 -238753 202384 -448194 -473696 3276 -635089 -158725 651028 520988
1848E20988j70866r52732m32527N78453P46921L92631l19255o02152k00998l39947
$$ 520988 350122 -602610 -1035137 -456684 290237 682868 363613 -238539 -439537 -779484
1838g79484P50377m56525N23363o01612m14071K06570L92703K67621K20038j24133
$$ -779484 -29107 -485632 37731 -563881 -977952 -771382 -378679 -111058 108980 -15153
1828a5153p5433J055186N39568M1704L82425j98708j145987k94019r098M07037
$$ -15153 -90586 964600 1504168 1545872 1928297 1729589 583602 289583 280485 687522
$$ [...]
##END NTUPLES=NMR SPECTRUM
##END=
