##TITLE=1H_DE-80H_X3
 200.13MHz, d2o
 8 sc
 
 19ns.26.2.2025
##JCAMPDX= 6.0         $$ Bruker NMR JCAMP-DX V2.0
##DATA TYPE= NMR SPECTRUM
##DATA CLASS= NTUPLES
##ORIGIN= UXNMR, Bruker Analytische Messtechnik GmbH
##OWNER= pz
$$ XWIN-NMR		Version 3.5
$$ Tue Jun 10 10:35:49 2025 Russian Standard Time (UT+4h)  Yarkov@DPX200
##.OBSERVE FREQUENCY= 200.1313
##.OBSERVE NUCLEUS= ^1H
##.ACQUISITION MODE= SIMULTANEOUS
##.ACQUISITION SCHEME= undefined
##.AVERAGES= 8
##.DIGITISER RES= 18
##SPECTROMETER/DATA SYSTEM= spect
##.PULSE SEQUENCE= zg30
##.SOLVENT NAME= CDCl3
##.SHIFT REFERENCE= (INTERNAL, CDCl3, 0, 15.4516)
##AUDIT TRAIL= $$ (NUMBER, WHEN, WHO, WHERE, WHAT)
$$ ##TITLE= Audit trail, XWIN-NMR		Version 3.5
$$ ##JCAMPDX= 5.01
$$ ##ORIGIN= Bruker BioSpin GmbH
$$ ##OWNER= Yarkov
$$ C:/Bruker/XWIN-NMR/data/yarkov2/nmr/H-C/1/pdata/1/auditp.txt
$$ ##AUDIT TRAIL=  $$ (NUMBER, WHEN, WHO, WHERE, WHAT)
(   1,<2025-06-10 10:34:50.10 +0400>,<Yarkov>,<DPX200>,
      <created by zg, POWCHK disabled, PULCHK disabled
       configuration hash MD5:
       00 E9 B6 7A A2 85 ED C7 34 08 36 98 17 FE 4E 26
       data hash MD5: 16K
       31 FB 89 C3 5E D5 5B 34 7A 3B CF 64 25 F0 E8 C6>)
(   2,<2025-06-10 10:34:58.81 +0400>,<Yarkov>,<DPX200>,
      <Start of raw data processing
       efp BC_mod = 2 LB = 0.25 FT_mod = 6 PKNL = 1 PHC0 = -1710.501 PHC1 = 9.76656 SI = 16K 
       data hash MD5: 16K
       8E 56 18 56 4D FD 10 C4 FA 56 34 4D 09 17 AD A7>)
(   3,<2025-06-10 10:35:03.87 +0400>,<Yarkov>,<DPX200>,
      <abs ABSG = 5 
       data hash MD5: 16K
       40 26 78 80 9A 08 56 86 15 81 E3 10 5A 62 F3 90>)
$$ ##END=
$$ 
$$ hash MD5
$$ 33 DE EF E6 6B B7 0C 53 B5 2C D3 40 44 6B 98 60
##$RELAX= 
##$RELAX= 
##$RELAX= 
##$RELAX= 
##$RELAX= 
##$RELAX= 
$$ Bruker specific parameters
$$ --------------------------
##$DU= <C:/Bruker/XWIN-NMR>
##$EXPNO= 1
##$NAME= <H-C>
##$PROCNO= 1
##$TYPE= <nmr>
##$USER= <yarkov2>
##$AMP= (0..31)
100 100 100 100 100 100 100 100 100 100 100 100 100 100 100 100 100 100 
100 100 100 100 100 100 100 100 100 100 100 100 100 100 
##$AQSEQ= 0
##$AQ_mod= 1
##$AUNM= <au_zg>
##$AUTOPOS= <>
##$BF1= 200.13
##$BF2= 200.13
##$BF3= 200.13
##$BF4= 200.13
##$BF5= 200.13
##$BF6= 200.13
##$BF7= 200.13
##$BF8= 200.13
##$BYTORDA= 1
##$CFDGTYP= 0
##$CFRGTYP= 5
##$CHEMSTR= <none>
##$CNST= (0..31)
1 1 145 1 1 1 1 1 1 1 1 1 1 1 1 1 1 1 1 1 1 1 1 1 1 1 1 1 1 1 1 1 
##$CPDPRG= <>
##$CPDPRG1= <>
##$CPDPRG2= <>
##$CPDPRG3= <>
##$CPDPRG4= <mlev>
##$CPDPRG5= <mlev>
##$CPDPRG6= <mlev>
##$CPDPRG7= <mlev>
##$CPDPRG8= <mlev>
##$CPDPRGB= <>
##$CPDPRGT= <>
##$D= (0..31)
0 0.7 0 0 0 0 0 0 0 0 0 0.03 0 0 0 0 0 0 0 0 0 0 0 0 0 0 0 0 0 0 0 0 
##$DATE= 1749537289
##$DBL= (0..7)
120 120 120 120 120 120 120 120 
##$DBP= (0..7)
150 150 150 150 150 150 150 150 
##$DBP07= 0
##$DBPNAM0= <>
##$DBPNAM1= <>
##$DBPNAM2= <>
##$DBPNAM3= <>
##$DBPNAM4= <>
##$DBPNAM5= <>
##$DBPNAM6= <>
##$DBPNAM7= <>
##$DBPOAL= (0..7)
0.5 0.5 0.5 0.5 0.5 0.5 0.5 0.5 
##$DBPOFFS= (0..7)
0 0 0 0 0 0 0 0 
##$DE= 6
$$ [...]
##$SUBNAM3= <"">
##$SUBNAM4= <"">
##$SUBNAM5= <"">
##$SUBNAM6= <"">
##$SUBNAM7= <"">
##$SUBNAM8= <"">
##$SUBNAM9= <"">
##$SW= 18.0517328524113
##$SWIBOX= (0..15)
0 0 2 0 0 0 0 0 0 0 0 0 0 0 0 0 
##$SW_h= 3612.71676300578
##$TD= 16384
##$TD0= 1
##$TE= 0
##$TE2= 300
##$TE3= 300
##$TEG= 300
##$TL= (0..7)
0 120 120 120 120 120 120 120 
##$TP= (0..7)
150 150 150 150 150 150 150 150 
##$TP07= 0
##$TPNAME0= <>
##$TPNAME1= <>
##$TPNAME2= <>
##$TPNAME3= <>
##$TPNAME4= <>
##$TPNAME5= <>
##$TPNAME6= <>
##$TPNAME7= <>
##$TPOAL= (0..7)
0.5 0.5 0.5 0.5 0.5 0.5 0.5 0.5 
##$TPOFFS= (0..7)
0 0 0 0 0 0 0 0 
##$TUNHIN= 0
##$TUNHOUT= 0
##$TUNXOUT= 0
##$USERA1= <user>
##$USERA2= <user>
##$USERA3= <user>
##$USERA4= <user>
##$USERA5= <user>
##$V9= 5
##$VALIST= <valist>
##$VCLIST= <CCCCCCCCCCCCCCC>
##$VD= 0
##$VDLIST= <DDDDDDDDDDDDDDD>
##$VPLIST= <PPPPPPPPPPPPPPP>
##$VTLIST= <TTTTTTTTTTTTTTT>
##$WBST= 1024
##$WBSW= 4
##$XGAIN= (0..3)
0 0 0 0 
##$XL= 0
##$YL= 0
##$YMAX_a= 343895
##$YMIN_a= -288762
##$ZGOPTNS= <>
##$ZL1= 120
##$ZL2= 120
##$ZL3= 120
##$ZL4= 120
##$ABSF1= 15.47805
##$ABSF2= -2.573799
##$ABSG= 5
##$ABSL= 3
##$ALPHA= 0
##$AQORDER= 0
##$ASSFAC= 0
##$ASSFACI= 0
##$ASSFACX= 0
##$ASSWID= 0
##$AUNMP= <proc_1d>
##$AZFE= 0.1
##$AZFW= 0.1
##$BCFW= 0
##$BC_mod= 2
##$BYTORDP= 0
##$COROFFS= 0
##$CY= -3
##$DATMOD= 1
##$DC= 0
##$DFILT= <>
##$DTYPP= 0
##$F1P= 0
##$F2P= 0
##$FCOR= 1
##$FTSIZE= 16384
##$FT_mod= 6
##$GAMMA= 0
##$GB= 0
##$INTBC= 1
##$INTSCL= 3.241238e-09
##$ISEN= 128
##$LB= 0.25
##$LEV0= 0
##$LPBIN= 0
##$MAXI= 10000
##$MC2= 0
##$MEAN= 0
##$ME_mod= 0
##$MI= 1.114404
##$NCOEF= 0
##$NC_proc= -7
##$NLEV= 6
##$NOISF1= 3.799351
##$NOISF2= 2.8
##$NSP= 0
##$NTH_PI= 0
##$NZP= 0
##$OFFSET= 15.45161
##$PC= 1
##$PHC0= -1710.501
##$PHC1= 9.76656
##$PH_mod= 1
##$PKNL= yes
##$PPARMOD= 0
##$PSCAL= 0
##$PSIGN= 0
##$REVERSE= no
##$SF= 200.130014027637
##$SI= 16384
##$SIGF1= 3
##$SIGF2= 2
##$SINO= 0.751879
##$SIOLD= 32768
##$SREGLST= <19F.Aceton>
##$SSB= 0
##$STSI= 16384
##$STSR= 0
##$SW_p= 3612.71676300578
##$SYMM= 0
##$S_DEV= 0
##$TDeff= 16384
##$TDoff= 0
##$TI= <>
##$TILT= no
##$TM1= 0
##$TM2= 0
##$TOPLEV= 0
##$USERP1= <user>
##$USERP2= <user>
##$USERP3= <user>
##$USERP4= <user>
##$USERP5= <user>
##$WDW= 1
##$XDIM= 16384
##$YMAX_p= 274850609
##$YMIN_p= -685285
$$ End of Bruker specific parameters
$$ ---------------------------------
##NTUPLES= NMR SPECTRUM
##VAR_NAME=  FREQUENCY,     SPECTRUM/REAL,   SPECTRUM/IMAG
##SYMBOL=    X,             R,               I
##VAR_TYPE=  INDEPENDENT,   DEPENDENT,       DEPENDENT
##VAR_FORM=  AFFN,          ASDF,            ASDF
##VAR_DIM=   16384,         16384,           16384
##UNITS=     HZ,            ARBITRARY UNITS, ARBITRARY UNITS
##FACTOR=    0.220516191357247, 1,           1
##FIRST=     3092.33084830131, 0,            0
##LAST=      -520.385914704467, 0,           0
##MIN=       -520.385914704467, -685285,     0
##MAX=       3092.33084830131, 274850609,    0
$$ Real data points
##PAGE= N=1
##DATA TABLE= (X++(R..R)), XYDATA
$$ [...]
9974 -474391 -377375 -278294 -400557 -421551 -473893 -286198 -500729 -511499 -516897 -488279 -344673
9963 -344673 -448979 -406956 -363861 -358665 -467865 -344112 -345207 -565225 -524479 -378198 -378345
9952 -378345 -508679 -424586 -386620 -492096 -489822 -439831 -388997 -375742 -246123 -289306 -307007
9941 -307007 -389419 -377706 -363537 -350701 -398344 -448570 -473377 -395593 -378516 -396543 -310660 -358339
9929 -358339 -219692 -214110 -377751 -262150 -283169 -167812 -210591 -300521 -304730 -319280 -217666
9918 -217666 -279410 -187204 -94998 -150037 -238403 -239316 -81313 -54718 35118 -103119 -170222 -95475
9906 -95475 -20312 6813 -92469 -91104 -16762 15114 245432 138698 229785 328206 212250
9895 212250 348802 478355 545405 643806 752666 692116 494145 492016 634090 637043 517294
9884 517294 568319 457660 384845 316009 467354 378092 318811 277549 293088 348693 291662
9873 291662 336594 307729 161993 2266 135984 112374 51823 43097 -61408 28525 25122
9862 25122 1346 -5072 -188696 -281219 -172823 13272 -79043 -259886 -298168 -191246 -213190
9851 -213190 -250230 -146217 -113252 -188069 -222531 -126946 -228577 -230315 -162030 -199775 -212962
9840 -212962 -188920 -93465 -130212 -72229 -81486 -10773 -212305 -228196 -267697 -273250 -299975 -220806
9828 -220806 -331330 -286044 -247947 -197885 -180253 -231812 -272683 -228809 -107172 -171768 -301464
9817 -301464 -362461 -284143 -253431 -258413 -312609 -301802 -286870 -229505 -244047 -182191 -126101 -150005
9805 -150005 -244960 -300366 -275542 -229216 -266370 -352647 -304083 -296162 -266064 -373755 -474660
9794 -474660 -248809 -214146 -164680 -94565 -164140 -163628 -70303 25356 -118136 -80364 -103465 -175522
9782 -175522 -156712 -189039 -230638 -256243 -242387 -182566 -346341 -295399 -195957 -52067 -115726
9771 -115726 -306180 -311502 -181107 -58847 -79158 -269890 -231661 -258606 -278892 -314203 -396961
9760 -396961 -217920 -142654 -237780 -220229 -96041 -126983 -127279 -21710 28165 -146910 -30519
9749 -30519 -78391 -122397 -5719 -62250 -4137 -37394 -106996 -254707 -275765 -90054 -52521
9738 -52521 -81520 -35010 -48893 43591 203302 209395 205273 176813 11791 -102640 25475
9727 25475 97942 118408 189909 241495 252330 326424 99751 16424 38256 -7704 -63518 13215
9715 13215 21988 78976 78424 37893 58300 212828 250232 206733 174815 264721 346304 267555
9703 267555 149755 154658 61104 98187 -69012 33526 116929 -27673 121747 53427 -21586
9692 -21586 -55396 -211524 -140255 -69395 -47620 -26691 -144954 -169082 -204074 -221690 -136328
9681 -136328 -17179 -12986 -30994 25106 -82155 -122230 -168932 -54390 -154919 -201673 -90180
9670 -90180 -113659 -240339 -218446 -147473 -98212 -130908 -150926 -139382 -123671 -141602 -128737 -80863
9658 -80863 1406 -26114 -131409 -127421 -106861 -43022 -196398 -132974 -73997 -190484 -175385
9647 -175385 -84241 -113289 -91431 -93555 -121298 -288693 -165878 -156050 -235714 -246428 -197084 -186138
9635 -186138 -170212 -249158 -110548 -105845 -213866 -157980 -234777 -326321 -279056 -289745 -189297
9624 -189297 -161108 -174635 -130254 -156963 -134758 -132418 -137676 -136004 -188629 -182050 -244749 -400588
9612 -400588 -355749 -260138 -229988 -219443 -256769 -274439 -209237 -160499 -249187 -119553 -133674
9601 -133674 -140289 -43468 16367 -74314 -27925 -122758 -84440 -197955 -78223 72397 33077
9590 33077 -96422 -198974 -206187 -187461 -98104 -189772 -232112 -126977 -84434 -239915 -86457
9579 -86457 -135559 -91077 -27795 -38814 -173695 -207767 -352220 -254346 -162037 -219804 -260493
9568 -260493 -158147 -51581 -188250 -226006 -223337 -97611 -82708 -189138 -102759 -62874 -76745
9557 -76745 -51281 -134335 -300113 -212827 -94871 -93721 28324 -93294 -164304 -176555 -236371
9546 -236371 -73859 -115214 -194162 -193714 -168999 -58860 -138844 -59736 -23118 -119632 -43820 -50399
9534 -50399 -87526 -164636 -166481 -39933 -11501 2129 8875 -42773 142536 34940 2797 29154
9522 29154 -23149 -235372 -342481 -309536 -293245 -157311 -126352 -201205 -235375 -116970 -80090
9511 -80090 -98800 -98987 -24568 2308 -121722 -161029 51351 -45801 65690 76175 67896 137910
9499 137910 40975 108968 78268 97264 -15444 105912 48613 -42690 43412 87210 101259
9488 101259 163225 156021 117197 152172 67693 54425 181484 205329 190103 218203 95269
9477 95269 98861 146460 134734 175875 53184 112008 177453 -54515 87609 61532 9782
9466 9782 96907 310382 414372 318862 182963 53150 79991 255232 198569 208120 287371
9455 287371 400135 525928 441377 474682 566640 477636 540208 489840 363970 557672 541046
9444 541046 669183 817275 724664 611330 497480 610919 705413 609646 645090 702779 793675
9433 793675 585060 651607 629748 614265 709907 716465 873447 920718 802998 800373 776766
9422 776766 800957 749337 756830 770924 767859 829885 782909 930512 1018930 1053953 1056757 1084996
9410 1084996 1046479 1114282 1174745 1227436 1323962 1385597 1457411 1497580 1615852 1692037 2005229
9399 2005229 2221364 2437725 2473813 2346852 2071449 1724664 1574261 1436652 1453315 1397050
9389 1397050 1400889 1311174 1438765 1422794 1488479 1519950 1443049 1450199 1443798 1366798 1343224 1353881
9377 1353881 1426334 1471714 1452744 1417917 1427568 1448209 1457163 1430763 1494786 1484303 1362898 1499721
9365 1499721 1408182 1369630 1452547 1521845 1547050 1555777 1544770 1475235 1634593 1611176 1501905
9354 1501905 1674877 1709505 1693271 1841159 1847008 1863225 1901682 1922681 1834483 1769610 1767891
9343 1767891 1798538 1852755 1775640 1939864 1835006 1822312 1902904 1878462 1942087 1984352 1969981
9332 1969981 2023567 2059446 2052471 2023617 2011620 2238348 2350797 2476429 2442491 2296188 2320089
9321 2320089 2414331 2307242 2353347 2443416 2330521 2445374 2547673 2367893 2312229 2459203
9311 2459203 2502150 2591160 2539821 2481039 2452065 2420954 2589804 2589988 2595391 2668354 2773889 2886284
9299 2886284 2857847 2948433 2905762 2802951 2922233 3016392 3044078 3088809 2998926 2973112 3046359
9288 3046359 2967409 3073417 3236547 3168093 3001934 3079845 3222459 3158961 3181946 3273848 3265524
9277 3265524 3320999 3315629 3399707 3442441 3376989 3604613 3659319 3717946 3683599 3861988 4083462
9266 4083462 4142786 4251348 4302627 4441878 4549215 4822356 5099494 5420726 5610090 5840702
9256 5840702 6159367 6348538 6573689 6740370 6780936 6920903 6941819 6816748 6751568 6685147
9246 6685147 6399441 6190492 6036384 5857490 5565538 5541706 5458771 5250660 5180564 5222096
9236 5222096 5240895 5325999 5277871 5298226 5407905 5372323 5482592 5474073 5653017 5867838 5944559
9225 5944559 6096998 6356710 6656222 6945905 7227796 7632460 7891748 8051636 8217270 8313282
9215 8313282 8352581 8338039 8089269 7992657 7794715 7436194 7074789 6851869 6779089 6684691
9205 6684691 6357748 6265170 6209977 6082807 5912869 5933113 5920707 5853345 5878549 5972634 6049326
9194 6049326 6018590 5974011 6138107 6124933 6035120 6205120 6234925 6210984 6134891 6199731 6353846
9183 6353846 6202659 6218200 6234917 6296069 6362471 6290515 6360251 6267455 6212408 6235878 6207788
9172 6207788 6368488 6321054 6375040 6487191 6627148 6669356 6767965 6865982 6910891 7165045 7234863
9161 7234863 7248282 7262789 7371733 7500041 7630636 7719167 7761850 7796127 7929964 8155473
9151 8155473 8237956 8350310 8493696 8552391 8661214 8659620 8744018 8785561 8898724 9051886 9301562
9140 9301562 9581414 9982116 10130058 10283929 10529465 10801136 11049325 11376522 11677935 11962738
9130 11962738 12345902 12760332 13141975 13371277 13595956 13676761 13896125 14116882 14125464 14307368
9120 14307368 14374246 14614021 14768420 14831253 15205139 15575668 15997923 16790401 17449330 18001993
9110 18001993 18599130 18996633 19515048 20098904 20743424 21199924 21693065 22177927 22589838
9101 22589838 23111395 23605200 24179997 24908045 25675861 26489367 27635090 28605647 29885201
9092 29885201 31548119 33205052 34881893 36481137 37810129 39087532 40060818 40566225
9084 40566225 41034123 41012441 40958432 41004520 40866189 40799975 40664052 40415327 39872361 39090221
9074 39090221 38265108 37875197 37414399 36995094 36693262 36462222 36333764 36350625 36423272 36416690
9064 36416690 36587675 36789682 37006806 37538063 38375061 39612909 41264552 43213795 45269273
9055 45269273 47416687 49388272 50564893 51194819 51630213 51976529 52479499 53032266 53689986
9046 53689986 54079864 53768925 53206131 52604810 51614804 50338188 49125758 47811875 46477767
9037 46477767 45136842 43824402 42758575 41890198 41221139 40549385 39853368 39383488 38694988
9028 38694988 38103455 37656035 37178974 36933461 36940926 36992486 36948331 36842500 36966601 37255181
9018 37255181 37692580 38133108 38611098 38760519 38586562 37895199 37046613 36126496 35307478
9009 35307478 34752709 34542243 34606611 34970089 35657712 36286649 37029538 37619520 37989980 38055422
8999 38055422 37764993 37196408 36177748 35011661 33902391 32780382 31799304 31144079 30578041
8990 30578041 30146390 29868311 29840427 29931364 30211119 30665297 31138351 31696685 32351380 33126271
8980 33126271 33986446 34707166 35823604 36898561 37868198 38857971 39850559 40427739 40869811
8971 40869811 41419656 41844998 42092543 42307678 42240721 41943130 41550665 41129220 40386008 39884985
8961 39884985 39628499 39580348 39496535 39739442 40067981 40573170 41091641 41785720 42511082 43391292
8951 43391292 44317777 45448902 46796270 48651834 50767706 53403240 56280390 59683440
8943 59683440 63425941 67391455 71549941 75829471 80082998 84345369 88801195 93732638
8935 93732638 98879292 105142741 112027197 120796806 132220006 148005292 167009071 191254901
8927 191254901 225909507 254386912 263442671 255321024 232985587 195866631 163856973
8920 163856973 142133578 126467809 114032850 101369122 90609799 82491191 75758013
8913 75758013 70189956 65534863 61764695 58873636 56291719 54262520 52726440 51574187
8905 51574187 50570808 49857855 49120149 48479836 48065891 47687726 47335995 47006874 46585885
8896 46585885 46200663 45605602 45201173 44871309 44546432 44163129 44005292 43949490 43998411 44049056
8886 44049056 44198679 44386578 44566115 45015783 45622149 46234155 47185333 48226073 49325661
8877 49325661 50348816 51490198 52047145 52546087 53118187 53838067 54387357 54787306 54977326
8868 54977326 54953714 54635748 54282289 54124063 54176310 54235494 54642957 55134806 55668691 56323687
8858 56323687 57045525 57684037 58342392 58798434 59035732 59383423 59969402 60777167 62012752
8849 62012752 63684627 65619297 68040529 70699715 73169847 75313449 77035458 78077287
8841 78077287 78644497 79065078 79276454 79176431 78471346 77384612 76007753 74529045 73158978
8832 73158978 71998571 71043898 70201255 69789830 69971150 70490220 71104965 71245353 71089947
8823 71089947 70741259 70661183 70836167 71628047 72801199 74599373 76284914 77510661 78743170
8814 78743170 79620687 80246434 80400932 80092702 79685912 79109561 78568559 78024859 77606075
8805 77606075 77589907 78271489 79139418 80024191 80216001 79639192 78396165 76846673 75733765
8796 75733765 74929411 74501896 73841940 72569645 70840513 68630563 66186365 64463882 63357655
8787 63357655 62393526 61682298 61148317 60654921 60413642 59876589 59592947 59510589 59509402 59664668
8777 59664668 60136521 60739328 61574869 62506599 63223793 64036452 65122080 66382501 67739087
8768 67739087 68926182 70015303 71006051 71749336 72558595 73315465 74208487 74406717 73820783
8759 73820783 72727102 71596190 70210864 69170816 68342538 67422062 66786517 66102820 65847065
8750 65847065 66103716 66778673 67586671 69122612 71389182 74165452 77763663 81576563 84836377
8741 84836377 87026294 87426862 86340045 84271372 81926991 79872669 78479924 77515130
8733 77515130 77106678 76922886 77349592 77693796 77670063 77065067 75961004 74810357 73704789
8724 73704789 72496210 71073604 69320203 67528586 65987547 65070020 64779990 64640617 64484867
8715 64484867 64368661 64090018 63640137 62727441 61334321 59748201 57998227 56204771 54635028
8706 54635028 53727553 53501647 53822417 54689243 56053313 57789493 58934961 58734257 57320684
8697 57320684 55249114 52593693 49902142 47733798 45868185 44260631 42743159 41438858
8689 41438858 40252917 39124815 37965097 36810559 35893651 34968008 34073835 33415701 32740995
8680 32740995 31958283 31179302 30372374 29546138 28809023 28031955 27515989 26975092 26674343
8671 26674343 26331582 25948011 25733260 25467637 25188576 24884432 24611611 24399016 24231979
8662 24231979 24015671 23735189 23673794 23738839 23635148 23555433 23512343 23298906 22846161 22481159
8652 22481159 22206562 21820644 21489575 21031415 20595945 20185781 19658969 19297123 19071326
8643 19071326 18731791 18617077 18501668 18374299 18186666 18194214 18083674 17991900 17916306 17681041
8633 17681041 17623590 17575898 17427060 17314715 17257563 17270833 17137682 16935320 16748461 16640046
8623 16640046 16421511 16169405 16032324 15731290 15478103 15152149 14931682 14617290 14383725
8614 14383725 14209280 13965143 13925824 13836004 13732473 13585923 13422246 13389949 13417276 13452450
8604 13452450 13335286 13155121 13120193 13149703 13075273 12925164 12802071 12714179 12649535 12580446
8594 12580446 12531319 12248086 12287981 12247047 12211746 12103657 11979896 11918249 11958347 11659377
8584 11659377 11406917 11374367 11148620 11035653 10934327 10978496 10862750 10762769 10666670 10621166
8574 10621166 10376424 10339581 10369652 10317294 10201022 10068792 9989784 9881463 9723037 9674615
8564 9674615 9681991 9753088 9588321 9507084 9457040 9578206 9560740 9388897 9242177 9176934 9124037
8553 9124037 9091990 9154169 9077386 9054386 9001299 9037287 9056249 9093207 8949935 8951107 8975934
8542 8975934 9047235 9092983 9091677 9252074 9357030 9483444 9682794 9892438 10149693 10458916
8532 10458916 10698911 10954674 11104378 11215086 11070012 10801140 10708721 10478066 10318959 10107178
8522 10107178 10064574 10136502 10090628 10111025 9932351 9911820 10117768 10369528 10631032 10964199
8512 10964199 11146856 11505159 11848066 11975585 12387764 12795062 12929110 12928718 12885933 12895227
8502 12895227 12797767 12615285 12702323 12817443 13056757 12955477 12727760 12409698 12084705 11612629
8492 11612629 11082213 10576122 10117260 9945631 9639955 9369398 9015562 8840184 8828282 8712319
8482 8712319 8608993 8548740 8554766 8571385 8821734 8921626 9041869 9370004 9749092 9897591
8472 9897591 10155008 10564585 10786404 10886459 10956663 11103979 11004543 10884685 10541436 10201628
8462 10201628 9665907 9333928 8943970 8480423 8125791 7703356 7385592 7152499 7061814 6916509
8452 6916509 6878188 6911386 6854904 6904405 7118212 7044369 6878233 6575184 6346450 6198380
8442 6198380 5896518 5776507 5708720 5873933 5728631 5528677 5392392 5239069 5132248 5152270
8432 5152270 5133446 5052990 4897856 4709027 4494633 4584951 4653651 4583293 4511947 4542888 4571629
8421 4571629 4532126 4488035 4423463 4527801 4402912 4288242 4155693 4212729 4255883 4093248
8411 4093248 4047466 4007823 4105545 4319253 4287803 4256885 4216594 4073659 4020773 4022115 3907579
8400 3907579 3921232 3943065 4001977 3875634 3845084 3744205 3601205 3739148 3691693 3649976 3755063
8389 3755063 3719748 3612423 3538635 3491798 3392776 3543371 3445097 3499752 3471411 3343968 3586362
8378 3586362 3602893 3498721 3548161 3534393 3374359 3409293 3398319 3300805 3310712 3310030 3291696 3326596
8366 3326596 3377968 3232087 3080395 3087295 3107857 3088497 3043541 3111007 3166097 3124059 3084109
8355 3084109 2880290 2788168 2846424 2926389 2883035 2923478 2960398 2907489 2884033 2917012 2954291
8344 2954291 2756934 2646740 2652224 2731162 2656243 2616970 2687617 2778489 2753951 2646001 2666923
8333 2666923 2709501 2668436 2537378 2658220 2706803 2531019 2539810 2574048 2635189 2434969 2411901
8322 2411901 2498768 2496480 2511376 2348161 2322858 2483084 2439628 2376073 2274655 2201759 2320175
8311 2320175 2289540 2360622 2378445 2303472 2129001 2012463 1849089 1936687 2094815 2123678 1943801
8300 1943801 1936171 2039907 1900183 1980038 1930002 1878177 1871138 1971893 1894911 1946439 1904939
8289 1904939 1820307 1876066 1951096 1883218 1856905 1972280 1921249 1733429 1817369 1787698 1794284
8278 1794284 1665804 1701742 1897869 1899661 1748537 1590793 1803950 1651674 1638800 1609095
8268 1609095 1630313 1640687 1603643 1645632 1590715 1604140 1656697 1548292 1497886 1450734 1513637
8257 1513637 1578521 1499858 1574364 1689305 1675218 1721756 1713753 1652821 1586555 1549372 1730774
8246 1730774 1609557 1525904 1621133 1373587 1279690 1308892 1427956 1523023 1324555 1361138 1350081
8235 1350081 1402570 1394563 1320286 1398794 1352966 1287919 1230727 1247500 1297608 1378620 1330874 1394238
8223 1394238 1247537 1263158 1352564 1462476 1398355 1257930 1231790 1159028 1234263 1210736 1148450
8212 1148450 1169675 1256800 1253349 1391206 1314861 1306694 1376931 1420184 1313104 1198545 1085674
8201 1085674 1090139 1088014 1061402 1122398 1182896 1153973 1240949 1204412 1323414 805948 609623
8190 609623 1074681 1053155 1236792 1113165 1031467 966909 1027913 1121479 1116619 1077967 1011687
8179 1011687 988146 777550 846241 894978 935846 839899 797114 959337 997620 980292 1061452
8168 1061452 1047461 1128213 1136729 983330 999183 846353 941247 1083664 1144653 1118835 1062560
8157 1062560 886793 934678 1047283 1017560 913793 852400 881514 952888 911840 772989 884291
8146 884291 871083 895668 860556 902317 835108 866181 984121 870838 998813 934985 812243
8135 812243 826401 887944 839906 733301 762578 832989 770710 766324 661299 676739 685617 764593
8123 764593 772871 725403 774786 700586 740130 623955 491198 659857 679325 609858 524066
8112 524066 579357 543997 614143 576359 426814 571569 518616 475049 512732 474535 519080
8101 519080 624918 636415 572661 485000 534165 681661 594270 476455 429517 459713 622624
8090 622624 564892 569853 528703 509307 350689 470088 533624 461164 556011 582689 607515
8079 607515 473533 330143 466138 430896 418737 565329 455319 309036 379330 321283
8069 321283 448800 514792 417950 506477 587094 506215 369906 318686 345245 412852 374021
8058 374021 479692 355466 410609 525475 341699 270045 274738 236987 415016 546981 431292
8047 431292 301926 368187 443955 478672 346980 383687 409390 321343 341728 386824 309647
8036 309647 199082 296340 305938 470687 468327 371527 345143 274731 359905 259034 293750
8025 293750 303011 388419 270810 255069 230476 253427 236782 282427 237584 169267 254423 193496
8013 193496 194769 228362 318510 244776 415842 286915 208246 253481 329153 281261 337525
8002 337525 319626 259373 346091 317256 213957 264094 281781 250126 203643 64942 133523
7991 133523 318131 332663 239681 263677 304133 187742 335391 341671 274188 255508 153610
7980 153610 262809 186640 75803 29579 10959 106077 120539 238127 247368 269653 358018
7969 358018 409835 235957 133483 56552 192189 320968 350881 237776 183323 201821 204944
7958 204944 207186 247736 208956 83284 134692 76138 170890 205223 187969 -7095 98829
7947 98829 237501 157582 130224 71519 50697 61993 126194 188431 60990 -12997 136110
7936 136110 239683 149952 76063 48885 -11530 161667 158299 44197 -23585 -32437 169532
7925 169532 109493 -24662 -91500 6399 71021 -46465 10638 80122 152038 241027 58400
7914 58400 136855 142951 74118 90869 75710 -15550 85157 181376 115601 180974 225441 117508
7902 117508 67386 140530 180897 176627 163895 183764 151518 101723 159170 105933 29091 -5189
7890 -5189 -36453 48199 214398 181669 215929 204882 169602 70595 103400 81970 66827 99037
7878 99037 -3551 -67292 -58529 14579 138860 70909 16675 27895 66826 126331 53319 -8689
7866 -8689 39801 116817 175648 66852 -25094 20041 -6981 153839 146904 44360 -49978 -18384
7854 -18384 -69704 -58031 -51257 -19025 -35445 -104686 41197 87700 -8864 103774 9285 -94684
7842 -94684 -43465 55062 -1859 -47939 -18551 -23194 106647 180860 189162 223091 -5459 -58106
7830 -58106 -77899 -30382 130490 67649 4205 29838 -135480 -136412 36873 34477 89706 135712
7818 135712 82324 129327 -14543 -53791 20901 13103 -33496 -112957 -98733 -435669 -194840
7807 -194840 7925 29472 166893 120827 51872 -111229 -12618 49648 46116 -20719 -37999
7796 -37999 3097 -79527 -118682 -117488 39133 -52714 -135552 -93433 -39205 54518 31629 -4088
7784 -4088 55361 53323 -26741 7906 -19985 -107 25417 21478 44103 -68284 -1472 44669
7772 44669 -37907 -110907 -93223 -144620 -81356 -87531 -113021 -27865 93108 22359 -226990 -91986
7760 -91986 -63615 -41762 -31756 -70209 -156322 -196459 -96250 -11206 110465 42054 -68981
7749 -68981 -76649 -96783 -68392 11631 -118055 -209525 -88662 10337 95319 43682 32458 109450
7737 109450 84917 -48203 -11681 -42328 -134122 -190902 -153814 -156922 -117445 -44464 -32104 -201715
7725 -201715 -239737 -166468 -114789 -90480 -131062 -22373 -78893 80528 85273 -63236 -121925
7714 -121925 -199138 -224848 -135489 -108882 -155833 -69677 -50886 -84297 -16813 -37349 -58784 30444
7702 30444 -39765 16808 -67774 -122118 -116922 -87935 -84309 -110248 -125657 -91584 34602 -56856
7690 -56856 -161722 -143750 -131629 -76133 -33262 -27173 -63310 -69131 -45821 32159 60317 119076
7678 119076 124460 45461 16828 3809 -26736 -1258 -42705 -171061 -122731 -70702 -19464 -17782
7666 -17782 -78122 -187116 -105156 44824 55093 -35031 15391 665 17321 4766 12644 -78672
7654 -78672 -115106 -191189 -78494 -726 43076 -6533 -158509 -266445 -223721 -102740 -139412
7643 -139412 -18312 -231816 -215052 -117518 -170962 -67632 11307 -99934 -195474 -156229 -75360
7632 -75360 -21854 -47462 -48247 -132901 -153872 -120614 -160769 -276480 -178996 -194224 -178843 -42265
7620 -42265 -96967 -239837 -143060 -230804 -145330 -70389 -90948 1823 -8869 148710 35095
7609 35095 -53496 -69738 -181620 -160929 -132071 -103058 23090 -11638 -106638 -9070 30583
7598 30583 32630 -29335 -56186 -148114 -229324 -117444 -315771 -267735 -175245 -95798 -104808 -85460
7586 -85460 -66511 -47178 48319 -92263 -261741 -214120 -179709 -144509 -38797 -166804 -97896
7575 -97896 -132610 -251706 -176232 -96491 -21551 -77285 -50598 -46487 -31149 46704 85473 -16
7563 -16 -56155 3843 -12058 -40465 24864 -60492 -67481 -118096 -22671 -25681 -87020 -45630 -146906
7550 -146906 -63289 -90168 6447 -32048 -190859 -194562 -98379 71926 169301 158576 80575
7539 80575 -45695 -61986 -84784 -52570 -48816 59746 25115 29950 24067 -65015 -66538 18405
7527 18405 104020 -68507 -97352 14524 144386 108266 63258 27434 95260 57226 73609
7516 73609 32982 6960 -70946 -69385 141618 37674 -82792 -115472 -72533 56608 10025
7505 10025 117354 94048 108435 60536 108368 268895 237877 166337 88908 121161 117185 48539
7493 48539 -87102 53700 267353 218564 170690 186743 160947 72406 139628 154846 176914
7482 176914 213443 316499 381076 401213 330772 349722 410457 324835 391901 416733 435951
7471 435951 467771 580115 602148 418937 511937 516309 462667 525573 546700 533809 642269
7460 642269 681951 738807 879196 682232 743903 719732 744980 809210 897019 1165317 1170603
7449 1170603 1192409 1136098 1131609 1269741 1321695 1370180 1448101 1592743 1725748 1940752 2026986
7438 2026986 2228510 2236412 2346977 2739388 2863617 2876836 3153845 3285649 3570225 3892321
7428 3892321 4012507 4061370 4156897 4069025 4065022 4135692 4135456 3963005 3837398 3677713 3566547
7417 3566547 3499123 3419028 3298889 3104707 2792189 2632535 2608875 2452547 2374965 2039639
7407 2039639 1889246 1929117 1879556 1745017 1635789 1581928 1427793 1215186 1248271 1294131
7397 1294131 1161109 1236150 1144313 1051961 991484 972912 1070807 1041101 900873 873327 841021
7386 841021 898757 850087 718127 717215 695514 710727 712116 741724 673790 758317 770414 805325
7374 805325 570054 541782 650308 567153 529234 486186 361761 471173 530572 563782 630229
7363 630229 616771 578152 445796 448666 539002 579658 596790 622136 629866 531605 583229 534890
7351 534890 588835 457755 385801 435016 484463 470811 372991 451570 446785 457596 494934 382123
7339 382123 366701 407939 443081 473581 420657 377076 339002 421497 383008 373690 356999 298617
7327 298617 289624 274663 222576 361619 408826 423542 420135 438597 302361 291253 249880 173716
7315 173716 217241 261825 370334 506341 529894 589876 533079 514441 512024 621331 626493
7304 626493 604414 628407 447873 487968 495695 570320 432264 441552 522777 544546 531654 583189
7292 583189 516113 461808 375501 438858 442334 588097 558661 612855 538667 502583 573740 616733
7280 616733 623828 447879 439215 588285 723341 751606 689710 557643 474624 490990 577753
7269 577753 495552 519098 500887 750593 772261 693067 743746 800044 799409 707435 687076 611084
7257 611084 700979 749120 665017 698625 783674 723204 839534 889148 1015862 1113673 1265645
7246 1265645 1417075 1327102 1401228 1440969 1494294 1601022 1721935 1577835 1514521 1551422 1618933
7235 1618933 1584533 1502493 1265865 1150464 1277350 1270905 1313676 1403713 1385701 1286808 1127240
7224 1127240 989515 885529 940740 887031 790526 874769 927688 767677 965139 980725 948568
7213 948568 905467 799417 832029 764590 787827 790229 740221 910295 883446 847823 775840
7202 775840 704266 879225 880815 794860 726937 821749 783321 806369 778217 698403 826874
7191 826874 942631 1136647 1094995 1160037 1235194 1245812 1297624 1476761 1547553 1650126 1682970
7180 1682970 1536107 1539276 1552509 1482496 1262451 1157469 997201 1014565 951484 955079 1007562
7169 1007562 857862 934091 1033403 902227 878999 812585 749805 816658 653230 576147 632281
7158 632281 838426 749294 730456 640131 579175 589417 547177 549092 566030 591726 554562 573792
7146 573792 582391 549597 457878 592591 497386 320606 399513 469947 424610 418344 509259 437986
7134 437986 194652 284958 295466 327107 412421 466694 346953 264176 243762 259025 228297
7123 228297 238785 171596 116906 128714 176326 131341 142830 171249 168343 73349 186076 194236
7111 194236 250083 219313 222611 151391 212732 197550 71667 17187 130894 319882 191325
7100 191325 72809 233105 336369 235816 148273 228458 225747 210641 186094 211718 204915
7089 204915 164823 243323 140731 126220 100068 159181 128689 204921 98416 137271 189625
7078 189625 205274 299321 310268 275763 206626 128602 177623 160170 117337 139402 27195
7067 27195 -19712 58126 75448 58823 81306 127034 119045 43740 12559 130498 202928 220867
7055 220867 199546 206832 118749 93679 35639 59686 87468 42275 98030 50106 98456 180845
7043 180845 160553 164914 130615 124529 82901 -23595 13658 146603 125383 106172 122966 181218
7031 181218 84576 172410 227340 154367 154949 197648 195675 225625 60674 12235 70543 132162
7019 132162 121898 122078 118752 173334 186738 159050 179963 175178 215786 237922 111460 250417
7007 250417 429344 246603 338762 381272 568585 482201 502244 498769 456254 398437 288069
6996 288069 273776 264081 152145 168863 301820 163671 -44246 -21215 31105 -18989 21866
6985 21866 100345 249896 194008 177910 36061 -104312 -39782 75327 188593 91316 59395
6974 59395 64576 -23255 -51682 -112921 58729 13477 63248 178694 256128 200825 75831
6963 75831 59597 -130286 -10497 213293 221977 182963 164866 88240 273604 174383 182617
6952 182617 198818 241801 345446 378738 359938 421705 403158 502298 464944 417070 415019 308277
6940 308277 268329 220647 420363 516354 681266 586337 616552 633779 600947 684588 639526
6929 639526 635941 756503 887407 943000 892465 1060411 1168409 1189485 1300330 1499007 1723338
6918 1723338 1886401 2126501 2352393 2311237 2243664 2464762 2582310 2618592 2358055 2101909
6908 2101909 1922772 1726334 1601260 1485740 1444233 1212757 1107684 1157181 1011287 916399
6898 916399 950294 966730 928328 891405 758076 599607 409457 263934 311759 535914 605649
6887 605649 545587 483591 538613 425160 449355 440960 440769 537908 558630 604482 483866 508646
6875 508646 523953 481281 418813 425471 369432 389299 383679 376774 375170 308383 253416 372303
6863 372303 190333 244548 426072 239099 284684 215728 323168 224003 239691 299224 173240
6852 173240 235316 203877 139645 318904 306114 187467 50380 161764 353888 330348 263232
6841 263232 175109 206044 107629 106176 95404 139008 216196 120212 110394 211276 191069 153897
6829 153897 136672 154327 87321 215545 204871 123376 160625 69672 76134 261541 200072
6818 200072 68727 128771 263291 271966 207746 230584 330805 429876 455502 526266 554322
6807 554322 641827 581867 622800 602669 510283 488190 440228 329981 241535 271856 184073
6796 184073 130584 83719 49339 -4213 -52231 21523 189119 122841 66260 190150 273772
6785 273772 61868 -43734 10859 -12807 50092 98027 116952 86214 -4137 22299 160706
6774 160706 120022 27102 53233 -6904 131387 73031 2348 32363 123759 104623 -1783
6763 -1783 10220 -25020 78455 -24751 30584 131264 92386 155649 158689 245468 212864 156943
6751 156943 256082 162940 130759 220474 181327 151505 143576 123700 214366 283451 422334 482991
6739 482991 471803 357562 179454 145602 206465 156778 172279 226206 273686 347103 344676
6728 344676 177178 144215 152502 252527 351536 214667 99690 143480 191852 202703 139887
6717 139887 212234 120906 30800 -8426 22238 182497 226415 191489 289767 249498 266563
6706 266563 283718 121855 134559 6252 111580 256638 220240 88977 216567 330428
6696 330428 288099 247731 106453 127489 260105 247150 264346 225154 -12071 -4498 187986
6685 187986 23928 51394 191321 176838 172093 232252 379152 411674 220832 231413 297792
6674 297792 249146 145336 110759 217971 364707 451309 390480 268881 351670 286872 251441
6663 251441 260005 294607 282756 252150 235636 219848 210841 310737 453322 343030 295127 349191
6651 349191 350620 398353 391337 374511 334752 356615 525212 420381 388599 358225 521528
6640 521528 410964 496319 659352 710803 760804 553566 538798 769668 770141 773156 826029
6629 826029 750373 775565 805056 850343 903011 964517 1032985 982219 1047519 1181695 1206819
6618 1206819 1405281 1470624 1504836 1507965 1495182 1599776 1651266 1851757 1835790 1965873 2049941
6607 2049941 2276759 2407678 2359081 2467574 2555380 2621954 2821913 3125673 3330032 3489638
6597 3489638 3590500 3802597 3993288 4217322 4579017 4821889 4938799 5128235 5424850 5625284
6587 5625284 5774951 5964287 5967789 6038483 6249101 6413993 6767903 7167151 7544343 7891598
6577 7891598 8354005 8886673 9503897 10243816 11011981 12022365 12923764 13881743 14848415
6568 14848415 15972489 16919653 17422854 17430971 17188635 16643915 15834691 14723009 13824201
6559 13824201 12875047 12138558 11463615 10818695 10339479 9781693 9236083 8762439 8373540
6550 8373540 7975265 7775434 7614626 7367883 7125889 7217834 7227364 7319098 7322419 7134934 7131556
6539 7131556 7220412 6992396 6820433 6510093 6296623 6060454 5842688 5632617 5333453 5150850
6529 5150850 4911098 4761648 4404984 4208491 4082474 3979396 3834397 3711736 3807968 3669423
6519 3669423 3582365 3625013 3465389 3523464 3407707 3195717 3082539 3032691 3044260 2976898 2882681
6508 2882681 2663183 2623541 2647282 2587106 2476099 2544026 2521776 2499096 2366639 2391784 2301572
6497 2301572 2265177 2329269 2288055 2397612 2302132 2331540 2327096 2333285 2254516 2311959 2145594
6486 2145594 2132066 2200651 2026912 2034128 2084087 2146403 2116244 2188640 2244076 2127536 2045679
6475 2045679 1949316 1979434 1981621 2001508 1947759 2010553 2064250 2026805 1996460 2070969 2007341 2029969
6463 2029969 2069852 2049676 1917651 1895297 1997075 2027047 2195343 2113415 2104306 2050414 2005948
6452 2005948 2208865 2327194 2215643 2123336 2028495 2023479 1932629 1823843 1836766 1930985 1927198
6441 1927198 1914560 1915502 1959396 1875773 1850975 1850890 1845652 1765743 1764017 1840682 1828680 1760750 1815102
6428 1815102 1783520 1841352 1831266 1828433 1850271 1813126 1719811 1710021 1636530 1544677 1535994 1626031
6416 1626031 1744095 1678004 1646315 1698080 1691244 1621392 1596334 1543432 1554042 1619729 1682400
6405 1682400 1723796 1812053 1754249 1734665 1725848 1695616 1714121 1783124 1852945 1749794 1660511
6394 1660511 1763031 1812964 1859564 1871976 1853587 1772921 1808236 1863890 1892637 1831589 1830649 1955457
6382 1955457 1893003 1911562 1897125 1942603 1822752 1948820 1993741 2044421 2056820 2044504 2088712
6371 2088712 2070787 2043619 2029219 2129194 2285439 2374663 2301261 2496823 2399456 2347415 2472101
6360 2472101 2575305 2390644 2445140 2541541 2413408 2426870 2538251 2612559 2523173 2501183 2605901
6349 2605901 2642497 2666755 2600619 2589434 2533173 2713023 2784533 2819906 2860155 2880626 3055727
6338 3055727 3180340 3204988 3079389 3095890 3162464 3134542 3164770 3200915 3143863 2998085 3057020
6327 3057020 3048092 3228433 3277950 3093029 3141479 3321316 3350530 3370015 3377177 3488604 3612872
6316 3612872 3485229 3534481 3553911 3604946 3561709 3573111 3628249 3908760 3908143 3878328 3826471
6305 3826471 3850661 3904237 3964365 4159606 4287544 4339503 4464836 4773770 4808818 4902365 5105662
6294 5105662 5303584 5625311 5894112 5807444 5803621 5766183 5770604 5756953 5733290 5938581 5933797
6283 5933797 6029318 6132180 6194256 6389996 6532671 6583697 6700581 6792658 7013247 7217590
6273 7217590 7229902 7407009 7439153 7277380 7140778 7223252 7155545 7204143 7322738 7461513
6263 7461513 7401842 7203247 7318839 7245261 7334192 7295451 7405697 7539172 7531621 7613276 7791157
6252 7791157 7868337 7792754 7728502 7618019 7318313 7228555 7244812 7009410 6830448 6858654 6977565
6241 6977565 7012467 6901613 6896227 6895406 6886596 7035686 7048918 6960514 6952599 7041655 7066215 7073128
6229 7073128 7227632 7223689 7423723 7505313 7394454 7338818 7519391 7743835 7786581 7771418 7890447
6218 7890447 8012626 8005420 8064316 8264154 8382252 8433938 8486050 8585968 8680374 8748277 8915410
6207 8915410 8953534 9321839 9400876 9545351 9843802 10046417 10078544 10228163 10430335 10570087
6197 10570087 10843271 11101651 11190545 11414471 11913592 12254587 12544377 12916737 13261228 13693177
6187 13693177 14044034 14406625 14904087 15445552 16198611 16827334 17498971 18316574 19062367
6178 19062367 19933199 20957202 22024255 23303514 24894236 26607796 28466426 30322349
6170 30322349 32162229 33661886 34679812 35007080 34948285 34643396 34155087 33675090 33266666
6161 33266666 33160518 33240591 33477346 33966938 34655039 35586786 36556957 37910255 39566757
6152 39566757 41323144 43441224 45934998 48859399 51988254 55503037 59174862 62698981
6144 62698981 65305499 66656237 66725553 65594244 63677823 61695784 59874968 58342799
6136 58342799 57398854 57048154 57359604 58627813 60408587 62757292 65194151 66810074 67689928
6127 67689928 67993990 68283596 68301580 68592248 69358959 70348171 71955799 73647613 75286120
6118 75286120 76265123 76013030 74775485 73044296 71215809 69786931 69000778 68513968 67961348
6109 67961348 66839343 65130021 63110896 61153092 59471780 58381786 57758890 57663942 57610316
6100 57610316 57198002 56292505 55228991 54177972 53474594 53067221 52992525 53749671 55016627
6091 55016627 56827345 58110583 58421982 57643150 56123209 54095710 51942649 49742488
6083 49742488 47674354 45585362 43519631 41493962 39509616 37691741 35997681 34423535
6075 34423535 33009997 31746124 30504227 29623823 28674956 27886099 27207681 26548745 26048744
6066 26048744 25567990 25052569 24807207 24499057 24213639 23979497 23740054 23710474 23653978 23504361
6056 23504361 23292814 22986435 22788105 22655105 22221075 22043277 22025138 21773082 21555253 21494963
6046 21494963 21441002 21475213 21366660 21372157 21400446 21333808 21529313 21607318 21636269 21728298 21798093
6035 21798093 21889119 22087535 22145620 22011759 21855648 21789899 21618566 21506651 21279406 21113292
6025 21113292 21134189 21143544 21106098 21120026 21225394 21370643 21435309 21580540 21859379 22074098
6015 22074098 22419875 22736522 23260322 23846636 24493925 24935770 25392427 25625730 25801402
6006 25801402 25713175 25301390 24824581 24272769 23685154 23138023 22686656 22340796 21994721 21489653
5996 21489653 21147631 21027826 20847522 20684188 20768772 20807548 20719750 20730263 20904202 20999117
5986 20999117 21242511 21487877 21507362 21465660 21500294 21410924 21250723 21026099 20827120 20376919
5976 20376919 20032227 19549576 19231750 18925365 18630654 18384573 18079835 17807636 17719711 17451979
5966 17451979 17232895 17054244 16935429 16825471 16676244 16532522 16538703 16383008 16128568 15974510
5956 15974510 15950237 16084019 15964591 15662089 15436584 15489032 15477872 15374476 15065718 15004052
5946 15004052 15001119 14768982 14641216 14660197 14432104 14314540 14134542 14100858 13868436 13697305
5936 13697305 13592300 13510817 13336326 13252399 13338386 13304945 12977359 12820915 12907001 12673300
5926 12673300 12535607 12433633 12198485 12178164 12061517 11957277 11906724 11745885 11668301 11599389
5916 11599389 11465149 11275749 11327733 11411300 11295143 11048561 10984733 10960439 10987233 10909425
5906 10909425 10651382 10835153 10864858 10779531 10662703 10568912 10547008 10453141 10409577 10428980 10429128
5895 10429128 10281201 10203692 10337793 10332341 10308826 10279942 10184883 10040230 9952765 9996061 10012975
5884 10012975 9886057 9808483 9913332 9902073 9750670 9643664 9527290 9501871 9512508 9512549 9609218
5873 9609218 9640218 9623359 9557326 9505064 9348954 9336637 9258264 9122799 9120295 9080979 9061661
5862 9061661 9118270 9046848 9004753 8929418 8842263 8912709 8927003 8883460 8972542 8835153 8855270
5851 8855270 8811569 8828820 8792592 8845602 8879898 8752079 8745296 8747735 8847537 8710516 8824115
5840 8824115 8992898 8989140 9006643 8995244 8914984 8860714 8945653 8990254 9078168 9113944 9024732
5829 9024732 9010872 9228984 9177619 9081406 9199793 9140765 9153924 9256452 9217424 9148577 9143111
5818 9143111 9230120 9244872 9269321 9273993 9391517 9480949 9348450 9451387 9701801 9737838 9774567
5807 9774567 9818269 9868504 9876198 9847183 10075952 10101845 10087773 10170492 10273637 10308992 10384484
5796 10384484 10483684 10665064 10749101 10653109 10781831 11011155 11196229 11187294 11214230 11411176
5786 11411176 11381122 11477658 11471927 11537315 11690870 11720383 11822033 11901124 11964766 11999193 12148987
5775 12148987 12328374 12573939 12668396 12813602 13047583 13247608 13581912 13889036 14199173 14625498
5765 14625498 14890308 15227224 15474459 15781669 16133535 16629929 17005745 17445174 17884909
5756 17884909 18466379 19144465 19831784 20665888 21324169 22165393 23123461 23891505 24491166
5747 24491166 25353732 26428997 27350093 28258368 29376140 30428342 31551056 32693097 34124362
5738 34124362 35802474 37765020 39916242 42257518 44979336 47866413 50469844 52641901
5730 52641901 54141145 54801186 54770275 54325980 53491298 52735144 51993020 51505634 51117416
5721 51117416 50976676 51163052 51555911 52247283 53248363 54807275 56609373 58816853 61420364
5712 61420364 64593579 68427348 72788846 77665076 82953236 88073675 92172085 94708605
5704 94708605 95878435 95830900 94894712 93992168 93267808 93178419 93912660 95237815 97272884
5695 97272884 99865637 103097121 106807744 110839105 115142145 119156774 123039180 126874956
5687 126874956 130268244 133112786 135222061 136472922 137028343 136803183 136032207 134360170
5679 134360170 132041931 129068409 125503508 121740365 117815409 113969508 110596165 107878337
5671 107878337 105760979 104106253 102895559 102283997 102056928 102277366 102947215 104119827 105704965
5662 105704965 107956025 110873386 113806439 116374640 118555262 120235859 121803785 123306205
5654 123306205 124585564 125477851 125730540 124890274 122979371 120059740 116236860 111831561
5646 111831561 107215402 102206793 97189184 92488037 87715109 83213178 79180706 75185042
5638 75185042 71802819 68756152 65862682 63459926 61491620 59612033 58203138 57202565
5630 57202565 56433547 56147914 55920260 55317168 53876847 52203733 50478810 48503575 46651837
5621 46651837 45211757 43798532 42465857 41391432 40365971 39457741 38688744 38068044 37321231
5612 37321231 36688116 36141221 35592708 34997424 34595512 34088897 33669668 33459909 33082015
5603 33082015 32753500 32509393 32299850 32276389 32289040 32412196 32467076 32526926 32399505 32027130
5593 32027130 31688781 31192495 30753088 30441721 30034994 29675918 29412591 29266277 29111447
5584 29111447 29015991 29059017 28982142 28888948 28859348 29071267 28958063 28886204 28841844 28869669 28879067
5573 28879067 28944606 28946035 28989896 29047904 29221499 29394658 29589432 29809842 29974838 30307931
5563 30307931 30619398 30845654 31276445 31679154 31929212 32205457 32595851 32964769 33484188
5554 33484188 34064276 34668814 35290652 35961664 36645052 37335911 38039487 38544521 39068522
5545 39068522 39689763 40478686 41479393 42903638 44483008 46372208 48824723 51771730
5537 51771730 54629799 57068785 58236668 57953005 57243318 56306083 55459409 54910210 54943288
5528 54943288 55628612 56890793 58589059 60335034 61550923 62017084 61957638 61718808 61767506
5519 61767506 62001381 62703535 63575899 64111873 63950672 63107150 61742349 59987025 58547754
5510 58547754 57502266 56848857 56081363 55181023 53838790 52518604 51355267 50283494 49881575
5501 49881575 49975238 50559693 51571742 52707324 53756782 54200616 53539240 52010054 49615574
5492 49615574 46944998 44201016 41660799 39392516 37186599 35361242 34056870 32840016
5484 32840016 31867267 31059873 30282725 29605742 29074153 28558993 28176987 27935309 27531986
5475 27531986 27034591 26596523 26282830 25857922 25532555 25231119 25022525 24711971 24384303
5466 24384303 24290258 24066612 23969677 23979151 23925650 23608354 23579875 23525707 23331806 23310710 23194191
5455 23194191 23326657 23462003 23445882 23594679 23834471 23959074 24045782 24160192 24233792 24367127
5445 24367127 24626786 24603679 24519588 24562803 24525023 24330745 24231107 24224321 24007860 23827723 23884549
5434 23884549 23849112 23771797 23823521 23937577 24080889 24064638 24171023 24501043 24773312 25069346
5424 25069346 25274236 25345276 25412615 25352454 25334324 25080532 24738689 24353612 23865050 23675574
5414 23675574 23317036 22847449 22694257 22565425 22262305 21918388 21868889 21694098 21585950 21635369
5404 21635369 21556958 21577764 21714251 21894923 21998383 22146792 22344547 22541543 22945540 23222795
5394 23222795 22944691 22603142 22082605 21440313 20812377 19989536 19383620 18943400 18423151
5385 18423151 18038729 17768691 17612886 17226159 17093358 17047862 16807771 16599661 16490186 16379756
5375 16379756 16377816 16469779 16523362 16495472 16600802 16702760 16528028 16487074 16344980 16199845
5365 16199845 15937190 15658966 15490807 15323680 15340567 15187927 14975546 14901904 14804043 14901924
5355 14901924 15080106 15086087 15050842 15100239 14988012 14963855 15132388 15219672 15204446 15293062 15098835
5344 15098835 14851561 14540308 14214720 14044887 13872030 13543512 13451104 13460605 13306637 13361739
5334 13361739 13228600 13156034 13236945 13267808 13182777 13161617 13114630 13000751 12967969 12725395 12664437
5323 12664437 12672306 12387662 12128298 11848584 11736241 11690720 11716441 11632043 11650102 11605928 11568065
5312 11568065 11527168 11478755 11470347 11470440 11484434 11471077 11411669 11404812 11433363 11316428 11286122 11164996
5300 11164996 11145832 11314850 11266993 11275860 11276250 11188005 11291225 11233193 11267246 11216953 11128680
5289 11128680 11120150 11173904 11210335 11305068 11304219 11065076 11086090 11119359 11131005 11333786 11150013
5278 11150013 11116822 11179153 11061669 11081769 10972181 11016105 11131778 11229921 11168970 11231454 11345946
5267 11345946 11226138 10987029 10991241 11100412 11195405 11309076 11370670 11354781 11409004 11293634
5257 11293634 11233668 11487411 11531833 11470170 11500684 11545060 11632882 11790902 11804468 11845407 11772024
5246 11772024 11771455 11728885 11721738 11850630 12001920 12057069 12005152 12062459 12266361 12474170 12668049
5235 12668049 12600855 12743132 12888455 12835511 12997869 12992252 12933107 12983434 13022336 13031419 13050117
5224 13050117 13035056 13039520 13087355 13088256 13050132 13296000 13566148 13524539 13493657 13512899 13535524
5213 13535524 13580941 13685688 13554036 13466724 13371699 13425720 13560851 13612029 13686354 13744500 13620545
5202 13620545 13596000 13683707 13648044 13718938 13930124 13967532 14098936 14513745 14709178 14883480
5192 14883480 14923283 15099677 15313919 15541284 15484016 15440308 15578039 15648939 15556912 15516345
5182 15516345 15534230 15626014 15758832 15803161 15775206 15809686 16010828 16044747 15972357 16009234 15952989
5171 15952989 15850722 15724856 15674295 15663718 15605867 15424265 15333770 15222755 15062149 14863251
5161 14863251 14818682 14746842 14627007 14779872 14798723 14848318 14923360 14918429 14851334 14889314 14907508
5150 14907508 14804275 14801084 14712850 14600001 14599892 14649543 14529676 14577635 14522811 14222669 14044715
5139 14044715 13912946 13747861 13627095 13585723 13587340 13578664 13653815 13786964 13701854 13594102 13639575
5128 13639575 13583604 13803171 13970039 13809140 13750438 13786928 13838919 13705734 13819301 13794365
5118 13794365 13756887 13876871 13906632 13862746 14001615 14170726 14393102 14483753 14535558 14655246
5108 14655246 14769557 14863766 15105282 15342655 15590184 15852543 16248851 16705119 17373175 18075392
5098 18075392 18888567 20003416 21572656 23288230 24537249 24856298 24294760 23365711 22126503
5089 22126503 21072234 20170935 19368353 18812475 18343365 17797101 17279137 16919709 16674930
5080 16674930 16436272 16221138 16042847 16006507 15866336 15781442 15780203 15731325 15735013 15796457 15738306
5069 15738306 15757791 15961280 16179828 16186371 16182184 16486535 16730072 16759460 17040112 17419549
5059 17419549 17527315 17673894 17698084 17787593 17882989 17972265 18089013 18132088 18316348 18490458
5049 18490458 18651928 18685939 18905658 19174110 19275651 19478573 19658895 19787783 19853300 19721960
5039 19721960 19557818 19326303 19109441 19140514 19120181 19067578 19202377 19216131 19357911 19531623
5029 19531623 19674406 19769356 20040600 20308624 20614699 20821790 20840656 21272340 21727449 21982049
5019 21982049 22287188 22731039 23129480 23584113 24142401 24630457 24930120 25336129 25728566
5010 25728566 26397864 26925676 27438702 28235883 28809650 29305873 29802624 30382538 31019449
5001 31019449 31576489 32200234 32875886 33543951 34428504 35416364 36387114 37185962 38106794
4992 38106794 39033403 39857967 40598364 41508793 42630276 43878775 45230664 46493365 47936411
4983 47936411 49695508 51549382 53460429 55473844 57535426 59664414 61894298 64330024
4975 64330024 66912432 69662620 72468386 75436801 78713981 81820576 84723135 87600885
4967 87600885 90630639 93713213 96987086 100464552 104433750 108467532 112736133 117170558
4959 117170558 121266075 125036964 128377375 131001914 132762713 133548038 133225504 131879969
4951 131879969 129470486 126597906 123086804 119480698 116227439 113221797 110840339 108981163
4943 108981163 107207023 105283049 103165608 100699689 97932100 94921821 91998276 89488394
4935 89488394 87273519 85464560 84126748 83123107 82366953 82005022 81822173 81910111 82186370
4926 82186370 82687331 83383630 84048268 84798898 85489839 86013124 86535227 86831365 86818210 86617151
4916 86617151 86154796 85550920 84953073 84404078 84008061 83631115 83238484 82931484 82912092 82925084
4906 82925084 83154858 83474563 84021489 84693100 85566465 86616593 87757633 89109110 90123290
4897 90123290 91207019 92092124 92750901 93251706 93368349 93297701 93227206 93227844 93155673 93493400
4887 93493400 93815998 94149491 94587842 94898295 95512179 96084367 96856131 97647482 98569024
4878 98569024 99785070 101215755 102921178 104859070 107026837 109461257 111949552 114516152
4870 114516152 117171543 119953024 122779612 125540842 128883629 132517952 136713835 141961856
4862 141961856 148328305 156479498 166586145 179279886 195435004 215641294 241017615
4855 241017615 263706314 274850609 273866287 264953464 250977237 236243951 225986648
4848 225986648 220118837 216720614 214343366 213441750 213740058 214640047 215459858 215783980 215249944
4839 215249944 213545181 210584075 206089927 200214756 193133747 185093581 176497162 167463584
4831 167463584 158351580 149445482 141066932 132892038 125280267 118388017 112147617 106290080
4823 106290080 100940796 96196514 91688505 87565666 83831680 80224585 77107365 74194968
4815 74194968 71584994 69267185 67126849 65158941 63287937 61598952 60069419 58589912
4807 58589912 57192048 55712401 54524531 53557296 52532625 51674008 50919105 50173116 49620910
4798 49620910 49131756 48777549 48700719 48453610 48332583 48287752 48297360 48034969 47462283 46705615
4788 46705615 45903305 45132947 44389065 43741775 43140778 42788131 42412085 42273059 41984352
4779 41984352 41590828 41339370 41094235 40782428 40430426 40058860 39621029 39331066 39040785
4770 39040785 38867167 38814248 38743689 38555166 38424681 38389860 38284228 38176723 38271815 38252442
4760 38252442 38406720 38586712 38688866 39058937 39441403 39584076 39567706 39700158 39966761 39994410
4750 39994410 39735418 39539835 39419115 39303326 39100050 38898708 38849873 38744800 38590932 38660057
4740 38660057 38874687 38991813 39142539 39033925 39142087 39254561 39441160 39599421 39783677
4731 39783677 40012722 40216859 40444942 40672031 40964593 41187818 41429323 41880451 42258182
4722 42258182 42766383 43363364 43943677 44524120 45215378 46049007 46793340 47958765 48967618
4713 48967618 49960007 51026035 52249049 53479288 54845715 56210668 57587793 59251768
4705 59251768 60734351 62521625 64642726 66868637 69033517 71255310 73340880 75086622
4697 75086622 76712894 78275014 79637609 81155589 82852930 84667827 86647385 88910292
4689 88910292 91585633 94658818 98482652 102607176 107577575 113364098 120312740 128784387
4681 128784387 138995941 151095099 164855840 179923570 194480523 205942497 211992457
4674 211992457 211950466 206190050 197050254 186980844 178443182 171796862 166599325 162661649
4666 162661649 159084056 156079550 153414568 150586854 147914609 145614049 143744059 142672232
4658 142672232 142145515 142077879 142740471 144181712 146811397 151139780 156814209 164448711 174142708
4649 174142708 185522431 198251488 210756763 220417913 224899953 223668698 217327589 207477553
4641 207477553 196193794 185268462 175608188 166505329 157874454 149590623 141898851 135030404
4633 135030404 128933492 123603674 118996515 115141262 112013975 109770871 108127193 107005436
4625 107005436 106316589 105756023 104834951 103440637 101329298 98446942 95052929 91481445
4617 91481445 88016177 84761843 81611824 78616300 75904486 73513722 71190060 69033646
4609 69033646 67221667 65544200 64118735 63089346 62150908 61439459 60834596 60314632 60037761
4600 60037761 59475937 58830839 57976358 56772789 55697704 54557493 53393366 52334859 51170540
4591 51170540 50124175 49212518 48464214 47734739 47045614 46539575 45972227 45444340 45002291
4582 45002291 44434791 44163927 43855420 43416260 43250441 43155203 42993782 42983215 43163715 43259702
4572 43259702 43194910 43162109 43300275 43575137 43752441 43817622 43801644 43853074 43857856 43759317 43551302
4561 43551302 43242493 42983327 42516254 42152360 41852506 41636877 41575152 41474875 41676453 41989315
4551 41989315 42424815 43139251 43477423 43479380 43457800 43013519 42358631 41607802 40882435 40241548
4541 40241548 39661653 39390485 39164158 38900910 38834997 39005396 39194408 39454344 39827178 40519852
4531 40519852 41500350 42539685 43538299 44836287 46495650 48640700 51230700 53787164
4523 53787164 55620805 55861943 54537535 52045078 48691856 45311768 42320635 39996852
4515 39996852 37927218 35851577 34137348 32931014 31690284 30515221 29590890 28728180
4507 28728180 28055487 27185995 26560058 26192756 25834128 25449357 25164533 24993144 24748727
4498 24748727 24364822 23986375 23725779 23636508 23463523 23142980 23013170 23099492 22880806 22760473
4488 22760473 22777436 22601884 22471546 22423803 22549536 22641375 22589782 22706909 22813436 22849313
4478 22849313 22960855 22971863 22824165 22683753 22625553 22411245 22127136 21965117 22002455 21849374
4468 21849374 21722416 21553382 21512878 21632994 21697500 21761731 21762657 21745292 21745994 21784445 21713119
4457 21713119 21500451 21319480 21306623 21244261 21122329 21177142 21179039 21209638 21352203 21380960 21486157
4446 21486157 21694410 21929161 22261105 22577444 23055408 23549364 23943021 24427918 24871774
4437 24871774 25257751 25764117 25993321 26341043 26797679 27446968 28275679 29128975 29564173
4428 29564173 29491239 29001368 28094363 27114017 26352947 25921727 25646090 25368990 25132546 24960958
4418 24960958 24812814 24677673 24394681 24269797 24325066 24406892 24517712 24667696 24824802 25228719
4408 25228719 25568912 26035979 26536807 26787777 27089421 27124556 27044778 26788545 26686020 26789124
4398 26789124 26686124 26763468 26780832 26930975 26972179 27294058 27506567 27804045 28220409 28615996
4388 28615996 28971151 29365062 29676630 30015672 30465986 30991283 31355177 31457116 31701761
4379 31701761 31955854 31888725 32035262 32298212 32493659 32905804 33483398 34134178 34909682 35774048
4369 35774048 36992313 38295910 39732339 41138285 42407450 43579873 43845439 43684958
4361 43684958 42721832 41254278 39640524 37907225 36214687 34774035 33359156 32089560
4353 32089560 30868619 29777405 29049837 28396804 27563008 26793352 26287014 25736063 25328183
4344 25328183 25098629 24758553 24373466 23968301 23782062 23637979 23333787 23095129 22907977
4335 22907977 22745663 22524716 22443112 22220132 22052591 22184592 22186719 22280017 22158977 22023775
4325 22023775 22018351 21969213 21663561 21433264 21178571 20941836 20858960 20529659 20295403 20286875
4315 20286875 20473907 20497101 20576092 20798390 20814656 20796975 20670400 20260252 19603103 19186776
4305 19186776 18847936 18434821 18121493 17856944 17637678 17400884 17150592 16996958 16749619
4296 16749619 16602833 16518212 16393246 16291590 16131092 16140761 15881854 15698077 15565908 15497371
4286 15497371 15377923 15357502 15272244 15211403 15034399 14921336 14924171 14850205 14729249 14728117 14645526
4275 14645526 14468257 14345621 14161255 14062460 14005833 14106712 14085827 13992587 13973453 14011672
4265 14011672 13846064 13756345 13687314 13609238 13617970 13740359 13614664 13657508 13597416 13311959 13186749
4254 13186749 13345126 13252896 13257419 13133995 12936621 13025676 12989384 13064078 13023248 13001822 13015036
4243 13015036 12962813 12963143 12953423 12715304 12739314 12704831 12657596 12680508 12648970 12578448 12463261
4232 12463261 12477138 12426071 12376876 12329262 12222827 12218539 12083810 11992345 12066959 11987547 12030420
4221 12030420 12201729 12046736 12067920 12280541 12143946 12009946 12040449 12004024 11863093 11987228
4211 11987228 12146447 12134568 11941455 12010236 12008624 12059941 12124949 12239850 12268450 12022309 11976593
4200 11976593 12138156 12021024 11964411 12041374 11752966 11603787 11569891 11541878 11511425 11397900
4190 11397900 11452243 11346461 11367058 11280961 11151109 11238424 11327841 11349935 11360296 11327906 11317130
4179 11317130 11443370 11627704 11750268 11810132 12048351 12170096 12317911 12286092 12338121 12336847
4169 12336847 12229819 12100123 11966212 11849216 11801954 11544083 11289872 11290181 11206464 10951188
4159 10951188 10944337 10907948 10887439 10914183 10955436 10863961 10980594 11065483 11029919 10974956 11067265
4148 11067265 11027534 11099272 11083016 11092078 10989426 10857471 10893008 10798876 10773768 10827729 10721134
4137 10721134 10598136 10497437 10513813 10613189 10658757 10692467 10621360 10486621 10265512 10200772
4127 10200772 10258440 10081275 10019979 10134052 10200256 10178922 10167029 10105930 10176881 10282067 10167025
4116 10167025 10076994 10079704 10090297 10039445 10059421 9877170 9850299 9645951 9500752 9435700 9359370
4105 9359370 9120276 9007972 9033500 8888800 8892139 8983237 8792904 8629429 8561768 8545105 8581547
4094 8581547 8644634 8583991 8605722 8569702 8578136 8657299 8615860 8608610 8616487 8607820 8676599 8638914
4082 8638914 8746804 8647658 8652249 8680962 8700334 8692285 8742973 8737084 8749575 8762618 8810745 8621796
4070 8621796 8542953 8495209 8405047 8469556 8376432 8204037 8096693 8275470 8331267 8244790 8138287
4059 8138287 8233531 8072365 7931869 7942170 7999010 8092999 8063611 8080734 8030226 7931549 7980999
4048 7980999 7992582 8000853 7881881 7994704 7908887 7829718 7784107 7693018 7704177 7747057 7738677
4037 7738677 7640906 7612164 7605334 7569727 7493318 7549681 7571036 7693155 7699020 7758936 7734261 7681994
4025 7681994 7581422 7561560 7614125 7556951 7571469 7536420 7411363 7407803 7524303 7461392 7333479
4014 7333479 7357442 7376420 7426991 7310124 7171619 7156928 7165128 7136993 7091201 7068829 7158092
4003 7158092 7265898 7322488 7291162 7065221 7081367 6974372 6816009 6876279 6802566 6791504 6797490
3992 6797490 6747826 6759706 6682214 6661656 6672836 6711332 6716390 6652011 6594673 6620649 6574309 6507170
3980 6507170 6520963 6481774 6378065 6322804 6404237 6620015 6546874 6427380 6342623 6327765 6354908
3969 6354908 6388996 6281436 6406391 6268223 6243443 6325283 6355722 6278853 6156083 6130630 6208454
3958 6208454 6342709 6270250 6213975 6192236 6145154 6246435 6197941 6133323 6187729 6211315 6283555
3947 6283555 6179116 6282909 6327340 6295318 6211822 6136151 6122619 6189816 6251636 6068291 6090449
3936 6090449 6053844 6046309 6087737 6090800 6117282 6032488 5986537 5906316 5976236 6120579 6004137
3925 6004137 5819636 5838428 6026087 6070122 6066678 5908811 6071310 6015725 5941973 5962649 5900917
3914 5900917 5953468 5963575 6049549 5994358 5925130 6073713 6059746 6016684 6074416 5934391 6129724
3903 6129724 5988311 5972600 5897741 5937053 5922772 5958969 6076832 6078175 5954815 5921850 5919367
3892 5919367 5848484 5950495 6010714 5891246 5876559 5967856 6032370 6074194 6032535 6011131 6031381
3881 6031381 5936503 5998539 6168691 6180030 6174168 6163446 6036635 6049974 5959581 5891825 5901828
3870 5901828 6125089 6211107 6258285 6177264 6120541 6243794 6162362 6096384 6064131 5997640 6046472
3859 6046472 6063014 5979703 5969746 6001818 5971629 5976222 6146467 6183567 6099144 6031025 6144363
3848 6144363 6187043 6201722 6221564 6126483 6205852 6427498 6344292 6318080 6323181 6339548 6366756
3837 6366756 6202340 6261574 6355130 6458595 6689905 6755760 6684811 6658632 6521416 6461011 6575202
3826 6575202 6579447 6609004 6766600 6810976 6745252 6744783 6579834 6690504 6859910 6853949 6855586 6782913
3814 6782913 6732889 6772769 6849730 6893001 6990917 6975698 6767114 6794698 6960720 6936391 6913902
3803 6913902 6942472 7014964 7005214 6991634 7059161 7096466 7066031 7149507 7112444 7131490 7249819
3792 7249819 7265488 7380657 7259289 7316853 7185893 7194522 7128708 7197202 7141347 7089073 7057676
3781 7057676 7089453 6942225 6856487 6962145 6926412 6928991 6956603 7127559 7073037 7070888 7163758
3770 7163758 7048166 6982923 7054006 7083238 6997865 6897666 6903322 6961429 7021104 6976665 7049442
3759 7049442 7023236 6797584 6841988 6974297 7021551 7023775 6983063 6948461 6830905 6787542 6875517
3748 6875517 6907365 6633984 6718551 6871558 6818841 6768871 6723673 6725987 6667962 6568705 6695771
3737 6695771 6644173 6568740 6596493 6567142 6628970 6713253 6737566 6720679 6684882 6555712 6731504
3726 6731504 6813300 6707713 6543296 6645969 6661188 6504614 6510887 6529198 6555356 6451220 6476267
3715 6476267 6528068 6500597 6564186 6573122 6493433 6563832 6641946 6610994 6478681 6586802 6611195
3704 6611195 6672749 6623828 6611930 6505527 6484481 6467078 6552455 6580567 6511169 6418162 6429842
3693 6429842 6588119 6579664 6585141 6429093 6438794 6343224 6257051 6390302 6387401 6436280 6455762 6513295
3681 6513295 6553187 6503884 6569872 6673913 6681419 6552321 6609971 6506461 6521977 6550936 6471043
3670 6471043 6611994 6655456 6719916 6755674 6632383 6641443 6618928 6584961 6592520 6665509 6695204
3659 6695204 6728977 6847293 6932130 6998129 7023030 6974436 7048489 6980859 6905737 7019814 7192102
3648 7192102 7165092 7129359 7074253 7171142 7127706 7144649 7318268 7153575 7307788 7288866 7176387
3637 7176387 7282035 7349878 7501990 7307567 7378748 7545677 7421903 7448133 7465390 7458057 7405315
3626 7405315 7371541 7457717 7661309 7500484 7566547 7598775 7490293 7565327 7561243 7611527 7626067
3615 7626067 7585103 7762288 7814711 7933739 7939817 8011169 8057680 8022938 8166448 8174276 8074987
3604 8074987 8173985 8344061 8417990 8381567 8328200 8343664 8429021 8474516 8526476 8676488 8758691
3593 8758691 8747884 8720520 8800117 8997921 8969928 9027304 9216157 9307698 9372072 9478566 9445595
3582 9445595 9363877 9445417 9434764 9682010 9798586 9871793 9875077 9828251 9918269 10073172 10169285
3571 10169285 10265634 10268128 10428027 10557046 10623973 10783371 10896615 11044458 11121420 11232447
3561 11232447 11480826 11614024 11597861 11731966 11804316 11961727 12210078 12391138 12484018 12644725
3551 12644725 12768591 12956821 13265399 13336649 13446786 13634334 13842531 13958809 14291650 14392285
3541 14392285 14681702 14909737 15058873 15122171 15409923 15822733 15960455 16271081 16316367 16597309
3531 16597309 16949410 17177762 17445109 17860692 18157060 18518864 18989809 19305904 19597584
3522 19597584 19937355 20213185 20511076 21026554 21526044 22172220 22642376 23217927 23886338
3513 23886338 24693794 25496278 26387629 27109682 28057644 29378212 30438242 31686079 33212992
3504 33212992 34620935 36193253 37978509 39539885 41057840 42598051 43960685 44980461
3496 44980461 45682787 46070513 46322016 46340004 46040721 45867502 45667752 45179732 44836591 44568029
3486 44568029 44251257 43712095 43337915 42910488 42465307 42033863 41589146 40908160 40173751
3477 40173751 39342157 38281223 37204078 35902288 34520927 33141149 31871363 30668233
3469 30668233 29650398 28498982 27511969 26740344 25653069 24943211 24360305 23795066 23272050
3460 23272050 22859804 22445346 22279756 22276664 22147624 22169748 22654970 23101011 23831289 24710843
3450 24710843 25078851 24658176 23877709 22927849 21780323 20686994 19903587 19378138 18931392
3441 18931392 18400698 17946281 17786369 17571616 17490694 17423648 17162169 17073552 17061087 17103038
3431 17103038 17179866 17335045 17491541 17519974 17801441 18274026 18834844 19539515 20488850 21712802
3421 21712802 23441189 25460465 27390904 28198823 27689150 26407217 24543688 22433126
3413 22433126 20874100 19757535 18947684 17973152 17128918 16487631 16113914 15661843 15367095
3404 15367095 15103706 14818364 14604590 14453774 14427771 14318243 14148902 14168589 14293754 14368425
3394 14368425 14426406 14593887 14949384 15234763 15834836 16684879 17680447 18515453 18723057 18506930
3384 18506930 17820773 16862820 15983487 15197010 14551417 13939052 13417198 12950979 12521006
3375 12521006 12236287 12044901 11844647 11540782 11374862 11239431 11036793 10779133 10744560 10700441
3365 10700441 10656958 10811505 10644489 10469710 10324333 10420071 10422381 10384826 10523368 10579549
3355 10579549 10561481 10597652 10454342 10436428 10197765 10105462 9892570 9682829 9679474 9603963 9575666
3344 9575666 9528914 9482003 9445164 9309071 9262796 9215270 9270145 9205557 9039350 9076710 9102527
3333 9102527 9090157 9098841 9186605 9173416 9254022 9311271 9315472 9444538 9681526 9808630 9858136
3322 9858136 10134776 10087000 9820388 9787203 9579219 9391863 9094179 9054345 8912382 8902472
3312 8902472 8794152 8549144 8595886 8611786 8391106 8130448 8110359 8075767 8084956 8145266 8114506
3301 8114506 8023623 7958446 7931177 7972932 7992017 8065425 8035398 8012560 7919952 7940645 7983121
3290 7983121 8007380 7945155 7829589 7672710 7709126 7721564 7647771 7472329 7363467 7450299 7270370
3279 7270370 7221660 7099387 7108840 7103590 7075805 7046848 6972533 6913645 6900203 6795211 6735197
3268 6735197 6658209 6898651 6957298 6791092 6777742 6809650 6738065 6644043 6692661 6809989 6723720
3257 6723720 6640610 6642407 6554748 6603176 6680823 6768242 6751294 6664549 6708375 6927760 6903432
3246 6903432 6760499 6743124 6691086 6761686 6758796 6712943 6877801 6970637 6901439 6990542 6955262
3235 6955262 6870263 6859286 7004551 6947297 6942515 7003667 6959342 7052007 7035632 7087432 7183607
3224 7183607 7198912 7087746 7082671 7048300 7057069 7111257 7278195 7316301 7356573 7362180 7349248 7516069
3212 7516069 7684259 7638956 7769716 7909588 7950723 8013971 8093698 8154661 8315700 8475887
3202 8475887 8633032 8752159 8831434 9007051 8967610 9061339 9182920 9394111 9792395 9767212
3192 9767212 9893205 10110815 10441590 10747949 10932111 11005441 11138640 11240522 11435812 11570770
3182 11570770 11446421 11653515 11754314 11801822 11823305 11784850 11962655 12045840 12175660 12215854
3172 12215854 12185318 12269185 12297276 12460101 12579502 12751032 12892564 13045363 13280714 13682546
3162 13682546 13903067 14320097 14770680 15042099 15310483 15728913 15770247 15747926 15781884 15506129
3152 15506129 15308294 14970986 14943861 14769730 14607763 14478618 14183565 14074216 13835212 13757598
3142 13757598 13498257 13276556 13252663 13189580 13127488 13042021 12917915 12940276 12925601 12856088 12996742
3131 12996742 13011541 13082290 12976142 12941238 13079306 12984192 12660034 12564824 12467269 12351498
3121 12351498 12158885 12061283 11936170 11793228 11643012 11321653 11251686 11280023 11150106 11187545
3111 11187545 10936030 10746433 10642412 10491158 10424666 10418999 10442637 10283311 10236401 10057350
3101 10057350 9960429 10015022 9953040 9892228 9726583 9850080 9870187 9842794 9771499 9797759 9845584
3090 9845584 9859351 10011842 10013978 10143879 10180116 10223738 10369650 10551605 10710125 10765189 10745549
3079 10745549 10607869 10343087 10224028 9944121 9687614 9334007 9223326 9134480 9035694 8674644
3069 8674644 8459359 8382932 8438176 8402293 8264765 8189988 8079668 7866931 7833999 7766414 7757987
3058 7757987 7687294 7625899 7558166 7564848 7417550 7161244 7159927 7107091 7066647 7166985 7081385
3047 7081385 7008361 6848902 6887334 6896720 6739727 6756261 6891432 6861409 6641951 6719649 6587435
3036 6587435 6544173 6665576 6552666 6376805 6372524 6421519 6624175 6475304 6377901 6279658 6224551
3025 6224551 6205691 6107888 5999204 6098071 6072670 5929475 5786504 5731631 5780542 5707591 5651488
3014 5651488 5652259 5540839 5493396 5561432 5474233 5337844 5522304 5494702 5547699 5444627 5294211
3003 5294211 5326095 5327659 5378349 5384140 5208290 5171579 5049974 4981906 5002269 5004128 4927201 4760299
2991 4760299 4878825 4967146 5087495 4878979 4712723 4682598 4696074 4644458 4467752 4340519
2981 4340519 4473256 4509258 4526534 4470398 4318088 4279700 4247413 4139270 4190678 4191161 4134475
2970 4134475 4041795 4192386 4334747 4238169 4191162 4089297 4007917 3985657 3960473 3962812 4016408
2959 4016408 3991316 3851401 3809932 3829043 3847414 3907249 3683981 3654093 3667128 3640602 3588507
2948 3588507 3502143 3389086 3517807 3588626 3396923 3359657 3441441 3286127 3349451 3327502 3357550
2937 3357550 3262315 3338344 3222532 3318904 3445814 3437614 3392089 3351444 3310766 3112190 3208197
2926 3208197 3091416 3066416 3179226 3077755 3078670 3086450 3146465 3234451 3156542 3206756 3016842
2915 3016842 2967891 2837186 2825438 2817162 2709905 2746331 2797469 2682655 2645585 2678435 2546745
2904 2546745 2416472 2505891 2645793 2759997 2784047 2613036 2672809 2663443 2413793 2540407
2894 2540407 2536253 2437744 2400613 2272397 2239081 2411711 2480748 2449910 2611489 2662353 2562192
2883 2562192 2501568 2432575 2465168 2551318 2470425 2352050 2235140 2202349 2231077 2234205 2063104
2872 2063104 2066015 2165368 2152107 2175178 2115301 2188001 2112786 2179952 2088981 1949029 1999811
2861 1999811 2193246 2036292 1941778 2043077 2124014 2141385 1825472 1826832 1802553 1743816 1643311
2850 1643311 1570400 1662397 1690343 1762624 1709335 1825001 1878529 1994459 1941960 1743451 1723078
2839 1723078 1734810 1649136 1569286 1676274 1775473 1723660 1658567 1588243 1706149 1699618 1563730
2828 1563730 1537879 1519233 1558072 1680487 1734012 1640285 1515960 1669568 1729488 1616929 1620904
2817 1620904 1482604 1451753 1630659 1413172 1380946 1583752 1517638 1507326 1400358 1330844
2807 1330844 1372681 1466557 1531856 1461293 1419370 1481229 1455273 1396747 1457101 1466103 1365133
2796 1365133 1409084 1347441 1320074 1303817 1310388 1290452 1186146 1105139 1322256 1299902 1337508
2785 1337508 1268175 1203241 1254739 1163661 1213677 1222624 1127995 1193956 1186102 1062720 1086332 1080004
2773 1080004 1115713 1269771 1255419 1089383 1183731 1113372 1016561 1057290 1053032 992315 1006392
2762 1006392 1049296 1032351 1140407 1074350 991948 950178 1090147 1109325 1134896 1100295 1161325
2751 1161325 1159497 1110911 1022012 977898 1003600 964481 922375 1011563 889390 1052848 1067804
2740 1067804 1022255 1040502 1116964 1095145 968272 854618 860643 770558 832891 1002422 921428
2729 921428 912910 955539 993652 1005492 930624 968125 1018868 950244 904447 863709 934037 790135
2717 790135 832350 909241 966323 1032372 942700 874330 932924 935367 771488 605620 612844 682995
2705 682995 862872 806186 884600 891004 919947 797066 760982 802066 835565 785582 844909
2694 844909 788144 685614 715913 781732 896695 888705 814148 753205 881562 917244 800362
2683 800362 821337 799911 777687 754598 869922 737382 703983 702897 798090 783230 828054
2672 828054 724002 706550 826714 817637 713939 640248 588724 585921 743418 740095 599027
2661 599027 663447 630487 703377 715098 680125 722862 703757 730790 743463 812580 736461 626792
2649 626792 630466 745369 686713 668180 695249 810010 854596 910318 781936 721938 739477
2638 739477 794076 805041 788062 730296 721620 841650 896119 1053695 961358 876829 991121
2627 991121 884105 854837 886000 808952 826400 778145 675263 728764 630295 623387 681800
2616 681800 787399 678793 619469 532804 431692 634435 658208 593991 529722 536204 613735
2605 613735 538792 559993 530180 610730 716268 741815 636991 501939 590482 532171 467672
2594 467672 601459 521240 653126 516256 496948 494672 510284 496509 341971 347054 429677
2583 429677 450299 438644 420157 415695 607784 688427 559813 400590 441555 498164 541786
2572 541786 535407 508549 371001 384922 380599 330145 373921 328383 306658 439368 424332 490144
2560 490144 449051 502088 595740 547826 446900 388590 504167 516528 416090 434638 543313
2549 543313 453868 553664 642673 630242 590140 331376 401057 540057 424111 325205 478692
2538 478692 503616 496229 508299 492982 464688 358786 390412 426826 555808 390234 382184
2527 382184 420581 440679 420593 567598 580656 462226 437549 399150 430004 451651 363374
2516 363374 411759 562886 413194 377066 469842 439441 403801 385620 497944 506824 430410
2505 430410 548655 558178 523881 353601 391645 542577 733977 763275 631329 481297 702042
2494 702042 583335 530141 531964 513066 646117 678845 431359 327432 406043 347256 415255
2483 415255 503024 362689 375280 528484 484688 549202 479629 517994 477568 490761 543175
2472 543175 462003 439471 489323 547331 500582 492583 534256 580688 588231 604260 558810 398574
2460 398574 407996 494461 443977 529499 552323 545137 587820 672478 627255 559162 539364 605499
2448 605499 599588 534914 535525 512663 601246 543138 643163 630084 605855 643474 542722 471125
2436 471125 631268 538849 719934 774491 709314 773188 744703 742535 795152 782146 845540
2425 845540 898475 811766 881566 937982 999543 994142 1059056 1134971 1313848 1438034 1462088
2414 1462088 1452482 1486518 1629721 1638978 1758194 1807111 1940643 1924271 1931144 1985132 2051527
2403 2051527 2156903 2238737 2356987 2457747 2653152 2823235 2802513 3042597 3318173 3389634
2393 3389634 3460268 3552654 3734076 3934185 4017404 4068985 4438547 4743157 4909035 5225509
2383 5225509 5509171 5884756 6352866 6815996 7433087 8081439 8866903 9449973 10095458 10731484
2373 10731484 11270642 11808279 12680974 13748901 15292587 17203821 19749549 23012866 27696410
2364 27696410 33054336 40105377 48413012 54439569 56252172 54816850 49110683 40174542
2356 40174542 33513164 28848951 25228941 22394518 19560069 16996755 15060249 13454315
2348 13454315 12155738 11124543 10364682 9651324 8897449 8286108 7617788 6995154 6449955
2339 6449955 6167804 5651894 5262113 5114682 4749505 4507944 4182496 3836008 3682015 3504286
2329 3504286 3278899 3179272 3109229 3112622 2965175 2856432 2741940 2613527 2464088 2338768
2319 2338768 2241719 2188802 2159939 2141289 2059259 1974457 1970501 1974496 1800349 1746298 1733538 1612624
2307 1612624 1514831 1439776 1396444 1439879 1469527 1485445 1373571 1328144 1333834 1231900 1191572
2296 1191572 1305530 1210549 1168907 1143103 1118639 1023483 921999 794045 914628 1019304
2286 1019304 969676 909511 902045 1023224 911311 799789 788228 846470 774322 847688 890653
2275 890653 786158 806922 773081 681864 791373 815862 761136 699171 734661 925058 925256
2264 925256 775245 757457 832711 780037 662468 587168 593341 582172 564982 438320 504316
2253 504316 540977 577290 555760 538164 698998 556185 478218 504046 558061 590558 551277
2242 551277 519160 531535 508913 503669 432972 533719 446781 425253 390800 410446 526582
2231 526582 587106 576363 508111 473953 475827 362015 327303 370423 423774 378601 253230
2220 253230 364395 358435 427221 346585 312604 262191 179990 262973 293957 340973 282091 318911
2208 318911 282280 270884 260109 98177 254946 346107 395096 364247 374243 359349 401854
2197 401854 439895 248161 202723 295167 332398 440937 425526 395724 479828 343333 358929
2186 358929 355796 260644 386093 367382 414414 466067 353862 310108 288108 393282 356415
2175 356415 329081 267152 266137 223408 209695 256310 224103 126382 159390 100793 80424 70370
2163 70370 146895 144365 207799 315067 367367 312905 223330 264947 313319 306083 329918 301033
2151 301033 355391 367533 301677 368758 267809 307086 427889 344828 304256 125863 144092
2140 144092 242302 354795 254817 144007 64956 97117 208881 278107 268844 197555 243213
2129 243213 207931 265757 157436 220607 228535 269203 213438 234595 185173 223031 215790 243465
2117 243465 249794 227492 177376 267464 167186 257015 312928 241139 326407 281400 366513 415222
2105 415222 232601 316314 242223 354106 506292 436970 192847 182185 336211 385214 480126
2094 480126 318607 414976 438566 372476 387259 499691 450880 219266 212365 214348 238566
2083 238566 253372 257770 160788 189176 300885 93964 -36353 67838 74469 56554 200572
2072 200572 166552 135351 70177 110747 246741 239962 161567 154314 165163 194078 128081 190730
2060 190730 226780 218069 177371 129459 258939 346217 132665 115072 186980 169073 201713
2049 201713 205683 232478 92628 93991 162262 118745 251535 143482 139474 249328 192380
2038 192380 190915 208066 266773 242228 188268 68816 115369 130536 190793 214921 144198 272060
2026 272060 340960 292649 229661 306253 210139 147154 169701 69163 86583 -40321 -9984
2015 -9984 66710 75173 121658 58546 -151275 -105310 -89258 -138546 -36373 169464 244491 134801
2003 134801 125697 170512 144414 77124 236121 197345 82870 -31862 38172 49204 133313
1992 133313 92747 126876 37149 -35002 108645 210583 176833 136260 14393 85376 139109
1981 139109 64706 41051 115270 190905 112607 121431 -30621 69142 16019 -38125 4141 -48733
1969 -48733 58207 57680 62 -69734 99794 276895 190045 144652 199466 214342 138981 39200
1957 39200 -67213 4957 94834 200158 167526 115883 15845 36120 16305 124336 110102
1946 110102 -20 -2838 -87595 7036 61432 26587 154424 141308 -8499 -17350 5496
1935 5496 127716 199476 200307 118964 -58264 28560 106888 106497 126971 35348 72609 104193
1923 104193 102108 126909 34721 62904 36568 -9144 -55313 -73743 -37909 66732 71477 -1785
1911 -1785 143871 204792 112462 -66802 -83824 22845 -22016 24935 116875 202854 163230
1900 163230 33994 182885 121597 4449 -6664 -705 17473 -34161 8445 26419 82384
1889 82384 -18494 -229989 -184785 -68981 -33919 37027 25159 -157494 89328 140690 -3458
1878 -3458 35417 8278 38729 30227 -62323 504 64787 4560 91802 63091 48094 109876
1866 109876 147037 147507 58088 40156 13713 -4440 -116247 -10978 53892 -40272 -10500 63912
1854 63912 54681 -138698 -171559 -75409 -20990 -40952 -93954 -149191 -29848 53838 52824 -14098
1842 -14098 43901 135692 74236 71455 143229 317405 190950 17227 75843 30047 59210
1831 59210 97290 -138430 -241564 -136421 -45065 -3377 -10139 18481 75499 82995 3376 -2346
1819 -2346 12084 77287 57027 19305 83051 135029 3457 -88444 -99322 19864 -79724 -131739
1807 -131739 -104950 -51701 47820 -27699 -4323 -16088 16631 -8312 1306 69172 112912 151175
1795 151175 -14413 -146152 10927 53506 24867 2843 -53133 -46038 54691 -7261 -82904
1784 -82904 12598 146590 35247 -67883 -86848 -23248 -54881 23074 41160 -58710 15792
1773 15792 71523 40524 3357 44243 145361 251217 118480 165623 169819 71642 102477
1762 102477 112152 103645 156845 99082 63923 58993 65362 44623 -18691 -121010 -116523 15492
1750 15492 123001 66706 -31260 -178214 -2068 82982 -77390 -12492 -7591 19843 10462
1739 10462 70830 174735 35504 4055 69115 126981 302590 225942 95029 76162 109005
1728 109005 21925 -121540 -135874 -118321 -51361 -11224 -122494 -135180 60715 54512 -9598
1717 -9598 38989 158263 14013 -73805 35198 8132 -100604 -68974 -83882 -102894 -242975
1706 -242975 -76732 76124 -3217 56023 11399 25012 31670 29078 52972 27119 -27163 111118
1694 111118 3386 -45989 -36286 8598 33662 116484 90196 95114 -33001 -46725 -58153 -7781
1682 -7781 -28552 -50025 -82699 7179 11799 -49122 -116284 18027 -21415 -116552 -142895 -63774
1670 -63774 15889 30435 -2555 -164247 -176101 -183646 -33713 -82699 -118049 -92910 -19522 -10839
1658 -10839 -112719 -91537 -45895 -64235 -123347 3804 59615 -70309 -64346 -78386 -18215
1647 -18215 -79560 -86340 -50090 -116486 -57892 -21949 -165734 -150596 -159911 -113974 -43049 105834
1635 105834 81729 33084 -34569 -85918 -106822 -140563 -12443 18479 -35981 -9253 93931
1624 93931 -18779 -76940 -53477 -132137 -151486 -1593 -44140 -135232 -65704 -73442 -849 -31657
1612 -31657 -109898 -130202 60346 84913 -17223 -120453 -102370 -221660 -150501 -56998 -28975
1601 -28975 -82533 30450 84419 58745 59758 -45182 -97208 -36748 -16190 -115739 -160783 -31950
1589 -31950 -63565 -90591 -47073 45995 31869 -52795 14282 81498 34023 -105352 -191498 -137353
1577 -137353 25640 71098 64433 108085 57195 192275 218821 87283 44448 85530 127475
1566 127475 154576 48786 -68286 -124673 -35996 103224 62247 48525 -98684 -106113 -12481
1555 -12481 21756 -81129 41277 128627 97084 86481 82044 4630 7988 39620 55118 -119918
1543 -119918 -113298 -93713 33851 64756 52844 150892 134655 50375 145657 369 31068
1532 31068 -6472 -32092 -46192 -68815 -70450 -45509 73968 86575 -2797 29449 11628 3039
1520 3039 59964 34619 74029 -78074 -75838 29346 -10824 -73529 -138086 96576 90340 10942
1508 10942 69829 68264 24350 -58812 -65642 -103738 9075 -51813 -102137 -165930 -118479 4921
1496 4921 44890 -34370 -121223 -20654 -14433 -11227 78286 106370 596 -172931 -7103 -39322
1484 -39322 -112839 -108722 -68042 -69243 78580 89677 3390 128666 -103602 -201192 -252618 -124785
1472 -124785 -5981 -71765 -30571 -134123 -157006 -151277 -151175 -93837 -4825 -49939 15046 163974
1460 163974 88833 28721 -150684 -153210 -175747 -128572 -20595 -60413 -75771 -170682 -270879
1449 -270879 -165970 -122095 -32376 -56005 -64821 -32399 -67507 -67313 -111059 -11436 131654 127136
1437 127136 -54058 -51541 9581 -8795 12408 3946 -59024 -5154 -32967 -71804 -193779 -34829
1425 -34829 65312 -66821 -113729 -90973 -97141 -25477 12942 11236 89594 144209 -73662 6015
1413 6015 59441 29624 -33514 30418 149507 23640 -69336 -74755 -111881 -146100 -59537 18455
1401 18455 -2650 -18470 -89928 -118930 -152885 -210275 -144769 -63289 -52234 -119063 -56704 -112508
1389 -112508 -81330 -40277 20630 -2626 -52778 -126285 -140221 -73732 47700 3015 -12763
1378 -12763 -83748 -163270 -131214 -221970 -162745 -280244 -199906 -133442 -56953 50884 44526 156322
1366 156322 112962 -71130 -90619 -15906 -32512 -46168 -73217 -126417 -101581 -120082 -108969
1355 -108969 -21217 -37265 -84669 -1217 8363 41407 -52158 -165837 -45545 -56220 -116546
1344 -116546 17083 5137 3893 -27768 -6203 -124250 -106628 -113779 -196 64363 -24387
1333 -24387 70623 89318 194199 48796 -72538 -92305 -57644 9833 74907 -157170 -114865
1322 -114865 -33700 -134917 -320151 -206077 -100709 -89837 -110267 -26314 -98415 -12965 15798
1311 15798 2563 -15392 -103922 -229072 -250731 -142763 -231979 -112504 -82060 -182035 -149839
1300 -149839 -21403 -30359 -58367 3676 -1782 27412 -56812 57418 53081 -75776 -88520 27899
1288 27899 -32410 -86903 -147304 -163083 -92358 -42069 23229 -107995 -23958 37220 42736 -10718
1276 -10718 -27093 102220 59073 71682 14735 -106201 -76467 -129802 -99036 -96918 -178198 -113171
1264 -113171 -154967 -115939 -114582 -185549 -178769 -97289 134353 9638 -72112 -56148 -9919 -126683
1252 -126683 -141307 -65121 29629 -75251 -87536 -88702 19261 133542 121736 -85190 -154174
1241 -154174 -88154 -62689 -191306 -119097 -63479 -229022 -143258 -2871 -37077 -127505 -154125
1230 -154125 -123302 3357 -47339 -35230 -114819 -217661 -131508 -92325 -34008 96560 -29595
1219 -29595 -34722 49313 -28160 -45726 -104970 -189349 -180726 -126612 11432 29156 -58701 -11638
1207 -11638 45048 -44070 -80619 -45739 27276 -1805 147895 32597 -33281 -27816 -36972 -90788
1195 -90788 -142232 -16415 -73309 -151764 -73899 6361 16409 935 4866 31560 -43177 -26351
1183 -26351 24366 8055 50520 77897 -69056 -73867 -151910 -156827 -39542 80524 9764 -49511
1171 -49511 -66110 -55412 -40179 -10821 -40268 -129677 -111881 63883 70717 -33256 -70426 -117189
1159 -117189 -171765 37413 72735 -124402 -97762 13625 -15791 -139882 4267 15303 36117
1148 36117 -8790 -179644 -80542 30710 151381 121513 78295 8846 -104500 -127543 -52977
1137 -52977 19634 157291 4540 -33172 3043 10515 -84092 47324 -30410 -80508 42173
1126 42173 -111455 -159141 -145285 -61228 -93751 -110893 -88879 -4977 -53921 -33095 -101666 -28655
1114 -28655 -100547 -47891 -101736 -129546 23647 65656 41094 73081 105923 103134 68109 138776
1102 138776 -126637 -101584 -173447 -222466 43907 144938 83168 38519 -14430 -111631 39096
1091 39096 92689 -4934 -12333 65554 48665 -19759 -20330 53667 35859 -43218 -51672 -46303 -20522
1078 -20522 -38026 -114432 -26974 -49642 -128849 -19384 115947 25656 -111269 -170647 -91480
1067 -91480 -188960 -116143 27321 121154 166584 53678 105896 216566 225145 48740 28350
1056 28350 -62982 67765 -46931 -136908 -12472 46893 19262 119768 216936 22686 -118442
1045 -118442 -103335 -221288 -165370 -15645 -37282 -86045 -151841 -49834 -111138 -100780 -224799
1034 -224799 -134753 -67878 -132194 7237 38128 87653 98453 53828 90631 -4028 -50041
1023 -50041 -138748 -157546 -142363 -37155 72250 -20566 -23775 -15593 55229 -54022 -147288 -227329
1011 -227329 -264336 -104171 92362 79177 15192 -112110 -117693 11286 27388 109713 86740
1000 86740 36995 -70682 -42631 -146067 -116849 -95520 102951 63454 -15345 -67081 -86264
989 -86264 -134312 -70381 -52146 -24349 70613 -6717 6119 -37688 -20217 124737 69005 76629
977 76629 158818 87312 20865 -89634 -134132 -351 57909 -18072 -29947 98964 91168 43185
965 43185 101603 82504 37402 -22561 -50897 -194446 -75461 -84681 10793 -36355 -160278 -196565
953 -196565 -100567 35159 115538 -79978 -43230 57271 -134405 -95823 -59025 -44690 -60058
942 -60058 -9417 -51200 -97348 -9922 107369 109668 19404 -36873 32516 -23401 82243 34746
930 34746 -67211 3138 -70295 -113708 -108358 96190 56096 -12559 -9105 -89717 -25079 -36380
918 -36380 84965 78192 -82131 -145754 -65978 -28938 16236 -410 -158599 -76367 -93522 -43961
906 -43961 -5002 -65731 -101722 -54582 -29387 -61360 58846 48573 42039 -50708 -87854 -28678
894 -28678 -105813 -85846 -50867 -48441 -151255 -170587 -157217 -169493 -200040 -106415 -165773 -208161
882 -208161 -56495 -96114 69789 110604 -83449 4620 -561 -2890 88191 179074 39637
871 39637 -12887 95046 107119 100077 93973 -18072 -85061 -102725 -25861 22549 -36652 -21633
859 -21633 74385 114578 109624 -17892 -110511 -85018 48277 -19910 -48108 -34055 -42913 -1852
847 -1852 -12841 22832 -44246 -39863 -148580 -86621 -90826 -60954 -117922 -185484 -39689 -73769
835 -73769 -156722 -21479 -17507 9100 618 8525 -92891 32410 -21809 -16431 -109733 -73034
823 -73034 49565 -50908 -128758 -102068 95950 45071 76577 -108622 -149284 -107379 -79814
812 -79814 -117448 -10517 23468 -106483 -21685 44528 -37617 -47749 -162851 -15999 110239
801 110239 68364 41302 -62341 -184893 -130100 16707 48994 52333 -21022 -84473 -148213
790 -148213 -65878 143512 14527 -106818 -39976 112322 156319 51258 57380 89624 77793
779 77793 -77443 -150232 -114615 -39525 -3534 2479 112970 172151 15124 13910 70921 87125
767 87125 -57703 -71881 -52931 65887 41806 19089 46855 31333 -3784 60207 150676 83944
755 83944 -2873 -31072 9806 -36383 -6455 107071 59743 43608 40760 31073 7986 86781
743 86781 124006 -87768 -107624 -132282 -131510 -151621 -133086 -101763 -49817 -55623 -48180 16472 -57179
730 -57179 7227 107282 -24712 -90131 -55744 52146 376 -38522 55976 60483 82495 -38643
718 -38643 -96499 -19229 22075 23843 -47907 -34622 108002 109633 225832 97948 15374 18338
706 18338 9817 20446 -80997 18231 44312 2493 -29430 11190 -18142 -8395 -67416 -60087
694 -60087 -90112 33429 15891 -28000 -35770 -45281 37044 87308 120046 70491 165266 47756
682 47756 37307 -13466 -35648 47269 44003 -5023 34971 43410 -495 107373 -10010 39769
670 39769 68137 -48604 -14404 55213 114368 29526 -53548 175768 198157 88245 -32286
659 -32286 -21852 -45938 -46100 22351 20860 -41256 -1625 25639 6783 -87346 54184 120771
647 120771 37563 7243 -48504 -34002 -88932 -102885 23120 34137 -42219 89324 -69535
636 -69535 -153087 -110456 -45025 -67954 -7390 -21229 -75004 -66886 20365 361 25683 109250
624 109250 95654 68468 -13311 -11952 -25042 7624 60278 -138902 -195025 -254693 -204058 -76651
612 -76651 -147735 -123588 -110799 -37661 90182 126018 1799 19386 42035 -42240 -60132 23286
600 23286 182663 149675 80778 77662 66568 90838 57360 -101712 -51200 22124 84201 -45151
588 -45151 -8165 -69249 -74251 19870 19846 -19356 5765 -134565 -88074 64759 51301 74450
576 74450 90647 20931 -114591 31939 -27493 72749 104989 -19140 82663 111242 76812
565 76812 242276 166542 199843 157580 -6271 -142544 -77317 -8036 -63263 -64459 -14245 7394
553 7394 625 -91200 -198875 -143638 -66118 -53949 -3221 23491 -16021 -49695 -36316 -31884
541 -31884 -88465 -130893 -61196 44002 46561 144375 230732 130831 71873 2785 -43702 -64183
529 -64183 -98269 -98146 -40935 28117 95078 107046 122710 65884 125980 98837 -25230 26814
517 26814 -12329 -3405 -32554 -93392 -70587 -61465 -59411 -19041 95126 119200 228117 211468
505 211468 88420 -873 40512 102502 44353 -59428 -23077 -94856 -132509 18760 49317
494 49317 89893 -38830 82554 118119 20074 8672 56306 -45204 -85098 -114446 -212474
483 -212474 -16215 41638 3788 85231 57251 83338 149052 52255 22792 73628 39558 15522
471 15522 32809 94809 214447 96807 153659 181491 51514 5785 -108481 78802 100105
460 100105 -5086 -41968 76793 125620 64771 35153 44072 86196 68991 70475 120391 -38169
448 -38169 -43642 -64307 -20934 -38899 -9484 95611 59340 6107 54797 114920 67582 -38947
436 -38947 -18546 -137283 -105423 -9694 -41780 -8809 97407 46036 47576 41857 -6719 85508
424 85508 -92076 -21252 84213 52210 -2850 -12094 92792 69730 60232 25577 -36692 29007
412 29007 -84087 -47695 -46058 158995 143062 6720 -31955 59638 30118 -48004 -48002 -37897
400 -37897 140273 245593 224452 87675 96374 151694 -6990 124768 119963 74201 166193
389 166193 126229 57728 53816 77240 89550 144683 46735 161265 98190 171998 224500 48779
377 48779 54959 107281 54578 32408 -31493 -93065 114775 186991 95871 7338 72359 44352
365 44352 91139 114174 81999 120631 91301 74157 178866 61981 -34697 67480 173200
354 173200 193137 139039 153469 220303 191633 143735 79430 47583 66866 -8063 -27755 53233
342 53233 175987 -75741 -190102 -18087 98283 194885 168101 155709 44742 100825 124481
331 124481 157059 155161 123383 38069 48156 165879 164025 127061 -39819 102970 162848 193470
319 193470 105681 169584 127781 72240 140235 123487 178958 155717 88240 83309 113486 236598
307 236598 295602 254454 255966 164887 47655 -37750 2576 163116 222549 144958 94670 42797
295 42797 8014 -25011 13536 -242553 -150156 80310 116372 126295 142547 133652 165012 257352
283 257352 157585 158236 81741 -85878 -66491 36700 30621 110775 87743 69728 -32977 54386
271 54386 56570 23755 54647 -25546 -10664 68373 10892 -29310 9759 -53888 -38629 124468
259 124468 -34103 -17643 22323 -127064 -87868 -1878 -15182 37837 71571 91967 168530
248 168530 100978 48307 69167 -11866 132312 174132 67856 -17710 -26248 146199 219518
237 219518 219094 159971 161827 50331 34350 157874 119172 111421 195726 259662 208063 183925
225 183925 224594 142415 126790 138858 280654 249416 132062 58609 157992 192932 233542
214 233542 203940 71420 55878 33227 -3410 193254 255786 303931 226655 139069 25058
203 25058 192009 159234 97294 163789 131444 198646 95368 96014 119743 136560 63046 123440
191 123440 -68957 9588 183268 237904 163693 122504 92240 5255 81011 148757 207461
180 207461 123978 232552 243796 56487 111031 137132 134705 248911 148110 174588 132185
169 132185 54435 -4596 43368 49344 -41815 -36481 53390 75493 73532 151243 87236 -11161
157 -11161 16421 78031 120150 118357 84684 55114 86526 173391 102701 152172 197377 76340
145 76340 -89412 -29547 -7029 111209 37198 9509 57304 116317 120089 130694 256468 214954
133 214954 145835 96665 157167 122908 170642 145383 164186 110256 -35390 91907 41927
122 41927 159203 185587 172858 208664 102904 57223 153695 264913 138295 152359 118433
111 118433 114176 89308 60906 109474 190666 195853 188644 182601 79078 39504 27701 45333
99 45333 60430 94854 44029 69734 164875 103383 19068 45556 41550 -1559 80415 24417
87 24417 2818 8730 124726 158516 102850 160050 124543 3914 -22904 31413 55790 32023
75 32023 24093 111072 47407 85114 60871 96468 141199 205500 288191 230008 188454 105606
63 105606 105175 140585 177011 160857 244959 191450 127251 123869 61204 44753 -20539 23334 98610
50 98610 128713 171932 155837 125187 82506 117711 201401 164285 76509 70787 174685 187829
38 187829 144588 75203 108906 149384 166328 146138 143998 151763 175056 135007 117847 161368
26 161368 136788 126436 103910 191129 169515 184878 150511 217208 123082 84295 52830 -5615
14 -5615 83232 181535 189912 100078 126854 126323 107518 30340 92912 73435 113643 135655 68438
1 68438 30305
0 30305
$$ Imaginary data points
##PAGE= N=2
##DATA TABLE= (X++(I..I)), XYDATA
16383 -1713691 -1704614 -1562647 -1575538 -1510477 -1468743 -1556782 -1454986 -1395607 -1437330 -1362893 -1296338
16372 -1296338 -1358164 -1353807 -1268872 -1204213 -1088881 -1090587 -1041662 -1009344 -933035 -875939 -757090
16361 -757090 -701103 -719731 -780401 -689716 -683930 -674726 -575512 -563554 -593223 -599949 -564440 -460843
16349 -460843 -320674 -261076 -281514 -250838 -262437 -160871 -153239 -94219 -63664 -3304 77442
16338 77442 66785 63978 79001 134138 188709 236802 214579 345192 459111 499076 383049
16327 383049 492593 472989 446237 431645 541983 612044 664986 750058 764329 703414 795608
16316 795608 838131 753902 754000 788832 837432 992245 1023188 1114698 1075295 1086022 1152855 1288894
16304 1288894 1337796 1240582 1387676 1326839 1405966 1552308 1539083 1461005 1470176 1591373 1613076
16293 1613076 1545830 1607048 1705404 1658809 1726886 1842279 1737526 1784264 1859542 1934181 1898359
16282 1898359 1873666 1989362 2037296 1985383 2053100 2107738 2049124 1977998 2106714 2201634 2248168
16271 2248168 2307819 2359771 2397339 2430118 2372120 2324150 2342903 2341189 2492551 2577267 2507687
16260 2507687 2530732 2573607 2582067 2628517 2686186 2629005 2692276 2656593 2719141 2633554 2714847
16249 2714847 2750626 2801352 2947725 2887070 2963022 3008856 3003679 3100125 3010961 2988312 3155783
16238 3155783 3155295 3049556 2990743 3014895 3080460 3147984 3191277 3386663 3316944 3353972 3327500
16227 3327500 3389899 3354026 3351890 3347368 3173073 3311885 3474002 3455876 3466013 3494841 3644632
16216 3644632 3660776 3691696 3674127 3629231 3594120 3516940 3352830 3468224 3642674 3718602 3794943
16205 3794943 3749029 3785502 3817568 3820612 3880533 3920647 3873785 3863413 3861863 3763952 3796884 3865331
16193 3865331 3905864 3892887 3925396 3923390 3988288 4058365 4022631 4009369 3982018 3893434 3918934
16182 3918934 4032252 4116148 3999454 3821517 4043666 4060550 4048362 4019319 3959274 4126623
16172 4126623 4156573 4193635 4219236 4137205 4060844 4052906 4158861 4183610 4205942 4179733 4248639
16161 4248639 4382854 4473516 4428849 4469478 4366360 4360697 4432020 4389031 4344573 4330780 4323754
16150 4323754 4357077 4356083 4396565 4426872 4381245 4325681 4394922 4371513 4357810 4325581 4281383 4286781
16138 4286781 4259616 4342424 4530750 4522317 4476596 4387929 4496947 4689268 4588876 4482937
16128 4482937 4468133 4494332 4400342 4404958 4408088 4470970 4334956 4388920 4461589 4530660 4698700
16117 4698700 4714050 4643142 4483744 4441556 4555788 4518212 4517526 4508352 4498224 4537977 4549114
16106 4549114 4577878 4627030 4499024 4520816 4512585 4552519 4593877 4633310 4616166 4550593 4501339
16095 4501339 4533750 4468909 4434198 4471810 4569396 4712312 4716096 4720295 4724391 4808726 4704982
16084 4704982 4709568 4659353 4577705 4511580 4610639 4687071 4542103 4577899 4687202 4629972 4646321
16073 4646321 4585264 4657273 4560342 4529398 4517438 4521221 4670916 4773070 4692983 4715384 4723306
16062 4723306 4651316 4612090 4617991 4671282 4632958 4645819 4659541 4697633 4638187 4592214 4620861
16051 4620861 4585510 4698596 4748619 4724980 4781690 4877898 4795888 4629333 4675255 4730986 4663787
16040 4663787 4695317 4743175 4829054 4686102 4647060 4682767 4678563 4642971 4687797 4844081 4736739
16029 4736739 4805603 4659589 4583738 4632657 4701113 4659344 4766543 4863712 4740479 4723292 4727504
16018 4727504 4768547 4742744 4708595 4722198 4632528 4666961 4727823 4759432 4843992 4700611 4652616
16007 4652616 4614740 4532691 4643137 4634499 4699947 4661528 4741999 4710171 4695877 4757667 4703263
15996 4703263 4816122 4870919 4854798 4789925 4694945 4724026 4713445 4591100 4678580 4708091 4802300
15985 4802300 4848926 4916914 4777784 4546805 4708506 4780590 4798216 4740299 4709922 4649316 4747196
15974 4747196 4811261 4791564 4812283 4788536 4687367 4687220 4736993 4862433 4864117 4845472 4815838
15963 4815838 4792883 4796738 4823258 4674697 4762392 4845785 4764373 4811506 4754252 4772464 4771769 4769888
15951 4769888 4641325 4674756 4922796 4878698 4890363 4907471 4840917 4924307 4947656 4877653 4830061
$$ [...]
##END NTUPLES=NMR SPECTRUM
##END=
