##TITLE=1H_DE-80H_X3
 200.13MHz, d2o
 8 sc
 
 19ns.26.2.2025
##JCAMPDX= 6.0         $$ Bruker NMR JCAMP-DX V2.0
##DATA TYPE= NMR SPECTRUM
##DATA CLASS= NTUPLES
##ORIGIN= UXNMR, Bruker Analytische Messtechnik GmbH
##OWNER= pz
$$ XWIN-NMR		Version 3.5
$$ Tue Sep 16 10:51:16 2025 Russian Standard Time (UT+4h)  Yarkov@DPX200
##.OBSERVE FREQUENCY= 200.1313
##.OBSERVE NUCLEUS= ^1H
##.ACQUISITION MODE= SIMULTANEOUS
##.ACQUISITION SCHEME= undefined
##.AVERAGES= 8
##.DIGITISER RES= 18
##SPECTROMETER/DATA SYSTEM= spect
##.PULSE SEQUENCE= zg30
##.SOLVENT NAME= CDCl3
##.SHIFT REFERENCE= (INTERNAL, CDCl3, 0, 15.4847)
##AUDIT TRAIL= $$ (NUMBER, WHEN, WHO, WHERE, WHAT)
$$ ##TITLE= Audit trail, XWIN-NMR		Version 3.5
$$ ##JCAMPDX= 5.01
$$ ##ORIGIN= Bruker BioSpin GmbH
$$ ##OWNER= Yarkov
$$ C:/Bruker/XWIN-NMR/data/yarkov2/nmr/H-C/1/pdata/1/auditp.txt
$$ ##AUDIT TRAIL=  $$ (NUMBER, WHEN, WHO, WHERE, WHAT)
(   1,<2025-09-16 10:50:13.09 +0400>,<Yarkov>,<DPX200>,
      <created by zg, POWCHK disabled, PULCHK disabled
       configuration hash MD5:
       00 E9 B6 7A A2 85 ED C7 34 08 36 98 17 FE 4E 26
       data hash MD5: 16K
       EE 2F 24 5F B1 B1 E8 4F 6E 9C 2B 87 E8 49 95 B4>)
(   2,<2025-09-16 10:50:32.78 +0400>,<Yarkov>,<DPX200>,
      <Start of raw data processing
       efp BC_mod = 2 LB = 0.25 FT_mod = 6 PKNL = 1 PHC0 = -1351.727 PHC1 = 4.790921 SI = 16K 
       data hash MD5: 16K
       33 7E F9 C6 48 18 41 65 D4 6A A3 95 FE 0D 87 2A>)
(   3,<2025-09-16 10:50:37.12 +0400>,<Yarkov>,<DPX200>,
      <abs ABSG = 5 
       data hash MD5: 16K
       22 71 1B 82 89 05 78 C7 E7 FB 9C E2 22 C5 17 3D>)
$$ ##END=
$$ 
$$ hash MD5
$$ 17 69 F8 9B 8F 65 EE 31 FE 5A 62 0C 3E E3 F6 E4
##$RELAX= 
##$RELAX= 
##$RELAX= 
##$RELAX= 
##$RELAX= 
##$RELAX= 
$$ Bruker specific parameters
$$ --------------------------
##$DU= <C:/Bruker/XWIN-NMR>
##$EXPNO= 1
##$NAME= <H-C>
##$PROCNO= 1
##$TYPE= <nmr>
##$USER= <yarkov2>
##$AMP= (0..31)
100 100 100 100 100 100 100 100 100 100 100 100 100 100 100 100 100 100 
100 100 100 100 100 100 100 100 100 100 100 100 100 100 
##$AQSEQ= 0
##$AQ_mod= 1
##$AUNM= <au_zg>
##$AUTOPOS= <>
##$BF1= 200.13
##$BF2= 200.13
##$BF3= 200.13
##$BF4= 200.13
##$BF5= 200.13
##$BF6= 200.13
##$BF7= 200.13
##$BF8= 200.13
##$BYTORDA= 1
##$CFDGTYP= 0
##$CFRGTYP= 5
##$CHEMSTR= <none>
##$CNST= (0..31)
1 1 145 1 1 1 1 1 1 1 1 1 1 1 1 1 1 1 1 1 1 1 1 1 1 1 1 1 1 1 1 1 
##$CPDPRG= <>
##$CPDPRG1= <>
##$CPDPRG2= <>
##$CPDPRG3= <>
##$CPDPRG4= <mlev>
##$CPDPRG5= <mlev>
##$CPDPRG6= <mlev>
##$CPDPRG7= <mlev>
##$CPDPRG8= <mlev>
##$CPDPRGB= <>
##$CPDPRGT= <>
##$D= (0..31)
0 0.7 0 0 0 0 0 0 0 0 0 0.03 0 0 0 0 0 0 0 0 0 0 0 0 0 0 0 0 0 0 0 0 
##$DATE= 1758005412
##$DBL= (0..7)
120 120 120 120 120 120 120 120 
##$DBP= (0..7)
150 150 150 150 150 150 150 150 
##$DBP07= 0
##$DBPNAM0= <>
##$DBPNAM1= <>
##$DBPNAM2= <>
##$DBPNAM3= <>
##$DBPNAM4= <>
##$DBPNAM5= <>
##$DBPNAM6= <>
##$DBPNAM7= <>
##$DBPOAL= (0..7)
0.5 0.5 0.5 0.5 0.5 0.5 0.5 0.5 
##$DBPOFFS= (0..7)
0 0 0 0 0 0 0 0 
##$DE= 6
$$ [...]
##$SUBNAM3= <"">
##$SUBNAM4= <"">
##$SUBNAM5= <"">
##$SUBNAM6= <"">
##$SUBNAM7= <"">
##$SUBNAM8= <"">
##$SUBNAM9= <"">
##$SW= 18.0517328524113
##$SWIBOX= (0..15)
0 0 2 0 0 0 0 0 0 0 0 0 0 0 0 0 
##$SW_h= 3612.71676300578
##$TD= 16384
##$TD0= 1
##$TE= 0
##$TE2= 300
##$TE3= 300
##$TEG= 300
##$TL= (0..7)
0 120 120 120 120 120 120 120 
##$TP= (0..7)
150 150 150 150 150 150 150 150 
##$TP07= 0
##$TPNAME0= <>
##$TPNAME1= <>
##$TPNAME2= <>
##$TPNAME3= <>
##$TPNAME4= <>
##$TPNAME5= <>
##$TPNAME6= <>
##$TPNAME7= <>
##$TPOAL= (0..7)
0.5 0.5 0.5 0.5 0.5 0.5 0.5 0.5 
##$TPOFFS= (0..7)
0 0 0 0 0 0 0 0 
##$TUNHIN= 0
##$TUNHOUT= 0
##$TUNXOUT= 0
##$USERA1= <user>
##$USERA2= <user>
##$USERA3= <user>
##$USERA4= <user>
##$USERA5= <user>
##$V9= 5
##$VALIST= <valist>
##$VCLIST= <CCCCCCCCCCCCCCC>
##$VD= 0
##$VDLIST= <DDDDDDDDDDDDDDD>
##$VPLIST= <PPPPPPPPPPPPPPP>
##$VTLIST= <TTTTTTTTTTTTTTT>
##$WBST= 1024
##$WBSW= 4
##$XGAIN= (0..3)
0 0 0 0 
##$XL= 0
##$YL= 0
##$YMAX_a= 44897
##$YMIN_a= -38716
##$ZGOPTNS= <>
##$ZL1= 120
##$ZL2= 120
##$ZL3= 120
##$ZL4= 120
##$ABSF1= 15.52983
##$ABSF2= -2.522019
##$ABSG= 5
##$ABSL= 3
##$ALPHA= 0
##$AQORDER= 0
##$ASSFAC= 0
##$ASSFACI= 0
##$ASSFACX= 0
##$ASSWID= 0
##$AUNMP= <proc_1d>
##$AZFE= 0.1
##$AZFW= 0.1
##$BCFW= 0
##$BC_mod= 2
##$BYTORDP= 0
##$COROFFS= 0
##$CY= -3
##$DATMOD= 1
##$DC= 0
##$DFILT= <>
##$DTYPP= 0
##$F1P= 0
##$F2P= 0
##$FCOR= 1
##$FTSIZE= 16384
##$FT_mod= 6
##$GAMMA= 0
##$GB= 0
##$INTBC= 1
##$INTSCL= 3.241238e-09
##$ISEN= 128
##$LB= 0.25
##$LEV0= 0
##$LPBIN= 0
##$MAXI= 10000
##$MC2= 0
##$MEAN= 0
##$ME_mod= 0
##$MI= 1.114404
##$NCOEF= 0
##$NC_proc= -9
##$NLEV= 6
##$NOISF1= 3.799351
##$NOISF2= 2.8
##$NSP= 0
##$NTH_PI= 0
##$NZP= 0
##$OFFSET= 15.48466
##$PC= 1
##$PHC0= -1351.727
##$PHC1= 4.790921
##$PH_mod= 1
##$PKNL= yes
##$PPARMOD= 0
##$PSCAL= 0
##$PSIGN= 0
##$REVERSE= no
##$SF= 200.130007412618
##$SI= 16384
##$SIGF1= 3
##$SIGF2= 2
##$SINO= 0.751879
##$SIOLD= 32768
##$SREGLST= <19F.Aceton>
##$SSB= 0
##$STSI= 16384
##$STSR= 0
##$SW_p= 3612.71676300578
##$SYMM= 0
##$S_DEV= 0
##$TDeff= 16384
##$TDoff= 0
##$TI= <>
##$TILT= no
##$TM1= 0
##$TM2= 0
##$TOPLEV= 0
##$USERP1= <user>
##$USERP2= <user>
##$USERP3= <user>
##$USERP4= <user>
##$USERP5= <user>
##$WDW= 1
##$XDIM= 16384
##$YMAX_p= 328020293
##$YMIN_p= -1856611
$$ End of Bruker specific parameters
$$ ---------------------------------
##NTUPLES= NMR SPECTRUM
##VAR_NAME=  FREQUENCY,     SPECTRUM/REAL,   SPECTRUM/IMAG
##SYMBOL=    X,             R,               I
##VAR_TYPE=  INDEPENDENT,   DEPENDENT,       DEPENDENT
##VAR_FORM=  AFFN,          ASDF,            ASDF
##VAR_DIM=   16384,         16384,           16384
##UNITS=     HZ,            ARBITRARY UNITS, ARBITRARY UNITS
##FACTOR=    0.220516191357247, 1,           1
##FIRST=     3098.94515032531, 0,            0
##LAST=      -513.771612680468, 0,           0
##MIN=       -513.771612680468, -1856611,    0
##MAX=       3098.94515032531, 328020293,    0
$$ Real data points
##PAGE= N=1
##DATA TABLE= (X++(R..R)), XYDATA
$$ [...]
7639f7161k24042J69296P7597m0017M8001o0073o4637J11539Q9515K07159r7785
$$ -67161 -291203 -121907 -44310 -84327 -36326 -96399 -161036 -49497 40018 247177 149392
7628A49392Q093N2595j17831j0996J56531j71181l98683p8670j39207M29908K06277
$$ 149392 157485 210080 92249 81253 237784 66603 -332080 -410750 -549957 -120049 86228
7617H6228l9426q597o7578p5672j26730l6493o3822N7256P8591L26962p15j59581
$$ 86228 46802 38205 -29373 -105045 -231775 -268268 -332090 -274834 -196243 130719 130004 -29577
7605b9577j28287k72901K10957K40063j10476k43102K27161J7068P7927k34731
$$ -29577 -157864 -430765 -219808 20255 -90221 -333323 -106162 -89094 -11167 -245898
7595b45898K3981K81751j54615P2691o547j06153k82282N6934L40394j98812K19542
$$ -245898 -221917 59834 -94781 -22090 -28637 -134790 -417072 -360138 -19744 -218556 986
7584I86r0066k44905J99164J69709r0632M2091q2584j76289k8219K21090r8406
$$ 986 -89080 -333985 -134821 34888 -55744 -13653 -96237 -272526 -300745 -79655 -178061
7573a78061k26108L22873L17126Q1096k50053M8591J14296k06649J25276M9643
$$ -178061 -404169 -81296 235830 316926 66873 115464 229760 23111 148387 198030
7563A98030m9003k21491q6384j54586Q730K29370L5684l2178k54824o0349L70569
$$ 198030 149027 -72464 -158848 -313434 -304704 -75334 -39650 -71828 -326652 -387001 -16432
7552a6432J02056j19832O5270m3232j25974J85426K58312O4418j39483k2552J06352
$$ -16432 85624 -34208 31062 -12170 -138144 47282 305594 370012 230529 207977 314329
7541C14329J97674k28736j71388O1914j98979J32826J50974k16507J62178m3917
$$ 314329 512003 283267 111879 173793 -25186 107640 258614 42107 204285 160368
7531A60368J16621P8651p5960k46640k21700J52483k0845r119m6345l22372l4975
$$ 160368 276989 355640 279680 33040 -188660 -36177 -57022 -66141 -112486 -434858 -469833
7520d69833M70667N4823j0422k9481K21810j01097K5347K01999l69455m62342
$$ -469833 834 55657 45235 15754 237564 136467 161814 363813 -5642 -467984
7510d67984K55208J44369o3187N4467q5124J22271n7931p4052K70987J53091k36668
$$ -467984 -212776 -68407 -131594 -77127 -162251 -39980 -97911 -171963 99024 252115 15447
7499A5447j16359j78172j77089M3352r885M1617J84357m4075J38299q6742N0312
$$ 15447 -100912 -279084 -456173 -412821 -422706 -381089 -196732 -240807 -102508 -189250 -138938
7488a38938R6298o950j7935k1690k29795m5034M25419M4322k22610q0136K13449
$$ -138938 -42640 -49590 -67525 -89215 -319010 -364044 61375 105697 -116913 -197049 16400
7477A6400N3944J06028r6224R4329p344J49569j01307l10592k47379j65429l734
$$ 16400 70344 176372 80148 174477 167133 316702 215395 -95197 -342576 -508005 -511739
7466e11739M10258O5058q8619q1445K47060k69850m8816N2503J78211J24431p4438
$$ -511739 -101481 -36423 -125042 -206487 40573 -229277 -278093 -225590 -47379 77052 2614
7455B614j34730j6855n9598K6689p5147k8420K48497L8241k26508l2160N2640
$$ 2614 -132116 -148971 -208569 -181880 -257027 -285447 -36950 1291 -225217 -257377 -204737
7444b04737J34510j97512k71666J44073j76926J92686K37545l4346L96426L9409
$$ -204737 -70227 -267739 -539405 -395332 -572258 -379572 -142027 -176373 220053 259462
7434B59462l73820p706J62022J22077q9058j07870k29647J14848J39748j35805
$$ 259462 -114358 -122064 39958 162035 72977 -34893 -264540 -149692 -9944 -145749
7424a45749l6845J34753p5933J53785k46214M2793P300K35073R3650R9942n1868
$$ -145749 -182594 -47841 -123774 30011 -216203 -173410 -166110 68963 162613 262555 210687
7413B10687j01528l98520o1173K95710K796k17408l7731N09127j07175j90184
$$ 210687 109159 -289361 -350534 -54824 -52028 -269436 -307167 201960 94785 -95399
7403i5399k04871Q6816L88215j02667k85463p6626L6808k0765p078M41175q3652
$$ -95399 -300270 -213454 174761 72094 -213369 -289995 -253187 -273952 -281030 160145 76493
7392G6493k63642M51090J29231k54507k8327k20010k77155K77705K50477j53441
$$ 76493 -187149 263941 393172 138665 110338 -109672 -386827 -109122 141355 -12086
7382a2086q0515o0780j56442j4119J08955K15747P108j88937N5608n654l1404
$$ -12086 -92601 -153381 -309823 -323942 -214987 760 7868 -181069 -125461 -131115 -162519
7371a62519R6337n5634J62031j34801j17191k0337K56016J81909k26643j8321
$$ -162519 -66182 -121816 40215 -94586 -211777 -232114 23902 205811 -20832 -39153
7361c9153K36558j43974r4942J42205N3459j57481J8787j21445j450P0623K89345
$$ -39153 197405 53431 -41511 100694 154153 -3328 15459 -105986 -107436 -36813 252532
7350B52532j06196l83159P9380N9598J98312O5380j1776n7378k89124k7865Q8497
$$ 252532 146336 -236823 -157443 -97845 100467 165847 154071 96693 -192431 -220296 -131799
7339a31799n526r1399L2714K08263j13832o7873K5708p0855n9422O2952J41324
$$ -131799 -137325 -228724 -196010 12253 -101579 -169452 -143744 -214599 -274021 -211069 -69745
7328f9745K00512k20425j16954J20138n839r4690J98707k4266P6502q8227j36230
$$ -69745 130767 -89658 -206612 -86474 -92313 -187003 11704 -12562 63940 -24287 -160517
7317a60517m8665R3849P6798m0185j00638j2261K68850p786j22741N335J46502
$$ -160517 -209182 -115333 -38535 -78720 -179358 -191619 77231 69445 -53296 -47961 98541
7306I8541K01536o0458N3353q9076j89085j32447J40596o3772p6174J68953j00645
$$ 98541 300077 239619 292972 203896 14811 -117636 22960 -40812 -116986 51967 -48678
7295d8678k00340j6030J62809J35071j54949J1189J14299j14054L4953j23177
$$ -48678 -249018 -265048 -102239 32832 -122117 -110928 3371 -110683 -75730 -198907
7285a98907j62681R4314J85803o4003j22733k09783J75293K07982j27110j26674
$$ -198907 -361588 -267274 -81471 -145474 -268207 -477990 -302697 -94715 -221825 -348499
7275c48499J46482J51843J3817j06220L10628N6946k04222j12830m8227k19921
$$ -348499 -202017 -50174 -36357 -142577 168051 224997 20775 -92055 -140282 -360203
7265c60203L59787J16092L0538J83190l65087M9508K53637J62246k02215M0764
$$ -360203 -416 115676 146214 329404 -35683 13825 267462 429708 227493 268257
7255B68257p7330q3317J8381j74082K41389J00526k15354J28672k01962J83205
$$ 268257 190927 107610 125991 -48091 193298 293824 78470 207142 5180 188385
7245A88385L9824R9184O1798p5622k31159j08469K86200K16274k62034j54859
$$ 188385 228209 327393 389191 313569 82410 -26059 260141 476415 214381 59522
7235E9522Q6958O0911M9088l41978p1943n2840J22990p0853J90136N7554l18804
$$ 59522 146480 207391 256479 -85499 -157442 -210282 -87292 -158145 31991 89545 -229259
7224b29259J10217K85086k02772p3441K02853J42224l3833r5876p3458j43740
$$ -229259 -119042 166044 -36728 -110169 92684 234908 201075 105199 31741 -111999
7214a11999M16624j51567j40804K21335O2990l32172j51113K09255O8809K75910
$$ -111999 304625 153058 12254 233589 296579 -35593 -186706 22549 91358 367268
7204C67268k28172j0523J070n6323O1065j37910L23441k78328k2446L00265n1261
$$ 367268 139096 128573 129643 73320 134385 -3525 319916 41588 19142 319407 268146
7193B68146l549L0979O885j41551K09456K4397k95600J62904J07522m8077m6209
$$ 268146 264597 295576 302461 160910 370366 394763 99163 262067 369589 321512 275303
7182B75303K816P3741P2575k4791j23840q8414J44905O3593k4679K10541J48747
$$ 275303 278119 351860 424435 399644 275804 187390 332295 395888 371209 581750 730497
7171G30497R634p6017q1420J46K7987J23353K68211k83276K5987j84648J95321
$$ 730497 740131 664114 582694 582840 610827 734180 1002391 719115 745102 560454 755775
7160G55775J27686M7288O2366l13088k52613Q6138K9062n0774J20524l8227j1546
$$ 755775 883461 930749 993115 680027 427414 513552 542614 491840 612364 574137 562591
7149E62591k24563J39621J36690j59334j02478j5426J91574K64825L20994p3395
$$ 562591 338028 477649 614339 455005 352527 337101 528675 793500 1114494 1041099
7139A041099n18527O8407j51857j4873r0388J52354O6775j50346J4622j16979
$$ 1041099 522572 590979 439122 424249 333861 486215 552990 402644 417266 300287
7129C00287K1461k18064O8406K6810K43333M50763K39835k44053j60853j6149
$$ 300287 321748 103684 172090 198900 442233 892996 1132831 888778 727925 711776
7119G11776M1606O3724j06398J32737J14276O7442j8475O9103p8810P2960M32682
$$ 711776 753382 817106 710708 843445 957721 1025163 1006688 1075791 996981 1069941 1502623
7108A502623M5006J41704q4965n2804n4656M4148R7125j17161J77818k47963k89309
$$ 1502623 1547629 1689333 1604368 1551564 1496908 1541056 1638181 1521020 1698838 1450875 1161566
7097A161566k27264k3698J40225r1103j38297k08831N7883J60367k8327l47676
$$ 1161566 934302 910604 1050829 959726 821429 612598 670481 830848 802521 454845
7087D54845J38239R0893N3717K03578k23467m90690r9189K41735L9076O5280L8097
$$ 454845 593084 683977 737694 941272 717805 227115 127926 369661 408737 474017 512114
7076E12114j91349r070O1773m6420j46891K02555j87403J40546L76669j17854
$$ 512114 320765 311695 373468 327048 180157 382712 195309 335855 712524 594670
7066E94670k7807j1561j25797k56893K9384J80279j49328N9566K37495N6611N2786
$$ 594670 566863 555302 429505 172612 201996 382275 232947 292513 530008 586619 639405
7055F39405o04460K19584J77627p834n1228p0287N4803J18890k4000J51333P0465
$$ 639405 34945 254529 432156 424322 373094 302807 357610 476500 452500 603833 674298
7044F74298l71037k10927R5297J52044K06922J93947O949q0264J7235L18282K17357
$$ 674298 303261 92334 187631 339675 546597 740544 747493 667229 684464 1002746 1220103
7033A220103K5359P6099k48404p8585K11846j51316k95090J14402j15384l65319
$$ 1220103 1245462 1321561 1073157 994572 1206418 1055102 760012 874414 759030 393711
7023C93711K37554J39960m14874K409K22191k2005J41195j07572k54048R5442
$$ 393711 631265 771225 356351 358760 580951 558946 700141 592569 338521 433963
7013D33963O7324q45l5297j55266j52852J46349J45019N7083k2260k07689M7978
$$ 433963 501287 500442 465145 309879 157027 303376 448395 505478 483218 275529 323507
7002C23507j88330p0186J65533M9818j82918O8301k16636P8573J17131k11348
$$ 323507 135177 64991 230524 280342 97424 165725 -50911 27662 144793 -66555
6992f6555J69741q0600k0912o0729J07551J69461L5482j29769n2820Q6861J60637
$$ -66555 103186 22586 1674 -59055 48496 217957 253439 123670 70850 157711 318348
6981C18348j8872l47005k07221J95916L36650j73525j22178M11764p390J6113
$$ 318348 299476 -47529 -254750 -58834 277816 104291 -17887 393877 386487 402600
6971D02600o7187O3053m3568r3563j11351K71p3089J24204R7343m3936j73692
$$ 402600 335413 398466 354898 261335 149984 150255 77166 201370 298713 254777 81085
6960H1085L9671O8149j87881N3942J11401N1678l62844K72193o8375Q9465j62311
$$ 81085 120756 188905 1024 54966 166367 218045 -144799 127394 59019 148484 -13827
6949a3827J60389O6965j4227p9487J2279M1733j55329L13787K09831m3639m1272
$$ -13827 146562 213527 199300 119813 132092 173825 18496 332283 542114 498475 457203
6938D57203l90371J09984o3312j20559K215k3259K63230l8812j18942o3678J33304
$$ 457203 66832 176816 113504 -7055 -4840 -28099 235131 196319 77377 13699 147003
6927A47003R4832j51675n656r8644J44939K4336r4279n8108j50227J72357O5858
$$ 147003 241835 90160 84504 -14140 130799 155135 60856 2748 -147479 24878 90736
6916I0736p4130n9059J22490R7427L6745j79452L36685J0687j23476K1834j20333
$$ 90736 16606 -42453 80037 177464 214209 34757 371442 382129 258653 280487 160154
6905A60154o6789J80546m3328J50685j53689r0826m0503j45299M59701P9597M3855
$$ 160154 93365 273911 230583 381268 227579 136753 96250 -49049 410652 490249 534104
6894E34104l02277j56119J08372K6020j46310j27466J21103j21161K4910J78729
$$ 534104 231827 75708 184080 210100 63790 -63676 57427 -63734 -38824 139905
6884A39905j80738p3623J46578o2231n7734R3515P7544k9623j07427N848Q5341
$$ 139905 -40833 -114456 32122 -30109 -87843 5672 83216 53593 -53834 -47986 37355
6873C7355J11153k78840J53988K74659k20628J00821l5305J36660k58135j41598
$$ 37355 148508 -130332 23656 298315 77687 178508 143203 279863 21728 -119870
6863a19870Q605l6860j14601L07536k02153j10524O0240J9732L78065q4335L6236
$$ -119870 -111265 -148125 -262726 44810 -157343 -267867 -207627 -187895 190170 105835 142071
6852A42071P4839m9974j87412k77517K81890m663l9172k3242o7045J63348J11496
$$ 142071 216910 166936 -20476 -297993 -16103 -20766 -59938 -83180 -150225 13123 124619
6841A24619J07252j21201l7001N58l0305j7418L59922p1733o4536k2067j09299
$$ 124619 231871 110670 73669 74227 43922 26504 386426 314693 250157 228090 118791
6830A18791k03883K26211n5614l2058K7079j00743K01476l1618L5334K4994j61524
$$ 118791 -85092 141119 85505 53447 80526 -20217 181259 149641 184975 209969 48445
6819D8445j18726r3400M7484o9907J37071K00637j01135N6846R3560J9285J29023
$$ 48445 -70281 -163681 -116197 -186104 -49033 151604 50469 107315 200875 220160 349183
6808C49183N1258K221j9265k74254K17203K45927k20595L77129J51391Q2458k09102
$$ 349183 400441 402662 383397 109143 326346 572273 351678 728807 880198 962656 753554
6797G53554P0602J82143O4179k3562q6594K201m8948J60364j13283o6138O2224
$$ 753554 824156 1006299 1070478 1046916 960322 962523 913575 1073939 960656 894518 956742
6786I56742J7907L6030k01924N5535L4394L1102K8038j07350O0362k63726J02769
$$ 956742 974649 1010679 808755 864290 898684 929786 957824 850474 910836 647110 749879
6775G49879P3270R607k92899K43035j66325j33575K44190j23492j86414R8125
$$ 749879 823149 832756 539857 782892 616567 482992 727182 603690 417276 515401
6765E15401M5530K05509Q8626O7835q7987J69105l0504K8947J35347R0661J04167
$$ 515401 560931 766440 855066 922901 834914 1004019 973515 1002462 1137809 1228470 1332637
6754A332637k10949K04226J56856p2363j25173j19495O0225k683N835l1277o6944
$$ 1332637 1121688 1325914 1482770 1410407 1285234 1165739 1225964 1223281 1229116 1197839 1130895
6743A130895j52543k24095k25994j14207K60522J23323o6756r1595m7012r0183
$$ 1130895 978352 754257 528263 414056 674578 797901 731145 639550 592538 502355
6733E02355J80520k15612j18751j02967k1930J24542M5908j0475J75148o6719
$$ 502355 682875 467263 348512 245545 223615 348157 394065 383590 558738 492019
6723D92019j44726J3398j89487K4668k4905J77941O6886j52041J41217J07301
$$ 492019 347293 360691 171204 195872 170967 348908 415794 263753 404970 512271
6713E12271j63341M2084Q3440j48595j63970J98232L75232k35218j07598J97156
$$ 512271 348930 391014 474454 325859 161889 360121 735353 500135 392537 589693
6703E89693J18040L2870j21368j79387K61239R265J40281J40352k58766p5592
$$ 589693 707733 740603 619235 439848 701087 710352 850633 990985 732219 656627
6693F56627M9939N4491Q6581P0786k4144k7244j4427k2039J7746K51848K6086
$$ 656627 706566 761057 847638 918424 894280 867036 852609 830570 848316 1100164 1126250
6682A126250l34418J87712K48970j66512r4647o2867j14075K62006R5749O1756
$$ 1126250 791832 979544 1228514 1062002 967355 904488 790413 1052419 1148168 1209924
6672A209924l1959J74914k839k94985N0511j83425j6703K21746q649j22892m4001
$$ 1209924 1177965 1352879 1350040 1055055 1105566 922141 905438 1127184 1118535 995643 951642
6661I51642J98327l375k07645K29063N6577r4269k11110l8877O8489n1200L15176
$$ 951642 1149969 1146594 938949 1168012 1224589 1130320 919210 880333 948822 897622 1212798
6650A212798p4320k61656L1208J41526m5496j09112n8748Q6177J72201M5692L2309
$$ 1212798 1138478 876822 908030 1049556 1004060 894948 836200 922377 1094578 1140270 1172579
6639A172579j89086j09173J86396N1638m9600q9249j46283L03556o9381j82088
$$ 1172579 983493 874320 1060716 1112354 1062754 973505 827222 1130778 1061397 879309
6629H79309R0494K07910k75733L885Q547P7486k47509m6224K61780j37686J66116
$$ 879309 969803 1177713 901980 905865 914412 991898 744389 698165 959945 822259 988375
6618I88375J91471M4402J20742k3642K365j25637j32392K3886N955l6880k4173
$$ 988375 1179846 1224248 1344990 1321348 1323713 1198076 1065684 1089570 1095525 1058645 1034472
6607A034472N4331p575J39279J02894j35135l27013l2973Q6068k7112K30744M6282
$$ 1034472 1088803 1081228 1220507 1323401 1188266 861253 828280 914348 887236 1117980 1164262
6596A164262R9139L33537j23834J4484l95649K22948L85476J90307J53039k03930
$$ 1164262 1263401 1596938 1473104 1487588 1091939 1314887 1700363 1890670 2043709 1839779
6586A839779k64707j85232R0563K14310J2728k20924o7030n934L0329J3311J52758
$$ 1839779 1575072 1389840 1480403 1694713 1707441 1486517 1419487 1413553 1443882 1457193 1609951
6575A609951J34102k51621J87071J83006L4478J28929n567M2942j10446K00808
$$ 1609951 1744053 1492432 1679503 1862509 1896987 2025916 2020349 2063291 1952845 2153653
6565B153653N3227P2068K10674K31125M17038m58793L6494K18013p5480R1903
$$ 2153653 2206880 2278948 2489622 2720747 3137785 2678992 2715486 2933499 2858019 2949922
6555B949922j16234Q6690q9647l12143J59360j43251j52129j47201r3746j4180
$$ 2949922 2833688 2920378 2830731 2518588 2677948 2534697 2382568 2235367 2141621 2127441
6545B127441J40815O4377j2969J19544k71326L31840O3923p6k50525k9325K1306
$$ 2127441 2268256 2332633 2319664 2439208 2167882 2499722 2563645 2563569 2313044 2283719 2305025
6534B305025l24495K16233j59228j08386J82596j3955J11759l08258Q9520Q9283
$$ 2305025 1980530 2196763 2037535 1929149 2111745 2097790 2209549 1901291 1990811 2080094
6524B080094J45896k6640J53923j80822l25582l2120R6095M04572q8353L2545
$$ 2080094 2225990 2199350 2353273 2172451 1846869 1814749 1910844 2315416 2227063 2259608
6514B259608k15184J5347n4047L1062K57162l43954j03782M6549J92879K84394
$$ 2259608 2044424 2059771 2005724 2036786 2293948 1949994 1846212 1892761 2085640 2370034
6504B370034p1855k74405R2544j4036R8014q9902K3852j29932m4800J79133J42255
$$ 2370034 2298179 2023774 2116318 2102282 2200296 2110394 2134246 2004314 1959514 2138647 2280902
6493B280902j6601j70546J41626L20015q1442k08255N616k2892K07821K1821K00443
$$ 2280902 2264301 2093755 2235381 2555396 2473954 2265699 2271315 2248423 2456244 2478065 2678508
6482B678508Q7226k49282N0217k12916j60047J37810j0394q6214k404J66562j28833
$$ 2678508 2765734 2516452 2566669 2353753 2193706 2331516 2321122 2234908 2232504 2399066 2270233
6471B270233j90257K86973M09479q0430k5452K15325Q886k01621k67182J12357
$$ 2270233 2079976 2366949 2776428 2695998 2670546 2885871 2894757 2693136 2425954 2538311
6461B538311M39423J26416p6030l93522K01770K75441k5765P7331k9933R5555
$$ 2538311 2977734 3104150 3028120 2634598 2836368 3111809 3086044 3163375 3133442 3228997
6451C228997N2977j81100R4906r9973P4975Q3861M2139k87083J85443L08605j24133
$$ 3228997 3281974 3100874 3195780 3095807 3170782 3254643 3296782 3009699 3195142 3503747 3379614
6440C379614j34781j4234K2726K29861k42540J55004K61990j372J58710o7202
$$ 3379614 3244833 3230599 3253325 3483186 3240646 3395650 3657640 3656268 3814978 3747776
6430C747776j7575L75734j62292j58929J25166p366k9441K85475N0000J9478P234
$$ 3747776 3730201 4105935 3943643 3784714 3909880 3902514 3873073 4158548 4208548 4228026 4235260
6419D235260K00989J86370j04365J30415N7239L26811L00346o012q6469J60110
$$ 4235260 4436249 4622619 4518254 4648669 4705908 5032719 5333065 5327053 5240584 5400694
6409E400694J23358J07472J19333r8084L9932O09659L58548Q7469J72492K14917
$$ 5400694 5524052 5631524 5750857 5652773 5692705 6302364 6660912 6748381 6920873 7135790
6399G135790R6108L37719K74484J10278J42234N58845M93895K76935K61227M90864
$$ 7135790 7231898 7569617 7844101 7954379 8096613 8655458 9149353 9426288 9687515 10178379
6389A0178379K04109L30185N46328M93562N31041M17446P98217P80041O73140
$$ 10178379 10382488 10712673 11259001 11752563 12283604 12701050 13499267 14279308 14952448
6380A4952448R19352N08983P85594J330901J465001J244672J376667J651499J593535
$$ 14952448 15871800 16380783 17166377 18497278 19962279 21206951 22583618 24235117 25828652
6371B5828652J245527J053355N20396N09700Q59677J529937J169152J238652J906589
$$ 25828652 27074179 28127534 28647930 29157630 30017307 31547244 32716396 33955048 35861637
6362C5861637J722709J396505J137447J049412Q69859R02473J347768J494622
$$ 35861637 37584346 38980851 40118298 41167710 42037569 42940042 44287810 45782432
6354D5782432J710963J554801J436974J269445R11816P43677R99717J511190K442713
$$ 45782432 47493395 49048196 50485170 51754615 52666431 53410108 54409825 55921015 58363728
6345E8363728K848358L596971M476460M930074N332734N613721N183833L380811
$$ 58363728 61212086 64809057 69285517 74215591 79548325 85162046 90345879 93726690
6337I3726690R83046j655342l808073l751133l189120j716968r89019n43046K66636
$$ 93726690 94709736 93054394 89246321 85495188 82306068 80589100 79600081 79057035 79323671
6328G9323671N67577J321680J971248K831181L074089L865683M611931M711727
$$ 79323671 79891248 81212928 83184176 86015357 89089446 92955129 97567060 102278787
6320A02278787L722126K001311M67381j71776j778279l464079m921681m784694
$$ 102278787 106000913 108002224 108469605 108297829 106519550 103055471 98133790 93349096
6312I3349096m266364l582744k328471k345115j592925j316885r95984n56802
$$ 93349096 89082732 85499988 83171517 80826402 79233477 77916592 76920608 76363806
6304G6363806m44142J73587O24232J629226J767743K543142L704427L913645M542935
$$ 76363806 75919664 76093251 76717483 78346709 80114452 82657594 86362021 90275666 94818601
6295I4818601N002318M550706L563178J445399K5384j212212k076061l342455
$$ 94818601 99820919 104371625 107934803 109380202 109405586 108193374 106117313 102774858
6287A02774858m147933l958181l420530k877375k364657j979309j280845l78298
$$ 102774858 98626925 94668744 91248214 88370839 86006182 84026873 82746028 82367730
6279H2367730O9795J066059J392069K218114L098263K757524K484673J116843
$$ 82367730 82437525 83503584 84895653 87113767 90212030 92969554 95454227 96571070
6271I6571070j308078l634097m958437n052635m341749l808764l176176k367795
$$ 96571070 95262992 91628895 86670458 81617823 77276074 73467310 70291134 67923339
6263F7923339k136153k176496j907182j433661j263184j191752j196838j551690
$$ 67923339 65787186 63610690 61703508 60269847 59006663 57814911 56618073 55066383
6255E5066383j643663j474880j279381j224770q19953j034142j033612j299062
$$ 55066383 53422720 51947840 50668459 49443689 48623736 47589594 46555982 45256920
6247D5256920j248563j717287j541513j505044j151032r34189q05480o01907q76863
$$ 45256920 44008357 42291070 40749557 39244513 38093481 37159292 36353812 35751905 34875042
6238C4875042j219691j451900j512745j425046j265351j591864q17864j085773
$$ 34875042 33655351 32203451 30690706 29265660 28000309 26408445 25590581 24504808
6230B4504808j073806q39107p07832n59277j077560o94950n47495p05164m93013
$$ 24504808 23431002 22591895 21884063 21324786 20247226 19552276 19004781 18299617 17806604
6221A7806604m61570j24132k28216j4542n85687j224k20206j01782m2821O9838
$$ 17806604 17345034 17220902 16992686 16978144 16392457 16391233 16171027 16069245 16026424 16096262
6211A6096262j14923k92766m39585l50588o31173m47598j94346m35234l31570
$$ 16096262 15981339 15688573 15248988 14898400 14267227 13819629 13625283 13190049 12858479
6202A2858479l40811n6643o43919m64017k32181k34830l17378k55160j17328k62533
$$ 12858479 12517668 12461025 11817106 11353089 11120908 10886078 10568700 10313540 10196212 9933679
6192I933679l55910k84697K15225m10520m21026l8021M2913o8433l15014j76575
$$ 9933679 9577769 9293072 9508297 9097777 8676751 8638730 8681643 8613210 8298196 8121621
6182H121621k5517o0917q7501L1734k0911n3350k90099k8886j20879j98849l20510
$$ 8121621 8096104 8035187 7947686 7979420 7958509 7905159 7615060 7586174 7465295 7266446 6945936
6171F945936k2497P297j12152k7671K23994R2395l06605n7570p7056j21109k56061
$$ 6945936 6923439 6930736 6818584 6790913 7014907 7107302 6800697 6743127 6666071 6544962 6288901
6160F288901K73841k67118k59922K65057m12929j00179P5363j43862k91157l2019
$$ 6288901 6562742 6295624 6035702 6300759 5887830 5787651 5863014 5719152 5427995 5395976
6150E395976k9583m9945m7640p1576o762K26337j30072l38357J82354k70418l33858
$$ 5395976 5366393 5316448 5268808 5197232 5190470 5416807 5286735 4948378 5130732 4860314 4526456
6139D526456R5819J46668j93639Q491J35640j93788k99052l64533m8631M40404
$$ 4526456 4622275 4768943 4575304 4583795 4719435 4525647 4226595 3862062 3813431 4253835
6129D253835j55422j96286l1636p4864j12353j27644O8480P276K8891L9400j79252
$$ 4253835 4098413 3902127 3870491 3795627 3683274 3555630 3624110 3631386 3660277 3699677 3520425
6118C520425k7203J08432P2738j98573j30680L7364j45162j75514l8333l08019
$$ 3520425 3493222 3601654 3674392 3475819 3345139 3382503 3237341 3061827 3023494 2715475
6108B715475O5653L00611J17267m5820k79030J85364m9448J8764K493j1415k83215
$$ 2715475 2781128 3081739 3199006 3153186 2874156 3059520 3010072 3028836 3031329 3019914 2736699
6097B736699q8867n366K8527K40482p3793M5257J24052r4625K20698k96384J29654
$$ 2736699 2647832 2642466 2670993 2911475 2837682 2882939 3006991 2912366 3133064 2836680 2966334
6086B966334j75958k19456k4411P4470L09188r6081k21386K36273J37331J01970
$$ 2966334 2790376 2570920 2546509 2620979 2930167 2834086 2612700 2848973 2986304 3088274
6076C088274j6209L1095j46398J02157M2810l96327L54680j05558q3069M5252
$$ 3088274 3072065 3103160 2956762 3058919 3101729 2705402 3060082 2954524 2871455 2916707
6066B916707O6944k07303l5164J41552l9735o1323p8003Q8349J10068j46304q4901
$$ 2916707 2983651 2776348 2741184 2882736 2843001 2781678 2703675 2792024 2902092 2755788 2670887
6055B670887o5061p1969J71269j74206J02852q7628J50266M35343K2312j34222
$$ 2670887 2605826 2533857 2705126 2530920 2633772 2546144 2696410 3131753 3154065 3019843
6045C019843j82143Q1277n2128j34160j51058J32907j74196L31333M8610k06327
$$ 3019843 2837700 2918977 2866849 2732689 2581631 2714538 2540342 2871675 2920285 2713958
6035B713958M3565J32639J92507n1632R1458m45427M2191R5729Q6011N6335K42523
$$ 2713958 2757523 2890162 3082669 3031037 3122495 2677068 2719259 2814988 2900999 2957334 3199857
6024C199857k36004J50044j27828l91520L06386K87979J36253k19960k27336j73885
$$ 3199857 2963853 3113897 2986069 2594549 2900935 3188914 3325167 3105207 2877871 2703986
6014B703986j88022j48237K12639j87124j24710J13938l6812J39756L2891j98923
$$ 2703986 2515964 2367727 2580366 2393242 2268532 2382470 2345658 2485414 2518305 2319382
6004B319382j82276L81295J89388j48890K5441p3497j96R2797K67590q4993P4760
$$ 2319382 2137106 2518401 2707789 2558899 2584340 2510843 2510647 2603444 2871034 2786041 2860801
5993B860801q8196K70042K7970q3015j3829J21833k36321o2115m407j23036n3395
$$ 2860801 2772605 3042647 3070617 2987602 2973773 3095606 2859285 2797170 2792763 2669727 2616332
5982B616332L64504K02817j78015J2688m5344J79705J19803N7871p1037j32362
$$ 2616332 2980836 3183653 3005638 3018326 2972982 3152687 3272490 3330361 3259324 3126962
5972C126962M0386k891J90050k668N6283l06342m95162M7996r0817N6545K73172
$$ 3126962 3167348 3164457 3354507 3351839 3408122 3101780 2606618 2654614 2563797 2620342 2893514
5961B893514P5828L9208j40091Q634O6506k07323n665j80102P893q1953J45263
$$ 2893514 2969342 3008550 2868459 2877093 2943599 2736276 2730611 2550509 2558402 2476449 2621712
5950B621712N6483k52186R1373j82418j49569O5490Q4356P004k05844l1444K19807
$$ 2621712 2678195 2426009 2517382 2334964 2185395 2250885 2335241 2342245 2136401 2104957 2324764
5939B324764J14966m0717L3327j81197k44327J83138M6684N1749Q5461L0411l9253
$$ 2324764 2439730 2399013 2432340 2251143 2006816 2189954 2236638 2288387 2373848 2404259 2365006
5928B365006R1550J86909m2042Q979J7619j30270j95790L3500O9234j07655Q7876
$$ 2365006 2456556 2643465 2601423 2610402 2628021 2497751 2301961 2335461 2404695 2297040 2384916
5917B384916k1286R2943J4334J40077K87166j10597q8477J19570J86558j51582
$$ 2384916 2363630 2456573 2470907 2610984 2898150 2787553 2699076 2818646 3005204 2853622
5907B853622k31638K9360L08895L43603P8208k63960l10450k2811L35533J94641
$$ 2853622 2621984 2651344 2960239 3303842 3382050 3118090 2807640 2784829 3120362 3315003
5897C315003M3088l00352j40614l5399j19858l91942K26426r8529J9830J11507
$$ 3315003 3358091 3057739 2917125 2881726 2761868 2369926 2596352 2497823 2517653 2629160
5887B629160O4228k07755o5529R8334j73352J77423J49810j98998k91472p3978
$$ 2629160 2693388 2485633 2420104 2518438 2345086 2522509 2672319 2473321 2181849 2107871
5877B107871J23042r4070N6309R7317j41457p7178R9066J77743m8650r8377o461
$$ 2107871 2230913 2136843 2193152 2290469 2149012 2071834 2170900 2348643 2299993 2201616 2195155
5866B195155L15822k23138k20252J43003K1279M1888j61630K4791R7543j53454
$$ 2195155 2510977 2287839 2067587 2210590 2231869 2273757 2112127 2136918 2234461 2081007
5856B081007M7307J31514q7355j95703O9328K1537K1925R2325l919O657l39477
$$ 2081007 2128314 2259828 2172473 1976770 2046098 2067635 2089560 2181885 2177966 2184623 1845146
5845A845146K11763J7752Q6309j15028r0207O0152k21065L52330J62494k74547
$$ 1845146 2056909 2074661 2160970 2045942 1955735 2015887 1794822 2147152 2309646 2035099
5835B035099k59773r1117J14111j3094K00418K08347j6083R4364L3989K8441q051
$$ 2035099 1775326 1684209 1798320 1785226 1985644 2193991 2177908 2272272 2306261 2334702 2326651
5824B326651q0597j21608J94783j15970q4713P5631j01856j37630o5931P1195
$$ 2326651 2246054 2124446 2319229 2203259 2118546 2194177 2092321 1954691 1888760 1959955
5814A959955K57976j02596K32723K41890k57150l16247M0069K7165K07116J3353
$$ 1959955 2217931 2115335 2348058 2589948 2332798 2016551 2056620 2083785 2290901 2304254
5804B304254j43311k6769n501n8127J00316O6915O85j82342j5474K15929K96254
$$ 2304254 2160943 2134174 2128673 2070546 2170862 2237777 2238462 2056120 2040646 2256575 2552829
5793B552829K13056k14800j16236L07769j6620k49476o9632P1342k88326j13540
$$ 2552829 2765885 2551085 2434849 2742618 2725998 2476522 2406890 2478232 2189906 2076366
5783B076366N3121J00006m0317J7701K96544L6435j74158J11175p8356j94373
$$ 2076366 2129487 2229493 2189176 2206877 2503421 2539856 2365698 2476873 2398517 2204144
5773B204144K4084M4476O7971M3448K38208J73319J72467j25819l65148j94892
$$ 2204144 2228228 2272704 2340675 2384123 2622331 2795650 2968117 2842298 2477150 2282258
5763B282258L2789J17549k4733K19169K79320j86024L4587j95481M23569J61126
$$ 2282258 2315047 2432596 2407863 2627032 2906352 2720328 2754915 2559434 2983003 3144129
5753C144129j17970K64064j30143k33418j70870j7613P0913J84017k31385l69012
$$ 3144129 3026159 3290223 3160080 2926662 2755792 2738179 2809092 2993109 2761724 2392712
5743B392712J14415L87458J69250j72788k37507L7193L13605j03233J19859j18043
$$ 2392712 2507127 2894585 3063835 2891047 2653540 2690733 3004338 2901105 3020964 2902921
5733B902921j04916K43346k429J13550o8391L3348N4270J88498j25345j88559
$$ 2902921 2798005 3041351 3038922 3152472 3084081 3117429 3171699 3360197 3234852 3046293
5723C046293J76459L2526L54501j496j95989k65489J0294L26019l59221j66687
$$ 3046293 3222752 3255278 3609779 3608283 3412294 3146805 3157099 3483118 3123897 2957210
5713B957210J38189K68303j74034M0726J34359K11629r2500k06675M34011J19118
$$ 2957210 3095399 3363702 3189668 3230394 3364753 3576382 3483882 3277207 3711218 3830336
5703C830336N2115j89220k5179K50315p9644j63492J47106R1173P1920J9574K24874
$$ 3830336 3882451 3693231 3668052 3918367 3838723 3675231 3822337 3913510 3985430 4005004 4229878
5692D229878P4847J11380K20372J15406k00143j21921K41225J21424j52466R3961
$$ 4229878 4304725 4416105 4636477 4751883 4551740 4429819 4671044 4792468 4640002 4733963
5682D733963k2900J36278J36260M4495K7042K36030J70662m753j65361J6634K29713
$$ 4733963 4711063 4847341 4983601 5028096 5055138 5291168 5461830 5457077 5291716 5308350 5538063
5671E538063m2733K92186j07816l6875K21427K94494J80508J7527J52662J03589
$$ 5538063 5495330 5787516 5679700 5642825 5864252 6158746 6339254 6356781 6509443 6613032
5661F613032K73979L66797J20041K73854K14758J92860J05583O9698M25166J94041
$$ 6613032 6887011 7253808 7373849 7647703 7862461 8055321 8160904 8230602 8655768 8849809
5651H849809L93213N67906L58648K80855K08824K88181L26518J58063L74121P73138
$$ 8849809 9243022 9810928 10169576 10450431 10659255 10947436 11273954 11432017 11806138 12579276
5641A2579276P60280L42116L65250N74632O54714O88813P64718O35466Q46949
$$ 12579276 13339556 13681672 14046922 14621554 15276268 15965081 16729799 17365265 18212214
5632A8212214R76336J098641J298046R20157J133841J333690J718085J692248
$$ 18212214 19188550 20287191 21585237 22505394 23639235 24972925 26691010 28383258
5624B8383258J623513K110560K185410K332303K287549K683261L065272L254550
$$ 28383258 30006771 32117331 34302741 36635044 38922593 41605854 44671126 47925676
5616D7925676L468894L887056M390799M488828M679445N437045N957408O239313
$$ 47925676 51394570 55281626 59672425 64161253 68840698 74277743 80235151 86474464
5608H6474464O869686P320863Q067858Q289892Q072307Q447571P809888O578969
$$ 86474464 93344150 100665013 108732871 117022763 125095070 133542641 141352529 147931498
5600A47931498N379426L909232J597994q66186l081844m707006n232782n843741
$$ 147931498 153310924 157220156 158818150 157951964 154870120 150163114 144930332 139086591
5592A39086591n843760o363271o867255p383843p464173p558559p000000o480189
$$ 139086591 133242831 126879560 120012305 112628462 105164289 97605730 90605730 84125541
5584H4125541n887755n391132m781236m250642m381123l998225l532185k907899
$$ 84125541 78237786 72846654 68065418 63814776 59433653 55435428 51903243 48995344
5576D8995344k948392k907851k236337j877741j904716k021751j699415j454546
$$ 48995344 46046952 43139101 40902764 39025023 37120307 35098556 33399141 31944595
5568C1944595j199588j460408j314372o88552p41558j061656r51832q36166r19112
$$ 31944595 30745007 29284599 27970227 27281675 26540117 25478461 24526629 23690463 22771351
5559B2771351n53818p73616p78022m42347l44354o28267p59031n57338k21849
$$ 22771351 22217533 21443917 20665895 20223548 19879194 19250927 18491896 17934558 17712709
5550A7712709k24532o35485m63029k13025m19293n11555j62695n87255j40642
$$ 17712709 17488177 16852692 16389663 16176638 15757345 15245790 15083095 14495840 14355198
5541A4355198j1982j92950k87684m53789j82205k8501k45729j93172L4683k86704
$$ 14355198 14343216 14150266 13862582 13408793 13226588 13198087 12952358 12759186 12793869 12507165
5531A2507165j74887K00616j22259J7727j02229m65808k81237Q1212j26678l80908
$$ 12507165 12332278 12532894 12410635 12428362 12326133 11860325 11579088 11660300 11533622 11152714
5521A1152714j98422j78391j08263r6221p5894j08197j65948m60199K1884o5299
$$ 11152714 10954292 10775901 10667638 10571417 10495523 10387326 10221378 9761179 9783063 9717764
5511I717764l33242k06945k26299j88932m16238j33113k02923k70750L9704l24229
$$ 9717764 9384522 9177577 8951278 8762346 8346108 8212995 8010072 7739322 7779026 7454797
5501G454797l41287n10943O4029k782J74155k08252l64528r2951m9693K51584
$$ 7454797 7113510 6602567 6666596 6663814 6837969 6629717 6265189 6172238 6122545 6374129
5491F374129l24541m13921L5351J27722O8095k21712k69335J54654M0352l73959
$$ 6374129 6049588 5635667 5671018 5798740 5866835 5645123 5375788 5530442 5570794 5196835
5481E196835j71095n4568R8052J58422k74809j49061J49728l5695j4942J02893
$$ 5196835 5025740 4971172 5069224 5227646 4952837 4803776 4953504 4917809 4902867 5005760
5471E005760j17963k37722N1314L8996r2446k14176O8603j49583m51933J61746
$$ 5005760 4887797 4650075 4701389 4740385 4647939 4433763 4502366 4352783 3900850 4062596
5461D062596K0263r7414J01805J02945Q6015k1105l55183K00428j6118K5497j8248
$$ 4062596 4082859 3985445 4087250 4190195 4276210 4255105 3899922 4100350 4084232 4109729 4091481
5450D091481l23985m0164R7185J67116j16724k34383j3075L43271j96128j48233
$$ 4091481 3767496 3727332 3824517 3991633 3874909 3640526 3627451 3970722 3774594 3626361
5440C626361m16676N1867L31608l11994j36512K02233J21723J44106K0857J9619
$$ 3626361 3209685 3261552 3593160 3281166 3144654 3346887 3468610 3612716 3633573 3653192
5430C653192j17730k35865L3188N8622K6202M8828q7959j9447n3972J28275M0587
$$ 3653192 3535462 3299597 3332785 3391407 3417609 3466437 3378478 3359031 3305059 3433334 3473921
5419C473921J79365r7791k54317q6002l18994R4910j56258J48538M7582p6574
$$ 3473921 3653286 3555495 3301178 3215176 2896182 2991092 2834834 2983372 3030954 2954380
5409B954380j12782P3548K55366n4333L0740K1104k76443K30753M39361M5912
$$ 2954380 2841598 2915146 3170512 3116179 3146919 3168023 2891580 3122333 3561694 3607606
5399C607606l07036j03847l26591J85381J80399k84073j53042m3456P0973L5676
$$ 3607606 3300570 3196723 2870132 3055513 3235912 2951839 2798797 2755341 2826314 2861990
5389B861990P9763Q0238O0406r7407k21498k37060K56042j47468J31304j46689
$$ 2861990 2941753 3021991 3082397 2984990 2763492 2526432 2782474 2635006 2766310 2619621
5379B619621l42788L75605r7377L0745j73141k7566J00604q3573j18416j51533
$$ 2619621 2276833 2652438 2555061 2585806 2412665 2385099 2485703 2402130 2283714 2132181
5369B132181L16965J50789r668k08788K92670j80418l7782p6515J69802O2243
$$ 2132181 2449146 2599935 2590267 2381479 2674149 2493731 2455949 2379434 2549236 2611479
5359B611479J63013r0592j80574J04992j14561J93279j01545J27745J55616J07857
$$ 2611479 2774492 2683900 2503326 2608318 2493757 2687036 2585491 2713236 2868852 2976709
5349B976709j32790j06498j90156N846j15128K31156j0747j77947N9987J51376
$$ 2976709 2843919 2737421 2547265 2553111 2437983 2669139 2658392 2480445 2540432 2691808
5339B691808J64356O5806l55036j67882K07514n8561J36294N8738o9723n9969
$$ 2691808 2856164 2921970 2566934 2399052 2606566 2548005 2684299 2743037 2673314 2613345
5329B613345J63013j07265o7174J83458J5024j00596o0686m8752K67892J91904
$$ 2613345 2776358 2669093 2601919 2785377 2800401 2699805 2639119 2590367 2858259 3050163
5319C050163p9109J89345l22297O9311k2240L01475k46903k01914J48965r7205
$$ 3050163 2971054 3160399 2838102 2907413 2885173 3186648 2939745 2737831 2886796 2789591
5309B789591P6178K70009l50527j0610K33566r1267K5985j02937l12018P2541
$$ 2789591 2865769 3135778 2785251 2774641 3008207 2916940 2942925 2839988 2527970 2600511
5299B600511P2799P5856K31239J55065k1417j5141n9155l32532j62588M07290
$$ 2600511 2673310 2749166 2980405 3135470 3114053 3098912 3039757 2707225 2544637 2951927
5289B951927J08813l18421j11558j3815K25678L081j8817k81155N0554j09593
$$ 2951927 3060740 2742319 2630761 2616946 2842624 2845705 2826888 2545733 2596287 2486694
5279B486694m9828k57141L49603m2587r8041m7665k83156p816K37460J08488j14719
$$ 2486694 2436866 2179725 2529328 2486741 2388700 2341035 2057879 2050063 2287523 2396011 2281292
5268B281292r1164n5221J5567m7036R89K38357j43171j31806j7884j86568J2063
$$ 2281292 2190128 2134907 2150474 2103438 2104427 2342784 2199613 2067807 2049923 1863355 1875418
5257A875418L45746K4198L2494k39758J25612K34573J40046j0405q8655J03009
$$ 1875418 2221164 2245362 2277856 2038098 2163710 2398283 2538329 2527924 2439269 2542278
5247B542278P9727j24828r319k24587K30173J38842k19504L29450p4043R3878
$$ 2542278 2622005 2497177 2487858 2263271 2493444 2632286 2412782 2742232 2668189 2762067
5237B762067j08928R2076m0709l48928J22813O4347j5609L52247M7927K22203
$$ 2762067 2653139 2745215 2704506 2355578 2478391 2542738 2527129 2879376 2927303 3149506
5227C149506n1637j09380N1789K05332o9956r3181O1129P7467j72642m405L35519
$$ 3149506 3097869 2988489 3040278 3245610 3175654 3082473 3143602 3221069 3048427 3044022 3379541
5216C379541j27669k10824j96747J54500j8152p6390p0990J33309j21296n5175
$$ 3379541 3251872 3041048 2844301 2998801 2980649 2904259 2833269 2966578 2845282 2790107
5206B790107O8924J0318K85513m5496L7659m5689O4034K2371N3604j70706J15105
$$ 2790107 2859031 2869349 3154862 3109366 3147025 3101336 3165370 3187741 3241345 3070639 3185744
5195C185744O5565k60896J96397j10749j0090M8366K31240q3620n6494K65812
$$ 3185744 3251309 2990413 3186810 3076061 3065971 3114337 3345577 3261957 3205463 3471275
5185C471275J54490j71836j35426j19897J20979K36838O3757k06454j2784O7436
$$ 3471275 3625765 3453929 3318503 3198606 3319585 3556423 3620180 3413726 3400942 3468378
5175C468378r8827n628m08169J05804J34713j91528J35923K73732J08170L4244
$$ 3468378 3369551 3363923 2955754 3061558 3196271 3004743 3140666 3414398 3522568 3556812
5165C556812j81463J01773J2649j65632J49542J22287n2629n6243k71587K74288
$$ 3556812 3375349 3477122 3489771 3324139 3473681 3595968 3543339 3487096 3215509 3489797
5155C489797R532j40831J62659J12612j11467j98634L96420P83j96798P899m971
$$ 3489797 3499329 3358498 3521157 3633769 3522302 3323668 3720088 3720871 3524073 3531972 3527001
5144C527001m2385K03824K18695j71371J43707q0111K22617J53310o9898j15250
$$ 3527001 3484616 3688440 3907135 3735764 3879471 3799360 4021977 4175287 4105389 3990139
5134C990139k92643j24203K42296Q2597K05678N5059l02583P3158J93425J70616
$$ 3990139 3697496 3573293 3815589 3898186 4103864 4158923 3856340 3929498 4122923 4293539
5124D293539K76546m61605J24009N44252L3749m35025m06996K8494L14231M4705
$$ 4293539 4570085 4108480 4232489 4776741 4810490 4375465 3968469 3996963 4311194 4355899
5114D355899j78127Q0750P9210J85894j00070N8714j6903L725j30436m2042K5546
$$ 4355899 4177772 4258522 4337732 4523626 4423556 4482270 4465367 4469092 4338656 4296614 4322160
5103D322160J12211j00725J71529p2026p5228O6338k08150j58384J35743l8979
$$ 4322160 4434371 4333646 4505175 4433149 4357921 4424259 4216109 4057725 4193468 4154489
5093D154489j15916O2557l039Q1695K1350J37953K7308J24495L1157j23182o9858
$$ 4154489 4038573 4101130 4098091 4179786 4201136 4339089 4366397 4490892 4522049 4398867 4329009
5082D329009Q9312r3589P6760p1078p9489q1553J20724M95861j06571k70343J9332
$$ 4329009 4418321 4324732 4401492 4330414 4250925 4169372 4290096 4785957 4679386 4409043 4428375
5071D428375M25110l953k23407J34296K43784J39452O8127j04077K6261r8163
$$ 4428375 4853485 4849532 4626125 4760421 5004205 5143657 5211784 5107707 5133968 5035805
5061E035805j7267R470J33660P8825J64309R1821K8298J81604k29566j11864K36030
$$ 5035805 5018538 5028008 5161668 5240493 5404802 5496623 5524921 5706525 5476959 5365095 5601125
5050E601125J34726J89716K55115k25003J4232J21263K37196Q7396k53458J99934
$$ 5601125 5735851 5925567 6180682 5955679 5969911 6091174 6328370 6415766 6162308 6362242
5040F362242M01020K64232l8680J49775j15099J82110K61414K32346J96938J14935
$$ 6362242 6763262 7027494 6988814 7138589 7023490 7205600 7467014 7699360 7896298 8011233
5030H011233L97781N40109K88291k51200L717j19119j8733L39249N5416n4523
$$ 8011233 8409014 8949123 9237414 8986214 8989931 8870812 8852079 9191328 9246744 9192221
5020I192221R6991n020L38644K74667j78209Q4161L02146r565J23830K94498J92874
$$ 9192221 9289212 9284192 9622836 9897503 9719294 9803455 10105601 10096036 10219866 10514364 10707238
5009A0707238J22720L33706R4024K1632M56123M51110k3643N3377J72817L40932
$$ 10707238 10829958 11163664 11257688 11279320 11735443 12186553 12162910 12216287 12389104 12730036
4999A2730036M14296J46467K18555J62444p2173L77295L75938K37780N26289M06741
$$ 12730036 13144332 13290799 13509354 13671798 13599625 13976920 14352858 14590638 15116927 15523668
4989A5523668L67881N51611M02198K40235Q23040L93211P69028N99513M21498
$$ 15523668 15891549 16443160 16845358 17085593 17908633 18301844 19070872 19670385 20091883
4980B0091883P63840N79690Q43932O12758K64182P82093J145210R46705P22711
$$ 20091883 20855723 21435413 22279345 22892103 23156285 23938378 25083588 26030293 26753004
4971B6753004P03991N91365J049048J082678P16049R69342J226406J234380J304302
$$ 26753004 27456995 28048360 29097408 30180086 30896135 31865477 33091883 34326263 35630565
4962C5630565J535273J401930J520058J539915J786391J781290K144383K665773
$$ 35630565 37165838 38567768 40087826 41627741 43414132 45195422 47339805 50005578
4954E0005578K308544K366943K807280L109631L455637L840538L930668M212757
$$ 50005578 52314122 54681065 57488345 60597976 64053613 67894151 71824819 76037576
4946G6037576M366716N047143N486799N443181N803802O160939O328670O733310
$$ 76037576 80404292 85451435 90938234 96381415 102185217 108346156 114674826 121408136
4938A21408136P142104P816674Q296951Q703608R692817R816311J0235363J0128953
$$ 121408136 128550240 136366914 144663865 153367473 163060290 172876601 183111964 193240917
4930A93240917J0308460J0625361J0760900J0404733R407778P308648M169361
$$ 193240917 203549377 214174738 224935638 235340371 244748149 252056797 256226158
4923B56226158P44109k337358m966000o761778p766332q203750q299006p755535
$$ 256226158 256970267 254632909 249666909 242905131 235138799 226935049 218636043 210880508
4915B10880508q129671r223577j0468239j1340599j0840870j0180204r514241
$$ 210880508 202750837 193527260 183059021 171718422 160877552 150697348 141183107
4908A41183107q287531p444220o464061o163789n606989m885021m737538l940305
$$ 141183107 132895576 125451356 118987295 112823506 107216517 102331496 97593958 93653653
4900I3653653l524897l168709k801375k428480k078621j674250j830453j423764
$$ 93653653 90128756 86960047 84158672 81730192 79651571 77977321 76146868 74723104
4892G4723104j375418j727184j076230j034355j342369j158882r47139p18397
$$ 74723104 73347686 71620502 70544272 69509917 68167548 67008666 66061527 65343130
4884F5343130n45023j253214j570146j173578j299821j484448j627552j428867
$$ 65343130 64798107 63544893 61974747 60801169 59501348 58016900 56389348 54960481
4876E4960481j584747j436217j382697j332435j078567q68952r59235j320760
$$ 54960481 53375734 51939517 50556820 49224385 48145818 47276866 46317631 44996871
4868D4996871j501221j253762j383010j489450j265015p30055r31593p21008p59975
$$ 44996871 43495650 42241888 40858878 39369428 38104413 37374358 36442765 35721757 34961782
4859C4961782o87450l98934m61122k18991j2070l59023l38161q19578j049078
$$ 34961782 34274332 33875398 33414276 33195285 33183215 32824192 32486031 31666453 30617375
4850C0617375p30103q30774l73854j081176n34550k98056o31988p69817n57837
$$ 30617375 29887272 29056498 28682644 27601468 27066918 26768862 26136874 25367057 24809220
4841B4809220n38062n89959n93101n09420n87294m29592l14119m82753l46145
$$ 24809220 24271158 23681199 23088098 22578678 21991384 21561792 21247673 20764920 20418775
4832B0418775l53133m80724l64594m07913k62709k52616l94724J4122j50211l89450
$$ 20418775 20065642 19584918 19220324 18812411 18549702 18297086 17902362 17916484 17766273 17376823
4822A7376823m37012j63852k34192o878K07328l70465o5623K1112l15820j15941
$$ 17376823 16939811 16775959 16541767 16534889 16742217 16371752 16306129 16327241 16011421 15895480
4812A5895480k08222j05880j41652L87935J94571m31977O4369j84250j78225M4357
$$ 15895480 15687258 15581378 15439726 15827661 16022232 15590255 15654624 15470374 15292149 15336506
4802A5336506k16847q8261J59024L72590j31906j42373p4216K17538J66j21459
$$ 15336506 15119659 15031398 15190422 15563012 15431106 15288733 15214517 15432055 15432221 15310762
4792A5310762K5358J52581K78503k49796K51179k46298K68420J57295K58772o3621
$$ 15310762 15336120 15488701 15767204 15517408 15768587 15522289 15790709 15948004 16206776 16143155
4782A6143155k651j76124Q1473M53320K48660K44303k4159J28045L494K42546
$$ 16143155 16140504 15964380 16045853 16499173 16747833 16992136 16967977 17096022 17099516 17342062
4772A7342062J4231M38999K10141M51826M24983N24202M2541N01989K80493M90781
$$ 17342062 17356293 17795292 18005433 18457259 18882242 19406444 19448985 19950974 20231467 20722248
4762B0722248O30581N41962M03104L98272O82539N54024N17190P42929O89055
$$ 20722248 21352829 21894791 22297895 22696167 23378706 23932730 24449920 25192849 25881904
4753B5881904N55968R05934Q94219R22382J351373R26791J047775J309759J253528
$$ 25881904 26437872 27343806 28238025 29160407 30511780 31438571 32486346 33796105 35049633
4744C5049633J607174J639434J730546K166394K145228J886721K476456K917479
$$ 35049633 36656807 38296241 40026787 42193181 44338409 46225130 48701586 51619065
4736E1619065L093754L434960M446741M533295M867656N537986N920396N848687
$$ 51619065 54712819 58147779 62594520 67127815 71995471 77533457 83453853 89302540
4728H9302540N353675N949572O542674P157728Q308357J0266051J2548070J5424573
$$ 89302540 94656215 100605787 107148461 114306189 122614546 132880597 145428667 160853240
4720A60853240J9200889K3603077K6636259K9976775L3918695L0209491L621867
$$ 160853240 180054129 203657206 230293465 260270240 294188935 324398426 328020293
4713C28020293l1912271m0277369l1249985k2677133j6444564j3123938j1095524
$$ 328020293 296108022 255830653 224580668 201903535 185458971 172335033 161239509
4706A61239509r585287q960567r293680r512757r271970q313714p019760o010009
$$ 161239509 151654222 142693655 133399975 123887218 114615248 106301534 99281774 93271765
4698I3271765n195168m448654m059979l426404l041531k855506k098166k063316
$$ 93271765 88076597 83627943 79567964 76141560 73100029 70244523 68146357 66083041
4690F6083041j468006j319479r35786o35306m76526m35012k6012J01156j67378
$$ 66083041 64615035 63295556 62359770 61724464 61247938 60812926 60786914 60888070 60720692
4681F0720692l5847K46892M17730J098464J011859J440879J532333J645371K404208
$$ 60720692 60684845 60931737 61349467 62447931 63459790 64900669 66433002 68078373 70482581
4672G0482581K002912K520369L237952L559259M037199M217347M625464N148172
$$ 70482581 72485493 75005862 78243814 81803073 85840272 90057619 94683083 99831255
4664I9831255N711612O078775N975011O550349P239449P692318R605122J1030378
$$ 99831255 105542867 111621642 117596653 124147002 131386451 139078769 148683891 159714269
4656A59714269J2902039J5786276J7864017K0904496K2835790K3591636K2342832
$$ 159714269 172616308 188402584 206266601 227171097 250006887 273598523 295941355
4649B95941355J4384232q23118j6160289k2590611k0975380j7562844j4744189
$$ 295941355 310325587 309502469 293342180 270751569 249776189 232213345 217469156
4642B17469156j3737563j3449210j2469888j1667077j0657634j0113493j0096313
$$ 217469156 203731593 190282383 177812495 166145418 155487784 145374291 135277978
4635A35277978q817247p846144p351173o900194o137239n441049m969236m908082
$$ 135277978 126460731 118614587 111263414 104363220 98225981 92784932 87815696 82907614
4627H2907614m345993m123266l131503k888407k813297k574468k342006k380739
$$ 82907614 78561621 74438355 71306852 68418445 65605148 63030680 60688674 58307935
4619E8307935k190751k084850j502004j519555j618825j768848j652528j008578
$$ 58307935 56117184 54032334 52530330 51010775 49391950 47623102 45970574 44961996
4611D4961996j198000q89784r21618p25491o73649r14142n07619n75911j146639
$$ 44961996 43763996 42874212 41952594 41227103 40553454 39639312 39131693 38555782 37409143
4602C7409143r38262q04076r22151o95842r90672r40973q76191o04046n86367
$$ 37409143 36470881 35666805 34744654 34048812 33058140 32117167 31240976 30636930 30050563
4593C0050563m70978l82244n95719n47688n23421k58311p09511m86119p43232
$$ 30050563 29579585 29197341 28601622 28053934 27530513 27272202 26562691 26076572 25333340
4584B5333340m15447l29354k77092l32831m20657j52921l57071m88158m21657
$$ 25333340 24917893 24588539 24311447 23978616 23557959 23405038 23047967 22559809 22138152
4575B2138152k64056l02036j41047k81553L2866L2656j74824j22552K9494k84921
$$ 22138152 21874096 21572060 21431013 21149460 21182326 21214982 21040158 20917606 20947100 20662179
4565B0662179j67203k75608l71500l46816l14173o5962l36607p6311J78762j10694
$$ 20662179 20494976 20219368 19847868 19501052 19186879 19120917 18784310 18707999 18886761 18776067
4555A8776067k68830k5619O3369J5098k81372Q9579o3899L35537Q4462J97040
$$ 18776067 18507237 18481618 18544987 18560085 18278713 18368292 18304393 18639930 18724392 18921432
4545A8921432L39906L16287M21886M15466L54423N81138M70460K07674j01725
$$ 18921432 19261338 19577625 19999511 20414977 20769400 21350538 21820998 22028672 21926947
4536B1926947k59635k27833o18085k10052l98445m52663k73516K16111j97336
$$ 21926947 21667312 21439479 20821394 20611342 20212897 19760234 19486718 19702829 19505493
4527A9505493j98254j9512L04370L7268o53648l21643m5561K87953P2594M39293
$$ 19505493 19307239 19287727 19592097 19629365 18975717 18654074 18608513 18896466 18969060 19408353
4517A9408353J13386L64084L78856j40044l68889l65199o05455o63962o81207
$$ 19408353 19521739 19885823 20264679 20124635 19755746 19390547 18785092 18121130 17439923
4508A7439923j91092M9645m54731n7056j67693k50341R4911k82157l97539r5853
$$ 17439923 17248831 17298476 16843745 16786689 16618996 16368655 16463566 16181409 15783870 15688017
4498A5688017l25483L0230L00881o0775k85930q3075J13705J25615M1763r5946
$$ 15688017 15362534 15392764 15693645 15632870 15346940 15263865 15377570 15503185 15544948 15449002
4488A5449002l7280K94381l2206m8231j17852J33806j2181K61096K65043L0654
$$ 15449002 15411722 15706103 15673897 15625666 15507814 15641620 15629439 15890535 16155578 16186232
4478A6186232J70717J35062j1315J97392M22953J42168K9172K64280R8359R8118
$$ 16186232 16356949 16492011 16480696 16678088 17101041 17243209 17272381 17536661 17635020 17733138
4468A7733138L2986K18026K84817J12603j51219m155K52035K89461K91792o1805
$$ 17733138 17766124 17984150 18268967 18381570 18230351 18226196 18478231 18767692 19059484 18997679
4458A8997679L09659J4925q7033O8438r7106J4523J93769J06321J38237J33877
$$ 18997679 19307338 19322263 19235230 19303668 19206562 19221085 19414854 19521175 19659412 19793289
4448A9793289R7137k72973j99063J79090L86845k3198k57505J22396k4586j34235
$$ 19793289 19890426 19617453 19418390 19597480 19984325 19961127 19703622 19826018 19801432 19667197
4438A9667197l05364j06300L65533j43575m6914K09619J92423L4796n80091k67178
$$ 19667197 19361833 19255533 19621066 19477491 19430577 19640196 19832619 19867415 19287324 19020146
4428A9020146l72748j10959j68642n4300j27432l61158r2165j88627r4610L6458
$$ 19020146 18647398 18536439 18367797 18313497 18186065 17824907 17732742 17544115 17449505 17485963
4418A7485963j77953m02125j75221l42554j11840j24912k55604k01549O7487k40474
$$ 17485963 17308010 16905885 16730664 16388110 16276270 16151358 15895754 15694205 15761692 15521218
4408A5521218k30901r0910j24335k32794m25326K8763k21135q0065k2774K5848
$$ 15521218 15290317 15199407 15075072 14842278 14416952 14445715 14224580 14144515 14121741 14147589
4398A4147589O6691k78324j11031n87099m95567j13733j37751m25281j28733l61403
$$ 14147589 14214280 13935956 13824925 13237826 12742259 12628526 12490775 12065494 11936761 11575358
4388A1575358j10707p8966k74788l87573k97851j73821J17032j34101k99066r2293
$$ 11575358 11464651 11385685 11110897 10723324 10425473 10251652 10368684 10234583 9935517 9843224
4378I843224j96551l54374j38754K0956p357J80266k37564j45268k37680J13411
$$ 9843224 9646673 9292299 9153545 9174501 9167144 9347410 9109846 8964578 8726898 8840309
4368H840309k77470l02561J35498j01432m40348R9426J18552k20264J08348r6674
$$ 8840309 8562839 8260278 8395776 8294344 7853996 7953422 8071974 7851710 7960058 7863384
4358G863384N8346l8253k23701k83799J99463L59658j21581j41576k2469l01294
$$ 7863384 7921730 7883477 7659776 7375977 7575440 7935098 7813517 7671941 7649472 7348178
4348G348178K5878K89260K0350q9162j79746K5404j62928j42922m8123K05344
$$ 7348178 7374056 7663316 7683666 7594504 7414758 7440162 7277234 7134312 7086189 7291533
4338G291533n6331j47735k00655q511k30845k7523k17650k08097J83299j45337
$$ 7291533 7235202 7087467 6886812 6878301 6647456 6619933 6402283 6194186 6377485 6232148
4328F232148n1887K03102q8996J35937k293J36697j11329j62913j08958J31545
$$ 6232148 6180261 6383363 6294367 6430304 6428011 6564708 6453379 6290466 6181508 6313053
4318F313053L28022L39863J576q4865L3885M9214J26558M43734L15254N0219O57215
$$ 6313053 6641075 6980938 6982514 6897649 6931534 6980748 7107306 7551040 7866294 7916513 8573728
4307H573728L33383O68736Q20917J113466O77759J001997O2605j226941j379857
$$ 8573728 8907111 9575847 10396764 11510230 12187989 13189986 13252591 12025650 10645793
4298A0645793j109665o61441l28420m93576n30720J9808j55690m00336l87272
$$ 10645793 9536128 8874687 8546267 8052691 7521971 7541779 7386089 6985753 6598481
4289F598481k37708k59584l44016m38638q7349j97402l10507j75639m45663J63217
$$ 6598481 6360773 6101189 5757173 5318535 5231186 5033784 4723277 4547638 4101975 4265192
4279D265192J99587k05581k34724j55282j25383j30999K86059O7268j07805j1463
$$ 4265192 4464779 4259198 4024474 3869192 3743809 3612810 3898869 3966137 3858332 3846869
4269C846869l51051P9785j62426k72972N2935J3611n8676j73748O1936O3097N318
$$ 3846869 3495818 3575603 3413177 3140205 3193140 3206751 3148075 2974327 3036263 3099360 3104678
4258C104678j43120J25278j47336k03036m0300k18954J53914L46041j2840R443
$$ 3104678 2961558 3086836 2939500 2736464 2696164 2477210 2631124 2977165 2964325 2973768
4248B973768l54764j79705J33363m4787m740K20961j01526J01471P7490n094k14476
$$ 2973768 2619004 2439299 2572662 2527875 2523135 2744096 2642570 2744041 2821531 2816437 2601961
4237B601961p5884N6422J8507k05821j23871Q4255J15236k82341k97186J76276
$$ 2601961 2526077 2582499 2601006 2395185 2271314 2355569 2470805 2188464 1891278 2067554
4227B067554P7428J68612l62146J41222Q0771N1620p5768J13142k41853p8709
$$ 2067554 2144982 2313594 1951448 2092670 2173441 2225061 2149293 2262435 2020582 1941873
4217A941873J2353L07509j67966q2018J57021Q2429j03588l31713J75542J40267
$$ 1941873 1954226 2261735 2093769 2011751 2168772 2251201 2147613 1815900 1991442 2131709
4207B131709p7918K4299r5866j94471O2017J45034P0608n5324r6848m1311j08527
$$ 2131709 2053791 2078090 1982224 1787753 1849770 1994804 2065412 2010088 1913240 1871929 1763402
4196A763402j09592M46621N1079r3566r5792L1789j43231j42831k8215j98589
$$ 1763402 1653810 2100431 2151510 2057944 1962152 1993941 1850710 1707879 1679664 1481075
4186A481075K69571J83644j91718n9563K707K6781J30784J36642P5274N0289j05029
$$ 1481075 1750646 1934290 1742572 1683009 1685716 1712497 1843281 1979923 2055197 2105486 2000457
4175B000457J29771n514k15544j57543j50535J69701M5773k02570L9237M0200
$$ 2000457 2130228 2124714 1909170 1751627 1601092 1770793 1816566 1613996 1653233 1693433
4165A693433M0457o6206Q8167q6355j3251q6719L5090K94392m14089r9377J6687
$$ 1693433 1733890 1667684 1755851 1669496 1656245 1569526 1604616 1899008 1484919 1385542 1402229
4154A402229N3645J34739L6215J11075q0425j13413L5718L6355P4482k21083k5860
$$ 1402229 1455874 1590613 1626828 1737903 1657478 1544065 1579783 1616138 1690620 1469537 1443677
4143A443677K35719k81272J5955J51467L1925j58849J6888r0348j17119J63466
$$ 1443677 1679396 1398124 1414079 1565546 1597471 1438622 1455510 1365162 1248043 1411509
4133A411509Q1657l30642J71557M5892j08521K3906J43647j54617j64187J45632
$$ 1411509 1493166 1162524 1334081 1379973 1271452 1295358 1439005 1284388 1120201 1265833
4123A265833J69228j58475q432J55729k05882j45530K23136p901R7813p0428o0875
$$ 1265833 1435061 1276586 1268154 1423883 1218001 1072471 1295607 1287706 1385519 1315091 1254216
4112A254216j31976j12132L44344k04603j25081K4989q1779m1179J90330K175
$$ 1254216 1122240 1010108 1354452 1149849 1024768 1049757 967978 926799 1117129 1119304
4102A119304O1458j96110K03304j7289Q1814J03419P7890l28405j37712l1184
$$ 1119304 1180762 984652 1187956 1170667 1252481 1355900 1433790 1105385 967673 936489
4092I36489j03661K73824R6964j08650K7791j71377p5372l1435J92364J34657
$$ 936489 832828 1106652 1203616 1094966 1122757 951380 876008 844573 1036937 1171594
4082A171594N674J43092j12870j03949K76719j23139m8256J61252l1458k45808
$$ 1171594 1177268 1320360 1207490 1103541 1380260 1257121 1208865 1370117 1338659 1092851
4072A092851J38233K02721J07278J33727o3537P010k00167q9443K01155J53808
$$ 1092851 1231084 1433805 1541083 1674810 1611273 1618283 1418116 1328673 1529828 1683636
4062A683636N7003J46J23408K39764j72815J17786j63336l5611k2464P2820J662
$$ 1683636 1740639 1740785 1864193 2103957 1931142 2048928 1885592 1849981 1827517 1900337 1901999
4051A901999O4396n9614k65352O7843J26778j15640P0374r9161P4515K73077J08042
$$ 1901999 1966395 1906781 1641429 1709272 1836050 1720410 1790784 1691623 1766138 2039215 2147257
4040B147257M0408j16359M6446k7811K09542J2483j2611j7460N0297J28721l29136
$$ 2147257 2187665 2071306 2117752 2089941 2299483 2311966 2299355 2281895 2332192 2460913 2131777
4029B131777j27021K26402P1321k64616j42656o9243K9449l26215J87562J05612
$$ 2131777 2004756 2231158 2302479 2037863 1895207 1825964 1855413 1529198 1716760 1822372
4019A822372m6997J61710j33124l14868N5125p2579L5891J62944k20954j66786
$$ 1822372 1775375 1937085 1803961 1489093 1544218 1471639 1507530 1670474 1449520 1282734
4009A282734J02849J80321j7469l0040M3123k33962J26423j18839l36918J26649
$$ 1282734 1385583 1565904 1548435 1518395 1561518 1327556 1453979 1335140 998222 1124871
3999A124871O6734j74323k77260J58405K56167q4679j35114L7981K32747l2319
$$ 1124871 1191605 1017282 740022 898427 1154594 1069915 934801 972782 1205529 1173210
3989A173210j36162m3483j02188M0459O0866L6577R619K8961l91102j31416Q5421
$$ 1173210 1037048 993565 891377 931836 992702 1029279 1038898 1067859 676757 545341 630762
3978F30762J57070k18671R7665J37938l46125J12978K82535K60848l63011k37971
$$ 630762 787832 569161 666826 804764 458639 571617 854152 1115000 751989 514018
3968E14018J78332N745l5125K3344K9958J68995k71144j37295j60496j53445L10485
$$ 514018 692350 698095 662970 686314 716272 885267 614123 476828 316332 162887 473372
3957D73372J87867J27807j78644k02579Q912M045K348L93617j5103k19988p0730
$$ 473372 661239 789046 610402 407823 416735 420780 423128 816745 801642 581654 510924
3946E10924N0529o2907J40565l87639R1318P8858K96608l81846l04086k9195O5692
$$ 510924 561453 498546 639111 251472 342790 421648 718256 336410 32324 3129 68821
3935F8821M6344M9851K24478n2408O2653p3661l2246K66552J23816j27620J90552
$$ 68821 115165 165016 389494 337086 399739 326078 293832 560384 684200 556580 747132
3924G47132l16013o9810r2949N8207O2106k43187R9601J16828p1863j35340K78363
$$ 747132 431119 361309 268360 326567 388673 145486 245087 361915 290052 154712 433075
3913D33075r1431J01984n9700K77866j46541j26304J79117l45448Q6642R7964
$$ 433075 341644 443628 383928 661794 515253 388949 568066 222618 309260 407224
3903D07224k6053J76139J06601k2854k3445l21755J3516o1130J00640K26128o1296
$$ 407224 381171 557310 663911 641057 617612 295857 309373 248243 348883 575011 513715
3892E13715j71701K112O6870p450m765O660k17776J19159Q94k67805J36911K69548
$$ 513715 342014 344126 410996 403546 398781 405441 187665 306824 307718 39913 176824 446372
3880D46372N6949j38363M9037J60795k63861m5608p4009K75844L7778j64859j82300
$$ 446372 503321 364958 413995 574790 310929 265321 191312 467156 504934 340075 157775
3869A57775J60395N1202J01037k66269K47315L51158j89044k00766r3843J45390
$$ 157775 318170 369372 470409 204140 451455 802613 613569 412803 318960 464350
3859D64350J49602j60496j66775K54926J62888k15806n7252K49209L1357n03547
$$ 464350 613952 453456 286681 541607 704495 488689 431437 680646 712003 208456
3849B08456j44204k8511K54987J04101k1112K40389j11959J47698j22686p6909
$$ 208456 64252 35741 290728 394829 373717 614106 502147 649845 527159 450250
3839D50250n1778k34736J52889J3364l6782K71132M6396l6127k20451J46222R268
$$ 450250 398472 163736 316625 329989 293207 564339 610735 574608 354157 500379 509647
3828E09647j98626J71861J981q8198J46771Q6866N1283j46195N7149r4341J01488
$$ 509647 311021 482882 484863 396665 543436 630302 681585 535390 592539 498198 599686
3817E99686m3681L8097J00996j7268j84059p0323J71615r3125J27660N6340j9916
$$ 599686 556005 594102 695098 677830 493771 423448 595063 501938 629598 685938 666022
3806F66022k18900L18057k65007Q7622J8816k24356q5210J44710K01923L19338
$$ 666022 447122 765179 500172 587794 606610 382254 297044 441754 643677 963015
3796I63015k11156l61762j8862K46714j24294k45710L41897K68903L86492l26641
$$ 963015 751859 390097 371235 617949 493655 247945 589842 858745 1245237 918596
3786I18596j34470j79343K21414p0564j21502K70991j69366k24554K45347k779
$$ 918596 784126 604783 826197 755633 634131 905122 735756 511202 756549 753770
3776G53770j69570j18828K06271j24130Q4559k95636k36316L91842K86604p4540
$$ 753770 584200 465372 671643 547513 632072 336436 100120 491962 778566 704026
3766G04026k97003J10103R3660m0628K5770o6275m739j53326J13912K71276K44901
$$ 704026 407023 517126 610786 570158 595928 529653 524914 371588 485500 756776 1001677
3755A001677L19982K08385k39329k88658K5278n1644O6974j18765l20681K27475
$$ 1001677 1321659 1530044 1290715 1002057 1027335 975691 1042665 923900 603219 830694
3745H30694k20192J60285O908j1039n4984m8603j8430J38588R0326j22481J16273
$$ 830694 610502 770787 777695 766656 711672 663069 644639 783227 873553 751072 867345
3734H67345l46801o9441J87656n1399l9861J02931P3840J96004M5094J38599k86719
$$ 867345 520544 451103 638759 587360 547499 650430 724270 920274 965368 1103967 817248
3723H17248k50511J59790J4688j25974J21117p5926K17456J29351q4446n8035
$$ 817248 566737 726527 741215 615241 736358 660432 877888 1007239 922793 864758
3713H64758j57952j83957j71945p3857J50253M9542J86024M1521M6531p6442J85156
$$ 864758 706806 522849 350904 277047 427300 476842 662866 704387 750918 674476 859632
3702H59632j56253j33656m8675q701k91158Q5248Q4068k53123J47577M9912j70490
$$ 859632 703379 569723 521048 512347 221189 306437 390505 137382 284959 334871 164381
3691A64381k9431L37914j21645k86558j15768L16417J27824O9374j12795J72113
$$ 164381 134950 472864 351219 64661 -51107 265310 393134 462508 349713 521826
3681E21826j82231j00407J44901l9959j25252L7899R9010r4246J31020N1730k49625
$$ 521826 339595 239188 384089 344130 218878 256777 355787 261541 392561 444291 194666
3670A94666r4359P0625K83681j01803J02010j19535k33144Q1703m5325o7661J0158
$$ 194666 100307 170932 454613 352810 454820 335285 102141 183844 138519 70858 81016
3659H1016L69387j36881O941q8667j89927K11963J08997Q8237k21103k84148j263
$$ 81016 450403 313522 320463 231796 41869 253832 362829 451066 229963 -54185 -55448
3648e5448J31798Q3593J61785K27769N3022k65855k20097j15178J31506J20770
$$ -55448 76350 159943 321728 549497 602519 336664 116567 1389 132895 253665
3638B53665N2526K41010l48664j96077k7795K85663m5613K45911m5250r1422j70852
$$ 253665 306191 547201 198537 2460 -25335 260328 214715 460626 415376 323954 153102
3627A53102k2873p8791J88068K4597Q3768k3690l15734k22669k37214M49397N4240
$$ 153102 130229 51438 239506 264103 347871 324181 8447 -214222 -451436 -2039 52201
3616E2201Q8443m310N6762J03375K9945P291K821m4463j97004J81094j61391o9374
$$ 52201 140644 136334 193096 296471 326416 333707 336528 292065 95061 276155 114764 45390
3604D5390O2049N1479J26721k40092O5820K01821j25171K03584r0094k60832K595
$$ 45390 107439 158918 285639 45547 111367 313188 188017 391601 301507 40675 43270
3593D3270J48935K04694J43142k82814j09892L51627Q1410K73406p5477j42492
$$ 43270 192205 396899 540041 257227 147335 498962 580372 853778 778301 635809
3583F35809l01561r548N5014M2547J44154L31751j23532j60049q7119j95490Q2761
$$ 635809 334248 324700 379714 422261 566415 898166 774634 614585 527466 331976 414737
3572D14737p4858J95223L9556r0983q490n8246m2379J2626q1493r0707O4909R5695
$$ 414737 339879 535102 574658 483675 475185 416939 374560 387186 305693 214986 279895 375590
3560C75590J71147j29056k34316M1876k00386j0142N00649l35826Q8997K43200
$$ 375590 546737 417681 183365 225241 24855 14713 515362 179536 268533 511733
3550E11733J39813P0083j82322J42904k6945k34061l5204Q2400j14064p5048K34368
$$ 511733 651546 721629 539307 682211 655266 421205 386001 468401 354337 279289 513657
3539E13657O2054j81641j95452j27532K10697K735Q5614p143k61685J66252J02482
$$ 513657 575711 394070 198618 71086 281783 284518 370132 362989 101304 267556 370038
3528C70038k67039o1223J64065L72382N6801j58240j50509L7883n5408J61371
$$ 370038 102999 41776 205841 578223 635024 476784 326275 364158 308750 470121
3518D70121L8879j20787J12103j77054J47556J20933j17339q9145K61798j97587
$$ 470121 509000 388213 500316 323262 470818 591751 474412 385267 647065 449478
3508D49478K16470K60257J50003j4955j83342K44849J31586p7217Q6141k5983
$$ 449478 665948 926205 1076208 1061253 877911 1122760 1254346 1177129 1263270 1237287
3498A237287K29446j68308l10239J15373Q7206J147O8195o2725K20624J62935
$$ 1237287 1466733 1298425 988186 1103559 1190765 1191912 1260107 1197382 1418006 1580941
3488A580941j53642p787N8733K21250j12648l4999M84269Q9058m0243j9265k01497
$$ 1580941 1427299 1419512 1478245 1699495 1586847 1551848 2036117 2125175 2084932 2065667 1864170
3477A864170J07192m8480L10124J89113L319J02920j78144J37354J36411J72208
$$ 1864170 1971362 1922882 2233006 2422119 2425438 2528358 2350214 2487568 2623979 2796187
3467B796187q236K39337O0805m82466Q9312r0501k82422n0983Q4457k16017m0125
$$ 2796187 2787951 3027288 3088093 2605627 2694939 2604438 2322016 2271033 2355490 2139473 2099348
3456B099348k97563k34017l60026K89195K38069k0962l34773m9513R7159N2617
$$ 2099348 1801785 1567768 1207742 1496937 1735006 1714044 1379271 1329758 1426917 1479534
3446A479534k53925j01224K10594p643J56879L888k48035j93052m03174j50659
$$ 1479534 1225609 1124385 1334979 1327336 1484215 1488103 1240068 1047016 643842 493183
3436D93183o0406K26984L78661k18632Q6175J41105N4223K0315j31605j63416
$$ 493183 432777 659761 1038422 819790 905965 1047070 1101293 1121608 990003 826587
3426H26587J38264M8949k36782j41255l9904j43050L43959J96491j67085k32166
$$ 826587 964851 1013800 777018 635763 595859 452809 796768 993259 826174 594008
3416E94008M269M13824m2751j86041k16911o7191J37169R3172m9528P5926o6434
$$ 594008 598277 1012101 969350 783309 566398 499207 636376 729548 680020 755946 689512
3405F89512l40355J23539l9705k8557k54794J48256J93718N8852J7521q8900k73866
$$ 689512 349157 472696 432991 404434 149640 297896 491614 550466 567987 479087 205221
3394B05221J49812R9666J25509q2443J32808J35065k09506j87206j11045J18677
$$ 205221 355033 454699 580208 497765 630573 765638 556132 368926 257881 376558
3384C76558n8753Q0601J56795J36144j03098J22203j05650R9682j51562j06779
$$ 376558 317805 398406 555201 691345 588247 710450 604800 704482 552920 446141
3374D46141m892j23748O2502j10154j07333J38777k3215R6432L963L4499l03869
$$ 446141 441249 317501 380003 269849 162516 301293 278078 374510 378473 412972 109103
3363A09103k15014L8628J21773j55297J4363K17967q7447j11847R5138N324N8271
$$ 109103 -105911 -67283 54490 -100807 -86444 131523 44076 -67771 27367 32691 90962
3352I0962r6771K44426P8109j35209Q4546J35956K38397j5312k00941n0437o8261
$$ 90962 -5809 238617 316726 181517 266063 402019 640416 625104 424163 373726 305465
3341C05465j19216Q1482k1508M8399j66153o929J01417K68733k33704j43256J8697
$$ 305465 186249 267731 246223 294622 128469 121540 222957 491690 257986 114730 133427
3330A33427N5736L1478K53322p639j64140j4594j50421N0094j60939P3449o7686
$$ 133427 189163 220641 473963 466324 302184 287590 137169 187263 26324 99773 32087
3319C2087J8488J05849j8438k5889o8460J18253P1111J0673J77274N70j44248
$$ 32087 50575 156424 137986 112097 43637 161890 233001 243674 420948 421518 277270
3308B77270j20334l36335K56293J84167j75362n5232J5027p1697K35885K4593
$$ 277270 156936 -179399 76894 261061 85699 30467 45494 -26203 209682 234275
3298B34275p8812M7274p2472j59265J38245l438K8864k90370K05326O2656j67447
$$ 234275 155463 202737 130265 -29000 109245 105807 134671 -155699 49627 112283 -55164
3287e5164K89636q090j52214K2010j45965N8502O7916R5988j99385J26103k84011
$$ -55164 234472 226382 74168 96178 -49787 8715 76631 172619 -26766 99337 -184674
3276a84674J7752K28850j32194J21235L66316m8549k56508m0126p5293r4572J78019
$$ -184674 -166922 61928 -70266 50969 417285 368736 112228 72102 -3191 -97763 80256
3265H0256J27362j03782k05872K49483L71686j82432J1379k1897o3228N6652j27641
$$ 80256 207618 103836 -102036 147447 519133 336701 348080 326183 262955 319607 191966
3254A91966j19364J60501n7005J90660k51099M205L2776l7021j16103J41335K11864
$$ 191966 72602 233103 176098 366758 115659 119864 152640 115619 -484 140851 352715
3243C52715q4966l83807K48382m0630J59551j65255j44297L6897n1862J50984
$$ 352715 267749 -116058 132324 91694 251245 85990 -58307 -21410 -73272 77712
3233G7712K70029p3469N2529M7794k84078j37616j6801N7224P9468J07320j54510
$$ 77712 347741 274272 326801 374595 90517 -47099 -63900 -6676 72792 180112 25602
3222B5602m2031J91246j98932l6479J82256j38300j89621l9610J65809J86417
$$ 25602 -16429 174817 -24115 -60594 121662 -16638 -206259 -245869 -80060 106357
3212A06357Q8627K20274q7919l0052k7299q7408k61660m9070l4631R3241J67792
$$ 106357 194984 415258 327339 297287 269988 182580 -79080 -128150 -162781 -69540 98252
3201I8252J25614m0606J27479k73958J47470J03405r3785j8120j73358J70280
$$ 98252 223866 183260 310739 36781 184251 287656 193871 175751 2393 172673
3191A72673L9122m4964l96679L47434K50409R2535k46186l1602j50574J94667
$$ 172673 211795 166831 -229848 117586 367995 460530 214344 182742 32168 226835
3181B26835j26426N7987J25947K00933j47450k39016j98433j79445L8794K0278
$$ 226835 100409 158396 284343 485276 337826 98810 -99623 -279068 -240274 -219996
3171b19996L48238l7117j09128J74148M21122o7954j34523K8807p2668j60202
$$ -219996 128242 91125 -18003 156145 577267 509313 374790 403597 330929 170727
3161A70727j41418J64666O3755k8950J33646J5464J91183k06876K764K46767j40939
$$ 170727 29309 193975 257730 228780 362426 377890 569073 362197 364961 611728 470789
3150D70789J3848j75389J44359q4081p5098J02744P1561k6868o0748j32089J43282
$$ 470789 484637 309248 453607 369526 294428 397172 468733 441865 381117 249028 392310
3139C92310J17813j695L718j61284P2886J40538j5316Q5414l4014l03635j15263
$$ 392310 510123 508428 512146 350862 423748 564286 548970 634384 600370 296735 181472
3128A81472J06157J61373l13377Q861J06560J92416j11095R9662J33628J42608
$$ 181472 287629 449002 135625 144486 251046 443462 332367 432029 565657 708265
3118G08265j84593j7132Q1683K35878k30271j54106J8474r6503K44446o0451r431
$$ 708265 523672 506540 588223 824101 593830 439724 458198 361695 606141 545690 536259
3107E36259L706L5701O2885N4694k96606J11100R5303K91935k74049L9348j39747
$$ 536259 539965 575666 638551 693245 396639 507739 603042 894977 620928 660276 520529
3096E20529k08703J40319N5894p427N023K4275j46244k02704m3172J76751M47516
$$ 520529 311826 452145 508039 500612 505635 529910 383666 180962 137790 314541 762057
3085G62057q1046l7849o299k95947J22169J55523L4028j42085J92177N9637O9459
$$ 762057 681011 643162 636863 340916 463085 618608 652636 510551 702728 762365 831824
3074H31824j52568k06164o3431j01418j3596L41884J94279j87085J8666O9815
$$ 831824 679256 473092 409661 308243 294647 636531 830810 643725 662391 732206
3064G32206l13190n1455l5958p4149p0580m7554K47592R2815j36914j20790K3200
$$ 732206 419016 367561 331603 257454 186874 139320 386912 479727 342813 222023 245223
3053B45223O9925k57117L6645L29881j3284q4324j32178J8830m1254j04056p1701
$$ 245223 315148 58031 94676 424557 411273 326949 194771 213601 172347 68291 -3410
3042c410r5615k6254R7910M2513J66941J97902j53144Q2116m1777m41477Q367
$$ -3410 -99025 -125279 -27369 15144 182085 379987 226843 308959 267182 -174295 -165928
3031a65928J16812J47240L44194j34368j99262n6367k70213O9585J47262J33831
$$ -165928 -49116 98124 442318 307950 108688 52321 -217892 -148307 -1045 132786
3021A32786j8193j27706R4452L3358k71810J22240J05332j32648P8315K77579
$$ 132786 114593 -13113 81339 114697 -157113 -34873 70459 -62189 16126 293705
3011B93705j76481j48247j5994n3016Q0093R8944j28902j14245K76090J18879
$$ 293705 117224 -31023 -47017 -100033 -19940 79004 -49898 -164143 111947 230826
3001B30826k86494K38Q8647J2937r448j67638J38595m6830L1921N1297r0978k45572
$$ 230826 -55668 -55430 33217 46154 36706 -130932 7663 -39167 -7246 44051 -46927 -292499
2989b92499q0127N3513J4055J8579J4783M53646r4589M6290p6902j70804l25465
$$ -292499 -372626 -319113 -305058 -286479 -271696 181950 87361 133651 56749 -114055 -439520
2978d39520j61197L93951L08067p1626q3401r4923j53969J13087r991K48539q7134
$$ -439520 -600717 -206766 101301 29675 -53726 -148649 -302618 -189531 -199522 49017 -38117
2967c8117K95204k00211j63806n600R5914J765P2525J21947j31390j31812j30260
$$ -38117 257087 56876 -106930 -112530 -16616 -14851 57674 179621 48231 -83581 -213841
2956b13841J29076k1730o2752m550k30308K19740O0148K4493o0715j3962j9215
$$ -213841 -84765 -106495 -169247 -173797 -404105 -184365 -124217 -99724 -160439 -174401 -193616
2945a93616j4760N444r7408j424K85523J7784j23209k11202J11413O6793Q9450
$$ -193616 -208376 -202932 -300340 -301764 -16241 1543 -121666 -332868 -221455 -154662 -65212
2934f5212j30284l4049J16691k91471K48570J4769o6902J80620R8578J5595j56082
$$ -65212 -195496 -229545 -112854 -404325 -155755 -140986 -207888 -27268 71310 86905 -69177
2923f9177j47070O3999o4358J9386Q0409j31250J32643k86815P7904J1408J42747
$$ -69177 -216247 -152248 -216606 -197220 -116811 -248061 -115418 -402233 -324329 -312921 -170174
2912a70174K26771Q0125l8525k11301j45775k10378J47041n4057J08046j18654
$$ -170174 56597 136722 98197 -113104 -258879 -469257 -322216 -376273 -268227 -386881
2902c86881Q245J12273L09821j46738l8705O3842L7680l17534l9017N43282l23883
$$ -386881 -378636 -266363 43458 -103280 -141985 -78143 -40463 -357997 -397014 146268 -177615
2891a77615j59633K88602j59098j02761K13914j61700k17643K48906l3698L60280
$$ -177615 -337248 -48646 -207744 -310505 -96591 -258291 -475934 -227028 -260726 99554
2881I9554j59509k95327l519O7925J92388j61756l3353K26058K50931J48806j69915
$$ 99554 -59955 -355282 -358801 -290876 -98488 -260244 -293597 -67539 183392 332198 162283
2870A62283j66591j12746L6729L987Q987J78940N93J01977l07008N7531o7584
$$ 162283 -4308 -117054 -80325 -76338 -67351 111589 112182 214159 -92849 -35318 -102902
2859a02902k35776J44067r0437M10042J512j77348k33543M9869J61316J05338
$$ -102902 -338678 -194611 -285048 124994 126506 -50842 -284385 -234516 -73200 32138
2849C2138m7844j2699q7033K32082r3856j99711l2253K33126j01312J23550M5227
$$ 32138 -15706 -28405 -115438 116644 22788 -176923 -209176 23950 -77362 46188 91415
2838I1415j14224J0508l98053k4731j03212R8875L40419R6097n0432l39460K0513
$$ 91415 -22809 -12301 -410354 -435085 -538297 -439422 -99003 -2906 -53338 -392798 -372285
2827c72285o7402J9551M2065J0023K43387j7251J32339l47940J29429J71360j17513
$$ -372285 -439687 -420136 -378071 -368048 -124661 -141912 -9573 -357513 -228084 -56724 -174237
2816a74237l9424J60201j6684P589J08050k12937l8774K04373j12085j88758j38327
$$ -174237 -213661 -53460 -70144 -62555 45495 -167442 -206216 -1843 -113928 -302686 -441013
2805d41013j02512J67720J33413K26809Q0935o35291K9967R6177K24232j53196
$$ -441013 -543525 -375805 -242392 -15583 65352 -569939 -539972 -443795 -219563 -372759
2795c72759j2876J84430n1257J90827l24637j40957K92656N6681J9056r7286J8370
$$ -372759 -385635 -201205 -252462 -61635 -386272 -527229 -234573 -177892 -158836 -256122 -237752
2784b37752m0474n2536j2760k7091J72936r5041j59250j8669M3024J6934M7671
$$ -237752 -278226 -330762 -343522 -370613 -197677 -292718 -451968 -470637 -427613 -410679 -363008
2773c63008M0790k71808J08673J23962K05337M4118j64476K42343j80876j78835
$$ -363008 -322218 -594026 -485353 -361391 -156054 -111936 -276412 -34069 -214945 -393780
2763c93780J53928L30755P0063j32087p7566j03731J05294J15622k72911j50630
$$ -393780 -239852 90903 160966 28879 -48687 -152418 -47124 68498 -204413 -355043
2753c55043N7465L5918j0789J01613J29697j70354K1400j67644K42649j89869
$$ -355043 -297578 -261660 -272449 -170836 -41139 -211493 -190093 -357737 -115088 -304957
2743c04957k33043J9334K1049K6714K42691j11243o7050N4860K23165j10664j7878
$$ -304957 -538000 -518666 -497617 -470903 -228212 -339455 -406505 -351645 -128480 -239144 -257022
2732b57022M3497k44387J24621J58282p689M8501J37444k13016j16822L39311
$$ -257022 -213525 -457912 -333291 -175009 -182698 -134197 3247 -209769 -326591 12720
2722A2720j34616l6885j17399P6293N8191k07952L17029j6904N6749j15627M5123
$$ 12720 -121896 -158781 -276180 -199887 -141696 -349648 -32619 -49523 7226 -108401 -63278
2711f3278J6529j00186j89517m070K47070N9840r2549P0660p8546o7546L9550
$$ -63278 -46749 -146935 -336452 -340522 -93452 -33612 -126161 -55501 -134047 -201593 -162043
2700a62043O4120Q2685Q2638p7551K79391l0418q6488n4698j32986p4229J06700
$$ -162043 -97923 -15238 67400 -10151 269240 238822 152334 97636 -35350 -109579 -2879
2689b879j97578j07036J41614m6789j18508P010J27528q2078J9752N3017m4256
$$ -2879 -200457 -307493 -165879 -212668 -331176 -324166 -196638 -278716 -258964 -205947 -250203
2678b50203J57603j62516j21734j89263K38000O1946O7845J41877l0789P3408
$$ -250203 -92600 -255116 -376850 -566113 -328113 -266167 -198322 -56445 -87234 -13826
2668a3826o5203M5780R4426n3624l3564J39012k84370M996J31574j06190K9189
$$ -13826 -79029 -33249 61177 7553 -26011 113001 -171369 -166373 -34799 -140989 -111800
2657a11800k3231r7018n426J23696j84080J58001J89420k19562M5589o7434J552
$$ -111800 -135031 -232049 -237475 -113779 -297859 -139858 49562 -170000 -124411 -191845 -190293
2646a90293L9471j14803K05826j01478l45537J84847J45719J15774J30521j80502
$$ -190293 -150822 -265625 -59799 -161277 -506814 -321967 -176248 -60474 70047 -110455
2636a10455J07712l05846N26p0695n8028k60166L24126L36808j17224p820N7499
$$ -110455 -2743 -308589 -308063 -378758 -436786 -696952 -372826 -36018 -153242 -161062 -103563
2625a03563K35515j89606j22319J22157J29198j29534m16883R4734M42728r0269
$$ -103563 131952 -57654 -179973 -57816 71382 -58152 -475035 -380301 62427 -27842
2615b7842J34484M6579j3840j61886P5747O4853l79343K08251K25326j21665J38988
$$ -27842 106642 153221 139381 -22505 53242 118095 -261248 -52997 172329 50664 189652
2604A89652J00723J00218k29189n7003Q8507M6225m1156l9328k5388J44940o4754
$$ 189652 290375 390593 161404 104401 192908 239133 197977 158649 133261 278201 213447
2593B13447j02760j61293j35613o4459J20793M7317k59199M0478L79258q6585
$$ 213447 110687 -50606 -186219 -250678 -129885 -82568 -341767 -301289 77969 -8616
2583h616R9682m761j8152J40244L1923j90449j94029J11228K70787j79300P7127
$$ -8616 91066 86305 68153 208397 240320 49871 -144158 -32930 237857 58557 135684
2572A35684J15721k17351k08602K39764M8446L5432L6255j37869l80606K21930
$$ 135684 251405 34054 -174548 65216 113662 149094 185349 47480 -333126 -111196
2562a11196j44639k49233M34088O2246O4461K09338j97671l13156K15966j69118
$$ -111196 -255835 -505068 -70980 -8734 55727 265065 67394 -245762 -29796 -198914
2552a98914J23529K06693p5550P6931j23146J18610K42062j68601j77395k64319
$$ -198914 -75385 131308 55758 132689 9543 128153 370215 201614 24219 -240100
2542b40100J38777K58705q3518m1202m0860l7270o7509j80832J35368J41894J16898
$$ -240100 -101323 157382 73864 32662 -8198 -45468 -112977 -293809 -158441 -16547 100351
2531A00351o5297j06707l9581M33721m5225k21565L1349j13941R9364l10723P6688
$$ 100351 35054 -71653 -111234 322487 277262 55697 87046 -26895 72469 -238254 -161566
2520a61566j84794K00184M8785k94146L01075J74388k4356q9979J62182j30014
$$ -161566 -346360 -146176 -97391 -391537 -90462 83926 59570 -30409 131773 1759
2510A759k0170J19664J82399J01348j40084m53950J09226K49477L48766k44203
$$ 1759 -18411 101253 283652 385000 244916 -209034 -99808 149669 498435 254232
2500B54232j68159Q0847N5747k29558l8053M6871o1546J15209P2280j26800Q5787
$$ 254232 86073 166920 222667 -6891 -44944 1927 -59619 55590 127870 1070 86857
2489H6857j93741k48421K36317J97924O639r5312M8101P7326j45588J29081J59085
$$ 86857 -106884 -355305 -118988 78936 85575 -9737 38364 115690 -29898 99183 258268
2478B58268M5247j9225k61764j33623P5153M3937J1945K13777M5390q9555J53323
$$ 258268 303515 284290 22526 -111097 -35944 7993 19938 233715 279105 189550 342873
2467C42873j05066j74097o344j7295n694Q5387J83644j10903k5192O4707K91257
$$ 342873 237807 63710 57366 40071 34377 119764 303408 192505 167313 232020 523277
2456E23277J7886k46234k717o6911J68268P1683o5646j0323l11796J6695o0282
$$ 523277 541163 294929 292212 225301 393569 465252 399606 389283 77487 94182 33900
2445C3900J37818J2300O6656J08794Q5657j7825O6826Q1191l05300M8998R4910
$$ 33900 171718 184018 250674 359468 445125 427300 494126 575317 270017 319015 413925
2434D13925k9540m3533l3373K08715k91608r1871J25841P9209J40075L5299j11761
$$ 413925 384385 340852 307479 516194 224586 132715 258556 337765 477840 513139 401378
2423D01378p9811K19834K46232j05855j86990j09779k51468j26101J35169J20183
$$ 401378 321567 541401 787633 681778 494788 385009 133541 7440 142609 262792
2413B62792J60513J74145R7166l52571J00701J02106J07272k6892O5543m4936
$$ 262792 423305 597450 694616 342045 442746 544852 652124 625232 690775 645839
2403F45839J79425J77003m53775m9399J0485J43799j18934J3182J33908K44806
$$ 645839 825264 1002267 548492 499093 509578 653377 534443 547625 681533 926339
2393I26339R2904n8550j25693M7538L69426L36044k81184j48577J80605L86937
$$ 926339 1019243 960693 835000 882538 1251964 1588008 1306824 1158247 1338852 1725789
2383A725789P9701l90369K23001J53640j8731j42571M2980J92469K03845k4447
$$ 1725789 1805490 1415121 1638122 1791762 1773031 1630460 1673440 1865909 2069754 2045307
2373B045307N24J608K4593J31897J17893J69763K05241Q6784N14694M12753K32425
$$ 2045307 2045831 2047439 2072032 2203929 2321822 2491585 2696826 2783610 3298304 3711057 3943482
2362C943482P5176L03176L35566q5830J02984K52846N24175K83030O35355L39303
$$ 3943482 4018658 4321834 4657400 4571570 4674554 4927400 5451575 5734605 6369960 6709263
2352F709263M28774Q15392P26691R82009P31323O59173J350171J164402Q53135
$$ 6709263 7138037 7953429 8680120 9662129 10393452 11052625 12402796 13567198 14420333
2343A4420333N59066O96547J016041J108279R67658K047160K506507K301038L573665
$$ 14420333 14979399 15675946 16691987 17800266 18767924 20815084 23321591 25622629 29196294
2334B9196294M149022M315377N350186O137902M349560k937960p559532o284864
$$ 29196294 33345316 37660693 43010879 49148781 53498341 50560381 43000849 36715985
2326C6715985m293373l081134k440801k034697j550325j545293j600505j438386
$$ 36715985 32422612 29341478 26900677 24865980 23315655 21770362 20169857 18731471
2318A8731471j477311j352342j293977j019152r37115j119386o25736q54741p15661
$$ 18731471 17254160 15901818 14607841 13588689 12651574 11532188 10906452 10051711 9336050
2309I336050n13692p88626l93192n30747k06468l01765l29957l88654n55885N6184
$$ 9336050 8822358 8033732 7640540 7109793 6903325 6601560 6271603 5882949 5327064 5383248
2299E383248l77959l49125J18428k89284l61781l24354j91111k36190q5642j64766
$$ 5383248 5005289 4656164 4774592 4485308 4123527 3799173 3608062 3371872 3286230 3121464
2289C121464k22336k4710j15685M9175K10348m98810j12635Q6996l9596n6874
$$ 3121464 2899128 2874418 2758733 2807908 3018256 2519446 2406811 2493807 2454211 2397337
2279B397337j35129J10656k94483k34309L23697J1780k56013m39398k542p763
$$ 2397337 2262208 2372864 2078381 1844072 2167769 2179549 1923536 1484138 1481596 1473833
2269A473833J4548k80647j00667K81221j83326J25111J42711j8060j39917j05868
$$ 1473833 1488381 1207734 1107067 1388288 1204962 1330073 1472784 1454724 1314807 1208939
2259A208939Q3840k82636r8793J94090m5843j96973Q1508P680J36806J09600m5953
$$ 1208939 1292779 1010143 911350 1105440 1059597 862624 944132 951812 1088618 1198218 1152265
2248A152265r9299j80224R2348K9639r8739m405P4010k47997k12020P2900L3058
$$ 1152265 1052966 872742 965090 994729 895990 891585 965595 717598 505578 578478 611536
2237F11536J42048O2802j37836n4151L67366j83226j29882j55316M2517j7540
$$ 611536 753584 816386 678550 624399 991765 808539 678657 523341 565858 548318
2227E48318L3264m544Q9842j23793p6707J02289j59495J6863N8854J21773j99259
$$ 548318 581582 577038 666880 543087 466380 568669 409174 426037 484891 606664 407405
2216D07405J61369p5497Q2086k38787q2465j71080L5078o1726J68652q1775L37913
$$ 407405 568774 493277 575363 336576 254111 83031 118109 56383 225035 143260 481173
2205D81173j94390m4205J44828n0824J89581q5188k92333l7897j03557j22570
$$ 481173 286783 242578 387406 336582 526163 440975 148642 110745 7188 -115382
2195a15382J52262Q3971K6343j76202K35164l9317L5206K9841P0471P4627P2618
$$ -115382 36880 120851 147194 -29008 206156 166839 202045 231886 302357 376984 449602
2184D49602K45639J68731j66636l09500m07597k11218K04281L28810J51909r2226
$$ 449602 695241 863972 697336 387836 -19761 -230979 -26698 302112 454021 361795
2174C61795J45169k22472j44374J41813K4174j26280k27429K26671n5378K1175
$$ 361795 506964 284492 140118 281931 306105 179825 -47604 179067 123689 144864
2164A44864p9278N1490K1728j43556l02402K09925K52434N5101n7085J39064J5899
$$ 144864 65586 117076 138804 -4752 -307154 -97229 155205 210306 153221 292285 308184
2153C08184Q8724j64989N2837L47507j89431l28896J0513j27071o8515M5600J9907
$$ 308184 396908 231919 284756 632263 442832 113936 124449 -2622 -71137 -25537 -5630
2142e630j56439p503R164m357J48187l486j5086o6952K70739M768n530R3797p1664
$$ -5630 -162069 -169572 -160408 -164765 -16578 -20064 -35150 -102102 168637 173405 167875 261672 190008
2129A90008R3054J92873j52446j82981j83433r5926R9104L01789J0097j35516
$$ 190008 283062 475935 323489 140508 -42925 -138851 -39747 262042 272139 136623
2119A36623k41386J68693j26913Q3683n6839P5553J75361n0577j9976k249L4162
$$ 136623 -104763 63930 -62983 20700 -36139 39414 214775 164198 144222 141973 176135
2108A76135J29597k8029k32438k94106r3938L16324J05558n3639j0859J49399
$$ 176135 305732 277703 45265 -248841 -342779 -26455 79103 25464 14605 164004
2098A64004p7806m650r4401m952n1539k8595L42039J55614M6250j54171k41357
$$ 164004 86198 81548 -12853 -17805 -69344 -97939 244100 399714 445964 291793 50436
2087E0436j73664M2611L11013j71891m24950M03417l0508j12901R0045j0338K66191
$$ 50436 -123228 -80617 230396 58505 -366445 36972 6464 -106437 -16392 -26730 239461
2076B39461J49479q6168j60593K2903j17260J63430n9263j59610O929J17889l340
$$ 239461 388940 302772 142179 165082 47822 211252 151989 -7621 -692 117197 113857
2065A13857k55027N6987K89760O5239j68830Q8757j64132n7433J59936j71815
$$ 113857 -141170 -84183 205577 270816 101986 190743 26611 -30822 129114 -42701
2055d2701k05236K40079j08400n2347o0594J29228M2354J48526L61899j42384
$$ -42701 -247937 -7858 -116258 -168605 -229199 -99971 -57617 90909 452808 310424
2045C10424k09771q0479R012j47176L7049l0198J58314K82871p4641k58437n3781
$$ 310424 100653 20174 29186 -117990 -80941 -111139 47175 330046 255405 -3032 -56813
2034e6813j48740J85918n8196O1343p2782M7092O1105m6990l32252K0006K46851
$$ -56813 -205553 -19635 -77831 -16488 -89270 -42178 18927 -28063 -360315 -340309 -93458
2023i3458K16573l17041j90194J98547Q2684J74784j31996K3302j68278J84336
$$ -93458 123115 -193926 -384120 -185573 -102889 71895 -60101 -36799 -205077 -20741
2013b0741o9568j33212n7808J23352N1451L9574K2800j92217k2545J63267O5147
$$ -20741 -90309 -223521 -281329 -157977 -106526 -66952 -44152 -236369 -258914 -95647 -30500
2002c0500k86089L1939j42700J42622K96322p8792n5771J01877N8295O8858k99568
$$ -30500 -316589 -284650 -427350 -284728 11594 -67198 -122969 -21092 37203 106061 -193507
1991a93507m8017M8591J4614J491K70044k5756K2341j64603k58668j03327J51148
$$ -193507 -241524 -192933 -178319 -176828 93216 67460 89801 -74802 -333470 -436797 -285649
1980b85649j0262p2311K15329j19133N7052K97101L3818k75505J97967J08415
$$ -285649 -295911 -368222 -152893 -272026 -214974 82127 115945 -159560 38407 146822
1970A46822Q3313l71945L9393L3595q1342L0955k3638J35439J45034k42251P4674
$$ 146822 230135 -141810 -102417 -68822 -150164 -119209 -142847 -7408 137626 -104625 -29951
1959b9951L42234j30448k69785K0909l3958n9084N5548K45984j00880k22144J26913
$$ -29951 312283 181835 -87950 -67041 -100999 -160083 -104535 141449 40569 -181575 -54662
1948e4662Q7690o7923o7637p415j09201J03375j59547p4786J52519j8743Q7753
$$ -54662 33028 -34895 -102532 -109947 -219148 -115773 -275320 -350106 -197587 -216330 -128577
1937a28577k07173n6035L11744M5428n8201j44990Q1049J70129k39692q666o84
$$ -128577 -335750 -391785 -80041 -34613 -92814 -237804 -156755 13374 -226318 -234984 -235668
1926b35668M4779j43707R3048J96982j64085n7665K27693K39973j41225K0946
$$ -235668 -190889 -334596 -241548 -44566 -208651 -266316 -38623 201350 60125 81071
1916H1071Q5915r5338r9090j1212J77250N3968q4522j66919j90929p188O9412
$$ 81071 166986 71648 -27442 -38654 138596 192564 108042 -58877 -249806 -256994 -187582
1905a87582J21743j67265j99016J22257k9241o2960P4523J41724j56238K65475
$$ -187582 -65839 -233104 -432120 -309863 -339104 -402064 -327541 -185817 -342055 -76580
1895g6580P7188j25841N5615O1649J07152j80526l9208L26887k97800k68151K23684
$$ -76580 608 -125233 -69618 -7969 99183 -81343 -120551 206336 -91464 -359615 -135931
1884a35931N4747K5971j6117J47762j14524K21470j17538l0580L1824L4152j28468
$$ -135931 -81184 -55213 -71330 76432 -38092 183378 65840 35260 67084 101236 -27232
1873b7232k08968J10417j66488J39670k0529R891n2205N9796M6803k42270J22840
$$ -27232 -236200 -125783 -292271 -152601 -173130 -163239 -215444 -155648 -108845 -351115 -228275
1862b28275K4891M8065M73503j26179j92950k34723J19442P7960j10092n115j63088
$$ -228275 -203384 -155319 318184 192005 -945 -235668 -116226 -38266 -148358 -153473 -316561
1851c16561J36873j14260Q5049J00991J7064L4129J42169n160j5964l8401j38556
$$ -316561 -179688 -293948 -208899 -107908 -90844 -56715 85454 80294 64330 25929 -112627
1840a12627L0265J91017o1971j06416j37958o736r8270Q6781n400r8218p7461
$$ -112627 -82362 108655 46684 -59732 -197690 -204426 -302696 -215915 -221315 -319533 -396994
1829c96994L93052K615j84084J82375J84399k09028J22966o153k56857m7737K22555
$$ -396994 -3942 -1327 -185411 -3036 181363 -27665 95301 89148 -167709 -215446 7109
1818G109J00085L2965Q4157o30632K83832P2119k12411K5778K0139j57982j81710
$$ 7109 107194 140159 224316 -406316 -122484 -50365 -262776 -236998 -216859 -374841 -556551
1807e56551j65792L42562K77229K14710k58263j94496J20397j07402n0676l1515
$$ -556551 -722343 -379781 -102552 112158 -146105 -340601 -220204 -327606 -378282 -409797
1797d09797L1393P0432J73802K17204j88923K8891K33702q7721j91053p4088L16897
$$ -409797 -378404 -307972 -134170 83034 -105889 -76998 156704 68983 -122070 -196158 120739
1786A20739J59255m8960k99223j0091R7697j31351k41861K39393J46189K0067
$$ 120739 279994 231034 -68189 -78280 19417 -111934 -353795 -114402 31787 51854
1776E1854j04895Q6866j28785k6789j66762j86735J19749J34305J05435K32181
$$ 51854 -53041 33825 -94960 -121749 -288511 -475246 -355497 -221192 -115757 116424
1766A16424J49097j2406l13351N6915J39897O0142j15468k05111J7294j14169
$$ 116424 265521 253115 -60236 -3321 136576 196718 81250 -123861 -106567 -220736
1756b20736r6945j68429K09025r1557o264o1245K43974J70170L3193m0401p9979
$$ -220736 -317681 -486110 -277085 -368642 -374906 -436151 -192177 -22007 11186 -29215 -109194
1745a09194n3229j02163j38280Q1193J7802P6533Q6838n117p6451K76830J30743
$$ -109194 -162423 -264586 -402866 -321673 -303871 -227338 -140500 -145617 -222068 54762 185505
1734A85505k90066p8709j17961r5906p803O3601P0061n8474K9035k140J59197
$$ 185505 -104561 -183270 -301231 -397137 -404940 -341339 -271278 -329752 -300717 -302857 -143660
1723a43660P7631q3604n190M0857n3792K20478R6611j82060j19909J66823N9906
$$ -143660 -66029 -149633 -154823 -113966 -167758 52720 149331 -32729 -152638 14185 74091
1712G4091k52058j29214k28095K79145j01678J23450N1051L2927j39692R8578
$$ 74091 -177967 -307181 -535276 -256131 -357809 -234359 -183308 -150381 -290073 -191495
1702a91495J77293L4217L7520J30257m9267j91696m176K0007J73477j36118j28329
$$ -191495 -14202 20015 57535 187792 138525 -53171 -57347 -37340 136137 19 -128310
1691a28310k42142K56723l5637J13804K20382O1188k03949k23485j11079K02159
$$ -128310 -370452 -113729 -149366 -35562 184820 246008 42059 -181426 -292505 -90346
$$ [...]
##END NTUPLES=NMR SPECTRUM
##END=
