##TITLE=1H_DE-80H_X3
 200.13MHz, d2o
 8 sc
 
 19ns.26.2.2025
##JCAMPDX= 6.0         $$ Bruker NMR JCAMP-DX V2.0
##DATA TYPE= NMR SPECTRUM
##DATA CLASS= NTUPLES
##ORIGIN= UXNMR, Bruker Analytische Messtechnik GmbH
##OWNER= pz
$$ XWIN-NMR		Version 3.5
$$ Fri Aug  1 10:59:55 2025 Russian Standard Time (UT+4h)  Yarkov@DPX200
##.OBSERVE FREQUENCY= 200.1313
##.OBSERVE NUCLEUS= ^1H
##.ACQUISITION MODE= SIMULTANEOUS
##.ACQUISITION SCHEME= undefined
##.AVERAGES= 8
##.DIGITISER RES= 18
##SPECTROMETER/DATA SYSTEM= spect
##.PULSE SEQUENCE= zg30
##.SOLVENT NAME= CDCl3
##.SHIFT REFERENCE= (INTERNAL, CDCl3, 0, 15.5221)
##AUDIT TRAIL= $$ (NUMBER, WHEN, WHO, WHERE, WHAT)
$$ ##TITLE= Audit trail, XWIN-NMR		Version 3.5
$$ ##JCAMPDX= 5.01
$$ ##ORIGIN= Bruker BioSpin GmbH
$$ ##OWNER= Yarkov
$$ C:/Bruker/XWIN-NMR/data/yarkov2/nmr/H-C/1/pdata/1/auditp.txt
$$ ##AUDIT TRAIL=  $$ (NUMBER, WHEN, WHO, WHERE, WHAT)
(   1,<2025-08-01 10:58:57.18 +0400>,<Yarkov>,<DPX200>,
      <created by zg, POWCHK disabled, PULCHK disabled
       configuration hash MD5:
       00 E9 B6 7A A2 85 ED C7 34 08 36 98 17 FE 4E 26
       data hash MD5: 16K
       D6 C6 D2 E3 20 25 CE 1D 79 A3 62 D1 21 40 A9 6B>)
(   2,<2025-08-01 10:59:01.40 +0400>,<Yarkov>,<DPX200>,
      <Start of raw data processing
       efp BC_mod = 2 LB = 0.25 FT_mod = 6 PKNL = 1 PHC0 = -1360.196 PHC1 = 17.79091 SI = 16K 
       data hash MD5: 16K
       66 6B 08 32 E5 7A 5C 3F CF 34 24 8A AE C8 D2 B7>)
(   3,<2025-08-01 10:59:08.65 +0400>,<Yarkov>,<DPX200>,
      <abs ABSG = 5 
       data hash MD5: 16K
       EA 4F 13 FB 45 5F BC E7 26 82 1D 2C 6F AE 3C E7>)
$$ ##END=
$$ 
$$ hash MD5
$$ CA 61 98 53 36 34 88 83 77 01 4A F7 2E 4C DC 35
##$RELAX= 
##$RELAX= 
##$RELAX= 
##$RELAX= 
##$RELAX= 
##$RELAX= 
$$ Bruker specific parameters
$$ --------------------------
##$DU= <C:/Bruker/XWIN-NMR>
##$EXPNO= 1
##$NAME= <H-C>
##$PROCNO= 1
##$TYPE= <nmr>
##$USER= <yarkov2>
##$AMP= (0..31)
100 100 100 100 100 100 100 100 100 100 100 100 100 100 100 100 100 100 
100 100 100 100 100 100 100 100 100 100 100 100 100 100 
##$AQSEQ= 0
##$AQ_mod= 1
##$AUNM= <au_zg>
##$AUTOPOS= <>
##$BF1= 200.13
##$BF2= 200.13
##$BF3= 200.13
##$BF4= 200.13
##$BF5= 200.13
##$BF6= 200.13
##$BF7= 200.13
##$BF8= 200.13
##$BYTORDA= 1
##$CFDGTYP= 0
##$CFRGTYP= 5
##$CHEMSTR= <none>
##$CNST= (0..31)
1 1 145 1 1 1 1 1 1 1 1 1 1 1 1 1 1 1 1 1 1 1 1 1 1 1 1 1 1 1 1 1 
##$CPDPRG= <>
##$CPDPRG1= <>
##$CPDPRG2= <>
##$CPDPRG3= <>
##$CPDPRG4= <mlev>
##$CPDPRG5= <mlev>
##$CPDPRG6= <mlev>
##$CPDPRG7= <mlev>
##$CPDPRG8= <mlev>
##$CPDPRGB= <>
##$CPDPRGT= <>
##$D= (0..31)
0 0.7 0 0 0 0 0 0 0 0 0 0.03 0 0 0 0 0 0 0 0 0 0 0 0 0 0 0 0 0 0 0 0 
##$DATE= 1754031536
##$DBL= (0..7)
120 120 120 120 120 120 120 120 
##$DBP= (0..7)
150 150 150 150 150 150 150 150 
##$DBP07= 0
##$DBPNAM0= <>
##$DBPNAM1= <>
##$DBPNAM2= <>
##$DBPNAM3= <>
##$DBPNAM4= <>
##$DBPNAM5= <>
##$DBPNAM6= <>
##$DBPNAM7= <>
##$DBPOAL= (0..7)
0.5 0.5 0.5 0.5 0.5 0.5 0.5 0.5 
##$DBPOFFS= (0..7)
0 0 0 0 0 0 0 0 
##$DE= 6
$$ [...]
##$SUBNAM3= <"">
##$SUBNAM4= <"">
##$SUBNAM5= <"">
##$SUBNAM6= <"">
##$SUBNAM7= <"">
##$SUBNAM8= <"">
##$SUBNAM9= <"">
##$SW= 18.0517328524113
##$SWIBOX= (0..15)
0 0 2 0 0 0 0 0 0 0 0 0 0 0 0 0 
##$SW_h= 3612.71676300578
##$TD= 16384
##$TD0= 1
##$TE= 0
##$TE2= 300
##$TE3= 300
##$TEG= 300
##$TL= (0..7)
0 120 120 120 120 120 120 120 
##$TP= (0..7)
150 150 150 150 150 150 150 150 
##$TP07= 0
##$TPNAME0= <>
##$TPNAME1= <>
##$TPNAME2= <>
##$TPNAME3= <>
##$TPNAME4= <>
##$TPNAME5= <>
##$TPNAME6= <>
##$TPNAME7= <>
##$TPOAL= (0..7)
0.5 0.5 0.5 0.5 0.5 0.5 0.5 0.5 
##$TPOFFS= (0..7)
0 0 0 0 0 0 0 0 
##$TUNHIN= 0
##$TUNHOUT= 0
##$TUNXOUT= 0
##$USERA1= <user>
##$USERA2= <user>
##$USERA3= <user>
##$USERA4= <user>
##$USERA5= <user>
##$V9= 5
##$VALIST= <valist>
##$VCLIST= <CCCCCCCCCCCCCCC>
##$VD= 0
##$VDLIST= <DDDDDDDDDDDDDDD>
##$VPLIST= <PPPPPPPPPPPPPPP>
##$VTLIST= <TTTTTTTTTTTTTTT>
##$WBST= 1024
##$WBSW= 4
##$XGAIN= (0..3)
0 0 0 0 
##$XL= 0
##$YL= 0
##$YMAX_a= 118648
##$YMIN_a= -104912
##$ZGOPTNS= <>
##$ZL1= 120
##$ZL2= 120
##$ZL3= 120
##$ZL4= 120
##$ABSF1= 15.5684
##$ABSF2= -2.483451
##$ABSG= 5
##$ABSL= 3
##$ALPHA= 0
##$AQORDER= 0
##$ASSFAC= 0
##$ASSFACI= 0
##$ASSFACX= 0
##$ASSWID= 0
##$AUNMP= <proc_1d>
##$AZFE= 0.1
##$AZFW= 0.1
##$BCFW= 0
##$BC_mod= 2
##$BYTORDP= 0
##$COROFFS= 0
##$CY= -3
##$DATMOD= 1
##$DC= 0
##$DFILT= <>
##$DTYPP= 0
##$F1P= 0
##$F2P= 0
##$FCOR= 1
##$FTSIZE= 16384
##$FT_mod= 6
##$GAMMA= 0
##$GB= 0
##$INTBC= 1
##$INTSCL= 3.241238e-09
##$ISEN= 128
##$LB= 0.25
##$LEV0= 0
##$LPBIN= 0
##$MAXI= 10000
##$MC2= 0
##$MEAN= 0
##$ME_mod= 0
##$MI= 1.114404
##$NCOEF= 0
##$NC_proc= -8
##$NLEV= 6
##$NOISF1= 3.799351
##$NOISF2= 2.8
##$NSP= 0
##$NTH_PI= 0
##$NZP= 0
##$OFFSET= 15.52212
##$PC= 1
##$PHC0= -1360.196
##$PHC1= 17.79091
##$PH_mod= 1
##$PKNL= yes
##$PPARMOD= 0
##$PSCAL= 0
##$PSIGN= 0
##$REVERSE= no
##$SF= 200.129999915491
##$SI= 16384
##$SIGF1= 3
##$SIGF2= 2
##$SINO= 0.751879
##$SIOLD= 32768
##$SREGLST= <19F.Aceton>
##$SSB= 0
##$STSI= 16384
##$STSR= 0
##$SW_p= 3612.71676300578
##$SYMM= 0
##$S_DEV= 0
##$TDeff= 16384
##$TDoff= 0
##$TI= <>
##$TILT= no
##$TM1= 0
##$TM2= 0
##$TOPLEV= 0
##$USERP1= <user>
##$USERP2= <user>
##$USERP3= <user>
##$USERP4= <user>
##$USERP5= <user>
##$WDW= 1
##$XDIM= 16384
##$YMAX_p= 426299320
##$YMIN_p= -1326270
$$ End of Bruker specific parameters
$$ ---------------------------------
##NTUPLES= NMR SPECTRUM
##VAR_NAME=  FREQUENCY,     SPECTRUM/REAL,   SPECTRUM/IMAG
##SYMBOL=    X,             R,               I
##VAR_TYPE=  INDEPENDENT,   DEPENDENT,       DEPENDENT
##VAR_FORM=  AFFN,          ASDF,            ASDF
##VAR_DIM=   16384,         16384,           16384
##UNITS=     HZ,            ARBITRARY UNITS, ARBITRARY UNITS
##FACTOR=    0.220516191357247, 1,           1
##FIRST=     3106.4419695039, 0,             0
##LAST=      -506.274793501881, 0,           0
##MIN=       -506.274793501881, -1326270,    0
##MAX=       3106.4419695039, 426299320,     0
$$ Real data points
##PAGE= N=1
##DATA TABLE= (X++(R..R)), XYDATA
$$ [...]
10671 -35185 -26046 71673 29631 -133472 -224551 -160762 35249 126090 10271 -2510 32908
10660 32908 -11624 -66619 -188920 -63014 -20043 -29944 54729 -28267 -91320 -88262 -184803 -123404
10648 -123404 -64052 -118132 20960 -28268 -70915 -8047 -14937 -1334 -57488 -82367 13603
10637 13603 27117 29249 -79326 -9296 -41789 64323 26487 -151454 -7552 -24648 -117607
10626 -117607 -112708 17613 18349 -94775 8166 -6976 -16905 -25916 21262 148690 -10240
10615 -10240 -68692 26137 16897 -69092 -50168 -31158 47382 45897 -39577 -29571 -64522 -105401
10603 -105401 21580 113923 90788 67282 -47349 94767 121058 51623 15166 -50442 -74049
10592 -74049 -113073 -10256 3051 123670 158441 13607 69190 95327 35496 128120 90203
10581 90203 33708 -80105 37820 9588 -43059 93445 96554 -88115 -45297 -53076 42201
10570 42201 102500 114418 -64559 -232707 -86001 128539 -95760 -143041 -45781 -41629 -1514
10559 -1514 -31531 -99271 -28644 -41750 -160256 -73787 30811 75372 -115478 -98372 32064
10548 32064 90714 77815 55155 -4268 -25978 -20954 41621 -33509 -105149 -1249 -29461 -40019
10536 -40019 62696 130755 131056 8198 -34833 -80974 -58197 -24857 -120907 -66082 -12596 -171549
10524 -171549 -100897 -90632 -7605 -64273 -66243 -27937 -46363 -65711 24846 -85764 -102433
10513 -102433 -83269 -73443 60457 113968 32895 -26159 57643 -49141 -51910 50679 132066
10502 132066 256451 136879 -130705 -151128 -55563 -30997 6044 31865 -32025 12094 21141
10491 21141 65879 -14847 15346 30379 14110 -351 27754 151811 45992 53927 -24299
10480 -24299 -137112 -141214 -22196 124629 3928 -134107 -87997 -54643 -6979 59552 20994
10469 20994 -78812 19703 -149424 -152960 -80239 -31817 -25412 70122 7037 -228980 -254086 -213604
10457 -213604 -111629 -18976 -82321 28488 69682 -118656 -214169 -224551 -97109 -125257 -110935
10446 -110935 -5253 -6481 1267 -1958 6079 118100 17158 7725 -37796 97615 11617 74119
10434 74119 91130 -65843 24341 102025 95660 -13463 27309 -10404 -136353 -36891 -96618
10423 -96618 -142046 -47193 -62673 -173503 -263532 -40078 11729 72472 86196 -27849 -74067
10412 -74067 -122483 -119013 4020 48214 5950 -43643 -36700 -46371 -36830 89816 198770 192712
10400 192712 39394 40668 -27101 -63238 22589 -106527 -42894 75579 56360 -25063 53578
10389 53578 86388 -24435 30495 -10312 -31186 -84723 28153 -5671 -93550 -161950 -34600
10378 -34600 -178888 -14164 -79081 -292293 -241736 -212012 -96627 27233 80916 12067 -38213
10367 -38213 -83699 -62995 -154321 -230652 -143028 -171418 -48314 167530 133219 -67102 -52637
10356 -52637 55430 -65690 -54487 -4524 -43067 -27106 85509 22142 20904 94845 61875
10345 61875 86106 83270 42883 33494 63716 53657 3147 47181 49256 53623 20173 33811
10333 33811 -2601 36074 19333 -71518 -44150 -37408 -85537 -46628 1211 -43759 147431 76135
10321 76135 -107574 -72118 -105191 -108110 -186335 -151070 -120074 -130993 -157546 -254912 -116715
10310 -116715 -100220 -133212 -48775 -57557 94735 79783 -10595 6316 82909 20311 -87213
10299 -87213 -44137 112562 119934 121333 -421 -66417 -99417 -88713 -118271 -95757 -58690 -44423
10287 -44423 -10013 54845 -14604 24178 -19474 -117642 -40413 106122 121586 11934 -17275
10276 -17275 3396 -55890 -20643 117840 114477 9509 55661 -30803 -86314 -124739 -103396
10265 -103396 -89864 -153161 35082 71181 82775 37666 -144337 27396 87331 55946 55387
10254 55387 81360 40676 -157214 -78341 61892 150879 147557 144792 -36306 -124799 -34167
10243 -34167 33864 -31194 -26706 -60945 -78887 52996 136410 42199 26438 19524 -65182 -84272
10231 -84272 -44472 5390 135208 29199 35862 86355 48295 27794 -39244 -11153 11684
10220 11684 -42705 27796 20246 22536 -22754 24326 -49465 -160817 -120358 -207102 -61720 66563
10208 66563 167050 184410 135260 31214 -115868 -77483 -162334 -37764 43394 -25928 -49283
10197 -49283 10953 7902 80864 84077 -16452 55158 29117 -145061 -171822 -114455 -49592 182513
10185 182513 198284 173524 126980 -10807 80840 45751 18384 43465 76342 135081 231426
10174 231426 58217 -68472 112131 92605 -2819 82724 39280 -6319 57600 -52241 -6790
10163 -6790 -29283 23674 -34456 -135311 -139255 -155046 -81476 -20527 -6312 35386 34522 -3534
10151 -3534 30259 26113 9358 18801 37487 -26590 -16864 -93562 -62755 -154763 -235098 -190589
10139 -190589 -20033 146310 102560 186691 54365 85383 65133 -32310 -22648 -52460 -9320
10128 -9320 41774 -89195 26070 158746 7659 -140601 -115604 -44287 22706 -49102 -117518
10117 -117518 -122654 -64554 13299 -42342 86512 6018 -30362 36649 -73460 -25355 85464
10106 85464 74695 75908 48236 66196 44406 -39467 817 -8604 -173 -12211 -1721 -155665
10094 -155665 -171257 -286457 -167739 -30305 29225 -108934 -93776 37991 -2430 27223
10084 27223 109538 140377 81813 79730 93016 237115 184257 44319 -76436 -126701 30222
10073 30222 100502 34463 97163 22560 50374 135744 195395 85588 143732 173255 59229
10062 59229 19846 -8524 15879 42776 82900 11262 -39249 -100828 -122081 -47919 16826 -68463
10050 -68463 -40994 -82085 -108067 109976 155445 58554 -49498 24603 -47376 59935 46853
10039 46853 -295 78417 63374 -16079 -37539 54020 38042 16904 -13194 88145 29155
10028 29155 -14815 -97350 -78902 -85453 -124005 -76439 43114 81250 90567 23664 -106292 -6763
10016 -6763 -87678 -99456 -101627 -85629 -148949 -147111 -120410 -10816 9368 -42529 -48098 21793
10004 21793 97773 88906 212989 130612 -35767 -135910 -122866 24802 -16912 -114090 -73235
9993 -73235 -26165 -37293 -103769 3344 -63115 -66123 -99333 -89095 -15953 -12254 -30197 -121222
9981 -121222 -123218 -44042 -51191 31346 -12494 -94806 -125708 -78213 -144431 -216892 -87662 -29648
9969 -29648 -15149 -103874 68560 185374 197800 39618 57905 -1937 -27741 -56038 -105799
9958 -105799 -35132 62709 143640 80327 -42931 -176114 -100090 -43901 -69543 9187 60884
9947 60884 101858 -9452 -191344 -25871 5517 54719 116455 39270 16011 -11665 15030
9936 15030 1848 2290 30078 -137502 8436 59079 -75949 -83000 -247459 -126023 70760
9925 70760 154639 38357 40179 60456 44006 -151062 -75784 49830 65655 63683 -81509
9914 -81509 -30655 110086 80650 73175 71143 68976 76679 35332 -29676 -75503 -63778 -10846
9902 -10846 -36997 -75649 41470 -73565 -124646 -123130 -196919 -229366 -45683 -25894 444
9891 444 -17065 -90367 -104371 -186608 -168382 -52977 -127735 -47080 -233478 -284752 -95630 -103578
9879 -103578 -143379 -215989 -168778 14080 13078 99413 97801 63475 -12590 -111114 -129760 -187841
9867 -187841 -68556 -74495 5245 42951 93497 68596 2947 -8366 -75765 -27927 59469 101645
9855 101645 79505 123219 247262 146995 -23819 -36745 66778 -33602 64638 45523 -27157
9844 -27157 45831 217415 215194 59694 -3209 -90488 -137608 -80986 -85515 -112661 -97463 -2667
9832 -2667 105206 96691 -15465 -38196 -43032 -90294 -131177 -104429 -4738 -165377 -82256 -25669
9820 -25669 -26471 -16732 45442 640 -6577 57706 -59915 -34228 20472 29850 46109 20709 -36035
9807 -36035 -163998 -90029 -44282 -41415 -133431 -141157 -2579 33136 65807 102239 62159 84111
9795 84111 -38456 -166926 -122871 -12493 -11461 5271 25540 127997 -25923 -35075 -80057
9784 -80057 -166968 52429 30560 -21074 29855 14081 -63517 -4008 7819 -95925 -197998
9773 -197998 -134590 4224 5563 -132784 -89320 -162457 -236615 -170917 36310 63503 3502
9762 3502 22519 51769 -63379 -180468 -86231 -57831 -55018 -41724 -105186 -80259 -83844 61230
9750 61230 36017 -5021 80636 92705 -10319 -89781 -61312 -14080 -119889 -92400 -105090
9739 -105090 -142671 -32318 5498 42882 43976 -11127 51210 52384 45140 74933 -29951 -2752
9727 -2752 -32270 -100864 -88789 6442 -9929 33401 -31235 -114852 -82595 -236488 -177673 -158228
9715 -158228 -77597 21344 40438 11262 11857 72396 124375 101960 -995 18690 -22834 -176496
9703 -176496 -140554 -62607 -27391 -73575 -108835 -85721 -92363 -102641 -119237 -65580 22550 26431
9691 26431 1346 -31643 -48385 -116204 -90946 -83861 -137239 -6445 -57239 -20746 -9331 -10356
9679 -10356 49086 164792 19170 55334 65091 -118484 -40859 -49017 23139 155088 92261
9668 92261 14865 64156 63730 87724 128882 61095 66769 65108 96329 58033 -68412 20938
9656 20938 34306 -38725 157717 240170 327803 314988 246432 168071 29702 89662 191536
9645 191536 67649 85155 54485 150458 133905 91446 95118 221878 209335 153378 187536
9634 187536 100646 161475 161903 48568 85764 103249 86896 27991 8650 -19380 -40263 27348
9622 27348 126450 98428 -63051 -75083 -154402 -104237 -148026 -58200 -7475 -45224 -76320 -86351
9610 -86351 -75762 91096 -23943 -113471 -8905 9068 -17450 75295 115156 -25926 -30545
9599 -30545 40820 -417 -111251 -109652 132254 46187 -34537 81928 180042 156781 57307
9588 57307 77760 -2040 -59131 -84045 -159023 -92908 40304 48490 31953 65895 60128 -12361
9576 -12361 8087 -145330 -144865 24576 2146 -9902 -54715 -107831 58281 -34359 -78135 -26772
9564 -26772 4483 109271 69689 113653 80616 127692 3304 -24809 190880 254404 101533
9553 101533 -10349 -5734 -39915 -99147 -72619 12356 -20721 -140357 -220192 -168407 -98868
9542 -98868 -9736 -99951 -88487 42572 -23593 37020 84352 -41067 -50833 43993 126170 32761
9530 32761 6186 77556 104634 108187 123819 98616 -48467 -97414 -84264 -22251 716 45749
9518 45749 -55853 34531 21753 45194 159094 -18737 -162827 -117271 77297 12244 -5082
9507 -5082 -59387 -48456 -38897 39796 43690 -99587 -117493 8898 -79679 -190288 -123957 -15539
9495 -15539 58655 -45200 -110186 -149666 -118879 -31178 -19513 7567 -48398 33780 15118 56024
9483 56024 -9976 -193536 -112637 -66087 27081 8150 42638 51873 -94216 -10382 65989 23489
9471 23489 80376 40353 -34700 36265 118793 131816 90605 -85331 -45678 -40042 17841 66312
9459 66312 4661 124293 183324 4439 31772 30736 31348 12133 68664 138292 102899 169051
9447 169051 41571 -118017 -85193 -706 122310 116614 156773 33704 -72201 -9349 -9239
9436 -9239 54704 39663 87632 76665 132281 160740 141303 113993 44621 76911 130139 135098
9424 135098 114173 270678 220112 194015 101915 -49999 129570 84868 -3645 -124462 76517
9413 76517 127430 -2821 -10617 23610 20671 112454 184735 176185 135895 142076 143976 200610 -12052
9400 -12052 -30607 -5789 -6725 91720 54953 63060 83469 81071 -54910 30020 -21115 -12475 34218
9387 34218 -53020 102931 43604 -47818 139412 117591 133314 182681 216613 243923 123580
9376 123580 20834 111347 87675 188220 133251 185012 243621 177748 191088 69829 -23588
9365 -23588 -51698 48752 90518 37245 146057 211359 186018 180251 170909 152484 11344 -46017
9353 -46017 -25282 107714 50756 -1450 -8926 18067 146629 177921 197985 122885 99095 120011
9341 120011 -10441 3216 72281 171377 180153 143589 242992 214085 203165 232421 308629 136093
9329 136093 124811 193176 92736 136543 16405 -11196 13875 51220 140466 68162 -61182
9318 -61182 7237 118357 13294 41620 144155 188261 144758 198011 158735 25153 -10063
9307 -10063 -68211 -158366 10312 26278 40988 53948 98208 146469 257914 139292 34646
9296 34646 52328 -26893 -74495 -96827 -101277 -84024 15921 66123 236275 132059 90862 100320
9284 100320 98394 85725 64493 8024 -74815 -177464 -6216 72712 50992 129405 32169
9273 32169 -53345 126283 176932 53987 88975 62425 166932 260374 69791 41822 45909
9262 45909 80125 44138 107165 53378 -1061 42397 71553 203970 172158 58725 133689
9251 133689 131680 99219 162657 97062 156694 186816 238077 107411 36189 76606 -15866 49575
9239 49575 87754 199694 9789 -12641 -31007 -74268 153844 129249 55865 156786 115131
9228 115131 148488 247874 223888 220553 192518 218992 135727 97510 169674 107793 -8194 98060
9216 98060 118881 127542 62829 90402 23611 55017 188730 8197 6655 69257 297 125191
9204 125191 84320 27452 121548 134255 81054 80223 75246 125669 113184 243567 263998 223313
9192 223313 120471 135882 189016 281658 289602 219433 58088 75536 131681 148578 157866 83574
9180 83574 119680 147692 169989 170843 165188 178474 232168 137143 77051 195410 210207 102283
9168 102283 76583 -20443 -115101 -59155 -3727 -17973 96162 120924 243601 103457 -24288
9157 -24288 -8039 -39571 39646 103635 121814 124497 234681 274675 180707 96605 58525 164863
9145 164863 109098 157460 191592 188766 161538 186835 134427 194366 208854 188852 282549 204139
9133 204139 207157 203590 69999 184627 234765 217700 251410 147899 167071 173416 98206 122177
9121 122177 196866 122822 65067 136555 144639 212082 197622 235110 199379 136086 117524 154123
9109 154123 235334 153383 140039 2931 -46370 69826 187574 135966 174723 167926 211525
9098 211525 153482 61112 139959 311618 385497 202394 208521 389836 223611 250009 189506
9087 189506 64572 15149 49851 60063 -4517 91460 44250 199299 302630 290333 189084
9076 189084 141177 196143 188798 134928 161844 146137 305856 215920 152538 21130 96190
9065 96190 253227 245546 168838 99478 197163 161412 69731 119621 93138 158789 108393 47669
9053 47669 202141 198777 -132896 -191295 -48429 16871 35011 73496 188697 165105 172312
9042 172312 137186 111539 91243 159326 272866 300686 211581 235729 105867 126525 225740
9031 225740 296327 177258 92248 99661 198371 75662 153983 154280 220069 132909 124122 234890
9019 234890 277581 244689 242240 119993 88062 152445 92216 136619 160875 177285 255619 63856
9007 63856 84542 304061 264808 332345 249718 250420 277047 261793 249056 417801 303497 271809
8995 271809 283317 288503 336713 295067 347874 288730 306663 254868 256196 307761 330162 357898
8983 357898 282100 201215 279851 325555 490233 434641 528688 417949 340712 408652 516508
8972 516508 534432 313351 398156 406788 463858 563604 699567 650298 594653 608200 656117
8961 656117 729875 761396 853963 887452 895201 948812 1023356 967292 929966 1064296 1152865 1251864
8949 1251864 1269329 1390033 1509256 1706136 1853096 1963299 2018397 2428875 2591668 2841921
8939 2841921 3233679 3736742 4195412 4738350 5459277 6435762 7341208 8732446 10321834
8930 10321834 11941207 13282766 15165536 17986289 22618745 27829982 31640111 27696539
8922 27696539 19530283 14847104 11639262 9751300 8295585 7279119 6471053 5850287
8914 5850287 5209897 4897675 4620462 4265412 3882514 3737329 3496515 3181650 2670960 2435511
8904 2435511 2295540 2109872 2010580 1885273 1745297 1754094 1682956 1470472 1326276 1423482
8894 1423482 1327731 1208016 1170752 1145583 970191 986611 946424 790841 798824 784486 732784
8883 732784 813946 658734 652191 638662 619454 666698 777936 575829 531792 475960 369006
8872 369006 537859 520778 430908 568253 478346 320933 367018 495810 483919 465026 453382
8861 453382 360608 260034 273102 412448 407324 474899 303288 317678 323591 336379 339697 414533
8849 414533 184423 201059 341863 349671 334030 365972 366924 353066 343111 374550 333081 437468
8837 437468 402537 269280 189871 261550 373804 351956 309588 306643 392976 295641 232522
8826 232522 264959 183899 265899 181929 113497 194906 54451 205166 209257 303087 322880
8815 322880 148421 276246 233000 198851 112017 169475 149199 142538 205149 167404 243440
8804 243440 124068 165953 303819 257761 269783 229060 99396 22444 36154 47335 78695
8793 78695 122553 215141 132329 159566 350186 301751 271724 244634 238868 107503 67620 185927
8781 185927 133849 235924 281910 158310 181767 140155 161751 198150 356173 294804 98611
8770 98611 121143 181434 127509 155033 156896 185325 84290 96086 170874 167580 247737 242032
8758 242032 169882 160234 126021 221168 283328 222060 242404 232704 215656 163209 174718 243661
8746 243661 253238 202978 93680 105120 116004 276918 197981 45866 38337 26717 93382
8735 93382 118255 145827 123554 90342 133730 70480 -63102 136252 161249 237056 76539
8724 76539 -40011 40738 14782 33487 35047 -15056 -32963 84265 76875 132870 131213 122821
8712 122821 224299 215690 128663 81481 171144 153178 125587 114440 75469 47475 33445 47791
8700 47791 81317 152847 39459 135963 107840 52738 192517 104025 48424 72328 173547
8689 173547 147436 205627 131825 112898 139184 183882 193594 158069 92008 40906 -44200 33151
8677 33151 12004 110297 92571 29527 -59232 30139 96985 133407 220978 268010 221808 115736
8665 115736 121991 22915 -17040 -35759 58714 30629 46194 3930 -35574 213292 150393 8978
8653 8978 167471 105251 114021 109398 95632 118019 106529 -85026 22582 168183 127538 107513
8641 107513 93541 57485 42172 -100767 -42823 -587 -68752 -148614 -35422 -27493 74503
8630 74503 44172 39299 31842 -138074 -78882 -67563 -103734 -44285 -49089 -80494 89575 128054
8618 128054 -2901 80735 56655 58200 -43563 -89013 -6370 -109276 -11940 77503 169345
8607 169345 164224 75277 24373 102660 102620 153949 165977 150158 194350 210783 137860 97028
8595 97028 74111 92154 43585 12669 -37589 -11502 -130852 12657 6939 -94396 -241591
8584 -241591 -88635 337716 250560 305272 198701 264042 186578 51660 -61519 25244 -56367
8573 -56367 3718 30030 75128 216871 65922 22884 96231 129533 -26405 -3405 -115839
8562 -115839 -86855 52894 182715 182925 139286 80540 161989 230491 137738 181884 244370 190224
8550 190224 116884 219447 297178 237199 275956 274213 118546 77263 53254 61707 202903
8539 202903 91994 80725 83804 223729 181630 104445 89001 56482 76793 126174 90538
8528 90538 -19940 -34731 22555 162051 209619 137054 -123114 -35259 161211 87988 -69287
8517 -69287 -1109 44582 18958 -70208 -172632 -92350 62494 39251 95970 121814 49507
8506 49507 17214 -26912 -21477 -32103 -51620 29765 86492 109925 4246 -117850 -99962 -38900
8494 -38900 52168 8420 -26111 69333 61527 89926 138250 76285 5907 50638 92908 44835
8482 44835 -178061 -76471 -25963 -164859 97359 80455 164028 164889 149378 175188 181659 119618
8470 119618 95174 106332 64469 232757 280065 140909 18750 -85260 -156634 -62360 -104313
8459 -104313 -75764 -37703 -55080 68724 160886 19021 -48360 -42854 -85541 20374 68338
8448 68338 226817 132834 22429 187820 108811 -20614 61977 168753 174289 -71079 7368
8437 7368 116088 24704 -46672 47131 75367 30548 69554 33756 147290 96371 -3524 -20661
8425 -20661 30032 -114632 -83809 -27542 -145276 -140269 -86069 -37622 12043 49437 -26302 -70144
8413 -70144 40406 23558 39585 -1866 -39147 -42785 26992 -46102 -19532 58602 -19916 -116986
8401 -116986 -194615 -72224 -396 8084 -130771 -100044 -86636 -32020 83877 149095 1269
8390 1269 -38104 65360 18590 35037 31643 -25480 -94078 -62901 -204814 76275 107659 -7162
8378 -7162 -550 -39788 -106645 -84402 8705 45167 -29877 8772 -33148 -121426 87887 148491
8366 148491 148893 151565 111542 -32000 -42953 -228726 -154718 -87157 93835 61956 55494 -22941
8354 -22941 -149587 -204952 -30653 -133956 -309324 6897 97368 -161616 -225412 -156308 -31892
8343 -31892 91829 -89111 -198471 -106656 -21326 -69822 -87304 -122307 -45501 -60102 -31536
8332 -31536 -10991 -56586 -45409 6003 -89290 -184209 -222229 -17106 38963 56630 -59059
8321 -59059 -102550 -43202 -109989 -53709 -24470 -113877 -147179 -158617 -100989 -74585 -200935 -206426
8309 -206426 -229758 -191190 -55093 -88342 -61838 6499 48553 -11902 94643 142772 76185
8298 76185 -5336 -155041 -118886 -17020 41178 -119292 -39765 -93689 -150539 -143453 -201061
8287 -201061 -36682 -72949 -28369 12865 -59525 -43683 -15916 -49355 -82097 82964 -5611
8276 -5611 -7945 27382 -8916 -16376 -127524 -147145 -195757 -63250 -67942 -204978 -257563 -106529
8264 -106529 6914 -96318 -114971 -63580 -18748 109876 3532 -139364 -51625 -89092 -34051
8253 -34051 -134486 -78826 -40511 -146207 -118686 51876 17349 25639 83567 7074 -118550
8242 -118550 -75642 65450 -37523 -144108 -26348 1179 -136897 35472 4858 -29291
8232 -29291 -163566 -184634 5235 -40208 -41292 -22301 7240 47351 118826 220032 139432
8221 139432 20136 -19795 -92235 71994 -2676 24524 114202 85368 57828 -9226 -71914
8210 -71914 38306 -113714 -214121 -173577 -142333 -195490 -90151 -95853 -137362 -173481 -58267
8199 -58267 90870 83829 -11231 -55775 131743 326145 -88533 -1326270 -986927 -554834
8189 -554834 -278978 -306903 -240953 -245930 -246318 -153241 -128660 -80019 -73100 -50920 -40835 -145810
8177 -145810 -180835 -215597 -265836 -193109 -161056 -129606 -149705 13409 6171 -84319 -121256 44953
8165 44953 -73347 -162898 -62217 -19814 -54689 352 29586 51221 118915 150467 -61548
8154 -61548 -101353 -69438 -75824 -150073 -99695 -90313 -65599 -123976 -124728 -196684 -172308 -116122 -140962
8141 -140962 -8830 -24872 -113414 -64404 -70639 8923 87294 63438 97204 34323 61770 -9786
8129 -9786 22709 -159936 -175289 -9089 -13142 94651 21714 -30718 25769 992 -219 33628
8117 33628 -56089 -179678 -39523 70663 -73 -19386 -46886 71575 87291 -17886 -76166
8106 -76166 27589 34672 9498 85740 -13791 -85605 -203096 -171211 -98187 -80071 -100045 64702
8094 64702 146287 -50412 -101946 -148625 -195440 76424 34441 52296 -30698 -208212 -146385
8083 -146385 -66957 -60840 -40480 -16463 32117 -31649 -71654 -25825 -164092 -148042 -11143
8072 -11143 104313 46906 -106279 21695 62899 -124206 -88867 -76995 -52911 -37496 19107
8061 19107 -34142 -72980 -143874 33870 -19683 -21481 94644 113824 -73375 -165009 -220013
8050 -220013 -190355 -11935 30540 -32322 -102726 -41888 -69015 -89168 -122038 -29527 -29193 -17267
8038 -17267 -17877 9117 32505 26753 47573 144963 99598 -169233 -211629 -153059 -31367 18093
8026 18093 -15474 -33003 -25218 5826 -159527 -151599 -57582 -15750 -11238 76279 -43483 -14062
8014 -14062 -8556 -40166 24666 -12180 -29799 103374 25921 6136 -45437 -140988 -57152 -114605
8002 -114605 -135307 -61484 -51148 -143057 -106690 -115016 -88312 -92018 -90027 -93346 -92524 -161966 -190281
7989 -190281 -80504 -197688 -281659 -284351 -237524 -50722 134827 89878 59440 48465 20085
7978 20085 73204 10624 6600 34986 -46367 -55092 -125882 -191883 -128111 -100065 -31795 -53561
7966 -53561 -94461 -123324 -68959 -205620 -94950 -74314 -95570 -29466 -104451 -58335 18335
7955 18335 -5181 -18895 216 56878 77552 14563 78211 58897 -78233 -95966 18764
7944 18764 -24019 -68177 -20863 22813 2611 -79106 -250471 -243173 -193045 -69611 -108426 -53491
7932 -53491 93334 24814 47990 89565 -26604 -25431 -31597 -148579 -59052 119 -102968
7921 -102968 -139488 -114909 -105268 -120158 -117270 -105139 -126723 -109111 -161532 -21014 -73209 -94015
7909 -94015 -7417 153951 20934 32423 37023 -22046 -87469 -72534 -117812 -77685 -87611 -103055
7897 -103055 -14150 -135604 -30006 -47018 -61706 -3404 -4706 -100860 -71958 -73040 -32297 93139
7885 93139 88084 15953 -114185 -197265 -181117 -31919 22823 -8518 -73118 -63178 -42538 -135278
7873 -135278 -31191 -180974 -181500 -35207 -30565 64737 -43781 -107732 -173977 -169943 -75421 -117010
7861 -117010 1438 13740 75892 22099 -27571 -115586 -69264 -74496 -12689 -28555 -153919
7850 -153919 -24803 -65932 18940 4132 -91955 -23624 -96464 -76553 36168 -20231 -97914
7839 -97914 -33289 135147 80906 58059 -6746 -21655 38289 -129451 -52228 2617 -41816
7828 -41816 -29075 -5120 -16840 -148492 -171207 -111805 -103444 -89129 -80134 71182 26439 19199
7816 19199 13382 -70929 -138712 -120447 -169608 -61547 2913 70053 -39811 -169323 -159144
7805 -159144 -30747 -30838 -152836 -212445 -18967 378224 137241 148291 213129 175169 159176
7794 159176 145804 132234 92064 106970 115278 -45766 -89124 -59093 84105 53529 28388
7783 28388 25190 99823 120248 54222 76219 36916 24032 -35463 15759 50616 28516 5035
7771 5035 78083 -101282 -138131 -92999 -80463 -100960 -126129 -92928 -84733 -107691 -126141 -193731
7759 -193731 -149896 -262692 -343556 -126344 -93657 2755 -81024 12810 28411 141628 56291
7748 56291 -9523 76138 45238 -133283 -18115 -9881 -26661 21230 1589 16035 -84701
7737 -84701 -42515 6823 -47059 14179 -3552 -70175 -21589 -77999 -230639 -278209 -97717
7726 -97717 -107040 25911 33474 -16515 547 35117 36814 66777 -50721 -6575 -3809 27737
7714 27737 121547 110539 229845 217758 105080 48023 -13484 145867 44718 -59232 56793
7703 56793 105398 -55533 -120572 43282 -15785 -40960 -14370 17242 -69498 -32060 -95306
7692 -95306 -144948 -122799 60062 68593 46090 -19673 44016 6394 36393 -29006 -158840 -56509
7680 -56509 64708 41895 116635 124018 34530 -36688 -3060 170273 91142 37083 29465 43077
7668 43077 161684 103494 -85966 -49155 -53688 -106359 -122488 -121226 -12120 44621 106248 140909
7656 140909 -67386 -29057 41125 898 -48187 107226 78387 154807 28757 -177342 -209007
7645 -209007 -152842 -129785 -46196 -44147 109279 192449 76992 7728 -53157 -50432 39088 104980
7633 104980 88848 43022 46355 47768 55809 44206 84213 69837 69169 26196 10502 9447 64362
7620 64362 121710 40456 71465 109699 16975 11664 -3361 -54194 -20216 -14193 62489 -30409
7608 -30409 -39844 43714 -19703 49646 87972 13284 17952 -6198 -27321 91638 -22663 -59044
7596 -59044 58639 113850 139108 -46513 -91847 -51773 -31755 -52132 9537 118901 97272
7585 97272 -51845 81394 36250 114240 147142 108150 -4094 -52175 -57621 148325 199045
7574 199045 98040 126022 82181 -18135 -111142 -58985 -93535 -98967 -148853 -104826 -5667
7563 -5667 -59212 -35017 -4842 -81962 -112824 -237300 -194903 -208175 -133417 -28445 36612 97536
7551 97536 133524 64915 -54177 -32434 -14427 61515 50462 -7609 49501 115124 120742 186291
7539 186291 156115 60036 51511 119073 994 -75797 12922 59550 68970 165238 86107 -76960
7527 -76960 6169 21955 20877 53401 107162 158068 58507 4760 43866 -74515 -148622 -142917
7515 -142917 -123368 2533 -106751 -145833 -201937 -91605 -107712 -147042 -159693 -93372 -14587
7504 -14587 -51607 -89396 -87003 2521 95836 -18849 -82452 -132570 -107046 70972 -51028
7493 -51028 -128820 -30017 59571 3517 -31164 -8200 23832 -147082 -188414 -98684 -51735 81925
7481 81925 21818 -125191 -107398 123552 -67394 -251543 -131539 -159307 -45971 -11955 -22025
7470 -22025 -22764 84091 128165 69739 -12565 35765 -9342 -76769 -67384 66190 -41632 -13649
7458 -13649 -43296 -38111 41935 -66794 -78739 -100794 -251502 -185637 -173149 -233788 -111791
7447 -111791 -107765 -38013 43266 -36000 -682 -46981 48780 70466 -100684 -85119 -108554 -105045
7435 -105045 -143024 -112996 -20579 -70131 -44204 -41951 -50445 -114947 -166776 -64753 5903 149095
7423 149095 51817 -62569 -123353 -90507 -159695 -126472 -166902 -257418 -165246 -170628 -44260
7412 -44260 -31196 -5848 -92 -64751 56168 178080 179710 189844 224540 17069 10355 95060
7400 95060 23289 30820 -97215 -12858 18562 -20702 -95793 -76426 -101287 -60171 -59562 -35350
7388 -35350 -110666 -18188 111715 18334 63938 76128 28782 -61836 -46631 -44379 7879 -14438
7376 -14438 -61008 -21239 -3174 -130148 -81761 -140701 -47441 -3638 -52530 -19706 -4174 -153118
7364 -153118 -62981 -78519 -110323 -125379 -28065 -32244 -56417 93546 36281 -33182 -17711 40525
7352 40525 -42028 -15331 75507 -32902 -104551 -33670 31643 1113 -85637 -43310 -99975 89285
7340 89285 49978 -33128 38781 54423 -49346 -174434 -14550 109084 -10260 -7193 13615
7329 13615 21089 149834 201066 142752 -19526 -96817 45843 98409 23241 -99494 -211729
7318 -211729 -68054 -47571 -10276 46124 94084 38970 -20390 -78050 -32984 32561 21561
7307 21561 -61473 -84285 82349 87845 5157 31196 -23695 -61786 -86429 -147048 -147852 -131907
7295 -131907 -86774 44155 18115 13564 121594 169505 114093 21481 164932 302090 158608
7284 158608 140542 241282 -17969 20798 6257 -1425 82373 151776 216539 233720 78117
7273 78117 96589 124684 75026 -2843 -14012 101982 114198 53527 115052 117575 109638 140591
7261 140591 165039 238513 89494 144727 99346 62291 -22195 -46839 56392 74047 -24490
7250 -24490 7611 15435 -12599 -34907 -2773 -127025 -132019 509 -54117 -108772 -64089 -41171
7238 -41171 49945 53181 32982 -7883 -79468 25169 66616 70791 103768 -7775 -124401 -208343
7226 -208343 -103564 10384 60407 117972 14250 22866 -145370 -180434 -189025 -70949 39891
7215 39891 83507 8929 -89897 -109948 -77151 -135024 -134866 -115341 -110966 -96886 16746 4060
7203 4060 -45759 20219 -2774 -32694 -32039 -49912 -81650 -67913 -10330 -86978 -103660 -17518
7191 -17518 -22054 150730 44580 -93773 -65469 -159651 -211621 -110834 -122328 -19954 -87325
7180 -87325 -127850 -77597 -43391 27884 23406 48916 -6990 44951 -11137 -38546 -143701 28332
7168 28332 207889 62386 -612 -8320 -68749 -80109 -73528 -11908 17250 -44423 -37496 -68914
7156 -68914 -46592 -24132 84609 15679 29121 155932 39438 194442 160035 -57221 10754
7145 10754 96385 29645 -22526 101673 45441 -11162 -49662 -90969 -92126 -101377 -101525 -78346
7133 -78346 55025 17874 -41869 36664 -36573 -113626 -118171 102463 180699 125738 126785 15356
7121 15356 85901 105765 30422 -83861 -68937 -5278 14892 70380 -75341 -118264 -22837
7110 -22837 -18888 74199 -1632 -52074 -60755 -45602 -4370 -7183 74047 17809 56169 82438
7098 82438 125854 78750 31723 -19158 -12895 9427 -77960 -135059 -42631 -129845 -32086 -37055
7086 -37055 -123255 -52868 -80872 -76573 -85261 -21009 -915 120585 34714 -49790 43042 26820
7074 26820 -59981 20477 -72562 54903 149394 144321 193884 108985 -3602 -102493 -101112 -23016
7062 -23016 54247 127258 39108 69312 216306 198870 35814 9191 129385 -13072 3653
7051 3653 1373 37694 184399 171894 63976 -134886 -203482 -57704 1134 -52730 -4737
7040 -4737 201822 140826 184810 154200 204299 150209 105241 65669 25989 -68368 -131855 -97667
7028 -97667 53164 198878 127948 132594 -18673 92153 87183 82805 141531 76130 105910 115824
7016 115824 86266 -2821 -112614 -98569 14655 -23041 -62037 -38601 39582 46064 42730 38637
7004 38637 -4515 -6552 -64395 -11272 150541 117503 123888 96395 66345 -114924 -52883 -20723
6992 -20723 46160 223851 192168 123710 31742 78402 -23802 28457 4129 -153180 -59348
6981 -59348 74317 6376 -667 51757 73401 26635 75582 163634 169207 43227 34833 89453
6969 89453 4698 -45385 75052 113700 85261 -18136 59489 57985 27483 -102774 -15791
6958 -15791 26941 54160 -57524 -80592 -11991 4337 -21301 -72771 -112219 -124802 -18308
6947 -18308 -139733 -27008 -42994 -113853 -77788 -86001 -30624 -55018 -5188 -114897 -22872
6936 -22872 -55223 -81333 -67705 -81284 49594 73405 33825 47930 30555 13015 54546 -2345
6924 -2345 10752 -59184 -17445 -43137 5805 -54963 -24700 -24881 22913 109934 -2425 9795
6912 9795 39006 -30725 -32731 -4706 -62366 -112232 -142425 -133791 -97282 -31443 72820 115935
6900 115935 107860 95087 74590 148348 286068 278312 62367 -27371 -44998 -100834 -137869 -76326
6888 -76326 -76348 26171 32917 12676 10962 -56374 -63684 -219411 -98076 80725 103310 91524
6876 91524 139594 70748 -42327 -58921 50945 -37775 -87862 14306 44425 -3816 61672
6865 61672 78994 -93596 -85446 -26203 11981 -15073 -34791 -42923 -82257 100514 106085 78487
6853 78487 41379 59824 50939 93153 -37078 25670 117542 9880 -204743 -167617 -117901
6842 -117901 -78325 -7333 -66869 -119555 -162505 -135734 -68988 128327 55506 -38430 -139045
6831 -139045 -140246 -41419 36875 -54105 -54348 -71777 -74403 37914 -112409 -53852 -13907 41061
6819 41061 85231 156211 132895 91324 1321 27022 -59850 -81368 22555 -22460 -21158 -78799
6807 -78799 56190 -12391 46494 98267 86797 151100 114580 -29127 -39482 -42155 -51607 -40770
6795 -40770 -12079 -71281 83554 57013 -5105 87226 650 -76862 -56340 -73621 53038
6784 53038 205534 102989 42589 -97429 -53390 -1534 -53443 16388 43096 131580 132415 28992
6772 28992 18204 161846 77010 39711 167043 129448 62117 -9906 52294 124108 256531
6761 256531 279995 276612 265964 194287 139341 83372 163192 158412 109668 38139 10766 102145
6749 102145 265723 9751 78156 237953 132028 136213 226143 149276 91479 135044 305834
6738 305834 149094 -32922 -82240 -37489 85861 89982 55240 25925 1076 -6956 79743
6727 79743 145004 155870 138071 107317 136592 141393 107642 53918 15702 84746 75985 54437
6715 54437 48199 19394 -84395 -49042 -63766 66594 83767 -54921 78023 52215 -16817
6704 -16817 69261 16728 52476 140491 70049 41169 -3014 -35870 -5178 29865 73470 117194
6692 117194 -20529 -52936 -98339 49441 20534 -11058 27279 -38984 40594 10869 28478
6681 28478 -83510 -128671 -163029 -26439 -75407 -26781 -132794 -111207 67669 43308 -81612
6670 -81612 -83957 82222 120940 -16207 34722 94934 25547 -111220 -16882 20459 -11252
6659 -11252 96715 119247 168301 265019 18066 -19863 -3709 90827 232024 156955 125289
6648 125289 76775 212701 94639 43332 219156 266247 266524 260521 203451 162232 220535 319588
6636 319588 252807 208499 323437 406849 583842 681950 728116 760521 567902 500124 644249
6625 644249 509726 430096 583002 678087 565138 656214 541847 543145 764653 655535 611286
6614 611286 631329 593330 639633 722472 704249 631255 515035 738357 668436 517225 513437
6603 513437 557779 733527 668617 649220 653226 649338 744817 683949 615259 612010 683817 594521
6591 594521 624264 707105 903640 727645 680987 623346 411663 555207 420582 460297 418542
6580 418542 342445 230645 243952 287881 258758 261432 271534 238834 356938 262115 164833
6569 164833 214806 203099 264438 258248 293134 185493 114191 81099 130844 33723 80587 223182
6557 223182 276225 259704 332838 300204 162828 224161 240288 208673 251679 239927 333288
6546 333288 204116 190787 339954 376868 300765 157888 194073 312551 212068 244666 281944
6535 281944 293258 116099 89839 240211 222704 245597 310591 263758 176806 231657 294661
6524 294661 348963 243659 184860 178581 180946 126828 221385 357746 282604 269134 352075 357621
6512 357621 307323 292860 283907 290742 209692 131037 177342 270329 315040 414347 301137 35699
6500 35699 195988 338466 349029 433419 266637 278284 265975 296005 263838 349301 366541
6489 366541 289587 377233 399060 294661 251533 334412 303462 228760 127198 71608 107457
6478 107457 214436 265711 229607 128437 220874 313958 286813 327723 476256 369004 283932
6467 283932 422517 414055 305586 428255 455593 555380 490758 302047 298665 296839 390694
6456 390694 514804 520139 608480 477032 498596 455485 374618 398634 488763 566082 527229
6445 527229 504885 497918 457441 498990 671738 608392 561987 562948 414441 570291 567205 488174
6433 488174 499247 477844 586606 644380 668722 627561 640990 564020 571267 577809 463034 519964
6421 519964 527537 565053 516393 708583 637334 588717 730535 744552 686428 786521 828612
6410 828612 865073 867183 776274 778369 754061 749677 737945 747458 802514 733952 747153 891154
6398 891154 790376 697272 659440 700530 707703 846176 907505 934796 930379 993848 930886 876973
6386 876973 875851 942397 897260 987112 996841 969697 1064943 1149873 1172868 1118165 1244185 1193563
6374 1193563 1036796 930749 975288 1144261 1131431 1142611 1195599 1224646 1211463 1244647 1323170
6363 1323170 1307619 1235484 1239315 1385145 1452711 1482557 1388499 1331719 1404673 1383524 1498890
6352 1498890 1618839 1592771 1464138 1506808 1689926 1692583 1724848 1817503 1902427 1956831 2036053
6341 2036053 2041329 2288846 2527804 2535947 2467032 2461128 2707697 2908471 3010322 3097201 3365073
6330 3365073 3573937 3666328 3840463 4171052 4328986 4589983 4755452 5166952 5678255 6133466
6320 6133466 6564028 7020194 7671074 8346581 9053688 9939429 10835461 11746877 12786685
6311 12786685 14179722 15730927 17591165 19971337 22452790 24927507 27317731 30186857
6303 30186857 33376972 36105320 38466228 40823753 43728231 47612102 53425666 61083360
6295 61083360 70209677 79071814 84589998 86514031 87205184 87077096 84664902 80422012
6287 80422012 76609994 74652663 75058217 77949819 82449325 87601851 91432475 92957887
6279 92957887 94162429 96420768 99145983 102326978 106408167 110488284 112171795 110962666
6271 110962666 108214454 104900933 101021176 97219614 95013997 95022607 95578622 94936158 93348604
6262 93348604 91776729 89087787 84983264 80474408 77518013 77295894 80125361 85350914
6254 85350914 91166292 94557432 93101432 88887214 84101459 77154722 67484186 57607221
6246 57607221 49402046 43155625 38416287 34578972 31537936 28824127 26369273 24274202
6238 24274202 22551665 21063552 19736372 18449623 17210659 16077965 15071734 14165022
6230 14165022 13237079 12420884 11723989 10942819 10282281 9771219 9306936 8782924 8369803
6221 8369803 8152085 7722908 7450338 7107536 6769419 6511649 6281327 6205064 6031403 5881898
6211 5881898 5598243 5348882 5199928 5067237 4858272 4760916 4697707 4707939 4611590 4344797
6201 4344797 4277935 4028685 3928545 3820077 3766849 3724145 3748965 3720667 3608809 3598734 3410829
6190 3410829 3311306 3467737 3294456 3248374 2983513 2765404 2796607 2760115 2816388 2827226 2698937
6179 2698937 2647372 2708747 2680452 2689220 2745488 2787022 2662208 2571718 2495949 2415151 2548745
6168 2548745 2695421 2479777 2385685 2340123 2297244 2188818 1977243 1972276 2035561 2051317 1858857
6157 1858857 1747066 1911744 1936587 1806181 1719932 1636158 1545124 1568225 1583367 1546864 1586046
6146 1586046 1448320 1285873 1375555 1286835 1251497 1179380 1247168 1192054 1000934 991766 1098631
6135 1098631 1048395 1092984 1123605 1017813 1015651 970892 1050107 908799 908224 929832 941931 983663
6123 983663 940658 778738 740455 811315 831665 767045 802628 828715 648022 671675 670087
6112 670087 633969 687880 720678 707174 629372 806480 745545 719647 710718 703154 839048 744736
6100 744736 671244 718447 671974 647607 664092 619313 650729 661353 636723 770347 842643
6089 842643 727307 650105 542029 621016 690701 610125 720128 859944 998086 989002 924178
6078 924178 877151 1031820 1064604 1003740 1042195 1022812 1135599 1161340 1079419 974427 938440
6067 938440 946765 926387 850444 926296 886298 871127 973158 1009506 1113327 1021625 1070825
6056 1070825 986100 933566 941817 901398 1046192 1141920 1067285 1026546 1163880 1239843 1095894
6045 1095894 1041905 1063072 1037016 991174 950664 907229 749347 709777 668711 788926 847874
6034 847874 932980 922278 979745 961413 936157 857617 816640 826345 832051 824264 769699 818775
6022 818775 694664 669402 680688 671007 744102 781679 850510 874911 837454 767837 739914 858437
6010 858437 945998 1040562 975851 896398 912097 842511 810633 908328 998075 1219093 1305290
5999 1305290 1259036 1192548 1218325 1198537 1139679 1227410 1391606 1597376 1739918 1962108 1977873
5988 1977873 2064530 2128426 2166847 2148164 2120419 2072444 2052512 2044527 2061509 2232441 2292039
5977 2292039 2306983 2450650 2287187 2310794 2323233 2380631 2666488 2680397 2799386 2918280
5967 2918280 3043818 2976116 3018932 3149104 2941198 2768316 2664014 2670605 2714893 2739628 2659583
5956 2659583 2641423 2653409 2708069 2902925 2993862 2952613 2960660 2964478 2897144 2883730 2922188 2981634
5944 2981634 3060519 3186264 3143915 3084480 2910250 2776459 2732352 2539119 2407022 2509030
5934 2509030 2519727 2402432 2391382 2357443 2431749 2468093 2326232 2409517 2397141 2285150 2307139
5923 2307139 2286512 2317872 2308096 2307027 2268344 2311898 2232679 2272657 2312543 2204844 2375350
5912 2375350 2488650 2484776 2432716 2341388 2220795 2249816 2347803 2272697 2177762 2132696 1984035
5901 1984035 1987910 1885891 1885443 1936700 2146237 2145029 2036623 1969368 1945195 1874729 1875324 1913806
5889 1913806 1913370 1893061 1857204 1921859 1766492 1888260 1942976 1842825 1894350 1967790 1960480
5878 1960480 1984275 1999177 1912004 2089715 2182690 2216051 2206174 2147328 2218526 2217743 2408272 2300044
5866 2300044 2180212 2238899 2243456 2192194 2205627 2213405 2129141 2291282 2294025 2291005 2259148 2196738
5854 2196738 2278874 2288328 2456449 2534385 2435358 2462927 2453052 2494607 2594339 2610261 2640531 2493720
5842 2493720 2638747 2858365 2981475 2985235 2854418 3038647 3120747 3221539 3246082 3147136
5832 3147136 2897676 2908578 2949790 3027541 2991934 3032825 3090697 3102215 3139737 3195800 3068871
5821 3068871 3003626 3166437 3204646 3306965 3361711 3389387 3481193 3684392 3627917 3643344 3744191
5810 3744191 3838824 3927781 3994953 3952084 4073649 4283943 4270550 4416193 4563803 4643270 4754103
5799 4754103 4817495 4708330 4796903 5171550 5400831 5625580 5696264 5887156 5974807 6214295
5789 6214295 6392766 6808010 7107695 7318380 7639321 8028431 8261276 8715618 9233027 9726314
5779 9726314 10356974 10848604 11514663 12242133 13216579 14160523 15232667 16407980 17759367
5770 17759367 19516003 21361962 23207329 25240117 27719827 30746346 34494711 39030416
5762 39030416 44495957 50130382 54973163 58868654 62482775 66502600 71415949 77778249
5754 77778249 86189876 95627943 103949425 108940374 111039320 111896550 109941539 105326600
5746 105326600 100074177 96721393 96105766 98530487 103797286 110504275 116385323 119475344
5738 119475344 121011418 122417065 123331467 124359015 126897322 131901900 137650216 141218636
5730 141218636 141872098 140527513 138258491 135515037 132738092 130915609 130390593 129548784
5722 129548784 128473189 127642383 125564727 120872973 115436415 111498328 108859644 107995236
5714 107995236 109930409 113795974 117551839 118521446 116161945 112515123 107597500 100728997
5706 100728997 92861508 85976193 81302956 78333204 76521646 75362902 74601480 74755712
5698 74755712 74814490 74294058 72860315 71427922 70381701 69394118 68723432 68860657 69873949
5689 69873949 71808260 74583892 77935947 82486972 88288591 95366218 103649727 113001155
5681 113001155 122083520 129693650 135780752 140137275 143201568 145226602 147695180 152616744
5673 152616744 161808106 175852067 193857001 212399601 227114156 236848880 240858768
5666 240858768 240072145 236912549 233770886 233037414 236060402 242193065 249304278 255553733
5658 255553733 260946224 264032095 264892434 265655833 267105335 270472007 278999176 295300449
5650 295300449 317574122 342081378 361806445 373270995 378647686 377793544 370049248 357890022
5642 357890022 343658841 329652550 320581921 314864770 308713042 303115813 298331217 292383114
5634 292383114 285440315 278167723 270020672 260671700 252365829 248002606 249113093 257415332
5626 257415332 271845205 288482482 299844619 301604863 294648621 280629971 259697272
5619 259697272 233511876 207844445 187264516 171875606 160590387 152589086 146362528
5612 146362528 140630823 135241928 129968939 124774009 119225150 113323749 107854467 102558429
5604 102558429 97643083 93317313 89163014 85623853 82950699 80844538 79120557 77154829
5596 77154829 75268362 73907886 73212588 73130411 73944983 75695403 77782209 79344531 80200730
5587 80200730 80501806 79690543 77974796 76216200 74129065 71323889 68639208 66525342
5579 66525342 64822862 63548597 63026738 62587888 62168924 61475929 59848198 57567355 55127877
5570 55127877 52916432 50793759 49314899 48191834 47710408 47472113 47137416 47018462 47222476
5561 47222476 46930755 46236179 45664660 45226846 44709221 44001083 42896655 41485406 40057757
5552 40057757 38466710 36763903 35285942 33885126 32360571 31131455 30153361 29433446
5544 29433446 28942134 28660079 28604906 28407927 28208600 27946872 27368344 26565955 25773001 25079544
5534 25079544 24280070 23761231 23360758 22859689 22611440 22409117 21872354 21175028 20406445
5525 20406445 19724852 18908071 18053747 17490595 16733912 16152527 15720947 15289208 14841116
5516 14841116 14479211 14202918 13926904 13767809 13531435 13336556 12958105 12625560 12629894 12629937
5506 12629937 12520560 12539642 12501295 12485799 12283503 12144702 11893118 11528596 11272935 11049768
5496 11049768 10775556 10510832 10358156 10106296 9979869 9881049 9683692 9518576 9367150 9284279
5486 9284279 9296834 9311485 9225961 9267761 9339729 9517749 9515346 9523981 9579558 9683814 9848767
5475 9848767 9826203 9807635 9900740 10048234 10223212 10406231 10607662 10853669 11064338 11136202
5465 11136202 11380367 11688362 12090030 12449174 12808970 13230709 13679867 14367440 14941998
5456 14941998 15488468 16141142 16938068 17656408 18519937 19658510 20664852 21864581 23057212
5447 23057212 24279511 25657577 27250544 28915554 30852046 32888928 35303849 38038582
5439 38038582 40982355 44437883 48166022 52244976 56919508 62365858 68509957 75475534
5431 75475534 83461143 92177137 101636805 111904442 123069707 135665925 149590976 165059541
5423 165059541 181820547 198965458 215085698 229055972 239710100 246773283 250515663
5416 250515663 251056983 248805519 244717016 239556945 234332811 229747922 226153142 224141273
5408 224141273 224363466 227251557 232793049 240636652 250675939 262540200 275714138 289680186
5400 289680186 303963970 317996986 330327402 339701208 345120779 345850630 342120013 334223787
5392 334223787 322995210 308890046 293484894 277899505 263255842 249803643 238214279
5385 238214279 228452377 221099581 215934566 212530652 210935128 211075099 212888241 215803692
5377 215803692 219372643 222468189 224249963 223740246 220674874 214535646 205972727 195317375
5369 195317375 182927708 169771571 156508930 143777730 132064669 121344878 111771898
5362 111771898 103377152 95993548 89649918 84161772 79273809 74865873 70893974 67473614
5354 67473614 64376686 61411781 58585513 55832795 53098857 50480234 47924929 45332098
5346 45332098 42887710 40684149 38686215 37031712 35387314 33975404 32716750 31662680
5338 31662680 30533041 29405043 28399546 27335008 26497891 25754858 24994336 24434561 23922422
5329 23922422 23486682 23028816 22866588 22490921 22074714 21929952 21958827 21904565 21828085 21814709
5319 21814709 21620569 21360045 21091085 20535912 19870381 19283966 18611528 17978517 17425806
5310 17425806 16904633 16329381 15916554 15614100 15354516 15101622 15044741 14876150 14677189 14944113
5300 14944113 15012388 14965186 15316269 15623953 15994550 16337858 16557868 16832242 17278597 18158172
5290 18158172 19446479 20833362 22091129 22833194 22938285 22653109 22237524 21316255 20002014
5281 20002014 18630155 17285645 16354919 15415581 14650891 13873426 13247061 12783194 12403490
5272 12403490 12101981 11814062 11649024 11559221 11571204 11776739 11933828 12172974 12502352 12688423
5262 12688423 13041929 13337772 13873345 14645709 15740725 17039828 18331140 19306774 19813980
5253 19813980 19745129 19517775 18815395 17662126 16346482 14957161 13913069 12968675 12276656
5244 12276656 11510255 10807492 10425929 9695294 9267827 8881438 8592356 8528254 8300316 8122478
5234 8122478 8023787 7966366 8028812 8069699 8005706 8028279 8118098 8240323 8386717 8875913 9421920
5223 9421920 9811352 9907318 9905909 9787023 9466865 9175666 8804094 8302830 7967700 7741025
5213 7741025 7509704 7390586 7252806 7044619 6768975 6860153 6947561 6871660 6713526 6582773
5203 6582773 6521473 6308713 5952823 5892352 5743457 5618389 5438174 5216137 5157751 5120620
5193 5120620 5179296 5183189 5010540 4979243 4933889 4827092 4953877 5060686 5034313 5126625 5236236
5182 5236236 5397570 5413001 5583604 5914149 6064819 6162550 6321428 6577254 6537649 6475409
5172 6475409 6608359 6615681 6488529 6428208 6266649 6101795 5742329 5511365 5371570 5283742
5162 5283742 5241149 5149821 5074548 5129213 5134360 5082622 5130449 5211711 5221502 5324291 5456938
5151 5456938 5451889 5479881 5680986 5896300 6132543 6318570 6511867 6758840 7066390 7270063
5141 7270063 7551781 7915813 8211936 8547235 8831679 9099180 9132444 9104695 9213237 9387319
5131 9387319 9567615 9847288 10305201 10730469 11279719 11841743 12571540 13233901 13902643 14550828
5121 14550828 15373439 16296383 17306997 18558831 19965079 21693005 23599081 25888226
5113 25888226 28468458 31404657 34990552 39461908 44182438 48384633 52994670 58168768
5105 58168768 64359117 72513669 83551828 97199878 112044529 124332337 132413851 140643503
5097 140643503 150360547 160185685 168088523 173189108 180865827 191854210 208419617 236125128
5089 236125128 280702874 336654166 393794211 426299320 422090000 409535983 384509203
5082 384509203 332582837 271048264 220744645 185024745 159786414 140933887 126209748
5075 126209748 114386747 104400711 95950330 88363295 81655952 75755620 70193561 65023770
5067 65023770 60156373 55796555 51637973 47607029 44138983 41045862 38193433 35437569
5059 35437569 32898856 30526300 28703284 27110271 25648242 24593073 23442285 22533129
5051 22533129 21547817 20450615 19503124 18561762 17682244 16944551 16196556 15463929 14913347
5042 14913347 14414146 13967069 13434572 13092523 12634233 12175430 11987606 11523687 11265623
5033 11265623 10999025 10624186 10419064 10236678 9848841 9679134 9464007 9159450 9042950
5024 9042950 8882882 8748406 8641768 8418948 8288643 8097845 7903848 7652001 7537500 7489323
5014 7489323 7171214 7110921 7017529 6895803 6830802 6672939 6647073 6680491 6608813 6487017 6347164
5003 6347164 6105729 5987487 5945331 5868542 5765472 5698115 5737895 5651073 5566302 5436656 5291392
4992 5291392 5281769 5151293 5098951 5086957 5020598 4989560 4754785 4785961 4731396 4712786 4694737
4981 4694737 4715726 4694119 4693869 4668017 4728731 4879326 4831673 4754241 4628465 4522958 4426465
4970 4426465 4276347 3970397 3808846 3687166 3559888 3380893 3270984 3290430 3132872 3058346
4960 3058346 3019071 2794385 2739038 2787717 2781219 2905994 2761315 2648279 2664516 2588536 2493753
4949 2493753 2433707 2476978 2513207 2525130 2432379 2380799 2375555 2246867 2287014 2349747 2284681
4938 2284681 2177958 2154926 2021450 1983929 1986506 2078688 1967924 2042627 1952001 1760107 1950063
4927 1950063 1906069 1844129 1950946 2080401 2113481 2081766 2043318 2001617 2092380 1990120 1963740
4916 1963740 1995558 2092820 2249433 2171080 2265447 2306058 2139282 2372172 2417656 2215607 2285741
4905 2285741 2373508 2351989 2321809 2407682 2549528 2565762 2638592 2565043 2608075 2859831 3120905
4894 3120905 3389683 3527522 3587502 3850302 4035662 4313611 4669007 4989412 5353509 5687636
4884 5687636 6005353 6347914 6739486 7090636 7629572 8432829 9362044 10675126 12297207
4875 12297207 13636196 14664759 15801701 17097764 18502383 20684549 23925470 28243999
4867 28243999 32672502 35730798 36776727 37287159 37007866 34744149 30667557 26835767
4859 26835767 23566270 20385147 17525748 15260033 13472937 12169544 10989988 10157946
4851 10157946 9343768 8567924 7974429 7431840 7071352 6733844 6174359 5809176 5462931
4842 5462931 5079602 4750709 4476704 4133986 3774430 3561483 3538438 3419773 3280120 3114401
4832 3114401 2944556 2985636 2898831 2818679 2722697 2740551 2822783 2772682 2699065 2620501 2526388
4821 2526388 2316277 2211788 2031664 1955366 1895154 1812690 1811273 1811020 1875764 1822193 1782946
4810 1782946 1610233 1489516 1583884 1616832 1529499 1581172 1525868 1473373 1422935 1424030 1363906
4799 1363906 1315056 1398844 1445825 1363264 1270527 1304144 1389475 1210985 1299009 1352921 1436460
4788 1436460 1507879 1657845 1752050 1782165 1804494 1918593 1944844 1886721 2014229 1920277 1909366
4777 1909366 1904056 1955749 2016440 2056319 2302031 2453751 2798210 3127712 3358901 3326429 3176610
4766 3176610 3181054 2989314 2628669 2339817 2171387 2056044 1933913 1736037 1670800 1584893
4756 1584893 1321888 1378178 1262707 1253638 1215105 1167604 1186414 1097828 1141722 1189354 1104152
4745 1104152 1054794 1058593 1043571 1064397 974317 1156661 1060039 1037384 1020229 994079 999349 890860
4733 890860 1115149 1064838 958119 980466 990922 960182 1017882 899751 939763 918446 924557
4722 924557 944924 906793 885610 698783 757795 802456 820261 747969 637884 647657 853404
4711 853404 773856 801509 935382 831283 855843 843550 875812 870305 808704 880861 924993
4700 924993 979706 878347 823294 706270 687674 709327 823777 802438 782930 775291 715769
4689 715769 757315 764628 754572 629080 693032 695735 805410 820745 871206 800521 722470 741339
4677 741339 678224 443905 559367 521850 468236 687584 688439 702134 648466 762609 688940
4666 688940 720050 647531 557750 575551 601311 681001 642683 691850 822071 674564 669552
4655 669552 671873 575663 621493 642614 582436 554587 645186 699318 710480 756397 835285 803422
4643 803422 750545 786172 750316 740534 634309 628068 627779 757396 666066 600966 683605 568175
4631 568175 708191 774939 765829 733925 645003 519453 384887 514001 524497 522549 595920
4620 595920 527512 568889 689828 575315 514799 483119 566777 543285 624944 828949 843297
4609 843297 583112 565855 548485 479028 567529 551375 371034 419946 687748 575822 441976
4598 441976 447285 498372 439000 402360 565962 665714 596155 635512 657933 663583 642782 593414
4586 593414 623300 546805 583060 735028 636250 467808 408869 721876 735765 611466 655384
4575 655384 617129 611890 660957 566754 548959 590589 562640 480613 526204 516517 646200 758926
4563 758926 729239 702621 704801 727964 687539 738109 896945 809599 738630 791861 692534 755762
4551 755762 748274 698213 655831 591404 576820 510142 592564 734217 737252 692971 594333 531195
4539 531195 552752 501702 664542 537921 558888 522865 505505 597873 576085 478930 476953
4528 476953 552657 485770 538773 542113 515922 551540 453686 403518 587930 647861 550192 416355
4516 416355 518493 511794 464897 463547 467216 542345 606642 599684 521979 455401 506725 613940
4504 613940 541441 421552 542277 632664 521193 484049 439049 416800 384179 456040 470404
4493 470404 503857 368021 265214 287854 324459 337611 433244 401631 352932 396594 386256
4482 386256 343114 284975 297069 257615 408409 463160 526201 482684 434670 399498 556147
4471 556147 395532 463889 565605 493974 475610 396995 339132 366359 413150 533936 505067
4460 505067 457479 382317 253733 264446 396956 514183 481412 492053 495885 461905 431254
4449 431254 479758 583680 537565 551895 484946 419190 496362 527351 487155 646376 631278
4438 631278 437140 364053 351182 364788 382533 288645 212344 300543 426311 497539 400359
4427 400359 347920 455984 523295 434650 515448 539918 551692 476967 424783 380980 503256
4416 503256 620999 536327 525342 488284 391661 384592 421830 555024 519603 562300 471919
4405 471919 399676 487018 429786 405932 335878 403677 581105 537416 557109 506226 561398
4394 561398 584563 573986 584391 481695 558046 552433 495808 555189 547833 437870 455468 533966
4382 533966 698304 663634 619904 662901 749088 733280 724037 690648 595236 530615 556368 692018
4370 692018 611149 731160 793123 604518 527621 501370 552381 691189 587292 504631 603871
4359 603871 700453 680320 602769 542562 598471 554773 564304 602414 647290 683906 573887 515816
4347 515816 514352 534216 577855 547054 397787 350569 407617 530435 659550 659671 416211
4336 416211 426749 516460 557361 587396 584504 521812 519405 540250 419515 475293 374682 353089
4324 353089 334145 272135 359745 405072 442269 353283 435979 372016 251776 353777 381607
4313 381607 460637 445171 433542 448233 253050 219395 310581 365275 276410 260667 317146
4302 317146 460360 360128 360033 424129 430248 391278 433112 411603 425006 474231 387698 331481
4290 331481 275310 263716 303030 440147 509149 549206 403918 523105 548411 532667 700882
4279 700882 546075 527737 642435 549994 662270 605697 755122 684023 741010 1008661 1018108
4268 1018108 944838 923676 930152 817248 754932 789770 787561 663998 434455 395247 317382
4257 317382 451904 333034 342170 325657 297467 365807 434110 485005 472153 606449 405915
4246 405915 472161 411687 313638 332645 405195 385740 385441 376911 416775 410745 312171 344327
4234 344327 364185 276746 260754 272783 287984 304473 348966 375706 469673 318810 299746
4223 299746 353570 438445 415720 359407 492222 507458 441558 399735 413338 544518 461701
4212 461701 408256 478111 440783 366828 264963 234980 194621 191263 174020 195190 214436 179295
4200 179295 263845 351136 358498 326303 267078 196645 244593 359566 415962 528951 617092
4189 617092 403141 339135 355329 249434 198911 346240 326869 301550 329747 282321 357257
4178 357257 286228 404658 478786 321717 302183 371323 463843 459086 537999 586925 364796
4167 364796 335621 226932 250367 256412 323310 303334 313327 280158 296469 273657 253254 249075
4155 249075 291771 331297 383215 444106 478586 472495 342018 336970 395533 276823 153554
4144 153554 251357 281524 256586 233379 274609 307098 391102 367522 288604 184744 289268
4133 289268 322257 220389 115442 258889 324290 239426 213498 263401 330458 272822 244612
4122 244612 233733 219558 166420 119223 312127 400730 337700 326742 344539 420081 324426
4111 324426 281213 281260 255956 291509 412033 458311 398373 279346 392478 387225 384426 475621
4099 475621 329354 270721 293981 349508 320688 473169 522836 397358 448328 400186 511759
4088 511759 446839 327813 319107 424317 437069 508608 557064 485434 434635 422320 408680
4077 408680 487573 481458 391090 215086 183053 267308 400373 372716 391730 512199 359510
4066 359510 474421 452531 464263 296947 357445 358855 331285 428241 512366 477125 489833
4055 489833 456118 381119 433836 419120 327115 347707 483851 480242 516011 580403 599910 640137
4043 640137 592363 495868 497411 449094 474395 575457 562529 482486 474134 426998 446346 503226
4031 503226 525221 591149 656240 530880 542930 569818 546066 525008 573624 652335 712997
4020 712997 697426 681527 602675 619870 721286 637075 605321 599976 636348 736324 688740 764686
4008 764686 914323 874388 1001109 1013166 1057031 976149 1022014 1163414 1297934 1361280 1348130
3997 1348130 1503645 1567363 1594268 1646417 1700049 1961508 2087152 2305497 2608984 2791064
3987 2791064 2949674 3182689 3414630 3533793 3884538 4154940 4461179 4752056 5190755 5862501
3977 5862501 6592771 7403897 8170961 8627725 8925238 9332281 9961407 10506403 11247271 12075427
3967 12075427 12865436 13566036 13750350 13385041 12549318 12009498 11956394 12397840 12636880 12199604
3957 12199604 11045337 9782567 8762299 7851973 7058142 6306266 5819172 5491538 5098270
3948 5098270 4688901 4381152 4115652 3858685 3694107 3615670 3479372 3243442 3095409 2911628
3938 2911628 2677870 2594505 2574601 2487742 2347831 2259513 2230755 2084299 1988888 1904167 1828950
3927 1828950 1778422 1751969 1670053 1547694 1588401 1587357 1534101 1479493 1568346 1548630 1591671
3916 1591671 1550214 1482657 1415515 1397198 1196597 1196614 1295281 1251975 1194955 1268375 1241141 1178365
3904 1178365 1299041 1223470 1100169 1213592 1168405 1032492 1055330 1182547 1063403 1008826
3894 1008826 1033512 1024322 932241 973398 1154403 1153181 1078946 982945 948128 879195 898586 963372
3882 963372 865486 944020 1094546 1180421 1092670 990432 1104690 1080250 1168034 1255013 1265337
3871 1265337 1164109 1133293 1004903 1017237 966201 981508 1066256 1112051 1118851 1051931 936391
3860 936391 977049 1106603 1211113 1073358 1116965 1133236 1115606 1141235 1174944 1060282 1079434
3849 1079434 1058469 1213750 1258651 1187481 1162068 1033504 995780 1116496 1106458 968836 1060386
3838 1060386 1001039 988493 1155318 1216405 1155209 1139573 1149802 1102098 1160631 1214084 1146897
3827 1146897 1208551 1323532 1316316 1348323 1345848 1359940 1368510 1423916 1455467 1289191 1352617 1276656
3815 1276656 1477981 1519510 1325748 1234336 1197262 1288315 1344059 1324043 1414066 1375262 1370630
3804 1370630 1351035 1351113 1360019 1479438 1575776 1585407 1626424 1737996 1593055 1668162 1665339 1616335
3792 1616335 1676603 1647477 1721131 1743748 1812478 1770165 1766874 1629889 1565615 1605503 1587295
3781 1587295 1691719 1592610 1600927 1664790 1786176 1679539 1643737 1679259 1698125 1691509 1679463
3770 1679463 1837268 1949427 2092075 2183596 2192939 2143302 2072382 2123806 2274811 2168483 2253662
3759 2253662 2209256 2068607 2041425 2036487 2152134 2384229 2337966 2333222 2272503 2312866 2403495
3748 2403495 2376430 2304575 2326607 2391804 2232783 2063867 2063622 2098180 2196801 2245177 2362506
3737 2362506 2482689 2510029 2733170 2729271 2775150 2826119 2737439 2777512 2766076 2867705 3017468
3726 3017468 2980395 2963734 2790038 2811117 2778125 2680889 2572021 2557413 2667038 2685621 2795249
3715 2795249 2735152 2684026 2721180 2736349 2727181 2814113 2632751 2572730 2674930 2463571 2426306
3704 2426306 2519813 2663540 2684075 2641504 2757433 2812223 2789083 2804992 2884425 2891339 2705858
3693 2705858 2626760 2610422 2551808 2433103 2405023 2470792 2495128 2462028 2456931 2583061 2647863
3682 2647863 2594151 2370763 2222140 2213504 2234173 2151497 2204292 2201006 2179469 2121844 2024504
3671 2024504 2049841 2132657 2096589 1991609 1967180 2057509 2202046 2201839 2204456 2215391 2152150 2199506
3659 2199506 2130810 2085269 1955554 2064936 2142766 2164082 2136469 2165303 2129040 2045580 1924864
3648 1924864 1907129 1973399 2052988 2099131 2128559 2070658 2029308 2038651 1950709 1993597 1875118
3637 1875118 1917293 1930179 2036380 1964552 1965129 2020404 1990174 1932323 1956006 2121197 2263729
3626 2263729 2183978 2126791 2119676 2048104 2207221 2217865 2114177 2061219 2110050 2177563 2156228
3615 2156228 2206340 2284111 2464598 2469363 2371641 2257372 2258040 2051783 2163830 2075453 2034165
3604 2034165 2062310 1979797 2007347 2032759 2092900 2080321 2041383 2093052 2149118 2101182 2030439
3593 2030439 2081247 2195717 2184329 2072165 2099429 2138200 2149084 2185405 2123132 2168008 2257050
3582 2257050 2279081 2386965 2396201 2371004 2410461 2403790 2388141 2290896 2326916 2354207 2353270 2406892
3570 2406892 2598452 2595129 2597350 2596729 2582795 2534983 2600874 2626710 2489751 2404442 2459285 2458424
3558 2458424 2403241 2399880 2509866 2373212 2349603 2360743 2398097 2434986 2462728 2739807 2708295
3547 2708295 2609044 2614366 2706946 2777119 3027692 3232406 3266326 3342609 3365060 3439718 3649122
3536 3649122 3690126 3706825 3759547 3719366 3643588 3419033 3342082 3223371 3272839 3345448 3257844
3525 3257844 3220004 3168598 3111743 3014914 3004778 3089403 3126174 3186769 3217356 3299651 3374758
3514 3374758 3373495 3423410 3376737 3363795 3575219 3668624 3729758 3872058 3903805 3973154 4044312
3503 4044312 4062451 4184153 4143946 4074119 4068859 4004616 3980679 4056943 4169121 4021536 3847740
3492 3847740 3880107 3823993 3877299 3965146 3978253 4081238 4163657 4069985 4063462 4156642 4231924
3481 4231924 4441762 4455732 4292676 4320944 4578457 4611610 4761271 4883374 5047576 5103262
3471 5103262 5413700 5746052 5793766 5961446 6069108 6147262 6317185 6204877 6258758 6327194
3461 6327194 6266640 6537857 6613570 6687729 6867014 7004089 7110654 7388475 7555163 7888209
3451 7888209 8191695 8452838 8912109 9390521 9891330 10390545 11040208 11711629 12418566 13308481
3441 13308481 14127571 15106985 16102354 17088893 18286549 19248806 20276783 21481038 22903345
3432 22903345 24520542 25712716 26335444 26349279 26145488 25832106 24952999 23618128 22258798
3423 22258798 20824687 19522026 18398515 17352848 16541016 15932773 15497236 15120381 15110300
3414 15110300 15236207 15482305 15678875 16022878 16608567 17444439 18530678 19783338 21276467
3405 21276467 22703840 24431278 26425497 28556554 31064242 34126536 37501691 39916607
3397 39916607 40930455 41392338 41331550 40367876 38298396 36014335 34236638 32856423 31660095
3388 31660095 31037289 30947438 31655989 33431962 35771958 38077659 40026195 42215251 44676298
3379 44676298 48317301 54040919 62463524 72995353 83404355 89418162 90126446 89460268
3371 89460268 87015164 80939000 73468286 67779062 64399252 62425216 61310155 61049239
3363 61049239 61388665 61891167 62162673 61050873 59470333 58512807 57406782 55882504 54344033
3354 54344033 53260026 52919684 53529433 55429606 59597285 66437347 74945598 82699310
3346 82699310 85716685 84655706 82579414 78128391 70321880 61688646 54931015 49947423
3338 49947423 46426056 44299920 42976211 42641121 42742152 42451570 41048108 39030512 36880113
3329 36880113 33886181 30232260 26895124 24298764 22109240 20248433 18864353 17674518
3321 17674518 16564432 15636393 14683882 13856174 13053973 12487753 11928255 11339857 10773905
3312 10773905 10250237 9812137 9533559 9158942 8819453 8356279 7922604 7795757 7627523
3303 7627523 7500731 7287598 7079875 6900438 6738437 6583397 6439617 6366712 6227399 5883327
3293 5883327 5780488 5709211 5640833 5544995 5441401 5329188 5192089 5154925 5102084 4982024
3283 4982024 4943044 4915023 4876073 4797765 4809444 4737531 4482098 4284246 4199855 4143628 4072706
3272 4072706 4040716 4015516 4011949 4004682 4030068 4038988 4025229 3982590 3914054 3686673 3703886 3681176
3260 3681176 3714256 3614267 3540593 3496484 3350416 3210015 3168001 3245660 3159323 3074973 3047536
3249 3047536 3027806 3049746 2971851 3027758 3064059 3026989 2965646 2800303 2936008 2764928 2623864
3238 2623864 2685987 2722739 2491655 2576667 2557003 2582245 2665441 2506485 2533865 2483665 2536195
3227 2536195 2484946 2451755 2605882 2438181 2358131 2327246 2262517 2354333 2377180 2350363 2326978
3216 2326978 2377652 2310367 2235066 2121755 2200609 2294757 2381435 2294988 2226969 2257934 2396727
3205 2396727 2458493 2461532 2415076 2440494 2547915 2785088 2805472 2767388 2776469 2975027 3086141
3194 3086141 3156450 3308297 3438350 3593249 3649143 3919325 4169699 4435865 4695396 5032844
3184 5032844 5236276 5190934 5211231 5373052 5276172 5244069 4969747 4759311 4798569 4818457 4756980
3173 4756980 4665228 4522819 4458136 4299087 4190985 4144311 4186600 4097214 4252709 4297149 4285778
3162 4285778 4538387 4574443 4732824 4890771 5045073 5269933 5632957 5903816 6339728 6867286
3152 6867286 7402303 7679623 7964372 8036963 7827952 7413762 7018051 6858922 6707541 6670693
3142 6670693 6594094 6488619 6539428 6389786 6237312 5947245 5644407 5540108 5192501 5036059
3132 5036059 4939353 5058529 5009688 5127494 5280742 5216021 5216303 5326450 5461560 5647994 5674647
3121 5674647 5664854 5762760 5962184 6187392 6119275 6098728 5916531 5777154 5725963 5713881 5707638
3110 5707638 5817646 5781538 5812011 5826905 5896531 5873830 5892853 5965752 5880279 5860140 5888964
3099 5888964 6028029 6072824 6096117 6221603 6169726 6137381 6129067 6014674 6028280 6020085 5949867
3088 5949867 5680525 5634753 5447113 5293444 5267751 5372948 5288824 5365321 5283320 5188439 5420168
3077 5420168 5468439 5477100 5577486 5725858 5700101 5734028 5769551 5935915 5992966 5857187 5762069
3066 5762069 5897124 6008177 5753538 5623889 5508653 5284987 5340644 5218116 5087526 4933594
3056 4933594 4736653 4602826 4409754 4320310 4355520 4367488 4371019 4217048 4047258 4154563
3046 4154563 4042239 3970162 3955890 3894465 4009601 3765788 3630993 3569137 3450572 3475685
3036 3475685 3367403 3251584 3250567 3124614 3071574 2823539 2776937 2674334 2664362 2644441 2689684
3025 2689684 2627748 2466766 2368136 2283936 2257537 2160370 2186163 2192157 2137884 2131974 2180893 2084456
3013 2084456 1976307 1845376 1868709 1845145 1895027 1874725 1779256 1754412 1740604 1671217 1705783
3002 1705783 1681686 1753825 1773181 1672005 1555075 1501077 1457820 1496519 1451074 1444000 1424223
2991 1424223 1409742 1328001 1397303 1489090 1465098 1277096 1132358 1223368 1326457 1263825 1318188
2980 1318188 1327895 1280456 1179015 1006660 1173302 1255061 1254827 1101823 1017442 1107690 1045457
2969 1045457 990763 1091373 1132989 1061825 1288430 1325232 1059942 1017775 953603 915589 992764
2958 992764 1088214 1036046 1012692 968901 958608 921310 927809 875763 805193 799452 833362 910365
2946 910365 927327 813637 674623 629136 741478 718817 721050 529580 635237 850674 801741
2935 801741 916799 961248 933327 729073 655893 636293 564496 480623 538564 695310 643316
2924 643316 650568 617356 470309 446414 417584 541729 571918 652909 710344 659230 641516
2913 641516 561072 692108 632726 706635 646101 580046 542544 590057 517448 416651 425482
2902 425482 384155 386034 410464 489055 518651 357596 423524 337450 394350 633232 477690
2891 477690 497154 578531 587115 445815 471109 443748 529180 427364 355523 417600 413541 393349
2879 393349 386122 340022 396903 402542 464782 481348 435319 404683 371212 293837 306421 354003
2867 354003 319372 303064 194155 229341 293931 295936 373591 400289 305222 284260 373299 284575
2855 284575 270301 371517 435453 369641 257915 278989 445881 409973 493259 377092 409464
2844 409464 304726 156001 268372 365698 487760 526374 448457 228073 280682 437347
2834 437347 275295 207899 305650 365308 382120 308910 357277 206987 234202 291956 298587
2823 298587 299159 155978 120875 101212 143743 144893 256013 251556 320395 269971 249800 326031
2811 326031 263811 320576 288183 435337 298175 190992 224983 281621 203397 193070 186981
2800 186981 274092 229978 330704 267726 108469 175213 332063 315789 286251 271956 297129
2789 297129 143347 51064 197067 224018 189892 330430 205802 384593 338984 248503 323259
2778 323259 268368 233121 152235 173410 296972 244440 196520 164155 176379 174385 231319 281556
2766 281556 156866 56733 33250 92512 512 19895 130604 212420 190956 129882 30500
2755 30500 164119 136773 187700 158072 203399 239743 289438 364447 366589 376059 360216 380995
2743 380995 253840 253610 256201 191431 243708 219972 342953 276292 460239 336193 336314 155842
2731 155842 148488 193373 294814 261394 206767 235336 39673 154254 198468 308951 290787
2720 290787 185936 170639 125871 205792 228491 355438 189134 149666 207457 155752 111032
2709 111032 96498 192049 151788 121475 134560 147961 143183 265513 176590 276555 182224 52230
2697 52230 66162 222705 148325 170589 227138 263514 247372 143192 44158 61493 14077
2686 14077 -63504 -60811 -37409 114002 89752 94810 -23263 12232 84818 246488 339611 215521
2674 215521 196198 181133 168871 183020 173091 167872 162946 200707 40294 -57398 -88988 69439
2662 69439 229989 189798 42220 66633 213796 148727 -4209 51234 92471 5894 69474
2651 69474 82801 131755 84991 136785 125980 209624 189588 176889 319589 311120 146669 201767
2639 201767 260383 308808 185910 49968 83446 72136 -54536 -27627 -50276 -21868 45762
2628 45762 -39898 -175383 8505 88280 106487 135257 34740 -1295 -5528 152040 239900
2617 239900 145057 90842 75768 96778 172902 114195 64490 272879 261263 282862 251988
2606 251988 89590 46927 -37544 -59059 -121788 -56545 -29524 43011 128709 91666 98347 100338
2594 100338 -92836 17110 96489 59709 -47576 -27216 -95465 -76048 -67012 101644 224029
2583 224029 209836 210946 234860 146536 81481 136191 107260 5765 -73523 -49369 63324
2572 63324 61904 100010 31750 20365 82993 230349 374862 272889 231124 192981 122541
2561 122541 230252 204120 -8246 31964 125829 118968 134466 216312 157610 231849 226062 75123
2549 75123 -88159 -39137 -78329 42629 57681 38472 121645 116177 17870 15514 16262 103524
2537 103524 85032 124739 77341 51616 247362 262098 150875 139079 155390 162964 103583
2526 103583 200499 234445 212971 96663 -20379 -77328 -68786 -32768 -46898 110070 51074
2515 51074 76470 68505 58993 28873 -92227 5019 64336 10542 166816 153398 86264 182400
2503 182400 120135 50030 92753 102838 44314 21573 -11254 -20092 -13033 -91347 -43007 -50531
2491 -50531 86867 85560 161909 162073 197819 16539 10592 166758 87719 43083 60572 -83360
2479 -83360 -4885 4662 -53240 16142 -30373 28177 85247 24886 47504 42214 106642 -22742
2467 -22742 -62231 7478 56860 72943 168789 176926 102764 164590 169461 119814 188917 281356
2455 281356 156101 175328 113861 91405 117862 174736 173182 91994 62403 186921 147881
2444 147881 72737 64249 86310 151008 130144 85020 223613 144818 152027 85283 21311 103134
2432 103134 126016 -3133 36246 -26045 74142 94412 98231 20777 113889 144601 130300
2421 130300 120996 48092 -70140 -30230 -9849 -56415 -54332 -110508 -107636 -101791 -58434 94663
2409 94663 145774 194760 133177 38043 88169 100399 117676 -81185 -44166 -195566 -100015
2398 -100015 47098 199061 144114 -10162 1531 -63626 -102495 41619 21149 60476 73906
2387 73906 10499 48632 -52155 -74105 37239 -21777 8692 25987 66519 125278 6822
2376 6822 3898 28639 150396 66454 -126185 45914 58134 44016 97463 112643 37219 -72551
2364 -72551 29378 86934 151941 118765 26639 55991 -15400 -17654 -25716 -100673 -53521 -49059
2352 -49059 -39814 78100 181156 189518 131564 176867 296057 274865 233254 202236 160499 267026
2340 267026 280231 180042 269320 357598 385085 511593 483780 500634 516808 635223 591261
2329 591261 605542 656202 713338 882181 856943 806465 819414 1070218 1266565 1375681 1569961
2318 1569961 1836522 1909649 2213285 2362653 2567573 3036020 3576784 3927181 4331550 4747530
2308 4747530 5532218 6584845 7900473 9039703 9649002 10579473 11640990 13010469 15481108
2299 15481108 19172605 23300828 27130334 27972585 27232301 26109589 22538563 18070662
2291 18070662 14631714 12285183 10724141 9452167 8367767 7652762 7093810 6625291 6171073
2282 6171073 5749164 5401085 5046661 4718768 4292387 3918585 3583153 3312130 3059465 2792677
2272 2792677 2590114 2424379 2338768 2212281 2034538 1834268 1769261 1650283 1501948 1480655
2262 1480655 1444201 1309013 1343223 1238703 1200032 1074060 1024706 1056777 1018309 864664 847659
2251 847659 898486 866312 888434 842998 775420 774588 713971 802240 768585 682142 873641 798857
2239 798857 718718 614195 635786 675213 649832 621828 554481 625824 655285 511141 460524
2228 460524 377102 380241 436531 501914 437644 392719 417989 517330 473589 529716 594592 525971
2216 525971 475699 535690 412645 268237 373518 327153 245483 292468 368675 384496 362196
2205 362196 277102 228176 214981 220866 229084 245628 298588 273488 226998 119838 219925 265647
2193 265647 275242 190192 237513 138765 119022 267608 238480 301606 184190 203135 121010
2182 121010 111364 46540 12868 208811 213702 302555 268890 224145 183043 121856 74445 34554
2170 34554 26191 116107 163038 223147 218688 47148 147774 117734 281897 291480 195379 164992
2158 164992 177867 49085 140145 195756 209948 292073 162671 121074 216544 135996 106107
2147 106107 213417 155187 70078 70321 1619 85422 177727 214563 223415 324872 235994 172056
2135 172056 252453 177200 234996 279916 261147 251235 207925 52519 -179385 -125905 -6836
2124 -6836 10681 97917 6166 112103 141594 103702 144794 179256 94699 214971 211916 89575
2112 89575 125860 68195 14921 132043 225175 56886 -225006 -47380 108582 191291 200016
2101 200016 97870 68954 178645 255826 128107 121676 183579 71648 -31524 130785 181630
2090 181630 142284 20790 1162 52953 200087 130811 120765 53089 47651 38375 111326 205696
2078 205696 180063 146828 121024 147168 179830 67727 52450 118641 204890 176937 48431
2067 48431 208626 118038 -68519 -78436 -48884 51696 61116 143277 100228 -21165 -69116
2056 -69116 -88869 -83543 -153340 -25073 -59730 -90621 12490 36390 111176 194428 27470
2045 27470 155179 34672 -102904 -125257 16522 31412 135818 273742 160644 133299
2035 133299 16564 157872 149952 202803 135026 70072 27231 83487 72052 98973 141721
2024 141721 -13397 80609 8322 78927 2422 -7450 -23491 -53367 -93943 -20353 51280 63979
2012 63979 75693 110294 67491 -50324 -58670 154516 131911 28410 10693 8998 -21848 65488
2000 65488 -77933 -55361 -31976 -96364 3636 76041 80800 53945 19521 -139823 -40755
1989 -40755 15322 54490 -11319 25330 3909 58718 47420 -3259 46765 -5366 -65691 -123621
1977 -123621 -94662 31772 73526 36233 -28493 36045 -44327 -20140 -32195 20341 50302
1966 50302 22464 -1124 -23710 8266 79822 120370 160572 -66710 -106805 -47894 40611 -94772
1954 -94772 -131136 -49867 126764 159263 116869 26483 35695 -9131 -68084 32252 -5201 -21223
1942 -21223 117023 72777 23882 27782 49921 143613 -59122 -14680 33087 -57947 -131323 -69576
1930 -69576 -30398 -36614 19859 86483 135024 10917 -84419 24275 117041 -46950 -27162
1919 -27162 59014 42411 118031 44160 6128 6103 -7662 -12695 -29814 -89776 -18798 59808 -55075
1906 -55075 -19456 126490 172724 171775 147877 82717 80473 -3482 -100786 -93116 -300782 -181474
1894 -181474 -178466 -181517 -181515 -84744 -100236 11519 86426 -68132 -135831 -141246 17528 17547 29239
1881 29239 40586 12440 -7675 -76923 -68529 -3696 177231 -31088 -64544 -37775 51291 144553
1869 144553 185480 97958 101350 102820 -142699 -198862 -95668 48616 110122 67499 -89080
1858 -89080 7005 93864 19445 68620 -17377 33031 111788 78673 25384 -12782 46207 29048
1846 29048 60420 44611 -32244 -34917 21066 -28745 -14581 -63197 -84389 56102 -28626 -49784
1834 -49784 116929 231258 256707 201409 128567 -42493 2844 41664 -3550 -76733 -5895
1823 -5895 21731 88966 123471 -8267 -7669 43494 -57028 -53680 -147353 -155652 261 49435
1811 49435 46217 80272 -952 72107 175047 149409 3902 -89017 -28482 39765 -26332 -11078
1799 -11078 -79286 -272799 -199516 -17357 37782 64956 -18266 -92336 -19386 -12408 -116281
1788 -116281 -67951 54930 2777 -9310 -59910 -56806 -43991 -170941 -154831 -29797 -76738
1777 -76738 -81209 -69168 -10452 -14005 -55504 -73867 -158656 -176733 -222594 -208450 -82864 -65081
1765 -65081 3269 -37320 -85986 -138604 -44099 118228 15257 -54723 42217 8328 85241
1754 85241 78478 37999 63097 30464 88805 -8183 -9643 175410 169811 150979 150872 71473 46514
1741 46514 142413 94925 -8825 69036 100660 355 -79458 -65362 -30483 21718 12616 87783
1729 87783 184842 57833 -49190 -50314 -85878 26073 81897 41503 68019 -53736 -63977
1718 -63977 -45236 10356 17121 -55967 -32492 73838 102746 -43525 -129392 -167634 -74916 95196
1706 95196 189502 190842 181593 92459 58638 -26500 -15500 -75673 2567 -62020 -58603 -35526
1694 -35526 33136 87547 104121 -49899 -91887 -37929 2926 15086 47196 50240 -18634 55948
1682 55948 24031 -110157 -58971 -78968 -252015 -106943 -93560 24492 107951 115407 112111
1671 112111 -17136 -64754 17623 -67690 -4401 -97171 -174467 -60885 88845 237012 145972
1660 145972 2603 -18902 -83455 -222972 -119581 6686 -1425 -63074 -139846 45144 5424
1649 5424 1894 -112911 -36250 -69150 18528 100851 23328 51042 -9563 -65811 -31165 -1284
1637 -1284 -7023 33750 -42697 -198330 -74394 23968 40041 126722 57923 49358 20624 -52151
1625 -52151 -113980 26549 -79591 -173845 -148921 -155470 -8830 8147 -21315 19777 167190
1614 167190 170134 44073 70042 102821 154023 162709 3244 -1294 -20622 31214 53468 -4144
1602 -4144 44784 -112694 -34196 55302 -78882 -97852 -3207 84438 32131 -2700 27113 -26495
1590 -26495 -35333 -108402 -101390 -93968 16487 5777 21604 61021 884 6408 4170 154376
1578 154376 103784 -81272 -69732 -100415 -62153 -110015 -86100 -181171 -131874 -63377 -50097
1567 -50097 -99041 -91405 -3544 125981 31708 161411 122043 -23598 -42116 -61406 -50536
1556 -50536 90890 177354 196107 67866 4255 96358 23708 18060 -37026 -38945 -24234 -62990
1544 -62990 -1758 74907 44061 67078 -62625 -62101 -81141 6754 88848 -44834 -134919 -61749
1532 -61749 -95916 -18761 56512 -49296 -90333 -15357 45596 -80514 -115325 -160009 -225896
1521 -225896 -121997 -92401 50743 55401 10451 122630 128149 71571 83895 24985 131318
1510 131318 136620 109705 -48236 -35406 23129 21469 61985 187015 100614 33075 18311 48241
1498 48241 -2256 -11644 -91524 -110485 -109992 -127937 -43816 -51173 -39772 56161 32036 -14573 -119468
1485 -119468 13274 86534 5609 62247 -10986 -70344 -24598 -21453 -138748 -87726 -148244
1474 -148244 -145202 -99858 -7844 6642 43542 130686 132952 -3717 -129911 -75249 104294
1463 104294 136117 26554 -60343 -51182 97448 51192 142944 44383 -53438 -15842 -95178
1452 -95178 84505 75760 -26704 -18718 37012 5651 22223 -132070 -16016 -104344 -199442
1441 -199442 -80960 -3761 -13142 126957 40209 104023 238300 33748 -63976 -44568 52910
1430 52910 134071 113794 -97450 10480 97580 76496 39438 17595 123487 4833 -17466
1419 -17466 -70668 6214 90340 -96630 -19853 148877 7190 -4573 48465 139347 33411
1408 33411 29685 49443 -50757 -16913 -112231 -85400 -93870 -169564 -130460 -189053 -85827 72827
1396 72827 -24245 -17080 71271 28100 -115894 -82773 20428 -158643 -34039 -45401 -78259
1385 -78259 -116469 -101094 -140411 -213618 -68036 -69005 -111486 -129930 -195212 -197189 -98582 -48175
1373 -48175 10370 -12581 -210762 -193163 -22069 31262 145760 -31843 -24698 45465 52385
1362 52385 4339 -54162 -153432 -19948 -10776 42482 -85848 -31386 44545 61373 5608 102835
1350 102835 148778 39202 -149610 -163388 -139364 -128498 -9230 -42252 -157605 -200745 -182204
1339 -182204 -106435 -72486 103792 -17562 -63886 -57686 -92720 -12631 -3024 92823 215738
1328 215738 28553 -33465 95296 103798 173913 182733 76621 -52253 -74934 -64914 -46203
1317 -46203 -6485 -40148 -14457 -45677 -30223 -2814 -67648 94494 28118 45605 109318 112240
1305 112240 9029 -14796 -4397 24151 37260 43498 54370 158684 191319 138161 60764
1294 60764 93209 116358 91432 -57921 -203501 -181999 -15789 -57418 -67349 -84643 -75231 -86035
1282 -86035 7809 98324 19182 -97246 56544 16360 -53572 -59737 -32339 -16688 -73932 11924
1270 11924 52925 -97723 -152226 -119775 -104962 9491 -36181 -70257 -70095 -147981 -45541 -42922
1258 -42922 54087 -73139 -34983 122524 65396 10358 62794 73812 -21262 -142097 -82420
1247 -82420 -75837 69206 -25946 -197380 -21707 -102614 -160615 -77363 13663 60042 17103
1236 17103 30619 110541 11111 93978 40693 76352 176449 169854 107463 5858 -20311 14519
1224 14519 52668 53081 -15489 -56471 -15138 -10353 60010 109948 -67459 31774 29965 -87629
1212 -87629 9353 40184 -85692 -69163 -33127 -47173 -77851 -56108 38184 66293 -46422
1201 -46422 -4238 44581 43972 8380 40633 -23846 -39110 -57175 -19472 -65030 -81824 -77633
1189 -77633 -706 13443 3706 1056 -84303 -60252 33746 22228 17121 -10308 -72292 -141152
1177 -141152 27043 45757 -944 11258 -546 -94000 -233868 -67608 -30665 -161226 -31194
1166 -31194 30523 -61015 -66644 -20925 110298 169648 13360 -25911 -14368 62202 -88722
1155 -88722 -58842 68465 42991 133027 61619 43413 -11712 31243 61100 150703 74066 -20941
1143 -20941 -50684 70063 170962 162668 944 -99005 90071 51433 -33713 95326 61353
1132 61353 31425 -22138 10365 95520 35708 -9419 25422 96783 163013 66281 31673 -29611
1120 -29611 81901 37805 -31717 -77180 -76865 -42233 45889 70152 -94037 -131710 -131862 -212387
1108 -212387 -136625 16722 -15844 -124636 -134862 -68785 -50647 -26797 -42355 11392 12163 -51449
1096 -51449 -43436 -40712 86360 12207 3535 131788 162653 161585 -14119 -167500 -144610 -55868
1084 -55868 -51307 -111158 -34157 51466 37921 41609 28343 -125884 -182991 -86773 -158491 -169185
1072 -169185 -116696 -96727 -13777 -42303 -103848 -104793 -84358 -61780 32779 84813 -37449 -154147
1060 -154147 -158797 -91741 -15142 -20359 -1477 -6936 4133 44474 58760 -134217 -139852 -148794
1048 -148794 -152742 8003 8521 90532 101746 -57611 -113420 -60325 -92157 -93109 -108820 12430
1036 12430 18929 -48741 -43557 -44279 -38467 89475 51838 109817 37070 203853 136453 -57919
1024 -57919 -113924 -233988 -120791 -22731 86450 173295 220420 39905 57896 8914 -61436
1013 -61436 -6271 131667 12015 -42121 -105690 -158370 -112093 -79130 -88125 -81967 -107891 -30552
1001 -30552 115407 28886 7187 -126600 -50992 36086 192309 136432 65428 -57759 -55154
990 -55154 -40055 -83934 -88589 -53961 -6467 -23190 -99998 -22680 -43718 -151929 -203996 -124720
978 -124720 -177419 -19417 45428 -78844 41612 -66862 55221 175209 16888 -136419
968 -136419 -170693 -54344 -7858 -44354 -160542 -57190 -85467 -188018 18503 72891 -12102
957 -12102 -29938 133619 95090 21873 93696 -5622 -23256 -27945 -100909 -42496 -78032 -68025
945 -68025 -110082 -97907 -10988 2597 21500 -51903 -222145 -157379 -90997 -238284 -184445 45998
933 45998 -55794 -37128 -170331 -153090 -112580 -141322 -77219 -70264 -53529 -96861 -64734 -142432
921 -142432 -145540 2562 -1363 -57260 57713 -35278 -207044 -88873 -82047 -49479 -17281 -65417
909 -65417 -67457 7595 -47582 -96643 -89404 -230914 -101675 -7633 13786 -17880 -18335 -50229
897 -50229 -103298 22363 32367 -42895 -84082 104138 146898 77549 19816 75759 83438 195442
885 195442 118288 -9153 -88086 -2023 43682 -77650 -44259 9040 36354 -44859 -190136
874 -190136 -190819 -141939 12172 109544 54678 -517 -75351 -112924 -198581 -119145 14865 -1062
862 -1062 -7725 46087 -71405 -77218 14069 -33442 16124 69628 -23173 -57853 -189899 -197641
850 -197641 -125827 -101653 -125333 -94268 28180 -29015 -149631 -2447 -41193 37690 21766
839 21766 -53537 -106769 -65844 42803 4961 -27902 -59432 -57010 -44910 64957 57983 13956
827 13956 64832 -113600 -91857 -170721 -146493 -108837 -35422 47418 385 -99055 -110739 13415
815 13415 76736 -7499 -4309 6119 -54112 10697 20954 65961 -838 -21687 6128 -62567
803 -62567 -76791 -58877 -115718 -19557 -69469 -8827 43575 -54050 -24767 -59479 68024 131013
791 131013 47712 36976 -135214 -211157 -58809 -83849 -121199 885 73857 9843 5331
780 5331 -50853 -193508 -125018 -134087 -45912 -15000 70448 15172 -49066 -91915 -17439 34406
768 34406 8834 -18817 -65991 62087 106035 -70095 -11919 23718 -53914 51306 62038
757 62038 -30512 -9693 -52977 -92442 -32516 28251 145180 116195 4087 107450 115853 113492
745 113492 139205 42849 -76266 -44563 -120590 7257 75707 103095 85668 -35515 -40965
734 -40965 -77737 40424 169484 4921 -43337 58942 101889 66420 -89103 -95902 -42888
723 -42888 36777 37627 71206 -33901 -117421 -34534 24447 -48527 43992 -13340 -22551 91946
711 91946 54498 3568 25601 -27411 79953 -18405 107040 49840 9882 -36090 -139379
700 -139379 -128544 -21334 79801 -47478 -57378 88157 86305 -25276 131942 132193 -76364
689 -76364 -112476 -154842 -142618 -212103 -161535 -202802 -108531 32654 -57244 -53880 71664 -8666
677 -8666 12844 -38553 -50069 94413 -24322 -24619 52696 35684 76083 24902 8801 89537
665 89537 10068 164581 82811 -99612 38995 119474 55807 88861 8220 71015 36326
654 36326 82166 23944 87049 80220 117081 61050 22065 77450 30026 -45568 -81758 -62133
642 -62133 -50919 19959 95739 49905 76354 114668 22542 -46336 -68882 -52751 94680 -2334
630 -2334 -82059 -119465 18359 53926 -65702 -42866 -132858 -112404 -162994 -165709 -86961 -61850
618 -61850 146188 191893 443 20779 68810 28779 139820 10469 -47247 -86738 -18517
607 -18517 81263 -51428 -154402 -210395 -151979 -27071 25244 7719 -55934 -78981 -64767
596 -64767 46566 13508 16546 62479 61041 119578 -104456 -102206 -44916 -31548 6531 50315
584 50315 16798 -45258 54920 115521 -40771 -129104 -81389 -21964 -8994 -67764 -142682 -92661
572 -92661 -60628 136156 83216 74627 60991 -45311 3712 10685 -51743 -82732 6449 59804
560 59804 -119414 -98456 -76003 7114 -35438 -98756 -113575 -21137 -36732 -1106 6091 -17920
548 -17920 9938 63612 12653 -25783 39446 -74857 13681 50023 74740 33146 -100403 -76929
536 -76929 26390 27830 -51804 -45107 -82786 -71147 61059 101160 49515 -37073 -169371 -35862
524 -35862 74980 -50409 -26388 37054 -8266 -96361 -24510 87236 82087 -26845 -27416 -97492
512 -97492 -18684 26892 -11441 31589 50106 135270 128164 160188 85758 26436 105143 234648
500 234648 322093 194701 28403 11461 48958 117059 147809 126002 -8386 -108234 68569
489 68569 225698 234808 87878 54850 84744 89016 11809 -68513 -85192 -33040 85508 79875
477 79875 -122040 -59849 7901 85030 81141 26467 7847 56844 -17733 79241 143616 -28891
465 -28891 1557 74615 167383 96713 -51024 -12588 171294 102286 -28076 22671 90579
454 90579 55364 -32176 -140505 -129215 9426 -28904 -4203 62812 83317 51361 -41795 -57271
442 -57271 -117850 -94107 11348 35577 -183881 -205078 -79598 -58321 14201 -28672 82151
431 82151 19669 -46886 -19019 47826 10612 -39410 102345 138481 104926 184073 -7590 -46663
419 -46663 110722 227218 154103 46216 60142 22563 59355 22071 34241 119344 111401 33215
407 33215 -802 45829 -42683 -28726 -1431 -11162 -67296 -92709 -31147 -33963 24134 17240 -72290
394 -72290 -65254 79434 -24549 -164760 -50239 -29356 -155005 -156518 107 -18683 -85911
383 -85911 -33214 48445 101925 146054 173941 -75924 2738 180733 191648 124101 89762 56913
371 56913 146395 16782 -89749 19229 192501 38253 -15199 -71389 7573 -21413 -18843
360 -18843 3488 -153688 -193901 -161658 -120780 -7214 66987 -54285 -25599 -32617 -18939 -22382
348 -22382 83259 173409 63673 67232 112452 -81399 -138989 -9983 43783 26249 22970 102515
336 102515 24597 -50676 -42052 34854 -9251 18576 52455 67556 -91934 -19711 48476 16460
324 16460 52156 -4860 1525 -113338 54567 10904 -20410 69372 8889 -41908 -1238 109270
312 109270 -24270 -2981 -138825 319 111624 80025 88117 66872 117405 -20443 -105958
301 -105958 -145196 -86528 -75446 -95666 -94018 -70153 -64518 2926 -78215 65272 94780 -25598
289 -25598 -113119 70617 -57568 -121212 -135997 -97190 52977 -3060 -223485 -199255 -62178
278 -62178 -45023 -23568 111797 160679 97379 18666 27013 83765 117695 2177 -4006 -28532
266 -28532 -47021 -44254 63674 -14414 -45676 115356 2602 -39881 -36818 -43943 -24692 31318
254 31318 89990 34032 89244 124940 63249 17569 -57832 -3948 60041 -671 61209 -17818
242 -17818 -68827 -9041 -27740 -197925 -41126 52409 -48734 21137 91701 72545 80046 76163
230 76163 1480 121316 161078 202916 -32579 53073 40757 77173 -10878 -44852 69300
219 69300 58661 -96658 -38064 -2853 24545 -52377 -41083 -56467 30573 110534 55406 -3058
207 -3058 -103787 -105053 -24922 14426 62437 -135815 -31128 11931 -158586 -82429 -10506 31866
195 31866 156130 142107 86943 8970 -102284 66125 108462 61796 92145 151380 103287
184 103287 26591 11385 -12916 -10234 55211 150596 189848 172087 106478 38091 -33712 -276499
172 -276499 -269162 -49794 37864 11282 -10159 28435 46458 60788 59850 56409 44842 99679
160 99679 172986 63045 -862 14858 -4562 -146114 -64685 -61547 29992 29149 99456 -55157
148 -55157 -83576 -51716 -24058 -142173 -72143 -104281 -71782 43485 16419 177701 101161
137 101161 -47119 -41011 -71958 -5909 -104034 43628 91850 -118902 -133285 -131286 -5418
126 -5418 32119 -26476 -43265 -12700 -143598 -53101 -92829 -39036 -17009 54377 100706 71637
114 71637 54524 20390 84643 7980 12411 -31467 9795 91723 21266 -86464 -107601 51295
102 51295 75905 125160 67238 -9906 -5671 -17821 -85167 124 -75617 -69899 5328 -40080
90 -40080 -86423 55640 40081 -55969 17495 76909 127267 218648 203616 190667 154038 163378
78 163378 80339 110446 152969 50689 20939 52121 -15103 -25280 -32988 -51847 52628 43066
66 43066 84641 40656 -63111 109809 118371 37345 52225 49878 20934 -105754 -62310 -878
54 -878 77568 55335 31844 -4726 73726 117165 42977 -63417 57534 92237 67439 -11958
42 -11958 -11880 -107185 -103552 -14707 -28863 -32024 -33151 19946 -14917 -95042 -35131 55310 -48635
29 -48635 -56490 41911 84510 -9425 10193 95868 119262 100306 60363 -10474 -13087 -23112 -48075
16 -48075 18523 24858 15724 54963 55112 66486 66606 22525 42244 -100226 -24835 98627 45682
3 45682 35392 -7010 27685
0 27685
$$ Imaginary data points
##PAGE= N=2
##DATA TABLE= (X++(I..I)), XYDATA
16383 -1150452 -1185121 -1094125 -1007169 -1022528 -981134 -960846 -1009613 -1007203 -907898 -875642 -854069
16372 -854069 -825159 -883723 -884129 -842816 -787806 -731634 -747415 -565873 -528441 -680885 -666307
16361 -666307 -618388 -490556 -504143 -551297 -518661 -477337 -420354 -418697 -447689 -537529 -541646 -460097
16349 -460097 -365671 -299634 -360408 -346490 -371609 -345044 -259956 -183505 -76297 -110530 -122091
16338 -122091 -190039 -164712 -49265 -64782 112308 41107 -18792 -3460 63083 71134 39189
16327 39189 -12829 -28760 34540 81090 97921 92534 71769 119894 154032 186924 298039 366127
16315 366127 279955 281216 289296 306482 367219 323740 398291 414661 468248 486466 522485 515645
16303 515645 468430 446387 531409 615170 732985 679170 691451 602533 565836 610664 578308
16292 578308 644852 755500 794074 781600 873563 874612 859533 832050 781701 821980 933699
16281 933699 916498 842543 976720 978310 927200 1020012 1086678 1075025 1092325 1060746 1036778
16270 1036778 1043161 1115712 1032270 985623 1116784 1315038 1389458 1285542 1287238 1292661 1184463
16259 1184463 1257718 1358527 1346605 1298899 1361655 1508570 1337079 1398759 1380862 1439176 1417632
16248 1417632 1470629 1369673 1358926 1479247 1453922 1476638 1632664 1625419 1527795 1530483 1557214
16237 1557214 1609468 1611220 1658076 1606982 1536378 1549032 1622592 1611529 1671125 1625435 1618080 1641177
16225 1641177 1625151 1661050 1679231 1685123 1703791 1717412 1683977 1659713 1685290 1652432 1621816
16214 1621816 1756919 1843038 1786495 1735064 1751649 1804160 1806906 1769665 1775673 1905697 1837855
16203 1837855 1851877 1953558 1896180 1939875 1970457 1879538 1947787 1918791 1860816 1903161 1902447
16192 1902447 2039340 1975786 1966143 1990653 1849836 1944403 1941108 1942438 1992460 2011539 2031196
16181 2031196 2038782 2088414 2015218 1952729 2062226 1946755 1972166 1932179 1931330 2082647 2272334
16170 2272334 2182495 2084224 2214449 2202478 2131860 2157182 2039691 2199901 2188753 2147488 2116366
16159 2116366 2089581 2296159 2241885 2067475 2045676 2136905 2233451 2208287 2107704 2152421 2102447
16148 2102447 2272077 2362329 2325716 2357229 2480834 2448195 2309963 2224640 2136215 2189927 2268814
16137 2268814 2186840 2201583 2195006 2363874 2312018 2330770 2379223 2312217 2408879 2392474 2272841
16126 2272841 2363593 2304501 2266914 2338297 2289000 2304005 2459617 2460435 2434270 2395465 2393558 2410897
16114 2410897 2361777 2396738 2378964 2311492 2354633 2357617 2346879 2275205 2382777 2418079 2361797
16103 2361797 2414070 2434482 2469566 2471371 2453697 2507946 2519720 2456734 2394171 2347232 2422609
16092 2422609 2368017 2320175 2456530 2440627 2458843 2439687 2344818 2341833 2330991 2167347 2236321
16081 2236321 2294497 2240675 2322851 2472959 2494079 2357423 2313484 2417024 2516134 2527683 2455572
16070 2455572 2440340 2301318 2228626 2331428 2338790 2243968 2324090 2393890 2417793 2387151 2226801
16059 2226801 2392574 2374898 2299077 2257146 2337244 2368266 2377185 2232810 2339766 2236533 2240792
16048 2240792 2291088 2432993 2386798 2425233 2444506 2310335 2240226 2207002 2236061 2301286 2465630
16037 2465630 2477030 2439208 2489677 2540256 2636247 2486987 2541347 2609906 2529983 2389404 2326134
16026 2326134 2412933 2399363 2488435 2550010 2484505 2441128 2475942 2449542 2453016 2420454 2425389 2442010
16014 2442010 2489981 2399104 2320466 2309100 2525549 2482521 2393837 2322606 2257803 2301518 2392917
16003 2392917 2407488 2405566 2585372 2557073 2538730 2379597 2266759 2298582 2245233 2090995 2214992
15992 2214992 2366504 2263491 2245664 2288178 2425558 2474186 2463639 2481939 2512469 2528816 2535514
15981 2535514 2467626 2541387 2314145 2320210 2363512 2412875 2457627 2493470 2535655 2346523 2319097
15970 2319097 2424815 2350712 2286441 2303340 2400153 2495611 2526120 2570345 2552116 2484804 2462523
15959 2462523 2335970 2333967 2389597 2484550 2495011 2497045 2614788 2594757 2485801 2402087 2437241
15948 2437241 2551334 2655676 2511643 2427186 2381390 2433505 2437899 2531823 2559697 2475588 2444390
15937 2444390 2421401 2341450 2370552 2472329 2476302 2469047 2430203 2455473 2426859 2326016 2368876
15926 2368876 2427953 2465853 2470773 2388803 2380652 2544917 2569709 2444891 2441278 2482640 2505381
15915 2505381 2589251 2602075 2511054 2459018 2511990 2581367 2559310 2496556 2520978 2501946 2441917
15904 2441917 2545159 2339761 2271660 2421046 2461023 2531376 2502954 2492067 2381708 2395934
15894 2395934 2584091 2489866 2368036 2421745 2512358 2475155 2440493 2261723 2303061 2294756 2465011
15883 2465011 2439481 2439386 2646690 2368816 2297850 2281305 2267795 2355814 2510533 2451914 2532291
15872 2532291 2526417 2526868 2457454 2559968 2445586 2489558 2505992 2463112 2454552 2311230 2509918
15861 2509918 2586029 2567915 2493913 2419285 2558699 2653259 2572170 2429039 2282016 2439837
15851 2439837 2525672 2512612 2595504 2486991 2413682 2418261 2579110 2528647 2456005 2422253 2282307
15840 2282307 2385628 2530445 2565401 2566649 2465670 2480467 2575938 2486527 2488365 2465774 2444305
15829 2444305 2509257 2588203 2533453 2451386 2354866 2425593 2449327 2444016 2478364 2444897 2575355
15818 2575355 2644087 2435692 2429656 2326397 2435856 2406087 2416575 2395527 2370886 2353358 2506242
15807 2506242 2527930 2591688 2509145 2534918 2624434 2548992 2491002 2532809 2497414 2446513 2582272
15796 2582272 2530208 2491630 2424278 2381598 2345312 2362132 2295032 2386367 2359130 2476502 2431988
$$ [...]
##END NTUPLES=NMR SPECTRUM
##END=
