##TITLE=1H_DE-80H_X3
 200.13MHz, d2o
 8 sc
 
 19ns.26.2.2025
##JCAMPDX= 6.0         $$ Bruker NMR JCAMP-DX V2.0
##DATA TYPE= NMR SPECTRUM
##DATA CLASS= NTUPLES
##ORIGIN= UXNMR, Bruker Analytische Messtechnik GmbH
##OWNER= pz
$$ XWIN-NMR		Version 3.5
$$ Wed Jul 30 10:31:40 2025 Russian Standard Time (UT+4h)  Yarkov@DPX200
##.OBSERVE FREQUENCY= 200.1313
##.OBSERVE NUCLEUS= ^1H
##.ACQUISITION MODE= SIMULTANEOUS
##.ACQUISITION SCHEME= undefined
##.AVERAGES= 8
##.DIGITISER RES= 18
##SPECTROMETER/DATA SYSTEM= spect
##.PULSE SEQUENCE= zg30
##.SOLVENT NAME= MeOD
##.SHIFT REFERENCE= (INTERNAL, MeOD, 0, 15.5199)
##AUDIT TRAIL= $$ (NUMBER, WHEN, WHO, WHERE, WHAT)
$$ ##TITLE= Audit trail, XWIN-NMR		Version 3.5
$$ ##JCAMPDX= 5.01
$$ ##ORIGIN= Bruker BioSpin GmbH
$$ ##OWNER= Yarkov
$$ C:/Bruker/XWIN-NMR/data/yarkov2/nmr/H-C/1/pdata/1/auditp.txt
$$ ##AUDIT TRAIL=  $$ (NUMBER, WHEN, WHO, WHERE, WHAT)
(   1,<2025-07-30 10:30:29.60 +0400>,<Yarkov>,<DPX200>,
      <created by zg, POWCHK disabled, PULCHK disabled
       configuration hash MD5:
       00 E9 B6 7A A2 85 ED C7 34 08 36 98 17 FE 4E 26
       data hash MD5: 16K
       65 0E 24 DE D9 1E F1 28 14 FA 89 2D EA C0 5F 06>)
(   2,<2025-07-30 10:30:47.56 +0400>,<Yarkov>,<DPX200>,
      <Start of raw data processing
       efp BC_mod = 2 LB = 0.25 FT_mod = 6 PKNL = 1 PHC0 = -1352.079 PHC1 = -1.809091 SI = 16K 
       data hash MD5: 16K
       3A 6C A3 D8 85 E8 D3 21 87 B6 C0 9E F0 77 11 CB>)
(   3,<2025-07-30 10:31:00.51 +0400>,<Yarkov>,<DPX200>,
      <pk PHC0 = 3.2 PHC1 = 0 
       data hash MD5: 16K
       05 E7 30 55 FB 27 7E 31 3E D9 0F F9 5D A9 95 81>)
$$ ##END=
$$ 
$$ hash MD5
$$ E2 FA BA 6F 99 0D 00 11 B3 80 2B 34 07 DE B7 B6
##$RELAX= 
##$RELAX= 
##$RELAX= 
##$RELAX= 
##$RELAX= 
##$RELAX= 
$$ Bruker specific parameters
$$ --------------------------
##$DU= <C:/Bruker/XWIN-NMR>
##$EXPNO= 1
##$NAME= <H-C>
##$PROCNO= 1
##$TYPE= <nmr>
##$USER= <yarkov2>
##$AMP= (0..31)
100 100 100 100 100 100 100 100 100 100 100 100 100 100 100 100 100 100 
100 100 100 100 100 100 100 100 100 100 100 100 100 100 
##$AQSEQ= 0
##$AQ_mod= 1
##$AUNM= <au_zg>
##$AUTOPOS= <>
##$BF1= 200.13
##$BF2= 200.13
##$BF3= 200.13
##$BF4= 200.13
##$BF5= 200.13
##$BF6= 200.13
##$BF7= 200.13
##$BF8= 200.13
##$BYTORDA= 1
##$CFDGTYP= 0
##$CFRGTYP= 5
##$CHEMSTR= <none>
##$CNST= (0..31)
1 1 145 1 1 1 1 1 1 1 1 1 1 1 1 1 1 1 1 1 1 1 1 1 1 1 1 1 1 1 1 1 
##$CPDPRG= <>
##$CPDPRG1= <>
##$CPDPRG2= <>
##$CPDPRG3= <>
##$CPDPRG4= <mlev>
##$CPDPRG5= <mlev>
##$CPDPRG6= <mlev>
##$CPDPRG7= <mlev>
##$CPDPRG8= <mlev>
##$CPDPRGB= <>
##$CPDPRGT= <>
##$D= (0..31)
0 0.7 0 0 0 0 0 0 0 0 0 0.03 0 0 0 0 0 0 0 0 0 0 0 0 0 0 0 0 0 0 0 0 
##$DATE= 1753857029
##$DBL= (0..7)
120 120 120 120 120 120 120 120 
##$DBP= (0..7)
150 150 150 150 150 150 150 150 
##$DBP07= 0
##$DBPNAM0= <>
##$DBPNAM1= <>
##$DBPNAM2= <>
##$DBPNAM3= <>
##$DBPNAM4= <>
##$DBPNAM5= <>
##$DBPNAM6= <>
##$DBPNAM7= <>
##$DBPOAL= (0..7)
0.5 0.5 0.5 0.5 0.5 0.5 0.5 0.5 
##$DBPOFFS= (0..7)
0 0 0 0 0 0 0 0 
$$ [...]
##$SUBNAM2= <"">
##$SUBNAM3= <"">
##$SUBNAM4= <"">
##$SUBNAM5= <"">
##$SUBNAM6= <"">
##$SUBNAM7= <"">
##$SUBNAM8= <"">
##$SUBNAM9= <"">
##$SW= 18.0517328524113
##$SWIBOX= (0..15)
0 0 2 0 0 0 0 0 0 0 0 0 0 0 0 0 
##$SW_h= 3612.71676300578
##$TD= 16384
##$TD0= 1
##$TE= 0
##$TE2= 300
##$TE3= 300
##$TEG= 300
##$TL= (0..7)
0 120 120 120 120 120 120 120 
##$TP= (0..7)
150 150 150 150 150 150 150 150 
##$TP07= 0
##$TPNAME0= <>
##$TPNAME1= <>
##$TPNAME2= <>
##$TPNAME3= <>
##$TPNAME4= <>
##$TPNAME5= <>
##$TPNAME6= <>
##$TPNAME7= <>
##$TPOAL= (0..7)
0.5 0.5 0.5 0.5 0.5 0.5 0.5 0.5 
##$TPOFFS= (0..7)
0 0 0 0 0 0 0 0 
##$TUNHIN= 0
##$TUNHOUT= 0
##$TUNXOUT= 0
##$USERA1= <user>
##$USERA2= <user>
##$USERA3= <user>
##$USERA4= <user>
##$USERA5= <user>
##$V9= 5
##$VALIST= <valist>
##$VCLIST= <CCCCCCCCCCCCCCC>
##$VD= 0
##$VDLIST= <DDDDDDDDDDDDDDD>
##$VPLIST= <PPPPPPPPPPPPPPP>
##$VTLIST= <TTTTTTTTTTTTTTT>
##$WBST= 1024
##$WBSW= 4
##$XGAIN= (0..3)
0 0 0 0 
##$XL= 0
##$YL= 0
##$YMAX_a= 385022
##$YMIN_a= -344345
##$ZGOPTNS= <>
##$ZL1= 120
##$ZL2= 120
##$ZL3= 120
##$ZL4= 120
##$ABSF1= 0
##$ABSF2= 0
##$ABSG= 0
##$ABSL= 0
##$ALPHA= 0
##$AQORDER= 0
##$ASSFAC= 0
##$ASSFACI= 0
##$ASSFACX= 0
##$ASSWID= 0
##$AUNMP= <proc_1d>
##$AZFE= 0.1
##$AZFW= 0.1
##$BCFW= 0
##$BC_mod= 2
##$BYTORDP= 0
##$COROFFS= 0
##$CY= -3
##$DATMOD= 1
##$DC= 0
##$DFILT= <>
##$DTYPP= 0
##$F1P= 0
##$F2P= 0
##$FCOR= 1
##$FTSIZE= 16384
##$FT_mod= 6
##$GAMMA= 0
##$GB= 0
##$INTBC= 1
##$INTSCL= 3.241238e-09
##$ISEN= 128
##$LB= 0.25
##$LEV0= 0
##$LPBIN= 0
##$MAXI= 10000
##$MC2= 0
##$MEAN= 0
##$ME_mod= 0
##$MI= 1.114404
##$NCOEF= 0
##$NC_proc= -6
##$NLEV= 6
##$NOISF1= 3.799351
##$NOISF2= 2.8
##$NSP= 0
##$NTH_PI= 0
##$NZP= 0
##$OFFSET= 15.51991
##$PC= 1
##$PHC0= -1348.879
##$PHC1= -1.809091
##$PH_mod= 1
##$PKNL= yes
##$PPARMOD= 0
##$PSCAL= 0
##$PSIGN= 0
##$REVERSE= no
##$SF= 200.130000357862
##$SI= 16384
##$SIGF1= 3
##$SIGF2= 2
##$SINO= 0.751879
##$SIOLD= 32768
##$SREGLST= <19F.Aceton>
##$SSB= 0
##$STSI= 16384
##$STSR= 0
##$SW_p= 3612.71676300578
##$SYMM= 0
##$S_DEV= 0
##$TDeff= 16384
##$TDoff= 0
##$TI= <>
##$TILT= no
##$TM1= 0
##$TM2= 0
##$TOPLEV= 0
##$USERP1= <user>
##$USERP2= <user>
##$USERP3= <user>
##$USERP4= <user>
##$USERP5= <user>
##$WDW= 1
##$XDIM= 16384
##$YMAX_p= 428531697
##$YMIN_p= -556832
$$ End of Bruker specific parameters
$$ ---------------------------------
##NTUPLES= NMR SPECTRUM
##VAR_NAME=  FREQUENCY,     SPECTRUM/REAL,   SPECTRUM/IMAG
##SYMBOL=    X,             R,               I
##VAR_TYPE=  INDEPENDENT,   DEPENDENT,       DEPENDENT
##VAR_FORM=  AFFN,          ASDF,            ASDF
##VAR_DIM=   16384,         16384,           16384
##UNITS=     HZ,            ARBITRARY UNITS, ARBITRARY UNITS
##FACTOR=    0.220516191357247, 1,           1
##FIRST=     3105.99956557634, 0,            0
##LAST=      -506.71719742944, 0,            0
##MIN=       -506.71719742944, -556832,      0
##MAX=       3105.99956557634, 428531697,    0
$$ Real data points
##PAGE= N=1
##DATA TABLE= (X++(R..R)), XYDATA
$$ [...]
$$ plain form
8088 -176608 -171969 -184890 -187380 -237732 -233315 -257474 -276420 -219711 -245439 -236444 -178245 -165782
8076 -165782 -227821 -263875 -263243 -185816 -138652 -198367 -266158 -257195 -249217 -264699 -208006 -203390 -237749
8063 -237749 -265210 -253863 -202694 -176720 -222033 -222468 -233910 -254015 -229751 -223087 -214867 -216189 -239769
8050 -239769 -273776 -238568 -212751 -223614 -206305 -196033 -156343 -178253 -258297 -289266 -274962 -257357
8038 -257357 -266251 -252897 -251076 -193776 -224003 -242553 -238930 -167339 -215329 -224955 -217864 -278037 -276969
8025 -276969 -261725 -230246 -230469 -200764 -259653 -219082 -223286 -265667 -266934 -205156 -224288 -236308
8013 -236308 -178089 -236570 -238341 -203964 -164334 -192675 -197702 -181528 -157390 -160617 -196842 -205209
8001 -205209 -215414 -226290 -200723 -180356 -183908 -183228 -182603 -209922 -213494 -230758 -178156 -152906 -202665
$$ packed form
8088a76608M639j2921k490n0352M417k4159j8946N6709k5728Q995N8199J2463
8076a65782o2039l6054O32P7427M7164n9715o7791Q963P978j5482N6693M616l4359
8063b37749k7461J1347N1169K5974m5313m35j1442k0105K4264O664Q220j322k3580
8050b39769l4007L5208K5817j0863J7309J0272L9690k1910q0044l0969J4304J7605
8038b57357q894J3354J821N7300l0227j8550L623P1591m7990r626P091o0173J068
8025b76969J5244L1479k23K9705n8889M0571m204m2381j267O1778j9132j2020
8013b36308N8219n8481j771L4377L9630k8341n027J6174K4138l227l6225q367
8001b05209j0205j0876K5567K0367l552O80O25k7319l572j7264N2602K5250m9759
$$ plain form
7988 -202665 -227971 -195255 -177093 -178074 -161015 -196924 -217477 -148646 -229902 -329435 -301557 -217357
7976 -217357 -214393 -209656 -224410 -276893 -280090 -299525 -251830 -240341 -224795 -259065 -275583 -293863
7964 -293863 -251922 -242995 -220621 -260807 -297358 -294387 -307600 -229124 -241152 -283074 -268734 -271270
7952 -271270 -214866 -213180 -233513 -219519 -253396 -212543 -173285 -200551 -232040 -242795 -296718 -331225
7940 -331225 -290911 -294360 -279997 -274474 -255997 -224826 -171945 -221092 -231455 -248703 -265755 -253818
7928 -253818 -291724 -287733 -308665 -261735 -223216 -255435 -245829 -260365 -200754 -242959 -300950 -262847
7916 -262847 -177838 -99159 -168925 -159683 -147743 -133521 -156534 -229155 -195348 -192524 -208103 -257913
7904 -257913 -275212 -233719 -176852 -170680 -212159 -204353 -169480 -138570 -166770 -224319 -239424 -188837
$$ packed form
7988b02665k5306L2716J8162r81J7059l5909k0553O8831q1256r9533K7878Q4200
7976b17357K964M737j4754n2483l197j9435M7695J1489J5546l4270j6518j8280
7964b93863M1941Q927K2374m0186l6551K971j3213P8476j2028m1922J4340k536
7952b71270N6404J686k0333J3994l3877M0853L9258k7266l1489j0755n3923l4507
7940c31225M0314l449J4363N523J8477L1171N2881m9147j0363j7248j7052J1937
7928b53818l7906L991k0932M6930L8519l2219R606j4536N9611m2205n7991L8103
7916b62847Q5009P8679o9766R242J1940J4222k3013p2621L3807K824j5579m9810
7904b57913j7299M1493N6867O172m1479P806L4873L0910k8200n7549j5105N0587
$$ plain form
7892 -188837 -187042 -192291 -201388 -228016 -216672 -256433 -220328 -230552 -239934 -225223 -258682 -250936 -250930
7879 -250930 -196973 -243837 -237300 -255412 -251290 -196768 -182582 -166468 -140017 -170786 -122111 -118134
7867 -118134 -169426 -216460 -240645 -269493 -254992 -203741 -121747 -174368 -190265 -177059 -267593 -301602
7855 -301602 -288145 -253924 -189612 -144531 -245253 -301456 -240864 -249774 -228929 -261689 -281063 -292163
7843 -292163 -277613 -269647 -221688 -215816 -218766 -228203 -173421 -187028 -183141 -108387 -190289 -157298 -209873
7830 -209873 -196685 -189435 -181407 -233091 -193003 -223064 -214630 -181618 -186245 -226181 -239549 -203460
7818 -203460 -282382 -235475 -178927 -251768 -286527 -249200 -266876 -290713 -255233 -249077 -200290 -79381
7806 -79381 -166817 -242519 -251282 -229534 -175946 -266774 -295848 -282020 -213819 -162122 -221478 -246320
$$ packed form
7892a88837J795n249r097k6628J1344l9761L6105j0224r382J4711l3459P746O
7879b50930N3957m6864O537j8112M122N4522J4186J6114K6451l0769M8675L977
7867a18134n1292m7034k4185k8848J4501N1251Q1994n2621j5897J3206r0534l4009
7855c01602J3457L4221O4312M5081j00722n6203O0592q910K0845l2760j9374j1100
7843b92163J4550P966M7959N872k950r437N4782j3607L887P4754q1902L2991n2575
7830b09873J3188P250Q028n1684M0088l0061Q434L3012m627l9936j3368L6089
7818b03460p8922M6907N6548p2841l4759L7327j7676k3837L5480O156M8787J20909
7806g9381q7436p5702q763K1748N3588r0828k9074J3828O8201N1697n9356k4842
$$ plain form
7794 -246320 -207758 -171487 -172053 -197673 -250186 -242331 -201980 -243788 -191060 -208162 -126322 -96552
7782 -96552 -85171 -186555 -283164 -238765 -228334 -256100 -238772 -235607 -259343 -265508 -264927 -229539
7770 -229539 -180916 -153581 -192405 -208221 -182344 -196195 -180010 -248098 -336583 -200885 -84109
7759 -84109 -125764 -222322 -206875 -164485 -163421 -243548 -216601 -210720 -205798 -203466 -223581 -234423 -133392
7746 -133392 -93662 -99873 -173126 -182745 -176724 -158197 -192863 -265781 -269177 -218436 -184428 -193554 -146427
7733 -146427 -184914 -98818 -75527 -103345 -142433 -224607 -235638 -231771 -171254 -108522 -158919 -169398
7721 -169398 -135587 -171246 -125745 -76820 -172398 -176701 -213111 -230983 -246333 -270250 -250868 -176027
7709 -176027 -163747 -170589 -167012 -185069 -167713 -217681 -216913 -250922 -267260 -203343 -214211 -221428 -164544
$$ packed form
7794b46320L8562L6271n66k5620n2513P855M0351m1808N2728j7102Q1840K9770
7782i6552J1381j01384r6609M4399J0431k7766J7328L165k3736o165N81L5388
7770b29539M8623K7335l8824j5816K5877j3851J6185o8088q8485J35698J16776
7759h4109m1655r6558J5447M2390J064q0127K6947N881M922K332k0115j0842J01031
7746a33392L9730o211p3253r619O021J8527l4666p2918l396N0741L4008r126M7127
7733a46427l8487Q6096K3291k7818l9088q2174j1031L867O0517O2732n0397j0479
7721a69398L3811l5659M5501M8925r5578m303l6410j7872j5350k3917J9382P4841
7709a76027J2280o842L577j8057J7356m9968P68l4009j6338O3917j0868p217N6884
$$ plain form
7696 -164544 -160373 -148901 -165195 -165298 -174565 -232557 -187051 -188085 -161279 -128784 -183462 -241036 -282100
7683 -282100 -208838 -239505 -226020 -203593 -190064 -147507 -165192 -176833 -177677 -155759 -123033 -161948
7671 -161948 -169994 -205103 -198547 -202595 -192478 -196031 -193098 -148056 -167429 -136153 -150332 -220987 -211648
7658 -211648 -185057 -172239 -191817 -217245 -240712 -150281 -110306 -179548 -213184 -185648 -166530 -202068
7646 -202068 -155553 -154993 -183168 -189357 -179968 -141340 -134355 -95986 -125730 -104779 -220079 -223316 -231672
7633 -231672 -205146 -184709 -214528 -181743 -225440 -148223 -154598 -136008 -183884 -198853 -186584 -147403
7621 -147403 -86921 -40085 -44107 -119265 -121957 -114659 -149024 -170980 -135280 -161039 -185327 -182030
7609 -182030 -167984 -83986 -100824 -170419 -221206 -248655 -231463 -107640 -148637 -190154 -155312
$$ packed form
7696a64544M171J1472j6294j03r267n7992M5506j034K6806L2495n4678n7574m1064
7683b82100P3262l0667J3485K2427J3529M2557j7685j1641q44K1918L2726l8915
7671a61948q046l5109O556m048J0117l553K933M5042j9373L1276j4179p0655R339
7658b11648K6591J2818j9578k5428k3467R0431L9975o9242l3636K7536J9118l5538
7646b02068M6515N60k8175o189R389L8628O985L8369k9744K0951j15300l237q356
7633b31672K6526K0437k9819L2785m3697P7217o375J8590m7876j4969J2269L9181
7621a47403O0482M6836m022p5158k692P298l4365k1956L5700k5759k4288L297
7609a82030J4046Q3998j6838o9595n0787k7449J7192J23823m0997m1517L4842
$$ plain form
7598 -155312 -173150 -210636 -243546 -173233 -152725 -141635 -108498 -162455 -135279 -189977 -97464 -103451
7586 -103451 -152370 -205529 -209263 -208005 -226315 -211277 -172338 -168664 -178536 -184270 -200741 -161782 -176253
7573 -176253 -199129 -214069 -259167 -220476 -173639 -153812 -169804 -216407 -195531 -189915 -227534 -219085
7561 -219085 -189222 -124104 -151433 -142016 -150586 -221072 -162639 -166323 -166045 -207637 -190477 -214006 -199167
7548 -199167 -222800 -282927 -322880 -306068 -229615 -200119 -198914 -253346 -257038 -286204 -249693 -148357
7536 -148357 -175279 -235798 -225249 -204904 -249686 -232651 -236387 -187326 -142981 -99640 -157536 -172675
7524 -172675 -155523 -195555 -146528 -206312 -261091 -197777 -121656 -162828 -176179 -127826 -178062 -197857
7512 -197857 -161477 -183920 -200129 -149817 -100065 -77558 -111250 -163240 -186669 -191080 -190153 -175334
$$ packed form
7598a55312j7838l7486l2910P0313K0508J1090L3137n3957K7176n4698R2513n987
7586a03451m8919n3159l734J258j8310J5038L8939L674r872n734j6471L8959j4471
7573a76253k2876j4940m5098L8691M6837J9827j5992m6603K0876N616l7619Q449
7561b19085K9863O5118k7329R417q570p0486N8433l684K78m1592J7160k3529J4839
7548a99167k3633o0127l9953J6812P6453K9496J205n4432l692k9166L6511J01336
7536a48357k6922o0519J0549K0345m4782J7035l736M9061M4345M3341n7896j5139
7524a72675J7152m0032M9027n9784n4779O3314P6121m1172j3351M8353n0236j9795
7512a97857L6380k2443j6209N0312M9752K2507l3692n1990k3429m411R27J4819
$$ plain form
7500 -175334 -168199 -210482 -235240 -213572 -157113 -163672 -215466 -230565 -202027 -164317 -199096 -181792
7488 -181792 -149847 -142184 -214567 -286875 -296743 -260753 -248339 -216326 -198525 -153020 -247234 -230211
7476 -230211 -229185 -194827 -189195 -201808 -127934 -182300 -203257 -153682 -120006 -199435 -199466 -215123 -200002
7463 -200002 -191825 -183170 -148401 -189204 -162470 -174406 -191516 -209015 -209786 -252537 -231705 -261082
7451 -261082 -163172 -66870 -198079 -196971 -110932 -129282 -81728 -60124 -58006 -101893 -119957 -93248
7439 -93248 -163823 -129408 -90561 -180295 -201035 -131118 -172422 -127626 -119071 -122327 -114851 -155162
7427 -155162 -136297 -101679 -109297 -216044 -265445 -247358 -243601 -225230 -255878 -248181 -178161 -115993
7415 -115993 -159289 -150837 -194189 -205211 -170720 -110859 -152877 -202874 -201211 -148726 -141550 -134911
$$ packed form
7500a75334P135m2283k4758K1668N6459o559n1794j5099K8538L7710l4779J7304
7488a81792L1945P663p2383p2308r868L5990J2414L2013J7801M5505r4214J7023
7476b30211J026L4358N632j2613P3874n4366k0957M9575L3676p9429l1j5657J5121
7463b00002Q177Q655L4769m0803K6734j1936j7110j7499p71m2751K0832k9377
7451b61082R7910R6302j31209J108Q6039j8350M7554K1604K118m3887j8064K6709
7439i3248p0575L4415L8847q9734k0740O9917m1304M4796Q555l256P476m0311
7427a55162J8865L4618p618j06747m9401J8087L757J8371l0648P697P0020O2168
7415a15993m3296Q452m3352j1022L4491N9861m2018m9997J663N2485P176O639
$$ plain form
7403 -134911 -163116 -234874 -236561 -184820 -194248 -178515 -161791 -95238 -131807 -153121 -171995 -190312
7391 -190312 -159901 -159001 -138397 -195030 -230154 -190469 -195979 -180114 -168776 -132514 -140432 -94893
7379 -94893 -72022 -121486 -144526 -170033 -214527 -239067 -195809 -146485 -79644 -187558 -245335 -280853
7367 -280853 -306623 -256769 -212762 -232190 -196358 -199816 -203769 -242021 -215831 -159686 -155602 -183871
7355 -183871 -189246 -211759 -223311 -228044 -261809 -221678 -193852 -133902 -140902 -176709 -237327 -211481
7343 -211481 -215844 -198603 -161013 -146376 -149021 -94466 -147202 -169666 -168950 -169782 -136786 -166368 -161533
7330 -161533 -125780 -115039 -180000 -106561 -89124 -151363 -96159 -116454 -140702 -142721 -175711 -211720
7318 -211720 -212943 -115170 -119561 -156748 -151594 -122647 -112119 -169002 -214027 -141077 -170535 -189068
$$ packed form
7403a34911k8205p1758j687N1741r428J5733J6724O6553l6569k1314j8874j8317
7391a90312L0411R00K0604n6633l5124L9685n510J5865J1338L6262p918M5539
7379i4893K2871m9464k3040k5507m4494k4540M3258M9324O6841j07914n7777l5518
7367b80853k5770M9854M4007j9428L5832l458l953l8252K6190N6145M084k8269
7355a83871n375k2513j1552m733l3765M0131K7826N9950p000l5807o0618K5846
7343b11481m363J7241L7590J4637k645N4555n2736k2464P16q32L2996k9582M835
7330a61533L5753J0741o4961P3439J7437o2239N5204k0295k4248k019l2990l6009
7318b11720j223R7773m391l7187N154K8947J0528n6883m5025P2950k9458j8533
$$ plain form
7306 -189068 -231796 -190208 -152576 -170229 -142331 -85188 -199104 -224320 -152729 -103375 -113918
7295 -113918 -159870 -188553 -216236 -172453 -196982 -233937 -179650 -181544 -221086 -219819 -158242 -118521
7283 -118521 -106804 -112445 -136435 -159661 -169200 -203881 -226764 -242091 -182231 -174753 -194161 -134795
7271 -134795 -181920 -156407 -164338 -156963 -178146 -179820 -178396 -128722 -152765 -148341 -204027 -230639 -248938
7258 -248938 -239076 -170314 -151993 -118118 -150780 -119508 -152857 -109290 -127723 -221145 -159048 -83828
7246 -83828 -113789 -81358 -83777 -85557 -164286 -206848 -174671 -118864 -93458 -120973 -168462 -157806
7234 -157806 -143834 -192229 -188244 -184822 -164763 -136652 -141558 -164587 -98707 -117692 -208676 -191413
7222 -191413 -213286 -237699 -227177 -182063 -226297 -255296 -183489 -198870 -179607 -208100 -189932 -192615
$$ packed form
7306a89068m2728M1588L7632j7653K7898N7143j13916k5216P1591M9354j0543
7295a13918m5952k8683k7683M3783k4529l6955N4287j894l9542J267O1577L9721
7283a18521J1717n641k3990k3226r539l4681k2883j5327N9860P478j9408N9366
7271a34795m7125K5513p931P375k1183j674J424M9674k4043M424n5686k6612j8299
7258b48938R862O8762J8321L3875l2662L1272l3349M3567j8433r3422O2097P5220
7246h3828k9961L2431k419j780p8729m2562L2177N5807K5406k7515m7489J0656
7234a57806J3972m8395L985L422K0059K8111m906k3029O5880j8985r0984J7263
7222a91413k1873k4413J0522M5114m4234k8999P1807j5381J9263k8493J8168k683
$$ plain form
7210 -192615 -254198 -227939 -209815 -171327 -155798 -148075 -170934 -221005 -166883 -143106 -176155 -161165
7198 -161165 -147550 -162029 -159166 -162795 -141861 -23334 -35079 -120239 -139938 -148036 -140755 -103896
7186 -103896 -138522 -179845 -143378 -115608 -140550 -189048 -132686 -102967 -27590 -16886 -48521 -114406
7174 -114406 -119707 -107376 -53770 -124523 -167921 -161560 -143017 -122722 -97919 -105343 -156006 -147818
7162 -147818 -111726 -101518 -144534 -131088 -151866 -204345 -174056 -157255 -119536 -86374 -59571 -60316
7150 -60316 -117517 -152515 -137643 -114002 -108746 -170930 -174491 -135989 -99006 -63750 -69246 -53136
7138 -53136 -92730 -151050 -166587 -163682 -175564 -155323 -178755 -212457 -162291 -84697 -149982 -187034
7126 -187034 -63825 -53629 -58510 -110316 -118167 -70816 -84691 -73683 -25503 -30915 -54223 -83827
$$ packed form
7210a92615o1583K6259J8124L8488J5529P723k2859n0071N4122K3777l3049J4990
7198a61165J3615j4479K863l629K0934J18527j1745q5160j9699q098P281L6859
7186a03896l4626m1323L6467K7770k4942m8498N6362K9719P5377J0704l1635o5885
7174a14406n301J2331N3606p0753m3398O361J8543K0295K4803p424n0663Q188
7162a47818L6092J0208m3016J3446k0778n2479L0289J6801L7719L3162K6803p45
7150f0316n7201l4998J4872K3641N256o2184l561L8502L6983L5256n496J6110
7138e3136l9594n8320j5537K905j1882K0241k3432l3702N0166P7594o5285l7052
7126a87034J23209J0196m881n1806p851M7351j3875J1008M8180n412k3308k9604
$$ plain form
7114 -83827 -100303 -111852 -125713 -121883 -92019 -69380 -137010 -109857 -102331 -150590 -144292 -135813 -172961
7101 -172961 -119507 -124847 -143251 -215151 -182013 -147530 -130347 -96812 -103757 -107422 -133085 -158659
7089 -158659 -89727 -89811 -104385 -89673 -95475 -103527 -122890 -126080 -47549 -26195 -100610 -46414 -52950
7076 -52950 -39478 -56593 -149647 -129136 -46258 -49120 -34846 -51478 -158089 -105556 -98923 -107368
7064 -107368 -32020 44667 41574 -13591 -19428 -11772 -49883 -68566 -71306 -96195 -28235 -52908
7052 -52908 -96166 -26918 -19100 -44214 -71156 -100752 -83057 -39474 -59857 -127802 -150483 -73189
7040 -73189 -23529 -36197 -37246 3907 -30822 -34902 -54927 -134357 -67860 -49137 -5115 -22561
7028 -22561 -128556 -125613 -113883 -104693 -148043 -121840 -138864 -48373 -4226 -77753 -130063 -124966
$$ packed form
7114h3827j6476j1549j3861L830K9864K2639o7630K7153P526m8259O298Q479l7148
7101a72961N3454n340j8404p1900L3138L4483J7183L3535o945l665k5663k5574
7089a58659O8932q4j4574J4712n802q052j9363l190P8531K1354p4415N4196o536
7076e2950J3472j7115r3054K0511Q2878k862J4274j6632j06611N2533O633q445
7064a07368P5348P6687l093n5165n837P656l8111j8683k740k4889O7960k4673
7052e2908m3258O9248P818k5114k6942k9596J7695M3583k0383o7945k2681P7294
7040g3189M9660j2668j049M1153l4729m080k0025p9430O6497J8723M4022j7446
7028b2561j05995K943J1730R190m3350K6203j7024R0491M4147p3527n2310N097
$$ plain form
7016 -124966 -79842 -50493 -60412 -42465 213 -38706 -44714 -37679 -46925 -49715 -13069 4405 8059
7003 8059 -4116 -46711 -67664 9838 -44280 -66835 -35288 -8762 -84199 -95041 -475 -40666
6991 -40666 -70526 -73438 -55223 -138997 -142794 -138423 -82604 -80889 -83884 -21720 -56254 -63538 -39230
6978 -39230 -29029 -113268 -98784 -99069 -46362 34498 -8699 -108408 -107063 -42580 -23480 -38089
6966 -38089 -5129 -34604 -76312 -151054 -158619 -160367 -153317 -101514 -28192 -109957 -142888 -121645
6954 -121645 -131937 -118120 -65595 -69558 4622 -7572 -102496 -65996 -43846 -58695 -109284 -80597
6942 -80597 -52122 -90661 -101045 -83191 -126897 -103133 -109750 -107526 -98085 -34857 -29910 -69200 -52097
6929 -52097 -12993 -58794 -102153 -48906 -76742 -93443 -84413 -47475 -31468 -24499 -74278 -60959
$$ packed form
7016a24966M5124K9349r919J7947M2678l8919o008P035r246k790L6646J7474L654
7003H059j2175m2595k0953P7502n4118k2555L1547K6526p5437j0842R4566m0191
6991d0666k9860k912J8215q3774l797M371N5819J715k995O2164l4534p284K4308
6978c9230J0201q4239J4484k85N2707Q0860m3197r9709J345O4483J9100j4609
6966c8089L2960k9475m1708p4742p565j748P050N1803P3322q1765l2931K1243
6954a21645j0292J3817N2525l963P4180j2194r4924L6500K2150j4849n0589K8687
6942h0597K8475l8539j0384J7854m3706K3764o617K224R441O3228M947l9290J7103
6929e2097L9104m5801m3359N3247k7836j6701R030L6938J6007O969m9779J3319
$$ plain form
6917 -60959 -91829 -108176 -115426 -112788 -80528 -55269 -74387 -65135 52922 -151 -67531 -84595
6905 -84595 -76244 -72958 -41329 -14338 4064 -39046 -67723 -43016 -10326 37737 1081 -37894
6893 -37894 3959 9721 -41015 -34547 -33306 -13987 30996 -37240 -80268 -8349 -12266 -33316 -64062
6880 -64062 -91979 -90845 -81151 -31415 -28444 -41575 6067 54834 -22267 15474 85517 51568
6868 51568 20229 18892 -13559 -24496 -50911 -42193 -115261 -195845 -127904 -27247 -112669 -114412
6856 -114412 -78143 -82296 -82040 -15910 -51703 -81788 -90292 -37107 -53166 -14348 -18120 -13240 -51792
6843 -51792 -67052 8290 -17758 16610 37434 59897 -47505 -30901 -50761 -76730 -10913 86362
6831 86362 50448 85559 24149 -48067 -55467 -20446 20428 55859 152829 62918 34822 46469
$$ packed form
6917f0959l0870j6347p250K638L2260K5259j9118R252J18057n3073o7380j7064
6905h4595Q351L286L1629K6991J8402m3110k8677K4707L2690M8063l6656l8975
6893c7894M1853N762n0736O468J241J9319M4983o8236m3028P1919l917k1050l0746
6880f4062k7917J134R694M9736K971j3131M7642M8767p7101L7741P0043l3949
6868E1568l1339j337l2451j0937k6415Q718p3068q0584O7941J00657q5422j743
6856a14412L6269m153K56O6130l5793l0085q504N3185j6059L8818l772M880l8552
6843e1792j5260P5342k6048L4368K0824K2463j07402J6604j9860k5969O5817R7275
6831H6362l5914L5111o1410p2216p400L5021M0874L5431R6970q9911k8096J1647
$$ plain form
6819 46469 46039 -14671 -57704 -82416 -69418 -46147 19959 -20911 -15819 -45917 -84822 35876
6807 35876 14592 52907 49160 22809 -44668 -76368 -56633 15870 -47681 -73990 -68877 -15838
6795 -15838 21425 29580 -14208 -29101 17431 -22478 6247 36526 51860 75643 71342 -19477
6783 -19477 33348 97487 13599 13427 49388 18842 -758 -552 -33747 -21056 -7717 11248 -24828
6770 -24828 10700 95435 80342 124578 85565 91374 28768 36659 39108 123173 156822 81683
6758 81683 84054 53557 57492 81949 105328 122536 93958 36675 98896 89237 124863 91006
6746 91006 109542 95962 109586 91743 74117 109379 101585 118842 104349 72651 87314 64764
6734 64764 62197 45139 92956 69961 73312 137991 156071 104045 76783 134380 81547 121597
$$ packed form
6819D6469m30o0710m3033k4712J2998K3271O6106m0870N092l0098l8905J20698
6807C5876k1284L8315l747k6351o7477l1700J9735P2503o3551k6309N113N3039
6795a5838L7263Q155m3788j4893M6532l9909K8725L0279J5334K3783m301r0819
6783a9477N2825O4139q3888j72L5961l0546j9600K06l3195J2691J3339J8965l6076
6770b4828L5528Q4735j5093M4236l9013N809o2606P891K449Q4065L3649p5139
6758H1683K371l0497L935K4457K3379J7208k8578n7283O2221r659L5626l3857
6746I1006J8536j3580J3624j7843j7626L5262p794J7257j4493l1698J4663k2550
6734F4764k567j7058M7817k2995L351O4679J8080n2026k7262N7597n2833M0050
$$ plain form
6722 121597 138033 127683 162477 142050 148331 192720 181399 156219 121923 171415 142635 107366
6710 107366 110468 92889 114307 144171 105601 73968 106090 120388 144292 67594 31391 80299
6698 80299 148372 231165 202385 187402 201758 142759 142301 106989 86690 86124 91318 178070 186411
6685 186411 183055 173400 185367 143904 115342 80805 13077 70155 182706 247248 192506 68603
6673 68603 103473 124290 86346 161960 167617 201529 248225 164547 241197 282693 339985 263262
6661 263262 269467 256970 232561 252100 239668 222667 220534 207606 209122 277499 212885 222109
6649 222109 282217 299318 315264 272258 267651 275309 345970 340903 301746 318083 333777 409997
6637 409997 420856 451274 493281 477868 517625 504922 533933 584630 645452 709567 764132 877240
$$ packed form
6722A21597J6436j0350L4794k0427O281M4389j1321k5180l4296M9492k8780l5269
6710A07366L102j7579K1418K9864l8570l1633L2122J4298K3904p6698l6203M8908
6698H0299O8073Q2793k8780j4983J4356n8999m58l5312k0299n66N194Q6752Q341
6685A86411l356r655J1967m1463k8562l4537o7728N7078J12551O4542n4742j23903
6673F8603L4870K0817l7944P5614N657L3912M6696q3678P6650M1496N7292p6723
6661B63262O205j2497k4409J9539j2432j7001k133j2928J516O8377o4614R224
6649B22109O0108J7101J5946m3006m607P658P0661n067l9157J6337J5694P6220
6637D09997J0859L0418M2007j5413L9757j2703K9011N0697O0822O4115N4565J13108
$$ plain form
6625 877240 859445 784905 778638 808005 756807 721560 781576 805671 701932 725903 794740 808114
6613 808114 818017 805949 801481 856509 917526 944978 887068 886164 894264 893166 857081 851460 855089
6600 855089 859824 779621 785756 823949 846753 820737 778296 728697 807706 806190 784777 796142
6588 796142 851023 899992 853927 892401 850646 785047 656377 631641 677518 622569 568028
6577 568028 578930 523122 444226 482032 508412 535427 539207 507962 461942 489084 516179 556476
6565 556476 562521 556339 599188 534032 548238 551501 527819 492819 476070 494451 474160 456134
6553 456134 426776 468372 452431 452507 460882 486707 492985 475730 504235 472803 540421 574464 502336
6540 502336 507692 490972 516890 543726 491459 472120 497087 542371 518209 492768 480292 566660
$$ packed form
6625H77240j7795p4540o267K9367n1198l5247O0016K4095j03739K3971O8837J3374
6613H08114R903j2068m468N5028O1017K7452n7910r04Q100j098l6085n621L629
6600H55089M735q0203O135L8193K2804k6016m2441m9599P9009j516k1413J1365
6588G96142N4881M8969m6065L8474m1755o5599j28670k4736M5877n4949n4541
6577E68028J0902n5808p8896L7806K6380K7015L780l1245m6020K7142K7095M0297
6565E56476O045o182M2849o5156J4206L263k3682l5000j6749J8381k0291j8026
6553D56134k9358M1596j5941P6Q375K5825O278j7255K8505l1432O7618L4043p2128
6540E02336N356j6720K5918K6836n2267j9339K4967M5284k4162k5441j2476Q6368
$$ plain form
6528 566660 526135 517097 521443 554650 623705 643151 574702 523388 554003 605623 518737 529880
6516 529880 502684 478484 472727 558078 548354 506851 510384 581831 605567 563257 627295 606191
6504 606191 548439 568688 651672 619867 653957 704982 684319 701986 687594 680998 703305 713275
6492 713275 734624 768092 769237 776213 824452 829666 806299 764848 765378 781480 808356 771164 796329
6479 796329 834505 832374 867430 858183 841769 925271 908929 963990 944090 938828 954300 899759
6467 899759 903018 954683 1006308 981797 946038 980855 980142 1018142 1020122 1056509 1073687 1121674
6455 1121674 1096644 1095351 1109422 1107496 1130610 1119668 1158827 1196277 1212282 1233882 1237261 1213057
6443 1213057 1180080 1128055 1143186 1207140 1214266 1270642 1284747 1178639 1216397 1202386 1290095
$$ packed form
6528E66660m0525r038M346L3207O9055J9446o8449n1314L0615N1620q6886J1143
6516E29880k7196k4200n757Q5351r724m1503L533P1447K3736m2310O4038k1104
6504F06191n7752K0249Q2984l1805L4090N1025k0663J7667j4392o596K2307R970
6492G13275K1349L3468J145O976M8239N214k3367m1451N30J6102K6876l7192K5165
6479G96329L8176k131L5056r247j6414Q3502j6342N5061j9900n262J5472n4541
6467H99759L259N1665N1625k4511l5759L4817p13L8000J980L6387J7178M7987
6455A121674k5030j293J4071j926K3114j0942L9159L7450J6005K1600L379k4204
6443A213057l2977n2025J5131O3954P126N6376J4105j06108L7758j4011Q7709
$$ plain form
6432 1290095 1292889 1291167 1266342 1270289 1249590 1248399 1302947 1286577 1334955 1388332 1423708 1391369
6420 1391369 1367755 1322722 1397775 1412426 1408241 1432605 1461549 1486133 1471611 1485230 1505278 1498261
6408 1498261 1518323 1542065 1537275 1519996 1533504 1532198 1528309 1687915 1737100 1655749 1671700 1712931
6396 1712931 1754393 1751908 1831784 1795963 1782698 1858610 1920139 1956273 1933834 1933547 1980784 2042218
6384 2042218 2113363 2161624 2223046 2223693 2233984 2303234 2309739 2322956 2398063 2491654 2523101 2586412
6372 2586412 2606228 2644315 2625172 2686144 2658741 2647703 2690057 2835041 2912599 2940661 3080001
6361 3080001 3116001 3164819 3252930 3231987 3282840 3320284 3353735 3382038 3492652 3592752 3679306
6350 3679306 3794474 3933857 3974194 4037561 4128098 4259570 4306389 4396474 4611998 4748685
$$ packed form
6432A290095K794j722k4825L947k0699j191N4548j6370M8378N3377L5376l2339
6420A391369k3614m5033P5053J4651m185K4364K8944K4584j4522J3619K0048p017
6408A498261K0062K3742m790j7279J3508j306l889J59606M9185q1351J5951M1231
6396A712931M1462k485P9876l5821j3265P5912O1529L6134k2439k87M7237O1434
6384B042218P1145M8261O1422O47J0291O9250O505J3217P5107R3591L1447O3311
6372B586412J9816L8087j9143O0972k7403j1038M2354J44984P7558K8062J39340
6361C080001L6000M8818Q8111k0943N0853L7444L3451K8303J10614J00100Q6554
6350C679306J15168J39383M0337O3367R0537J31472M6819R0085K15524J36687
$$ plain form
6340 4748685 4884196 5023120 5180573 5340798 5621278 5772232 5973395 6196932 6380734 6647873
6330 6647873 6889515 7116679 7425079 7751118 8130629 8527492 8987065 9568133 9985107 10313846
6320 10313846 10685998 11045066 11446941 11845279 12326111 12891432 13519246 14306362 15108211
6311 15108211 16072193 17123977 18241855 19618487 21195436 22956895 24847676 26937366
6303 26937366 29187257 31411534 33472686 35184033 36728750 38646675 41238203 44929535
6295 44929535 49738427 55386438 61747803 68943391 76951163 84773323 90783554 93935562
6287 93935562 92333758 86813280 80628345 76483662 74968725 75296894 76832201 79139267
6279 79139267 82456318 86599537 90698857 94675479 97342443 98175352 98756688 100770100
$$ packed form
6340D748685J35511J38924J57453J60225K80480J50954K01163K23537J83802K67139
6330F647873K41642K27164L08400L26039L79511L96863M59573N81068M16974L28739
6320A0313846L72152L59068M01875L98338M80832N65321O27814P87116Q01849
6311A5108211R63982J051784J117878J376632J576949J761459J890781K089690
6303B6937366K249891K224277K061152J711347J544717J917925K591528L691332
6295D4929535M808892N648011O361365P195588Q007772P822160O010231L152008
6287I3935562j601804n520478o184935m144683j514937L28169J535307K307066
6279G9139267L317051M143219M099320L976622K666964Q32909N81336K013412
$$ plain form
6271 100770100 104335189 108051771 110709791 110924134 107889671 102326488 96492998 92529378
6263 92529378 91151404 91651302 92665898 92920599 91373881 87077728 81528699 77236209
6255 77236209 75571657 76271778 78641292 82249867 86971092 92083697 95461688 96084536
6247 96084536 91874064 82286622 70479563 59822366 51807585 45818655 41215342 37442277
6239 37442277 34366303 31812539 29591228 27609396 25913659 24394830 23049158 21821991
6231 21821991 20812056 19785912 18904846 18057534 17309481 16676150 16041299 15409291 14881376
6222 14881376 14344826 13856038 13331630 12901149 12490759 11997282 11644085 11307945 10949610
6213 10949610 10536996 10195013 9887893 9602052 9318457 9052716 8848263 8592303 8365547
$$ packed form
6271A00770100L565089L716582K658020K14343l034463n563183n833490l963620
6263I2529378j377974M99898J014596K54701j546718m296153n549029m292490
6255G7236209j664552P00121K369514L608575M721225N112605L377991O22848
6247I6084536m210472r587442j1807059j0657197q014781n988930m603313l773065
6239C7442277l075974k553764k221311j981832j695737j518829j345672j227167
6231B1821991j009935j026144q81066q47312p48053o33331o34851o32008n27915
6222A4881376n36550m88788n24408m30481m10390m93477l53197l36140l58335
6213A0949610m12614l41983l07120k85841k83595k65741k04453k55960k26756
$$ plain form
6204 8365547 8104722 7865073 7662749 7408996 7256031 7079035 6862302 6761725 6630523 6417294
6194 6417294 6293463 6127449 5994211 5836683 5772382 5621742 5531799 5379931 5223016 5104569
6184 5104569 5052987 5032146 4966031 4859144 4743368 4625040 4579428 4466329 4390735 4364335 4282130
6173 4282130 4206360 4141758 4097465 4095978 4129427 4077281 4097721 4110786 4003854 3951460 3970564
6162 3970564 3868132 3801295 3689682 3644247 3562734 3467122 3473183 3434499 3421286 3323625 3298624
6151 3298624 3256038 3175705 3143502 3079359 3023706 3047565 2981972 2906387 2808662 2763380 2777071
6140 2777071 2831354 2880201 2801735 2711761 2701341 2677546 2656990 2642307 2594163 2650613 2541057
6129 2541057 2499057 2514731 2476036 2440093 2395008 2440164 2396035 2340036 2377070 2358187 2313418
$$ packed form
6204H365547k60825k39649k02324k53753j52965j76996k16733j00577j31202k13229
6194F417294j23831j66014j33238j57528o4301j50640q9943j51868j56915j18447
6184E104569n1582k0841o6115j06887j15776j18328m5612j13099p5594k6400q2205
6173D282130p5770o4602m4293j487L3449n2146K0440J3065j06932n2394J9104
6162C970564j02432o6837j11613m5435q1513r5612O061l8684j3213r7661k5001
6151C298624m2586q0333l2203o4143n5653K3859o5593p5585r7725m5282J3691
6140B777071N4283M8847p8466q9974j0420k3795k0556j4683m8144N6450j09556
6129B541057m2000J5674l8695l5943m5085M5156m4129n5999L7034j8883m4769
$$ plain form
6118 2313418 2227315 2188399 2254610 2202294 2184308 2201910 2166186 2195212 2100101 2066225 2050507
6107 2050507 2045240 2064020 2057335 2009915 2016352 2072929 1986893 1920379 1991610 1976141 1969521 1949625
6095 1949625 1920317 1956744 1986341 1966952 1825478 1838971 1842503 1817644 1865332 1878115 1879758 1980774
6083 1980774 2047494 2070603 2062182 2034511 2063828 2117797 2104127 2129540 2150512 2162084 2151073 2112450
6071 2112450 2130704 2236229 2299939 2346230 2292639 2283977 2226648 2274944 2277729 2239960 2220501 2172709
6059 2172709 2229209 2233908 2224948 2244686 2318708 2346429 2342790 2314972 2320589 2290867 2309270 2354616
6047 2354616 2375117 2377628 2414471 2328510 2327559 2268299 2310991 2322739 2327770 2266154 2250014 2261647
6035 2261647 2311075 2261357 2165905 2182946 2246118 2265737 2283763 2221245 2200935 2221983 2192337
$$ packed form
6118B313418q6103l8916O6211n2316j7986J7602l5724K9026r5111l3876j5718
6107B050507n267J8780o685m7420O437N6577q6036o6514P1231j5469o620j9896
6095A949625k9308L6427K9597j9389j41474J3493L532k4859M7688J2783J643J01016
6083A980774O6720K3109q421k7671K9317N3969j3670K5413K0972J1572j1011l8623
6071B112450J8254J05525O3710M6291n3591q662n7329M8296K785l7769j9459m7792
6059B172709N6500M699q960J9738P4022K7721l639k7818N617k9722J8403M5346
6047B354616K0501K511L6843q5961r51n9260M2692J1748N031o1616j6140J1633
6035B261647M9428m9718r5452J7041O3172J9619J8026o2518k0310K1048k9646
$$ plain form
6024 2192337 2138345 2136526 2122216 2083494 2118530 2111175 2106186 2052137 2042113 2057823 2083027 2110566
6012 2110566 2146380 2172511 2138792 2066146 2098999 2169932 2191090 2260912 2364031 2384314 2425536
6001 2425536 2428401 2319605 2389860 2562440 2585663 2565167 2554137 2522891 2523739 2497337 2559775 2552530
5989 2552530 2607621 2788951 2875276 2937707 2972821 2979002 2991404 3009575 3020330 3110663 3124956
5978 3124956 3164486 3210051 3270822 3299513 3318851 3288917 3248368 3272368 3301513 3305587 3350465 3355785
5966 3355785 3450287 3480464 3551010 3589573 3640382 3679787 3701828 3681804 3717729 3671444 3702915
5955 3702915 3624713 3700481 3765535 3755949 3758158 3825724 3844412 3827470 3828058 3809268 3828964 3759926
5943 3759926 3755111 3814741 3840717 3902366 3958034 3886209 3843877 3782003 3709292 3721166 3719372 3684429
$$ packed form
6024B192337n3992j819j4310l8722L5036p355m989n4049j0024J5710K5204K7539
6012B110566L5814K6131l3719p2646L2853P0933K1158O9822J03119K0283M1222
6001B425536K865j08796P0255J72580K3223k0496j1030l1246Q48k6402O2438p245
5989B552530N5091J81330Q6325O2431L5114O181J2402J8171J0755R0333J4293
5978C124956L9530M5565O0771K8691J9338k9934m0549K4000K9145M074M4878N320
5966C355785R4502L0177P0546L8563N0809L9405K2041k0024L5925m6285L1471
5955C702915p8202P5768O5054r586K209O7566J8688j6942N88j8790J9696o9038
5943C759926m815N9630K5976O1649N5668p1825m2332o1874p2711J1874j794l4943
$$ plain form
5931 3684429 3783227 3769760 3804394 3767198 3723122 3805851 3753712 3724628 3727557 3653777 3680021 3683423
5919 3683423 3646931 3699765 3711036 3682559 3710099 3640640 3648011 3670920 3678033 3701110 3826356 3877852
5907 3877852 3880953 3858226 3868579 3810858 3772145 3740963 3720027 3621320 3603508 3653478 3583749 3552220
5895 3552220 3579642 3648181 3684136 3706613 3751500 3747768 3703787 3650542 3660945 3690437 3631653 3688968
5883 3688968 3741318 3734921 3759692 3874166 3898371 3860258 3934755 3959330 4007530 3969612 3920043
5872 3920043 4045380 4127396 4053142 4107522 4169433 4133291 4175611 4294307 4347057 4379338 4405516
5861 4405516 4396235 4374308 4427346 4499837 4522381 4522409 4638146 4676427 4701274 4786951 4858863 4939244
5849 4939244 4988951 5060319 5075723 5077679 5181297 5221346 5315863 5429897 5421891 5409906 5548818
$$ packed form
5931C684429R8798j3467L4634l7196m4076Q2729n2139k9084K929p3780K6244L402
5919C683423l6492N2834J1271k8477K7540o9459P371K2909P113K3077J25246N1496
5907C877852L101k2727J0353n7721l8713l1182k0936r8707j7812M9970o9729l1529
5895C552220K7422O8539L5955K2477M4887l732m3981n3245J0403K9492n8784N7315
5883C688968N2350o397K4771J14474K4205l8113P4497K4575M8200l7918m9569
5872C920043J25337Q2016p4254N4380O1911l6142M2320J18696N2750L2281K6178
5861D405516r281k1927N3038P2491K2544K8J15737L8281K4847Q5677P1912Q0381
5849D939244M9707P1368J5404J956J03618M0049R4517J14034q006j1985J38912
$$ plain form
5838 5548818 5625744 5641780 5780865 5865321 5937969 5992941 6084273 6118129 6114504 6146389 6196573
5827 6196573 6261246 6336535 6451320 6485744 6570721 6609683 6666396 6853573 6956096 7027927 7093830
5816 7093830 7212750 7294142 7343024 7517094 7696356 7753042 7899770 8069427 8230853 8321133
5806 8321133 8408609 8656289 8815131 9041820 9214195 9339775 9588928 9778348 10029754 10296624
5796 10296624 10566134 10791047 11010652 11303916 11691483 12020850 12409503 12816860 13213152
5787 13213152 13575813 13941118 14360922 14920952 15462225 16053122 16660491 17263494 17744428
5778 17744428 18374868 18975715 19515637 20183915 21001942 21967933 23015652 24238840 25446550
5769 25446550 26766064 28235795 29785151 31605284 33802317 36336595 39325031 42780961
$$ packed form
5838E548818P6926J6036J39085Q4456P2648N4972R1332L3856l625L1885N0184
5827F196573O4673P5289J14785L4424Q4977L8962N6713J87177J02523P1831O5903
5816G093830J18920Q1392M8882J74070J79262N6686J46728J69657J61426R0280
5806H321133Q7476K47680J58842K26689J72375J25580K49153J89420K51406K66870
5796A0296624K69510K24913K19605K93264L87567L29367L88653M07357L96292
5787A3213152L62661L65305M19804N60030N41273N90897O07369O03003M80934
5778A7744428O30440O00847N39922O68278Q18027R65991J047719J223188J207710
5769B5446550J319514J469731J549356J820133K197033K534278K988436L455930
$$ plain form
5761 42780961 46615302 50838596 55482566 60402210 65123962 69508542 73293581 76705698
5753 76705698 80373877 85074686 91133768 98404510 105765602 111539313 114856975 113916867
5745 113916867 109199620 103685634 99609053 97951114 98242069 100509025 104532695 109850738
5737 109850738 115492182 120305526 123282642 123481416 122106255 121340650 122630502 126076245
5729 126076245 130375027 134237538 136280965 135348865 131383244 125987361 121692178 119831677
5721 119831677 120027186 120674072 120829857 119216506 115607048 111512447 108172887 105628228
5713 105628228 104057684 103821598 105101438 107636075 110770899 112888641 112864916 109455869
5705 109455869 102404223 93963019 86503062 81080236 77345251 74761201 73215650 72238897
$$ packed form
5761D2780961L834341M223294M643970M919644M721752M384580L785039L412117
5753G6705698L668179M700809O059082P270742P361092N773711L317662r40108
5745A13916867m717247n513986m076581j657939K90955K266956M023670N318043
5737A09850738N641444M813344K977116J98774j375161p65605J289852L445743
5729A26076245M298782L862511K043427r32100l965621n395883m295183j860501
5721A19831677J95509O46886J55785j613351l609458m094601l339560k544659
5713A05628228j570544k36086J279840K534637L134824K117742k3725l409047
5705A09455869p051646q441204p459957n422826l734985k584050j545551r76753
$$ plain form
5697 72238897 71646365 71128924 70538039 69938370 69296726 68660042 67681377 66553808 65891406
5688 65891406 65878401 66603741 68024407 70298714 73487676 77489968 82330318 87928931 94134901
5679 94134901 100581712 106540282 111413801 114246497 114929673 114055204 112920675 113266171 115691815
5670 115691815 120306423 126552201 134056611 141996293 149786677 155920915 158890509 159294694
5662 159294694 158254401 158064899 160398799 165516129 172237172 178743211 183649021 185482337
5654 185482337 184124495 181106744 178449885 177656877 179334586 183557935 189347262 196393099
5646 196393099 205019397 214108409 221801025 224590793 221436366 214510272 207510385 202791524
5638 202791524 200909917 200315262 198910734 197229793 195652273 193997989 191269571 186367627
$$ packed form
5697G2238897n92532n17441n90885n99669o41644o36684r78665j127569o62402
5688F5891406j3005P25340J420666K274307L188962M002292M840350N598613O205970
5679I4134901O446811N958570M873519K832696O83176q74469j134529L45496K425644
5670A15691815M614608O245778P504410P939682P790384O134238K969594M04185
5662A59294694j040293j89502K333900N117330O721043O506039M905810J833316
5654A85482337j357842l017751k656859p93008J677709M223349N789327P045837
5646A96393099Q626298R089012P692616K789768l154427o926094o999887m718861
5638B02791524j881607n94655j404528j680941j577520j654284k728418m901944
$$ plain form
5630 186367627 178508564 168478493 159125195 153222427 151260713 152545665 156123832 161226936
5622 161226936 167159733 172252750 174652560 171801140 162567864 148437981 133685637 121352769
5614 121352769 112316180 105820731 101036763 97189726 93923156 91126199 88526305 85800153
5606 85800153 82818998 79574311 76324077 73277274 70310635 67419749 64622808 62176901
5598 62176901 60253036 58756852 57479251 56412309 55524940 54816231 54384673 54101883 53948937
5589 53948937 54355874 55222312 56316118 57364532 58088294 57993452 57056376 55765997 54181074
5580 54181074 52307645 50323574 48348907 46522927 44947530 43837780 43117640 42811963
5572 42811963 42530203 42123727 41422673 40287116 38897297 37542385 36125956 34964163 34192524
$$ packed form
5630A86367627p859063j0030071r353298n902768j961714J284952L578167N103104
5622A61226936N932797N093017K399810k851420r233276j4129883j4752344j2332868
5614A21352769r036589o495449m783968l847037l266570k796957k599894k726152
5606H5800153k981155l244687l250234l046803k966639k890886k796941k445907
5598F2176901j923865j496184j277601j066942q87369p08709m31558k82790j52946
5589E3948937M06937Q66438J093806J048414P23762r4842r37076j290379j584923
5580E4181074j873429j984071j974667j825980j575397j109750p20140l05677
5572D2811963k81760m06476p01054j135557j389819j354912j416429j161793p71639
$$ plain form
5563 34192524 33876620 33906221 34127615 34350207 34518650 34490309 34415721 34276232 33932229 33385874
5553 33385874 32613897 31754826 30889523 30061558 29209240 28142628 27103112 26188879 25438029
5544 25438029 24825822 24244628 23600262 23086008 22762688 22630241 22616613 22608054 22516282 22285170
5534 22285170 21866488 21380769 20995781 20725110 20484856 20276864 20024930 19681093 19335562
5525 19335562 18936197 18527806 18112500 17611540 17142361 16664896 16204841 15852522 15538249
5516 15538249 15237466 14974486 14762301 14509952 14307380 14199171 14111590 13958750 13733363 13616988
5506 13616988 13556660 13460742 13450965 13427688 13439062 13396777 13388558 13265699 13175664 13084592 12952804
5495 12952804 12692308 12530290 12457509 12396732 12317992 12244600 12101315 12142093 12174589 12171434 12134542
$$ packed form
5563C4192524l15904K9601K21394K22592J68443k8341p4588j39489l44003n46355
5553C3385874p71977q59071q65303q27965q52318j066612j039516r14233p50850
5544B5438029o12207n81194o44366n14254l23320j32447j3628q559r1772k31112
5534B2285170m18682m85719l84988k70671k40254k07992k51934l43837l45531
5525A9335562l99365m08391m15306n00960m69179m77465m60055l52319l14273
5516A5538249l00783k62980k12185k52349k02572j08209q7581j52840k25387j16375
5506A3616988o0328r5918r777k3277J1374m2285q219j22859r0035r1072j31788
5495A2952804k60496j62018p2781o0777p8740p3392j43285M0778L2496l155l6892
$$ plain form
5484 12134542 12166206 12155153 12181660 12213236 12187264 12328612 12451284 12529260 12637036 12841462
5474 12841462 12987855 13124795 13300966 13476753 13662946 13872300 14136039 14299355 14466471
5465 14466471 14721280 15020629 15350286 15667199 16046847 16502103 16890647 17322276 17805197
5456 17805197 18320157 18825410 19471586 20143153 20921259 21703577 22458375 23267061 24072088
5447 24072088 24827731 25677909 26520235 27371404 28370406 29404708 30527420 31776166 33152780
5438 33152780 34660919 36267718 38023913 40038368 42280763 44738113 47515915 50614363
5430 50614363 53944378 57714340 61774019 66267534 71400838 77240771 83803862 91270363
5422 91270363 99595864 108762352 118498989 128510833 138223992 147000383 154149172 159037148
$$ packed form
5484A2134542L1664j1053K6507L1576k5972J41348J22672P7976J07776K04426
5474A2841462J46393J36940J76171J75787J86193K09354K63739J63316J67116
5465A4466471K54809K99349L29657L16913L79648M55256L88544M31629M82921
5456A7805197N14960N05253O46176O71567P78106P82318P54798Q08686Q05027
5447B4072088P55643Q50178Q42326Q51169R99002J034302J122712J248746J376614
5438C3152780J508139J606799J756195K014455K242395K457350K777802L098448
5430E0614363L330015L769962M059679M493515N133304N839933O563091P466501
5422I1270363Q325501R166488R736637J0011844R713159Q776391P148789M887976
$$ plain form
5414 159037148 161700933 162391965 161410455 159258369 156066644 152106180 147856556 144045065
5406 144045065 141361067 140151770 140638788 142902192 146798987 152375691 159428380 167507165
5398 167507165 176327054 185232304 193633464 201265278 207340471 211326514 212674067 211100686
5390 211100686 206757993 200100565 191952481 182865801 173341525 163800007 154545719 146180302
5382 146180302 139197299 133853819 130128450 127912971 127084936 127386503 128635924 130661371
5374 130661371 133091722 135380563 137113736 137747341 136572425 133611988 128905463 122860504
5366 122860504 115837276 108155039 100160925 92238328 84758351 78107691 72280584 67187267
5358 67187267 62812038 58926237 55563528 52674420 50086645 47829280 45802743 44114602
$$ packed form
5414A59037148K663785O91032r81510k152086l191725l960464m249624l811491
5406A44045065k683998j209297M87018K263404L896795N576704P052689Q078785
5398A67507165Q819889Q905250Q401160P631814O075193L986043J347553j573381
5390B11100686m342693o657428q148084r086680r524276r541518r254288q365417
5382A46180302o983003n343480l725369k215479q28035L01567J249421K025447
5374A30661371K430351K288841J733173O33605j174916k960437m706525o044959
5366A22860504p023228p682237p994114p922597p479977o650660n827107n093317
5358F7187267m375229l885801l362709k889108k587775k257365k026537j688141
$$ plain form
5350 44114602 42480520 40921664 39386080 37786356 36263774 34777808 33340500 32005043
5342 32005043 30839297 29670724 28599168 27649225 26768597 25918828 25138900 24405194 23722327
5333 23722327 23058736 22442200 21809109 21186713 20617715 20114058 19597941 19176213 18826164
5324 18826164 18442659 18090112 17863931 17719379 17643332 17642915 17689242 17668615 17700560 17645898 17505525
5313 17505525 17230094 16741154 16184009 15641811 15086258 14640828 14258085 13818200 13420873
5304 13420873 13161144 12945084 12751367 12611450 12518765 12445858 12419454 12454408 12464289 12442228 12435537
5293 12435537 12532780 12709817 12879770 13218776 13648777 14183637 14952279 15781984 16659831 17505240
5283 17505240 18173108 18621110 18540620 17802207 16762700 15703066 14768659 14001719 13273249
$$ packed form
5350D4114602j634082j558856j535584j599724j522582j485966j437308j335457
5342C2005043j165746j168573j071556r49943q80628q49769p79928p33706o82867
5333B3722327o63591o16536o33091o22396n68998n03657n16117m21728l50049
5324A8826164l83505l52547k26181j44552p6047m17M6327k0627L1945n4662j40373
5313A7505525k75431m88940n57145n42198n55553m45430l82743m39885l97327
5304A3420873k59729k16060j93717j39917r2685p2907k6404L4954R881k2061o691
5293A2435537R7243J77037J69953L39006M30001N34860P68642Q29705Q77847Q45409
5283A7505240O67868M48002q0490p38413j039507j059634r34407p66940p28470
$$ plain form
5274 13273249 12646249 12106657 11663219 11311880 10981961 10763795 10623251 10516983 10497435 10497782
5264 10497782 10432381 10413489 10483595 10603262 10758852 10896884 11170002 11588062 12144350 12806313
5254 12806313 13556495 14419285 15390166 16180277 16739640 16839747 16421889 15506693 14439464
5245 14439464 13379769 12535788 11797131 11105597 10524196 9965752 9503513 9128525 8818177
5236 8818177 8632833 8453654 8227474 8094035 7995996 7920948 7883040 7841186 7814749 7741109 7765981
5225 7765981 7813162 7930641 8086128 8349639 8593099 8850963 9111162 9336890 9413198 9334871
5215 9334871 9138683 8824739 8481768 8143220 7918723 7692529 7516305 7303486 7226628 7208477
5205 7208477 7177751 7149912 7190755 7237328 7279123 7258855 7221682 7232497 7030830 6907905 6857109
$$ packed form
5274A3273249o27000n39592m43438l51339l29919k18166j40544j06268j9548L47
5264A0497782o5401j8892P0106J19667J55590J38032K73118M18060N56288O61963
5254A2806313P50182Q62790R70881P90111N59363J00107m17858r15196j067229
5245A4439464j059695q43981p38657o91534n81401n58444m62239l74988l10348
5236H818177j85344j79179k26180j33439r8039p5048l7908m1854k6437p3640K4872
5225G765981M7181J17479J55487K63511K43460K57864K60199K25728P6308p8327
5215I334871j96188l13944l42971l38548k24497k26194j76224k12819p6858j8151
5205G208477l0726k7839M0843M6573M1795k0268l7173J0815k01667j22925n0796
$$ plain form
5194 6857109 6789276 6709146 6620876 6570259 6508576 6582873 6614103 6597805 6528877 6600939 6724327
5183 6724327 6768863 6791169 6842722 6887848 7087355 7288444 7419800 7609173 7821406 7993263
5173 7993263 8183153 8326607 8459608 8545283 8612880 8647378 8623756 8498873 8488933 8454265 8511694
5162 8511694 8490187 8515207 8588584 8679805 8795817 8881214 8959195 9108107 9224985 9367443 9502823
5151 9502823 9685330 9846026 10089009 10318453 10586687 10822004 11134570 11378666 11655478 11999734
5141 11999734 12364118 12758728 13228872 13691630 14256573 14829963 15580599 16152032 16691878
5132 16691878 17257912 17845979 18339105 18789195 19273795 19840987 20405913 21165548 21931876
5123 21931876 22914573 23952458 25171137 26527907 28328447 30397772 32753142 34647846
$$ packed form
5194F857109o7833q0130q8270n0617o1683P4297L1230j6298o8928P2062J23388
5183F724327M4536K2306N1553M5126J99507K01089J31356J89373K12233J71857
5173G993263J89890J43454J33001Q5675O7597L4498k3622j24883r940l4668N7429
5162H511694k1507K5020P3377R1221J16012Q5397P7981J48912J16878J42458J35380
5151I502823J82507J60696K42983K29444K68234K35317L12566K44096K76812L44256
5141A1999734L64384L94610M70144M62758N64943N73390P50636N71433N39846
5132A6691878N66034N88067M93126M50090M84600N67192N64926P59635P66328
5123B1931876R82697J037885J218679J356770J800540K069325K355370J894704
$$ plain form
5115 34647846 35947736 37079268 38354433 39577254 40888859 42578405 44660379 47160307
5107 47160307 50102109 53649620 57887345 63176182 69866401 77816691 86880576 97204198
5099 97204198 108538788 120651219 131081284 139262167 143578486 142702534 140997559 142896217
5091 142896217 150824738 165534935 188136585 217115116 251097903 290127392 334443403
5084 334443403 380628178 412691173 428531697 410454534 355773731 288002853 230117943
5077 230117943 189372231 160593505 139771599 123699550 111116425 100192619 90825730
5070 90825730 82624240 75972712 70291952 65537267 61216844 57528244 54057892 50958888
5062 50958888 48079468 45612403 43339807 41432157 39531016 37769330 36103007 34687704
$$ packed form
5115C4647846J299890J131532J275165J222821J311605J689546K081974K499928
5107D7160307K941802L547511M237725N288837O690219P950290R063885J0323622
5099I7204198J1334590J2112431J0430065Q180883M316319q75952j704975J898658
5091A42896217P928521J4710197K2601650K8978531L3982787L9029489M4316011
5084C34443403M6184775L2062995J5840524j8077163n4680803o7770878n7884910
5077B30117943m0745712k8778726k0821906j6072049j2583125j0923806r366889
5070I0825730q201490o651528n680760m754685m320423l688600l470352l099004
5062E0958888k879420k467065k272596j907650j901141j761686j666323j415303
$$ plain form
5054 34687704 33247025 31929726 30613380 29460240 28256857 27238166 26114550 25210458
5046 25210458 24261435 23374169 22520505 21827886 21056575 20446524 19726824 19183118 18612014
5037 18612014 18082666 17595092 17086461 16568661 16115093 15642553 15269557 14898305 14491869
5028 14491869 13927839 13365340 12761397 12282978 11799504 11379937 10964902 10562699 10265473
5019 10265473 10011244 9724511 9517319 9330833 9062522 8814124 8558662 8313946 8105110
5010 8105110 7952067 7735185 7588488 7497436 7405479 7277069 7152311 6995616 6877004 6821986
5000 6821986 6627501 6445378 6315970 6234366 6040882 5937570 5786923 5667335 5568849 5516727
4990 5516727 5394865 5316264 5190848 5166947 5167639 5121722 5047795 4998929 4929384 4822557 4741873
$$ packed form
5054C4687704j440679j317299j316346j153140j203383j018691j123616r04092
5046B5210458r49023q87266q53664o92619p71311o10051p19700n43706n71104
5037A8612014n29348m87574n08631n17800m53568m72540l72996l71252m06436
5028A4491869n64030n62499o03943m78419m83474m19567m15035m02203k97226
5019A0265473k54229k86733k07192j86486k68311k48398k55462k44716k08836
5010H105110j53043k16882j46697r1052r1957j28410j24758j56695j18612n5018
5000F821986j94485j82123j29408q1604j93484j03312j50647j19588r8486n2122
4990E516727j21862p8601j25416k3901O92m5917p3927m8866o9545j06827q0684
$$ plain form
4979 4741873 4747183 4772700 4815822 4907241 4899774 4880055 4913864 4878350 4817904 4774320 4672369 4507987
4967 4507987 4249451 4111716 4084809 4017543 4026351 4094879 3907842 3828347 3760739 3642537 3548594
4956 3548594 3518845 3478898 3438598 3310837 3234799 3208347 3166314 3233452 3217396 3098782 3035991
4945 3035991 3008489 3010289 2959132 2954713 2927663 2925101 2865135 2820588 2768058 2772897 2608760 2609205
4933 2609205 2632458 2651143 2624811 2608024 2624470 2617209 2559569 2546667 2475371 2413256 2332594 2320174
4921 2320174 2364437 2332090 2214963 2246842 2282011 2274565 2299998 2264748 2305455 2278713 2232273
4910 2232273 2260564 2272070 2238201 2285663 2288667 2330234 2364636 2332487 2313649 2410407 2530151
4899 2530151 2685978 2836811 2917905 3093870 3159132 3238056 3319891 3437413 3524636 3667911
$$ packed form
4979D741873N310K5517M3122R1419p467j9719L3809l5514o0446m3584j01951j64382
4967D507987k58536j37735k6907o7266Q808O8528j87037p9495o7608j18202r3943
4956C548594k9749l9947m0300j27761p6038k6452m2033O7138j6056j18614o2791
4945C035991k7502J800n1157m419k7050k562n9966m4547n2530M839j64137M45
4933B609205K3253J8685k6332j6787J6446p261n7640j2902p1296o2115q0662j2420
4921B320174M4263l2347j17127L1879L5169p446K5433l5250M0707k6742m6440
4910B232273K8291J1506l3869M7462L004M1567L4402l2149j8838R6758J19744
4899B530151J55827J50833Q1094J75965O5262P8924Q1835J17522Q7223J43275
$$ plain form
4889 3667911 3733828 3840399 3958944 4014570 4151665 4284700 4482130 4729117 4956434 5291304
4879 5291304 5557818 5784656 6133011 6599827 7076044 7611871 8199717 8864613 9557245 10419987
4869 10419987 11490921 13043571 14965510 17151446 19643726 22565558 25021444 26736050
4861 26736050 26997118 25251139 22457541 19547035 17120264 14725027 12539096 10657937
4853 10657937 9260867 8215038 7383174 6625647 6090408 5652336 5243595 4829360 4500059
4844 4500059 4240243 3980444 3729381 3734610 3593100 3425302 3256375 3121769 2904515 2750962
4834 2750962 2632979 2552881 2551859 2472901 2354179 2304543 2278033 2186403 2187601 2153404 2114148
4823 2114148 2196861 2160712 2070025 1967851 1862565 1780095 1673738 1528486 1447084 1420984 1402089
$$ packed form
4889C667911O5917J06571J18545N5626J37095J33035J97430K46987K27317L34870
4879E291304K66514K26838L48355M66816M76217N35827N87846O64896O92632Q62742
4869A0419987J070934J552650J921939K185936K492280K921832K455886J714606
4861B6736050K61068j745979k793598k910506k426771k395237k185931j881159
4853A0657937j397070j045829q31864p57527n35239m38072m08741m14235l29301
4844D500059k59816k59799k51063N229j41510j67798j68927j34606k17254j53553
4834B750962j17983q0098j022p8958j18722m9636k6510r1630J198l4197l9256
4823B114148Q2713l6149r0687j02174j05286q2470j06357j45252q1402k6100j8895
$$ plain form
4812 1402089 1342909 1361040 1392176 1386192 1322385 1278234 1232090 1187171 1180740 1119907 1113309 1118225
4800 1118225 1097853 1068038 1120964 1096783 1073473 1074500 1047691 964459 961320 1050134 1010557 991421
4788 991421 993736 983766 983594 1009939 972600 1025958 1063247 1166849 1213215 1225884 1247269 1238999
4776 1238999 1256691 1310148 1377039 1367394 1443140 1548726 1687441 1830476 2090618 2311665 2509027
4765 2509027 2573083 2480847 2226694 1903758 1620109 1459740 1228264 1015207 926193 919465
4755 919465 856077 719532 706017 704119 664542 645413 633986 556149 507629 516882 541352 521760
4743 521760 432671 371077 386391 383005 372240 396497 293429 265572 343858 380402 427901 498102
4731 498102 435842 410297 381007 340424 353048 388452 387537 378037 369003 328506 265431 224197
$$ packed form
4812A402089n9180J8131L1136n984o3807m4151m6144m4919o431o0833o598M916
4800A118225k0372k9815N2926k4181k3310J027k6809q3232l139Q8814l9577j9136
4788I91421K315r970j72K6345l7339N3358L7289J03602M6366J2669K1385q270
4776A238999J7692N3457O6891r645P5746J05586J38715J43035K60142K21047J97362
4765B509027O4056r2236k54153l22936k83649j60369k31476k13057q9014o728
4755I19465o3388j36545j3515j898l9577j9129j1427p7837m8520R253K4470j9592
4743E21760q9089o1594J5314l386j0765K4257j03068k7857P8286L6544M7499P0201
4731D98102o2260k5545k9290m0583J2624L5404r15r500r034m0497o3075m1234
$$ plain form
4719 224197 264670 255424 210998 235339 278240 313498 311329 218274 182123 157698 146536 117042
4707 117042 97545 170814 155916 82467 140820 138723 120810 156498 109712 86009 77401 119382
4695 119382 147510 93649 99326 117397 130748 115742 113517 79239 79707 62456 115192 29375
4683 29375 -1790 -16117 -2117 48854 53162 99828 52248 14338 -18755 -24000 21969 29230
4671 29230 10436 13010 -46100 -11451 -21373 -42459 -18195 -33085 30431 73870 -22552 10460
4659 10460 47249 95891 60611 19969 72106 24253 29881 27448 43879 19881 -13318 7340
4647 7340 7167 86128 24811 19234 90974 61020 37349 56935 27145 -27713 -43241 -27978 -11419
4634 -11419 2743 -41661 -12768 7225 59364 64143 20417 -27628 30782 121411 53588 -14599
$$ packed form
4719B24197M0473r246m4426K4341M2901L5258k169r3055l6151k4425j1162k9494
4707A17042j9497P3269j4898p3449N8353k097j7913L5688m6786k3703q608M1981
4695A19382K8128n3861N677J8071J3351j5006k225l4278M68j7251N2736q5817
4683B9375l1165j4327J4000N0971M308M6666m7580l7910l3093n245M5969P261
4671B9230j8794K574n9110L4649r922k1086K4264j4890O3516M3439r6422L3012
4659A0460L6789M8642l5280m0642N2137m7853N628k433J6431k3998l3199K0658
4647G340j73P8961o1317n577P1740k9954k3671J9586k9790n4858j5528J5263J6559
4634a1419J4162m4404K8893J9993N2139M779m3726m8045N8410R0629o7823o8187
$$ plain form
4622 -14599 62863 47456 10455 17087 -80 35007 7278 -14778 -1753 -12266 27950 -19437
4610 -19437 -7017 26142 14142 53016 30708 -8402 12092 2725 -165958 -182935 -75221 -9034
4598 -9034 -46859 -66929 -93023 -54412 -7800 -24044 -92199 -115400 -65393 -60824 -131737 -111632
4586 -111632 -88678 -66987 -29336 -59754 -93688 -66456 -116165 -99309 -69141 -104577 -78584 -31802
4574 -31802 -60698 -28628 -43693 -114319 -111990 -137871 -150771 -151735 -73600 -22500 -86857 -37691
4562 -37691 -33764 -61119 -76980 -62346 24262 76101 13210 27025 50658 15015 26118 26622
4550 26622 38086 62210 30804 35119 34438 11654 22075 -23230 -38159 -21530 16365 185
4538 185 -15729 -33240 -33990 -28061 -76796 -75042 -15583 -80305 -73182 -67245 -42132 -43489 7346 -24226
$$ packed form
4622a4599P7462j5407l7001O632j7167L5087k7729k2056J3025j0513M0216m7387
4610a9437J2420L3159j2000L8874k2308l9110K0494r367j68683j6977J07714O6187
4598i034l7825k0070k6094L8611M6612j6244o8155k3201N0007M569p0913K0105
4586a11632K2954K1691L7651l0418l3934K7232m9709J6856L0168l5436K5993M6782
4574c1802k8896L2070j5065p0626K329k5881j2900r64P8135N1100o4357M9166
4562c7691L927k7355j5861J4634Q6608N1839o2891J3815K3633l5643J1103N04
4550B6622J1464K4124l1406M315o81k2784J0421m5305j4929J6629L7895j6180
4538A85j5914j7511p50N929m8735J754N9459o4722P123N937K5113j357N0835l1572
$$ plain form
4524 -24226 -99328 -106646 -171245 -172820 -123307 -118083 -146804 -88404 -101899 -79171 -120102 -102327
4512 -102327 -102392 -137167 -195026 -190162 -170298 -197544 -189582 -132059 -74727 -106697 -162980 -216614 -262366
4499 -262366 -273612 -242108 -194253 -176405 -167269 -155006 -144408 -151251 -219371 -197298 -173799 -109180
4487 -109180 -150326 -260220 -156284 -160170 -186747 -196688 -225161 -255292 -294592 -263666 -213722 -199598
4475 -199598 -198245 -190450 -141488 -131445 -175918 -213708 -196688 -188810 -134752 -138021 -201326 -173050
4463 -173050 -95997 -40538 -90778 -153899 -147897 -96470 -131923 -121946 -104573 -108092 -135688 -128358
4451 -128358 -76353 -132567 -154661 -108896 -163868 -126210 -143708 -89574 -92531 -142542 -146830 -80643
4439 -80643 -158307 -201065 -146306 -41087 -60668 -60796 -103152 -108091 -114235 -156412 -218498 -233851
$$ packed form
4524b4226p5102p318o4599j575M9513N224k8721N8400j3495K2728m0931J7775
4512a02327o5l4775n7859M864J9864k7246P962N7523N7332l1970n6283n3634m5752
4499b62366j1246L1504M7855J7848R136J2263J0598o843o8120K2073K3499O4619
4487a09180m1146j09894J03936l886k6577r941k8473l0131l9300L0926M9944J4124
4475a99598J353P795M8962J0043m4473l7790J7020P878N4058l269o3305K8276
4463a73050P7053N5459n0240o3121O002N1427l5453R977J7373l519k7596P330
4451a28358N2005n6214k2094M5765n4972L7658j7498N4134k957n0011m288O6187
4439h0643p7664m2758N4759J05219j9581j28m2356m939o144m2177o2086j5353
$$ plain form
4427 -233851 -242011 -212803 -151877 -173733 -245175 -223956 -122333 -144888 -151046 -62429 -70288 -114160
4415 -114160 -82058 -94700 -75063 -101410 -114837 -113596 -133671 -160181 -284086 -251009 -173021 -155308
4403 -155308 -121850 -201777 -183960 -148369 -115238 -95118 -43617 -68342 -84483 -175219 -164624 -83866
4391 -83866 -56210 -114589 -101518 -125801 -158801 -102647 -22224 9231 -26725 -111884 -121124 -107414
4379 -107414 -84596 -123287 -144780 -100604 -105037 -56560 -67536 -52324 -11761 -73987 -31642 -25178
4367 -25178 11730 -52079 -77510 -139385 -127037 -97135 -102724 -145630 -110597 -112929 -92866 -28531
4355 -28531 -59713 -48528 2147 42199 -37796 -70548 -25435 61159 47868 -16301 -49370 -18558
4343 -18558 -26658 38797 -30129 -68704 -68588 -48999 -26184 -74165 -86192 -73419 -44780 -24570
$$ packed form
4427b33851q160K9208O0926k1856p1442K1219J01623k2555o158Q8617p859m3872
4415a14160L2102j2642J9637k6347j3427J241k0075k6510j23905L3077P7988J7713
4403a55308L3458p9927J7817L5591L3131K0120N1501k4725j6141r0736J0595Q0758
4391h3866K7656n8379J3071k4283l3000N6154Q0423L1455l5956q5159r240J3710
4379a07414K2818l8691k1493M4176m433M8477j0976J5212M0563o2226M2345O464
4367b5178L6908o3809k5431o1875J2348K9902n589m2906L5033k332K0063O4335
4355b8531l1182J1185N0675M0052p9995l2752M5113Q6594j3291o4169l3069L0812
4343a8558q100O5455o8926l8575J16J9589K2815m7981j2027J2773K8639K0210
$$ plain form
4331 -24570 -1731 -50573 -60247 -108405 -114260 -61683 -108557 -28877 -36465 -31333 -49030 -30370 -86139
4318 -86139 33324 26579 -39429 -12138 13817 45163 30391 -1132 -39206 -19260 -27441 27408
4306 27408 -6804 -50947 -41539 14072 5107 52200 72196 70629 21276 78544 76745 6009 46193
4293 46193 49080 75766 148918 73200 16822 19897 14925 108399 188072 236527 215902 134525
4281 134525 143592 83256 46316 105546 159354 223725 215603 268381 336402 430426 559557 552617
4269 552617 676485 810613 1015441 1175070 1259791 1187150 1033025 812925 636730 543055
4259 543055 404334 334621 314487 286662 148949 114545 22774 53565 90290 93594 78896
4248 78896 49580 -4178 17384 6583 58968 72046 63853 3190 -22367 26359 58700 57214
$$ packed form
4331b4570K2839m8842r674m8158n855N2577m6874P9680p588N132j7697J8660n5769
4318h6139J19463o745o6008K7291K5955L1346j4772l1523l8074J9946q181N4849
4306B7408l4212m4143R408N5611q965M7093J9996j567m9353N7268j799p0736M0184
4293D6193K887K6686P3152p5718n6378L075m972R3474P9673M8455k0625q1377
4281A34525R067o0336l6940N9230N3808O4371q122N2778O8021R4024J29131o940
4269E52617J23868J34128K04828J59629Q4721p2641j54125k20100j76195r3675
4259E43055j38721o9713k0134k7825j37713l4404r1771L0791L6725L304j4698
4248G8896k9316n3758K1562j0801N2385J3078q193o0663k5557M8726L2341j486
$$ plain form
4236 57214 49368 3448 -25572 -13193 30739 69504 -2398 -26001 -106167 -106055 -87709 -45711
4224 -45711 -59069 -84911 -72706 -114051 -152044 -89161 -103395 -119655 -83017 -124402 -86252 -94417
4212 -94417 -158912 -214510 -177644 -140897 -134653 -117075 -112683 -76704 -96387 -97444 -67597 -87815
4200 -87815 -16878 -27634 -46906 -155 -18111 -59188 -76061 -93866 -45855 -33016 35126 48500
4188 48500 67685 95179 141064 118254 133922 165760 189834 281756 233673 180772 121232 112256
4176 112256 130552 105478 38986 63782 49634 42402 58404 33853 -11902 -101359 -87278 -23556
4164 -23556 -46337 -36097 -55222 -22899 -60723 -36998 -58362 -73000 -85582 -25695 -51458 -126508
4152 -126508 -93051 -20756 -26993 -16838 1170 -56415 -62959 -110930 -56645 -8777 18483 -25097
$$ packed form
4236E7214p846m5920k9020J2379M3932L8765p1902k3603q0166J12J8346M1998
4224d5711j3358k5842J2205m1345l7993O2883j4234j6260L6638m1385L8150q165
4212i4417o4495n5598L6866L6747O244J7578M392L5979j9683j057K9847k0218
4200h7815P0937j0756j9272M6751j7956m1077j6873j7805M8011J2839O8142J3374
4188D8500J9185K7494M5885k2810J5668L1838K4074R1922m8083n2901n9540q976
4176A12256J8296k5074o6492K4796j4148p232J6002k4551m5755q9457J4081O3722
4164b3556k2781J0240j9125L2323l7824K3725k1364j4638j2582N9887k5763p5050
4152a26508L3457P2295o237J0155J8008n7585o544m7971N4285M7868K7260m3580
$$ plain form
4140 -25097 -101131 -121180 -177555 -160372 -174605 -157088 -121956 -34227 -87455 -82238 -31284 -41101
4128 -41101 25151 -19165 -61313 -61570 -78120 -38984 -45865 -10906 -30694 -74257 -84188 -130531 -54974
4115 -54974 33336 -3667 9846 29173 -13506 -26981 -5190 -19995 -2460 -9995 -17029 -3981
4103 -3981 -22132 -8520 70990 45138 52977 60190 29400 53521 -1959 11922 -22285 -2079
4091 -2079 -2608 28063 -59040 -13328 6206 13825 -15739 70398 44375 32487 75874 47727 55023
4078 55023 74076 86192 109503 104511 46745 98509 100999 54637 53602 48500 68853 93646 96973
4065 96973 133126 87327 45487 79090 98889 180654 115746 120655 152559 92221 107333 113314
4053 113314 88206 159346 217739 211394 278395 208033 202786 198278 177936 202386 261961 317618
$$ packed form
4140b5097p6034k0049n6375J7183j4233J7517L5132Q7729n3228N217N0954r817
4128d1101O6252m4316m2148k57j6550L9136o881L4959j9788m3563r931m6343P5557
4115e4974Q8310l7003J3513J9327m2679j3475K1791j4805J7535p535p034J3048
4103c981j8151J3612P9510k5852P839P213l0790K4121n5480J3881l4207K0206
4091b079n29L0671q7103M5712J9534P619k9564Q6137k6023j1888M3387k8147P296
4078E5023J9053J2116K3311m992n7766N1764K490m6362j035n102K0353K4793L327
4065I6973L6153m5799m1840L3603J9799Q1765o4908M909L1904o0338J5112N981
4053A13314k5108P1140N8393o345O7001p0362n247m508k0342K4450N9575N5657
$$ plain form
4041 317618 294313 262612 303457 354183 347165 301358 307374 328634 372150 445905 400178 353582
4029 353582 358583 473976 493016 473913 560744 553910 547301 591830 636829 678012 620530 634024
4017 634024 755955 818692 866971 931220 1019865 1087670 1108143 1168448 1265993 1292743 1390973
4006 1390973 1427758 1413840 1488869 1574825 1625639 1636150 1693233 1826415 1940587 2080194 2199363
3995 2199363 2370058 2569233 2743421 2984010 3237564 3460200 3810023 4177578 4569108 5091224
3985 5091224 5801348 6633259 7567541 8634910 9843860 11005203 12282564 13424192 14040680
3976 14040680 14162871 13432435 12065132 10443702 8868928 7659336 6656643 5864323 5147958
3967 5147958 4617108 4190726 3791103 3460737 3195325 2916043 2720227 2574199 2342932 2161046
$$ packed form
4041C17618k3305l1701M0845N0726p018m5807O016K1260M3516P3755m5727m6596
4029C53582N001J15393J9040j9103Q6831o834o609M4529M4999M1183n7482J3494
4017F34024J21931O2737M8279O4249Q8645O7805K0473O0305R7545K6750R8230
4006A390973L6785j3918P5029Q5956N0814J0511N7083J33182J14172J39607J19169
3995B199363J70695J99175J74188K40589K53554K22636L49823L67555L91530N22116
3985E091224P10124Q31911R34282J067369J208950J161343J277361J141628O16488
3976A4040680J22191p30436j367303j621430j574774j209592j002693p92320p16365
3967E147958n30850m26382l99623l30366k65412k79282j95816j46028k31267j81886
$$ plain form
3957 2161046 2069617 1925633 1908045 1817216 1683905 1637752 1502400 1497592 1498200 1444523 1361730
3946 1361730 1267092 1236626 1129016 1007338 932401 909866 919486 904613 874207 842608 888275
3935 888275 883253 893598 853548 833962 794917 814067 748112 739801 733451 709899 642257 628817
3923 628817 616484 632913 659144 563539 553400 576883 576045 544405 524931 499918 492656 511115
3911 511115 533307 539949 481725 487177 437537 435793 431601 436042 409047 368366 392597 432912 408825
3898 408825 362404 407484 379973 336911 332254 415668 480159 446740 506639 467815 362579 332470
3886 332470 324134 373214 430693 484996 522589 518585 409303 385260 424750 458022 406552 391569
3874 391569 468740 447373 479257 467942 441993 443998 435958 496656 499424 410819 408750 379904
$$ packed form
3957B161046r1429j43984j7588r0829j33311m6153j35352m808O08n3677q2793
3946A361730r4638l0466j07610j21678p4937k2535R620j4873l0406l1599M5667
3935H88275n022J0345m0050j9586l9045J9150o5955q311o350k3552o7642j3440
3923F28817j2333J6429K6231r5605j0139K3483q38l1640j9474k5013p262J8459
3911E11115K2192O642n8224N452m9640j744m192M441k6995m0681K4231M0315k4087
3898D08825m6421M5080k7511m3062m657Q3414O4491l3419N9899l8824j05236l0109
3886C32470q336M9080N7479N4303L7593m004j09282k4043L9490L3272n1470j4983
3874C91569P7171k1367L1884j1315k5949K005q040O0698K768q8605k069k8846
$$ plain form
3862 379904 384160 452388 446268 456895 439510 450624 471004 529650 608009 608171 553281 569291
3850 569291 603065 600131 548839 546105 523184 558039 540698 551267 517321 431180 511967 542531
3838 542531 593588 585858 532576 541811 514616 566906 577666 562684 591949 539552 495458 515766
3826 515766 576835 604502 626355 698043 682774 698466 728726 740753 723869 724637 740764 771158
3814 771158 749159 735864 747576 715205 723212 674501 694078 730797 731949 683094 644129 673780
3802 673780 616248 666438 689888 740501 821801 802669 869001 874198 900633 923307 983617 1039525
3790 1039525 1045130 1020719 980015 986671 1079186 1087435 1099858 1094164 1137269 1121259 1139814 1119835
3778 1119835 1044811 1096900 1113984 1005333 1119323 1191311 1097419 1093515 1169773 1192512 1208549
$$ packed form
3862C79904M256O8228o120J0627j7385J1114K0380N8646P8359J62n4890J6010
3850E69291L3774k934n1292k734k2921L4855j7341J0569l3946q6141Q0787L0564
3838E42531N1057p730n3282R235k7195N2290J0760j4982K9265n2397m4094K0308
3826E15766O1069K7667K1853P1688j5269J5692L0260J2027j6884P68J6127L0394
3814G71158k1999j3295J1712l2371Q007m8711J9577L6719J152m8855l8965K9651
3802F73780n7532N0190K3450N0613Q1300j9132O6332N197K6435K2674O0310N5908
3790A039525N605k4411m0704O656R2515Q249J2423n694M3105j6010J8555j9979
3778A119835p5024N2089J7084j08651J13990P1988r3892l904P6258K2739J6037
$$ plain form
3767 1208549 1262173 1222434 1309974 1331113 1366907 1364673 1428829 1504441 1506867 1477530 1527832 1502927
3755 1502927 1489678 1538438 1582639 1667112 1724041 1728644 1734856 1747456 1744082 1721597 1644226 1655406
3743 1655406 1691607 1649905 1599788 1673339 1729934 1774309 1881111 1889428 1892009 1963363 2009757 2003818
3731 2003818 2030003 2075475 2161686 2109982 2098560 2094929 2148089 2211585 2157001 2104473 2091754 2137062
3719 2137062 2128814 2135447 2087969 2059254 2127424 2124548 2072999 2028134 1994454 1944237 1903651 1869000
3707 1869000 1795103 1772061 1753100 1685733 1710022 1690024 1697837 1702283 1617060 1687225 1736753 1759504
3695 1759504 1788918 1754764 1767787 1786957 1792588 1737025 1713556 1700547 1639839 1614647 1626428 1692721
3683 1692721 1688227 1634209 1618741 1668135 1663691 1632071 1580436 1536839 1541700 1531868 1492628 1421191
$$ packed form
3767A208549N3624l9739Q7540K1139L5794k234O4156P5612K426k9337N0302k4905
3755A502927j3249M8760M4201Q4473N6929M603O212J2600l374k2485p7371J1180
3743A655406L6201m1702n0117P3551N6595M4375J06802Q317K581P1354M6394n939
3731B003818K6185M5472Q6211n1704j1422l631N3160O3496n4584n2528j2719M5308
3719B137062q248O633m7478k8715O8170k876n1549m4865l3680n0217m0586l4651
3707A869000p3897k3042j8961o7367K4289j9998P813M446q5223P0165M9528K2751
3695A759504K9414l4154J3023J9170N631n5563k3469j3009o0708k5192J1781O6293
3683A692721m494n4018j5468M9394m444l1620n1635m3597M861r832l9240p1437
$$ plain form
3671 1421191 1325421 1346243 1331085 1344968 1340505 1293863 1245211 1331226 1372352 1409414 1445083 1396441
3659 1396441 1393546 1505368 1511730 1480500 1494278 1434413 1473664 1451346 1452720 1482753 1467085 1415522
3647 1415522 1398901 1383476 1337681 1353177 1404357 1371929 1353593 1417923 1427331 1452981 1450938 1427878
3635 1427878 1400421 1367696 1429711 1436808 1359323 1416761 1441035 1461173 1454208 1464695 1474770 1491944
3623 1491944 1588360 1563319 1515615 1514896 1475341 1509310 1628132 1672547 1695290 1683418 1717638 1727724
3611 1727724 1702602 1740515 1754773 1804300 1778253 1683901 1675897 1654320 1573676 1549067 1561077 1588621
3599 1588621 1614535 1607086 1612457 1638375 1651101 1596013 1593033 1604965 1612178 1625864 1673400 1686753
3587 1686753 1778020 1761332 1885586 2031705 2003157 1968262 1909494 1872099 1912788 1939251 1942580
$$ packed form
3671A421191r5770K0822j5158J3883m463m6642m8652Q6015M1126L7062L5669m8642
3659A396441k895J11822O362l1230J3778n9865L9251k2318J374L0033j5668n1563
3647A415522j6621j5425m5795J5496N1180l2428j8336O4330R408K5650k043k3060
3635A427878k7457l2725O2015P097p7485N7438K4274K0138o965J0487J0075J7174
3623A491944R6416k5041m7704p19l9555L3969J18822M4415K2743j1872L4220J0086
3611A727724k5122L7913J4258M9527k6047r4352q004k1577q0644k4609J2010K7544
3599A588621K5914p449N371K5918J2726n5088k980J1932P213J3686M7536J3353
3587A686753R1267j6688J24254J46119k8548l4895n8768l7395M0689K6463L329
$$ plain form
3576 1942580 1891264 1841312 1836023 1884834 1924589 1987039 2025850 2000724 1972727 2013507 2041942 1973815
3564 1973815 2058002 2089309 2098230 2099068 2121563 2075639 2015456 2037310 2013536 2065603 2141641 2110551
3552 2110551 2114680 2101115 2126079 2066074 2076541 2100772 2140265 2183668 2197453 2213461 2249306 2323585
3540 2323585 2364102 2435379 2525819 2646851 2695700 2749976 2805407 2837975 2861746 2853207 2827598
3529 2827598 2811065 2794853 2766063 2738109 2656096 2637167 2644115 2668623 2678596 2602628 2557890 2553617
3517 2553617 2602753 2614501 2654547 2689211 2750567 2769238 2797204 2875319 2950844 2946403 3041548 3108694
3505 3108694 3144427 3131676 3204859 3345216 3326899 3380970 3404056 3472464 3498513 3484207 3524409
3494 3524409 3483239 3476678 3501506 3484265 3462962 3502703 3470913 3490924 3506165 3562919 3538820 3609855
$$ packed form
3576A942580n1316m9952n289M8811L9755O2450L8811k5126k7997M0780K8435o8127
3564A973815Q4187L1307Q921Q38K2495m5924o0183K1854k3774N2067P6038l1090
3552B110551M129j3565K4964o0005J0467K4231L9493M3403J3785J6008L5845P4279
3540B323585M0517P1277R0440J21032M8849N4276N5431L2568K3771q539k5609
3529B827598j6533j6212k8790k7954q2013j8929O948K4508R973p5968m4738m273
3517B553617M9136J1748M0046L4664O1356J8671K7966P8115P5525m441R5145O7146
3505C108694L5733j2751P3183J40357j8317N4071K3086O8408K6049j4306M0202
3494C524409m1170o561K4828j7241k1303L9741l1790K0011J5241N6754k4099P1035
$$ plain form
3482 3609855 3615153 3624602 3705363 3773639 3875025 3921665 3956671 4045376 4182911 4266340 4352948
3471 4352948 4395753 4393107 4509235 4720288 4891527 5105359 5250703 5479712 5651218 5701055
3461 5701055 5757972 5796535 5794641 5870579 5992887 5994053 6016594 6117860 6184812 6348862 6488879
3450 6488879 6654118 6868674 7017630 7230443 7524227 7886504 8165610 8483480 8861910 9195831
3440 9195831 9639877 10017536 10554613 11117665 11743796 12398613 13164877 13967913 14904079 15852236
3430 15852236 16871852 17882258 18783397 19587094 20090817 20275356 19972940 19166561 18151656
3421 18151656 17178733 16388491 15552700 14681699 13900838 13256618 12909242 12762873 12578390
3412 12578390 12598092 12755167 12876506 13052931 13307670 13731600 14242448 14898489 15735534 16686067
$$ packed form
3482C609855N298R449Q0761O8276J01386M6640L5006Q8705J37535Q3429Q6608
3471D352948M2805k646J16128K11053J71239K13832J45344K29009J71506M9837
3461E701055N6917L8563j894P5938J22308J166K2541J01266O6952J64050J40017
3450F488879J65239K14556J48956K12813K93784L62277K79106L17870L78430L33921
3440I195831M44046L77659N37077N63052O26131O54817P66264Q03036R36166R48157
3430A5852236J019616J010406R01139Q03697N03723J84539l02416q06379j014905
3421A8151656r72923p90242q35791q71001p80861o44220l47376j46369j84483
3412A2578390J9702J57075J21339J76425K54739M23930N10848O56041Q37045R50533
$$ plain form
3402 16686067 17725305 19060494 20664232 22552286 24509617 26640142 28710213 30498075
3394 30498075 31831097 32587216 32556995 31328834 29525627 27773029 26256664 25027144 23797396
3385 23797396 22786373 22172888 21891852 21980144 22323141 22917850 23822330 25113252 26941900
3376 26941900 29514206 32584236 36145560 40239159 44899357 49721798 53404831 55491826
3368 55491826 54598269 50545959 45759563 42124436 40432859 40030101 40503971 41207768 41830312
3359 41830312 42179584 42569395 42777373 42566596 41623498 39275450 36124270 33254382 31368093
3350 31368093 30638086 30808470 31958194 33766795 36158491 39112725 42517166 45907035
3342 45907035 47989768 48566613 46093412 41203495 36016801 32112203 29734409 28501282
$$ packed form
3402A6686067J039238J335189J603738J888054J957331K130525K070071J787862
3394C0498075J333022P56119l0221j228161j803207j752598j516365j229520j229748
3385B3797396j011023o13485k81036Q8292L42997N94709R04480J290922J828648
3376B6941900K572306L070030L561324M093599M660198M822441L683033K086995
3368E5491826q93557m052310m786396l635127j691577m02758M73870P03797O22544
3359D1830312L49272L89811K07978k10777r43098k348048l151180k869888j886289
3350C1368093p30007J70384J149724J808601K391696K954234L404441L389869
3342D5907035K082733N76845k473201m889917n186694l904598k377794j233127
$$ plain form
3334 28501282 27951497 27734999 27791550 28204446 28996436 29520795 29350606 28151077 25475757
3325 25475757 22081265 18977067 16722667 15061207 13714847 12703013 11951423 11233198
3317 11233198 10591529 9991425 9363570 8915078 8569838 8145582 7766481 7415375 7125598
3308 7125598 6853496 6598244 6301630 6100085 5978407 5776423 5544985 5318420 5191646 5100102
3298 5100102 4894656 4737421 4587070 4485312 4308424 4154196 4071742 3936408 3868554 3778221
3288 3778221 3714760 3573557 3460381 3346201 3283617 3170010 3091122 3032490 3003196 2952216 2896987
3277 2896987 2814743 2706686 2626557 2711625 2652169 2551741 2477109 2390450 2343405 2338569 2276782
3266 2276782 2281720 2213221 2161469 2152942 2020325 2009119 2061519 2033365 2016500 1935718 1831623
$$ packed form
3334B8501282n49785k16498N6551M12896P91990N24359j70189j199529k675320
3325B5475757l394492l104198k254400j661460j346360j011834p51590p18225
3317A1233198o41669o00104o27855m48492l45240m24256l79101l51106k89777
3308G125598k72102k55252k96614k01545j21678k01984k31438k26565j26774r1544
3298E100102k05446j57235j50351j01758j76888j54228q2454j35334o7854r0333
3288C778221o3461j41203j13176j14180o2584j13607p8888n8632k9294n0980n5229
3277B896987q2244j08057q0129Q5068n9456j00428p4632q6659m7045m836o1787
3266B276782M938o8499n1752q527j32617j1206N2400k8154j6865q0782j04095
$$ plain form
3255 1831623 1821668 1770823 1783485 1787949 1703664 1725179 1726468 1701932 1681547 1579621 1567946 1553746
3243 1553746 1564674 1629121 1589801 1604328 1533806 1504296 1434343 1403569 1475401 1471710 1374560 1333228
3231 1333228 1317461 1322070 1363561 1340408 1259774 1274131 1368537 1385464 1325960 1341573 1357364 1246763
3219 1246763 1191210 1239859 1296438 1295837 1274882 1305860 1317683 1260666 1207138 1214649 1209975 1255711
3207 1255711 1293306 1303565 1336759 1341272 1393908 1414811 1455341 1480429 1474889 1530091 1609996 1530456
3195 1530456 1621348 1656828 1621097 1779349 1820674 1877911 1959610 2046550 2150989 2303007 2428203
3184 2428203 2625642 2765438 2946054 3116485 3240332 3303817 3226983 3188406 3144133 2939483
3174 2939483 2809088 2839329 2819312 2889925 2848626 2844817 2804002 2752218 2646749 2586922 2548053
$$ packed form
3255A831623r955n0845J2662M464q4285K1515J289k4536k0385j01926j1675j4200
3243A553746J0928O4447l9320J4527p0522k9510o9953l0774P1832l691r7150m1332
3231A333228j5767M609M1491k3153q0634J4357R4406J6927n9504J5613J5791j10601
3219A246763n5553M8649N6579o01k0955L0978J1823n7017n3528P511m674M5736
3207A255711L7595J0259L3194M513N2636K0903M0530K5088n540N5202P9905p9540
3195A530456R0892L5480l5731J58252M1325N7237Q1699Q6940J04439J52018J25196
3184B428203J97439J39796J80616J70431J23847O3485p6834l8577m4273k04650
3174B939483j30395L0241k0017P0613m1299l809m0815n1784j05469n9827l8869
$$ plain form
3163 2548053 2575692 2598995 2566293 2578277 2675570 2715401 2792857 2904714 3005935 3132029 3241980
3152 3241980 3459487 3749813 4106446 4399968 4655116 4819581 4864117 4769087 4644187 4452814
3142 4452814 4225500 4063099 3915973 3955844 4009777 3967817 3918373 3786987 3545803 3279027
3132 3279027 3082894 2949772 2867877 2810916 2829864 2819633 2833166 2817427 2844522 2894779 2872687
3121 2872687 2954217 3028758 3138791 3238349 3346800 3386237 3451894 3446366 3393404 3380107 3361253
3110 3361253 3344540 3242994 3159084 3154685 3201926 3240170 3312128 3332601 3276335 3228018 3220094 3181458
3098 3181458 3154236 3185039 3172752 3209910 3187664 3206824 3276391 3307660 3226410 3171778 3166763 3098769
3086 3098769 2956901 2910147 2911389 2851524 2833187 2755152 2699249 2669493 2687810 2721831 2702903
$$ packed form
3163B548053K7639K3303l2702J1984R7293L9831P7456J11857J01221J26094J09951
3152C241980K17507K90326L56633K93522K55148J64465M4536r5030j24900j91373
3142D452814k27314j62401j47126L9871N3933m1960m9444j31386k41184k66776
3132C279027j96133j33122q1895n6961J8948j0231J3533j5739K7095N0257k2092
3121B872687Q1530P4541J10033R9558J08451L9437O5657n528n2962j3297j8854
3110C361253j6713j01546q3910m399M7241L8244P1958K0473n6266m8317p924l8636
3098C181458k7222L0803j2287L7158k2246J9160O9567L1269q1250n4632n015o7994
3086C098769j41868m6754J242n9865j8337p8035n5903k9756J8317L4021j8928
$$ plain form
3075 2702903 2644207 2646798 2648228 2760107 2815760 2827668 2806588 2812991 2832759 2770713 2841316 2819213
3063 2819213 2852785 2794827 2809384 2815022 2674149 2578481 2533157 2417454 2408950 2297121 2204079
3052 2204079 2146586 2041025 1997368 1945665 1985757 2012903 1974221 1868374 1855036 1889775 1934087
3041 1934087 1876513 1779722 1781945 1709814 1555261 1473204 1446055 1429425 1376479 1349817 1288817
3030 1288817 1218233 1201804 1159982 1039159 894438 873606 952156 906518 832564 813470 900102
3019 900102 824358 779852 782495 780208 767229 767523 817449 815539 727272 719892 686186 531513 520050
3006 520050 530822 462582 472747 454374 476101 506972 487345 403683 414534 415764 398079 425713
2994 425713 392855 378990 376536 321580 328077 278585 253610 263326 270940 276142 281441 254315 249069
$$ packed form
3075B702903n8696K591J430J11879N5653J1908k1080O403J9768o2046P0603k2103
3063B819213L3572n7958J4557N638j40873r5668m5324j15703q504j11829r3042
3052B204079n7493j05561m3657n1703M0092K7146l8682j05847j3338L4739M4312
3041A934087n7574r6791K223p2131j54553q2057k7149j6630n2946k6662o1000
3030A288817p0584j6429m1822j20823j44721k0832P8550m5638p3954j9094Q6632
3019I00102p5744m4506K643k287j2979K94M9926j910q8267p380l3706j54673j1463
3006E20050J0772o8240J0165j8373K1727L0871j9627q3662J0851J230j7685K7634
2994D25713l2858j3865k454n4956O497m9492k4975R716P614N202N299k7126n246
$$ plain form
2981 249069 206491 227158 212199 222118 211837 144232 175722 181176 175689 165789 143202 96684
2969 96684 132662 127662 100940 148084 173993 126456 111402 114104 120732 91142 95791 35486 -6297
2956 -6297 -14094 -17367 -28522 59824 52253 -4455 10092 -24305 -38524 -51983 17003 41521 -2984
2943 -2984 -84223 -88534 -33174 -66263 -67460 -92635 -119789 -135268 -84116 -111905 -142879 -160499
2931 -160499 -184486 -135610 -104802 -88095 -143787 -176473 -186016 -245895 -234351 -233690 -194976 -182441
2919 -182441 -149840 -158096 -162660 -191106 -209286 -202834 -188707 -179284 -183079 -143126 -177106 -217227 -160196
2906 -160196 -207317 -261938 -252435 -299359 -361220 -296482 -217350 -223353 -211999 -183388 -264325 -286248
2894 -286248 -244793 -264298 -227355 -215759 -255218 -231133 -273959 -276642 -264617 -273564 -268088 -334113
$$ packed form
2981B49069m2578K0667j4959R919j0281o7605L1490N454n487r900k2587m6518
2969I6684L5978n000k6722M7144K5909m7537j5054K702O628k9590M649o0305m1783
2956f297p797l273j1155Q8346p571n6708J4547l4397j4219j3459O8986K4518m4505
2943b984q1239m311N5360l3089j197k5175k7154j5479N1152k7789l0974j7620
2931a60499k3987M8876L0808J6707n5692l2686r543n9879J1544O61L8714J2535
2919a82441L2601q256m564k8446j8180O452J4127R423l795L9953l3980m0121N7031
2906a60196m7121n4621R503m6924o1861O4738P9132o003J1354K8611q0937k1923
2894b86248M1455j9505L6943J1596l9459K4085m2826k683J2025q947N476o6025
$$ plain form
2882 -334113 -329273 -298732 -254681 -302570 -282433 -232273 -251870 -261632 -223943 -243164 -236250 -250151
2870 -250151 -284427 -277207 -309387 -360498 -319018 -261182 -241588 -229197 -264971 -241583 -285345 -275916
2858 -275916 -253811 -240041 -274592 -232800 -247846 -297808 -313070 -330785 -301528 -280954 -293049 -270372
2846 -270372 -256192 -277284 -273084 -322247 -310210 -322775 -308373 -367016 -345513 -334607 -289513 -287451
2834 -287451 -275747 -271732 -330501 -360887 -380073 -313826 -268661 -271288 -343486 -370173 -347516 -351592
2822 -351592 -375105 -371805 -406368 -434392 -426059 -352020 -353354 -356976 -333770 -341336 -390560 -386394 -329097
2809 -329097 -286411 -322807 -335493 -270387 -342771 -341413 -322772 -354757 -319375 -376851 -351550 -287814
2797 -287814 -253477 -249601 -292292 -307555 -291569 -340041 -366920 -359049 -356700 -350342 -379276 -395438
$$ packed form
2882c34113M840L0541M4051m7889K0137N0160j9597r762L7689j9221O914j3901
2870b50151l4276P220l2180n1111M1480N7836J9594J2391l5774K3388m3762R429
2858b75916K2105J3770l4551M1792j5046m9962j5262j7715K9257K0574j2095K2677
2846b70372J4180k1092M200m9163J2037j2565J4402n8643K1503J0906M5094K062
2834b87451J1704M015n8769l0386j9186O6247M5165k627p2198k6687K2657m076
2822c51592k3513L300l4563k8024Q333P4039j334l622K3206p566m9224M166N7297
2809c29097M2686l6396j2686O5106p2384J358J8641l1985L5382n7476K5301O3736
2797b87814L4337L876m2691j5263J5986m8472k6879P871K349O358k8934j6162
$$ plain form
2785 -395438 -437583 -351642 -391851 -393167 -367020 -343126 -341436 -339684 -370806 -356676 -348889 -325531
2773 -325531 -316718 -324450 -336400 -348576 -358117 -354950 -386955 -355117 -345443 -317658 -278845 -232580 -307395
2760 -307395 -391946 -347598 -386189 -414977 -371037 -351917 -337616 -307446 -345279 -327895 -274784 -232950
2748 -232950 -303919 -295887 -354469 -467718 -458498 -425523 -382810 -371024 -392709 -385845 -398675 -406054
2736 -406054 -418919 -407859 -384331 -350054 -305272 -384227 -404281 -362829 -343662 -352979 -372150 -353235
2724 -353235 -383726 -403294 -394715 -422581 -423826 -403610 -418997 -374717 -306273 -298599 -363809 -427526
2712 -427526 -421031 -397674 -348029 -357948 -352584 -363494 -377972 -350933 -316814 -318215 -436796 -432000
2700 -432000 -461545 -503331 -478679 -459460 -452120 -415254 -383053 -450121 -501330 -469747 -465574 -433989
$$ packed form
2785c95438m2145Q5941m0209j316K6147K3894J690J752l1122J4130P787K3358
2773c25531Q813p732j1950j2176r541L167l2005L1838R674K7785L8813M6265p4815
2760c07395q4551M4348l8591k8788M3940J9120J4301L0170l7833J7384N3111M1834
2748b32950p0969Q032n8582j13249R220L2975M2713J1786k1685O864j2830p379
2736d06054j2865J1060K3528L4277M4782p8955k0054M1452J9167r317j9171J8915
2724c53235l0491j9568Q579k7866j245K0216j5387M4280O8444P674o5210o3717
2712d27526O495K3357M9645r919N364j0910j4478K7039L4119j401j18581M796
2700d32000k9545m1786K4652J9219P340L6866L2201o7068n1209L1583M173L1585
$$ plain form
2688 -433989 -456298 -461680 -442874 -353598 -367376 -436128 -427667 -401463 -356095 -382984 -415429 -458964
2676 -458964 -417571 -377538 -376144 -388213 -381178 -312295 -355190 -401600 -391829 -362303 -367474 -414942
2664 -414942 -342934 -376280 -416878 -450141 -441326 -400070 -418944 -431066 -444677 -418849 -442309 -449276
2652 -449276 -380885 -364001 -397965 -375959 -335571 -392095 -436351 -374738 -421633 -358103 -343137 -358259
2640 -358259 -397685 -387040 -389015 -422962 -424022 -444421 -405215 -475482 -437139 -322382 -346021 -361193
2628 -361193 -386222 -410540 -369724 -341255 -388984 -348299 -367781 -380655 -386564 -402261 -390609 -370176
2616 -370176 -395175 -413087 -445089 -467840 -452899 -359680 -396975 -416343 -315046 -379485 -453079
2605 -453079 -425361 -395494 -407747 -404602 -363652 -376161 -389193 -433553 -399931 -288221 -280395 -365473
$$ packed form
2688d33989k2309n382J8806Q9276j3778o8752Q461K6204M5368k6889l2445m3535
2676d58964M1393M0033J394j2069P035O8883m2895m6410R771K9526n171m7468
2664d14942P2008l3346m0598l3263Q815M1256j8874j2122j3611K5828k3460o967
2652d49276O8391J6884l3964K2006M0388n6524m4256O1613m6895O3530J4966j5122
2640c58259l9426J0645j975l3947j060k0399L9206p0267L8343J14757k3639j5172
2628c61193k5029k4318M0816K8469m7729M0685j9482j2874n909j5697J1652K0433
2616c70176k4999j7912l2002k2751J4941R3219l7295j9368J01297o4439p3594
2605d53079K7718K9867j2253L145M0950j2509j3032m4360L3622J11710P826q5078
$$ plain form
2593 -365473 -422303 -452201 -406005 -370206 -425659 -400295 -427334 -359318 -389565 -337692 -367536 -369009
2581 -369009 -346219 -423295 -411664 -339477 -321721 -366581 -363844 -403349 -380725 -280407 -318444 -345217
2569 -345217 -404520 -446375 -388763 -324553 -380800 -353691 -326299 -311952 -283973 -283190 -310292 -312504
2557 -312504 -293720 -307506 -373613 -342689 -394652 -395820 -350324 -375679 -395124 -419082 -422303 -425277
2545 -425277 -442619 -468932 -470618 -466046 -447288 -420277 -380518 -366643 -400920 -419916 -415966 -366105
2533 -366105 -331231 -319204 -313363 -318051 -369054 -406536 -426063 -393275 -357910 -333399 -380821 -404384
2521 -404384 -401460 -356346 -360183 -403859 -375749 -413493 -316166 -344915 -419247 -395602 -361941 -365421
2509 -365421 -395692 -394996 -351092 -380870 -343028 -305837 -391546 -418503 -368771 -357112 -423416 -396884
$$ packed form
2593c65473n6830k9898M6196L5799n5453K5364k7039O8016l0247N1873k9844j473
2581c69009K2790p7076J1631P2187J7756m4860K737l9505K2624J00318l8037k6773
2569c45217n9303m1855N7612O4210n6247K7109K7392J4347K7979P83k7102k212
2557c12504J8784j3786o6107L0924n1963j168M5496k5355j9445k3958l221k974
2545d25277j7342k6313j686M572J8758K7011L9759J3875l4277j8996L950M9861
2533c66105L4874J2027N841m688n1003l7482j9527L2788L5365K4511m7422k3563
2521d04384K924M5114l837m3676K8110l7744R7327k8749p4332K3645L3661l480
2509c65421l0271O96M3904k9778L7842L7191q5709k6957M9732J1659o6304K6532
$$ plain form
2497 -396884 -304323 -325013 -329567 -358262 -340335 -368437 -365961 -404321 -443153 -370561 -347400 -312257
2485 -312257 -339424 -357518 -321224 -297825 -319122 -329813 -339681 -311556 -308377 -333760 -416166 -361777
2473 -361777 -343060 -359396 -345414 -325665 -300931 -238412 -271778 -327559 -256435 -279366 -303415 -321874
2461 -321874 -295922 -283278 -327207 -337410 -346069 -374839 -355275 -391850 -369385 -361505 -354890 -355785 -369886
2448 -369886 -349380 -313520 -304931 -232210 -227197 -227645 -292302 -306087 -291329 -294008 -303503 -297608 -250400
2435 -250400 -220267 -301444 -349510 -350028 -307040 -330671 -311088 -294682 -279816 -275727 -255453 -183170
2423 -183170 -193903 -175258 -188333 -184084 -248733 -334464 -299680 -302447 -204236 -221559 -265929 -252575
2411 -252575 -222532 -209376 -184200 -219623 -302938 -339226 -279389 -282073 -347311 -297794 -271241 -283819
$$ packed form
2497c96884R2561k0690m554k8695J7927k8102K476l8360l8832P2592K3161L5143
2485c12257k7167j8094L6294K3399k1297j0691r868K8125L179k5383q2406N4389
2473c61777J8717j6336J3982J9749K4734O2519l3366n5781P1124k2931k4049j8459
2461c21874K5952J2644m3929j0203q659k8770J9564l6575K2465P880O615q95j4101
2448c69886K0506L5860Q589P2721N013m48o4657j3785J4758k679r495N895M7208
2435b50400L0133q1177m8066n18M2988k3631J9583J6406J4866M089K0274P2283
2423a83170j0733J8645j3075M249o4649q5731L4784k767R8211j7323m4370J3354
2411b52575L0043J3156K5176l5423q3315l6288N9837k684o5238M9517K6553j2578
$$ plain form
2399 -283819 -260951 -264523 -259728 -270244 -267298 -216673 -158622 -203373 -223096 -158377 -97074 -155956
2387 -155956 -234094 -221595 -221977 -207898 -173714 -154298 -142862 -153436 -223412 -197357 -260358 -191088
2375 -191088 -120957 -172098 -198311 -145574 -152917 -100276 -155745 -223585 -195399 -111560 -169415 -193335
2363 -193335 -115765 -35922 -99886 -146949 -77899 -40559 -62332 -117276 -98020 -16202 -58030 -28735
2351 -28735 -31609 27791 42163 -18263 51529 122440 144679 143613 121964 174600 193327 213108
2339 213108 247621 245652 219543 252888 307234 320208 320025 367431 445466 509197 570869 674276
2327 674276 768787 824750 845882 882466 909148 927052 987574 1048707 1118062 1144311 1256858
2316 1256858 1376016 1463391 1548020 1715287 1936953 2138795 2381132 2545461 2815022 3052846
$$ packed form
2399b83819K2868l572M795j0516K946N0625N8051m4751j9723O4719O1303n8882
2387a55956p8138J2499l82J4079L4184J9416J1436j0574o9976K6055o3001O9270
2375a91088P0131n1141k6213N2737p343N2641n5469o7840K8186Q3839n7855k3920
2363a93335P7570P9843o3964m7063O9050L7340k1773n4944J9256Q1818m1828K9295
2351b8735k874N9400J4372o0426O9792P0911K2239j066k1649N2636J8727J9781
2339B13108L4513j969k6109L3345N4346J2974j83M7406P8035O3731O1672J03407
2327F74276R4511N5963K1132L6584K6682J7904O0522O1133O9355K6249J12547
2316A256858J19158Q7375Q4629J67267K21666K01842K42337J64329K69561K37824
$$ plain form
2306 3052846 3335644 3611196 3860020 4215134 4664725 5190358 5884543 6959759 8343126
2297 8343126 9848689 11620221 13482567 15735418 17432993 18350564 18127016 15715355 12438932
2288 12438932 9491697 7592811 6329721 5476626 4776961 4254544 3809060 3376085 3018540
2279 3018540 2830933 2640493 2446971 2323744 2138663 1858996 1729903 1567186 1372533 1282406
2269 1282406 1193293 1091546 1018592 953620 870858 806110 766749 700488 640422 616419 605350
2258 605350 485739 407223 382037 398614 405380 340630 359292 328748 350862 338513 275719 262349
2246 262349 199612 202213 234214 171490 143481 117499 61550 89524 109600 85357 86235 59869
2234 59869 -6546 433 9984 988 -27453 -30187 -99169 -118641 -125237 -87657 -122048 -86878 -91916
$$ packed form
2306C052846K82798K75552K48824L55114M49591N25633O94185J075216J383367
2297H343126J505563J771532J862346K252851J697575R17571k23548k411661l276423
2288A2438932k947235j898886j263090q53095o99665n22417m45484m32975l57545
2279C018540j87607j90440j93522j23227j85081k79667j29093j62717j94653r0127
2269A282406q9113j01747p2954o4972q2762o4748l9361o6261o0066k4003j1069
2258F05350j19611p8516k5186J6577O766o4750J8662l0544K2114j2349o2794j3370
2246B62349o2737K601L2001o2724k8009k5982n5949K7974K0076k4243Q78k6366
2234E9869o6415O979R551q996k8441k734o8982j9472o596L7580l4391L5170n038
$$ plain form
2221 -91916 -100433 -88983 -154711 -205246 -174891 -152741 -178324 -156008 -162435 -173732 -175231 -174955 -200139
2208 -200139 -213034 -204781 -154314 -150838 -268907 -265421 -242215 -251617 -275995 -327038 -278871 -269264
2196 -269264 -254151 -240454 -270903 -276524 -299730 -339653 -330478 -313870 -315577 -288133 -309580 -300523
2184 -300523 -296922 -398946 -409926 -337270 -312094 -333064 -370971 -352442 -286078 -340273 -356467 -287491
2172 -287491 -257108 -284206 -303802 -306448 -281918 -280341 -267950 -340693 -365454 -367622 -368306 -336742 -339695
2159 -339695 -398082 -372766 -304474 -237310 -354096 -395357 -333371 -360467 -330716 -313812 -295330
2148 -295330 -313804 -351251 -296309 -326374 -290984 -283936 -266753 -340456 -389306 -363148 -377011 -433332
2136 -433332 -447502 -414175 -446656 -453171 -440327 -375953 -398160 -450792 -435964 -444919 -362770 -399124
$$ packed form
2221i1916q517J1450o5728n0535L0355K2150k5583K2316o427j1297j499K76k5184
2208b00139j2895Q253N0467L476j18069L486K3206r402k4378n1043M8167R607
2196b69264J5113J3697l0449n621k3206l9923R175J6608j707K7444k1447R057
2184c00523L601j02024j0980P2656K5176k0970l7907J8529O6364n4195j6194O8976
2172b87491L0383k7098j9596k646K4530J577J2391p2743k4761k168o84L1564k953
2159c39695n8387K5316O8292O7164j16786m1261O1986k7096K9751J6904J8482
2148b95330j8474l7447N4942l0065L5390P048J7183p3703m8850K6158j3863n6321
2136d33332j4170L3327l2481o515J2844O4374k2207n2632J4828q955Q2149l6354
$$ plain form
2124 -399124 -402363 -382980 -390784 -400551 -416643 -435426 -467660 -422898 -401130 -352425 -295831 -365247
2112 -365247 -395778 -404128 -400305 -411442 -382149 -326914 -364464 -414806 -477245 -459073 -369477 -347297
2100 -347297 -386338 -404257 -391141 -400806 -441934 -392944 -330882 -364296 -431782 -388846 -409669 -388349
2088 -388349 -342366 -377267 -394950 -332785 -381375 -368570 -378078 -420284 -343144 -315485 -357620 -334463
2076 -334463 -366315 -413194 -398274 -444545 -435562 -441329 -355649 -387916 -418761 -402327 -414109 -332619
2064 -332619 -380252 -374799 -288090 -312521 -409993 -447529 -404229 -414833 -484808 -449591 -467683 -470252
2052 -470252 -518128 -419494 -405681 -435603 -422819 -373867 -433513 -460809 -403335 -400692 -439735 -465414
2040 -465414 -437356 -474747 -428958 -387864 -359125 -355980 -369509 -354994 -379794 -395613 -427738 -414989
$$ packed form
2124c99124l239J9383p804r767j6092j8783l2234M4762K1768M8705N6594o9416
2112c65247l0531q350L823j1137K9293N5235l7550n0342o2439J8172Q9596K2180
2100c47297l9041j7919J3116r665m1128M8990O2062l3414o7486M2936k0823K1320
2088c88349M5983l4901j7683O2165m8590J2805r508m2206P7140K7659m2135K3157
2076c34463l1852m6879J4920m6271Q983n767Q5680l2267l0845J6434j1782Q1490
2064c32619m7633N453Q6709k4431r7472l7536M3300j0604o9975L5217j8092k569
2052d70252m7876R8634J3813k9922J2784M8952n9646k7296N7474K643l9043k5679
2040d65414K8058l7391M5789M1094K8739L145j3529J4515k4800j5819l2125J2749
$$ plain form
2028 -414989 -399955 -324572 -306115 -368480 -348039 -341159 -324912 -353450 -373105 -371064 -317866 -351253
2016 -351253 -384964 -416868 -444969 -392469 -379803 -390997 -376563 -425764 -435102 -376931 -387862 -361174
2004 -361174 -351071 -386189 -330711 -382477 -397358 -397222 -468897 -447646 -423766 -427017 -439957 -403017
1992 -403017 -413723 -432985 -484757 -452488 -383372 -395158 -470424 -493184 -438114 -385116 -412152 -429415
1980 -429415 -429721 -384872 -373723 -405615 -373669 -410875 -433315 -423417 -441587 -458751 -382697 -288066
1968 -288066 -289430 -315012 -302866 -336724 -405881 -420184 -393784 -370373 -388819 -473595 -489561 -481275
1956 -481275 -428288 -385674 -397419 -390826 -356243 -419631 -387142 -394535 -384649 -362751 -360200 -350149
1944 -350149 -413237 -374856 -382186 -441818 -456132 -430397 -461601 -504985 -409663 -392871 -385464 -387527
$$ packed form
2028d14989J5034P5383J8457o2365K0441O880J6247k8538j9655K041N3198l3387
2016c51253l3711l1904k8101N2500J2666j1194J4434m9201r338N8171j0931K6688
2004c61174J0103l5118N5478n1766j4881J36p1675K1251K3880l251j2940L6940
1992d03017j0706j9262n1772L2269O9116j1786p5266k2760N5070N2998k7036j7263
1980d29415l06M4849J1149l1892L1946l7206k2440R898j8170j7164P6054R4631
1968b88066j364k5582J2146l3858o9157j4303K6400K3411j8446q4776j5966Q286
1956d81275N2987M2614j1745O593L4583o3388L2489p393R886K1898K551J0051
1944c50149o3088L8381p330n9632j4314K5735l1204m3384R5322J6792P407k063
$$ plain form
1932 -387527 -399054 -392920 -383017 -406039 -359894 -366769 -351340 -355835 -391423 -396740 -368707 -397948 -373413
1919 -373413 -363135 -392211 -344831 -426003 -445726 -397053 -408170 -451196 -401236 -455996 -468294 -440782
$$ packed form
1932c87527j1527O134R903k3022M6145o875J5429m495l5588n317K8033k9241K4535
1919c73413J0278k9076M7380q1172j9723M8673j1117m3026M9960n4760j2298K7512
$$ [...]
##END NTUPLES=NMR SPECTRUM
##END=
