##TITLE=1H_DE-80H_X3
 200.13MHz, d2o
 8 sc
 
 19ns.26.2.2025
##JCAMPDX= 6.0         $$ Bruker NMR JCAMP-DX V2.0
##DATA TYPE= NMR SPECTRUM
##DATA CLASS= NTUPLES
##ORIGIN= UXNMR, Bruker Analytische Messtechnik GmbH
##OWNER= pz
$$ XWIN-NMR		Version 3.5
$$ Fri Jul 18 14:41:43 2025 Russian Standard Time (UT+4h)  Yarkov@DPX200
##.OBSERVE FREQUENCY= 200.1313
##.OBSERVE NUCLEUS= ^1H
##.ACQUISITION MODE= SIMULTANEOUS
##.ACQUISITION SCHEME= undefined
##.AVERAGES= 8
##.DIGITISER RES= 18
##SPECTROMETER/DATA SYSTEM= spect
##.PULSE SEQUENCE= zg30
##.SOLVENT NAME= CDCl3
##.SHIFT REFERENCE= (INTERNAL, CDCl3, 0, 15.5287)
##AUDIT TRAIL= $$ (NUMBER, WHEN, WHO, WHERE, WHAT)
$$ ##TITLE= Audit trail, XWIN-NMR		Version 3.5
$$ ##JCAMPDX= 5.01
$$ ##ORIGIN= Bruker BioSpin GmbH
$$ ##OWNER= Yarkov
$$ C:/Bruker/XWIN-NMR/data/yarkov2/nmr/H-C/1/pdata/1/auditp.txt
$$ ##AUDIT TRAIL=  $$ (NUMBER, WHEN, WHO, WHERE, WHAT)
(   1,<2025-07-18 14:40:55.07 +0400>,<Yarkov>,<DPX200>,
      <created by zg, POWCHK disabled, PULCHK disabled
       configuration hash MD5:
       00 E9 B6 7A A2 85 ED C7 34 08 36 98 17 FE 4E 26
       data hash MD5: 16K
       0B 0A 15 50 C0 C9 32 56 6E C3 0D EE 41 2C DA F3>)
(   2,<2025-07-18 14:40:59.68 +0400>,<Yarkov>,<DPX200>,
      <Start of raw data processing
       efp BC_mod = 2 LB = 0.25 FT_mod = 6 PKNL = 1 PHC0 = -1353.143 PHC1 = 7.190909 SI = 16K 
       data hash MD5: 16K
       FE 32 BE 18 22 51 2C D7 75 24 80 53 2A 5E 51 B9>)
(   3,<2025-07-18 14:41:07.23 +0400>,<Yarkov>,<DPX200>,
      <abs ABSG = 5 
       data hash MD5: 16K
       E3 B9 0E 6C C0 84 E9 9A 7A 9E 49 D8 0E 95 58 EB>)
$$ ##END=
$$ 
$$ hash MD5
$$ 1A 1B 9F AF 2F 0D 60 91 63 B0 99 E0 64 26 D6 26
##$RELAX= 
##$RELAX= 
##$RELAX= 
##$RELAX= 
##$RELAX= 
##$RELAX= 
$$ Bruker specific parameters
$$ --------------------------
##$DU= <C:/Bruker/XWIN-NMR>
##$EXPNO= 1
##$NAME= <H-C>
##$PROCNO= 1
##$TYPE= <nmr>
##$USER= <yarkov2>
##$AMP= (0..31)
100 100 100 100 100 100 100 100 100 100 100 100 100 100 100 100 100 100 
100 100 100 100 100 100 100 100 100 100 100 100 100 100 
##$AQSEQ= 0
##$AQ_mod= 1
##$AUNM= <au_zg>
##$AUTOPOS= <>
##$BF1= 200.13
##$BF2= 200.13
##$BF3= 200.13
##$BF4= 200.13
##$BF5= 200.13
##$BF6= 200.13
##$BF7= 200.13
##$BF8= 200.13
##$BYTORDA= 1
##$CFDGTYP= 0
##$CFRGTYP= 5
##$CHEMSTR= <none>
##$CNST= (0..31)
1 1 145 1 1 1 1 1 1 1 1 1 1 1 1 1 1 1 1 1 1 1 1 1 1 1 1 1 1 1 1 1 
##$CPDPRG= <>
##$CPDPRG1= <>
##$CPDPRG2= <>
##$CPDPRG3= <>
##$CPDPRG4= <mlev>
##$CPDPRG5= <mlev>
##$CPDPRG6= <mlev>
##$CPDPRG7= <mlev>
##$CPDPRG8= <mlev>
##$CPDPRGB= <>
##$CPDPRGT= <>
##$D= (0..31)
0 0.7 0 0 0 0 0 0 0 0 0 0.03 0 0 0 0 0 0 0 0 0 0 0 0 0 0 0 0 0 0 0 0 
##$DATE= 1752835254
##$DBL= (0..7)
120 120 120 120 120 120 120 120 
##$DBP= (0..7)
150 150 150 150 150 150 150 150 
##$DBP07= 0
##$DBPNAM0= <>
##$DBPNAM1= <>
##$DBPNAM2= <>
##$DBPNAM3= <>
##$DBPNAM4= <>
##$DBPNAM5= <>
##$DBPNAM6= <>
##$DBPNAM7= <>
##$DBPOAL= (0..7)
0.5 0.5 0.5 0.5 0.5 0.5 0.5 0.5 
##$DBPOFFS= (0..7)
0 0 0 0 0 0 0 0 
##$DE= 6
$$ [...]
##$SUBNAM3= <"">
##$SUBNAM4= <"">
##$SUBNAM5= <"">
##$SUBNAM6= <"">
##$SUBNAM7= <"">
##$SUBNAM8= <"">
##$SUBNAM9= <"">
##$SW= 18.0517328524113
##$SWIBOX= (0..15)
0 0 2 0 0 0 0 0 0 0 0 0 0 0 0 0 
##$SW_h= 3612.71676300578
##$TD= 16384
##$TD0= 1
##$TE= 0
##$TE2= 300
##$TE3= 300
##$TEG= 300
##$TL= (0..7)
0 120 120 120 120 120 120 120 
##$TP= (0..7)
150 150 150 150 150 150 150 150 
##$TP07= 0
##$TPNAME0= <>
##$TPNAME1= <>
##$TPNAME2= <>
##$TPNAME3= <>
##$TPNAME4= <>
##$TPNAME5= <>
##$TPNAME6= <>
##$TPNAME7= <>
##$TPOAL= (0..7)
0.5 0.5 0.5 0.5 0.5 0.5 0.5 0.5 
##$TPOFFS= (0..7)
0 0 0 0 0 0 0 0 
##$TUNHIN= 0
##$TUNHOUT= 0
##$TUNXOUT= 0
##$USERA1= <user>
##$USERA2= <user>
##$USERA3= <user>
##$USERA4= <user>
##$USERA5= <user>
##$V9= 5
##$VALIST= <valist>
##$VCLIST= <CCCCCCCCCCCCCCC>
##$VD= 0
##$VDLIST= <DDDDDDDDDDDDDDD>
##$VPLIST= <PPPPPPPPPPPPPPP>
##$VTLIST= <TTTTTTTTTTTTTTT>
##$WBST= 1024
##$WBSW= 4
##$XGAIN= (0..3)
0 0 0 0 
##$XL= 0
##$YL= 0
##$YMAX_a= 373559
##$YMIN_a= -337427
##$ZGOPTNS= <>
##$ZL1= 120
##$ZL2= 120
##$ZL3= 120
##$ZL4= 120
##$ABSF1= 15.49899
##$ABSF2= -2.552859
##$ABSG= 5
##$ABSL= 3
##$ALPHA= 0
##$AQORDER= 0
##$ASSFAC= 0
##$ASSFACI= 0
##$ASSFACX= 0
##$ASSWID= 0
##$AUNMP= <proc_1d>
##$AZFE= 0.1
##$AZFW= 0.1
##$BCFW= 0
##$BC_mod= 2
##$BYTORDP= 0
##$COROFFS= 0
##$CY= -3
##$DATMOD= 1
##$DC= 0
##$DFILT= <>
##$DTYPP= 0
##$F1P= 0
##$F2P= 0
##$FCOR= 1
##$FTSIZE= 16384
##$FT_mod= 6
##$GAMMA= 0
##$GB= 0
##$INTBC= 1
##$INTSCL= 3.241238e-09
##$ISEN= 128
##$LB= 0.25
##$LEV0= 0
##$LPBIN= 0
##$MAXI= 10000
##$MC2= 0
##$MEAN= 0
##$ME_mod= 0
##$MI= 1.114404
##$NCOEF= 0
##$NC_proc= -6
##$NLEV= 6
##$NOISF1= 3.799351
##$NOISF2= 2.8
##$NSP= 0
##$NTH_PI= 0
##$NZP= 0
##$OFFSET= 15.52873
##$PC= 1
##$PHC0= -1353.143
##$PHC1= 7.190909
##$PH_mod= 1
##$PKNL= yes
##$PPARMOD= 0
##$PSCAL= 0
##$PSIGN= 0
##$REVERSE= no
##$SF= 200.129998592946
##$SI= 16384
##$SIGF1= 3
##$SIGF2= 2
##$SINO= 0.751879
##$SIOLD= 32768
##$SREGLST= <19F.Aceton>
##$SSB= 0
##$STSI= 16384
##$STSR= 0
##$SW_p= 3612.71676300578
##$SYMM= 0
##$S_DEV= 0
##$TDeff= 16384
##$TDoff= 0
##$TI= <>
##$TILT= no
##$TM1= 0
##$TM2= 0
##$TOPLEV= 0
##$USERP1= <user>
##$USERP2= <user>
##$USERP3= <user>
##$USERP4= <user>
##$USERP5= <user>
##$WDW= 1
##$XDIM= 16384
##$YMAX_p= 523267149
##$YMIN_p= -196530
$$ End of Bruker specific parameters
$$ ---------------------------------
##NTUPLES= NMR SPECTRUM
##VAR_NAME=  FREQUENCY,     SPECTRUM/REAL,   SPECTRUM/IMAG
##SYMBOL=    X,             R,               I
##VAR_TYPE=  INDEPENDENT,   DEPENDENT,       DEPENDENT
##VAR_FORM=  AFFN,          ASDF,            ASDF
##VAR_DIM=   16384,         16384,           16384
##UNITS=     HZ,            ARBITRARY UNITS, ARBITRARY UNITS
##FACTOR=    0.220516191357247, 1,           1
##FIRST=     3107.76479159247, 0,            0
##LAST=      -504.951971413312, 0,           0
##MIN=       -504.951971413312, -196530,     0
##MAX=       3107.76479159247, 523267149,    0
$$ Real data points
##PAGE= N=1
##DATA TABLE= (X++(R..R)), XYDATA
$$ [...]
8155I018n663o5937J4706P9813J4995l6032k3012p008o4982O4857K9894l6669
8143b6020o325k9718N735k0548J4090j292J1090k5126R5629j8558p3621M4142
8131c0522O0881q0913o690O547l6301o6241R1281M804J3416l450n3126K1059L2766
8118d6489j8972K9388Q72k4491J1980r069K2470j8527j6420j0532j8441K8807
8106f9424P163l4198P095m827M9510k8825n6817J7200K7456K5065j9166N1697
8094b8071L6470p6699n6536L9977P0722p239K9688q882l0184m5368j8077M691
8082h9508M4919k4789p2431J3463L6471j5366r94n151J3489l2432R2091o8990
8070a09228J6470P7510l2109N7689l0277o6499k3664K0176K7378k4864K8258n7985
$$ y = [9018, 3355, -62582, -47876, 31937, 46932, 10900, -12112, -19120, -84102, -19245, 10649, -26020, -32345, -62063, -56328, -76876, -62786, -64078, -52988, -78114, 17515, -1043, -74664, -30522, 30359, -50554, -57244, -50697, -86998, -153239, -61958, -57154, -43738, -47188, -100314, -79255, -46489, -65461, -36073, -35201, -59692, -47712, -56781, -34311, -52838, -69258, -79790, -98231, -69424, -62261, -96459, -89364, -94191, -44681, -73506, -130323, -113123, -85667, -60602, -79768, -28071, 8399, -68300, -124836, -84859, -14137, -21376, 8312, -570, -30754, -76122, -94199, -89508, -44589, -69378, -141809, -128346, -91875, -107241, -108235, -113386, -99897, -132329, -40238, -109228, -92758, -15248, -47357, 10332, -19945, -86444, -110108, -89932, -62554, -87418, -59160, -117145]
8058a17145O837J3156K1911K9056m5190Q836Q51j11248M0678N2758m4512N9242
8046h4770l70L3634O9014K8814n8331o3583M4157M4825j26211j1978N0464l6051
8034a10386L0921k1258K6489k2624M5628M7021m2823K8791n9824L187N693M3058
8022b6127K9858l7591K5475J0483j0511q546k8957k9409m1497R5818j5627J2736
8010b3895k0812O37q098L7155L6523j5556j452p1434k1063n1742M0464Q9972j2165
7997b1466m7045l6265J9076L1963J8655k2993l7918K2270j2732O1792m2485K9842
7985c7306J7142L8889o3923o44j1277Q074k3998j8503J3970j0722N2523j22932
7973a58707Q6996J5128J516k0255M4850L9348k685r0515j5367L9614p8775L350
$$ y = [-117145, -110308, -97152, -75241, -46185, -91375, -82539, -81688, -192936, -152258, -99500, -144012, -84770, -85140, -51506, 17508, 46322, -12009, -75592, -31435, 13390, -112821, -124799, -74335, -110386, -79465, -100723, -74234, -96858, -51230, -4209, -47032, -18241, -78065, -74878, -69185, -26127, 3731, -33860, -8385, 2098, -8413, -16959, -45916, -75325, -116822, -21004, -36631, -23895, -44707, -44070, -52168, -15013, 21510, 5954, 4502, -66932, -87995, -139737, -99273, -9301, -21466, -68511, -104776, -85700, -53737, -35082, -58075, -95993, -73723, -86455, -24663, -67148, -37306, -20164, 18725, -45198, -45842, -57119, -49045, -73043, -91546, -77576, -88298, -35775, -158707, -71711, -56583, -55067, -75322, -30472, 8876, 6191, -84324, -99691, -60077, -138852, -135502]
7961a35502K4136j0358K7956k2722L7394L9392m5007M3997j909k4922k3859o1188
7949a52592M3257O0294K0368Q7995n1249j7395m8834m3979r28N6477m6976O703
7937h6859P9302r0456r12k0375N2555M355j7667n1279O1324N2588L3251m7797
7925c1970o4308N6904k4599J8397l2164l4923R097O2256M9489o8615j8211j6928
7913i5575r963P672M864K3703j0412L7480j3535l5540P870K523J5839r550m224
7900g8848q028K9963K8854Q251k1888m2836L6942J9440K0230k8960n2595l3742
7888a23217P3039j953l6516k5268J099K2457l3966J8039K161j1134Q389N7954
7876d8916M0442j6939k5414K416r949j9778K1256O738N5480m5227m3430j125k644
$$ y = [-135502, -111366, -121724, -93768, -116490, -79096, -39704, -84711, -40714, -42623, -67545, -91404, -152592, -109335, -49041, -28673, 59322, 8073, -9322, -58156, -102135, -103063, -46586, -93562, -86859, -7557, -98013, -98925, -119300, -66745, -62390, -80057, -131336, -70012, -17424, 15827, -31970, -96278, -39374, -63973, -45576, -77740, -112663, -103566, -41310, 8179, -60436, -78647, -95575, -105538, -97866, -93002, -69299, -79711, -42231, -55766, -91306, -83436, -80913, -65074, -74624, -78848, -86876, -56913, -28059, -19808, -41696, -84532, -47590, -28150, -7920, -36880, -89475, -123217, -50178, -52131, -88647, -113915, -112816, -90359, -124325, -106286, -104125, -115259, -106870, -48916, -8474, -25413, -50827, -48411, -58360, -78138, -56882, -50144, 5336, -39891, -83321, -84446, -87090]
7863h7090J5618K4028l2876N50l3840J6187O0604n0511l4465J9071J3047J5236
7851g4441m2016l773M7568P0686l9959l1285L8932l5492l7657K0107L9374m8104
7839i6060J8068l8769J0795l1333J9007Q0485m556M749M5482k0910m9436Q3444
7827B0966j4579k1046k3605L0533n5835q583M2514q0427j4000K6066J7205j0228
7815i1019L6965K2465K5216l0746o8523m3761q015M4682N5883L782k2948n3777
7803a29796Q1424m1942K41732J850j39717M4390q524k7635k628l2043N117j6205
7791b3977l221Q671K1246j0819n3861N5906J727j8699M208K147q4079j144K0688
7778h1207k8076m8061R1172J5907N4602l5073l8346L2618N3271n2869j3846o8677
$$ y = [-87090, -71472, -47444, -80320, -79770, -113610, -97423, -36819, -87330, -121795, -102724, -89677, -74441, -116457, -120230, -72662, -1976, -41935, -73220, -34288, -69780, -107437, -87330, -47956, -96060, -77992, -116761, -105966, -137299, -118292, -37807, -42363, -37614, 7868, -13042, -62478, 20966, 6387, -14659, -38264, -7731, -63566, -72149, -29635, -110062, -124062, -97996, -80791, -91019, -54054, -31589, -6373, -37119, -105642, -149403, -157418, -112736, -56853, -53071, -76019, -129796, -48372, -90314, 151418, 153268, 13551, 57941, 49417, 21782, 19154, -12889, -7772, -23977, -27198, -18527, 2719, -8100, -61961, -6055, -4328, -23027, -18819, -16672, -100751, -101895, -81207, -109283, -157344, -66172, -50265, 4337, -30736, -69082, -36464, 16807, -36062, -49908, -118585]
7766a18585M6380J4773k51J7859M2992n093n7826P807k7222j5199M9813o803k3906
7753g5261k9188k3025R4342k917J7920l9802j5357n9532M7733M0648k9380M3837
7741b9982L9272r6424O1361O3j3958k3309l7555P023m7644k3359O4192P5364l3309
7728e8265l2625O2977P069o548M8079k9356l0223K3240L3395o6238L3391q6474
7716a01578N7453m0342p755L0148J3210Q478L6242j5287m1212Q752j0015M3912
7704a7994q9955k816O2227L5093J1929K1636m5873j6120j9739o355J6141m7815
7692i9641j8457M1269L7777M739j6921L8970P67l4476K2836M5981n80k4699P0314
7679F7879M2290q9043r2379r515K1385m9681j6396P0355k25L6995l7170L7248
$$ y = [-118585, -72205, -57432, -57683, -39824, 3168, -1925, -59751, -51944, -79166, -94365, -44552, -51355, -75261, -104449, -127474, -33132, -36049, -18129, -57931, -73288, -132820, -85087, -44439, -73819, -29982, 9290, -87134, -25773, -25710, -39668, -62977, -100532, -93509, -141153, -164512, -100320, -24956, -58265, -90890, -27913, -20844, -27392, 20687, -8669, -38892, -15652, 17743, -48495, -15104, -101578, -44125, -84467, -92222, -62074, -48864, -40386, -4144, -19431, -60643, -51891, -61906, -17994, -107949, -110765, -48538, -13445, -1516, 20120, -25753, -41873, -61612, -67967, -51826, -99641, -118098, -76829, -39052, -34313, -51234, -12264, -11497, -45973, -23137, 22844, 22264, -2435, 67879, 110169, 21126, -71253, -80768, -59383, -109064, -125460, -55105, -55330, -18335, -55505, -18257]
7667a8257J3598k7182N1485l6335l6839j9880N4542j5782M257j6047p4802o560
7655a27802Q1243r01j1630L0206n6544Q779L2068j5895O7474m7978m4482M6022
7643c9440j1352n502N2356n8920m227L5946l3344k6410O5300Q179J01558j3968
7631G0176j39399K4825Q4476j05542J2554J6464l2691J0493L0430k5584o0928
7620a14726l1023Q0769P1639l8357J4058R609K1750l5343N9524n3138l3063L2275
7608a6026N9497p2719m2212Q6296J8363n0985L2327J1971k1953k7763M870J1486
7596f848o9747o4485M1369J6776m6322J2800L705J7251M6041j1049O614j2340
7584f6235j687J6508q814N8306K1834m0742j8775r641l8110l7550L0686M3853
$$ y = [-18257, -4659, -31841, 19644, -16691, -53530, -73410, -18868, -34650, -30393, -46440, -121242, -127802, -46559, -47460, -59090, -28884, -85428, -76649, -44581, -60476, 6998, -40980, -85462, -39440, -50792, -56294, -3938, -62858, -67085, -31139, -64483, -90893, -25593, -17414, 84144, 70176, -69223, -44398, 40078, -65464, -52910, -36446, -69137, -58644, -28214, -53798, -114726, -145749, -64980, 6659, -31698, -17640, -8031, 13719, -21624, 37900, -15238, -48301, -16026, 43471, -29248, -71460, 14836, 33199, -17786, 14541, 26512, 4559, -23204, -18334, -6848, -76595, -141080, -99711, -82935, -129257, -116457, -112752, -95501, -49460, -60509, -53895, -66235, -67922, -51414, -60228, -1922, 19912, -20830, -39605, -49246, -87356, -124906, -94220, -50367]
7572e0367J2941M7073m3197n3092Q2792n0895k500K5171M5070N62k299j1919o1941
7559f2601m2276P0693J7484p335L6196n903p3565k6523l5514L1334J5013K0043
7547f2954k5403j4609M6782N1937k7693k1677M5521m8281k5723L2242J660j1109
7535e9307L3446l8535l8263L204J6551K6666O9053l7839N368j4663J204K4595
7523h520l1878l4066J3346M1915l459k5670J8770p2250K1571p585m1895L6658
7511i3063m555L6463L6362l0308l6641J7811M3610j0901p673k596J6749m3533
7499g8275j6639P567o932J210k6647Q2319l7292Q838L7328K1611l8772n7537o590
7486a09811K4204k155l874L5411k375Q5272m1836l9866l7356J7140L747O1767
$$ y = [-50367, -37426, 9647, -33550, -86642, -3850, -54745, -57245, -32074, 12996, 13558, 11259, -660, -62601, -104877, -34184, -16700, -24035, 12161, 6258, -67307, -93830, -129344, -98010, -82997, -62954, -88357, -102966, -56184, -4247, -31940, -53617, -8096, -56377, -82100, -49858, -48198, -59307, -25861, -64396, -102659, -99455, -82904, -56238, 12815, -25024, -19656, -34319, -33115, -8520, -40398, -74464, -61118, -19203, -22662, -48332, -29562, -101812, -80241, -87826, -129721, -93063, -97618, -61155, -24793, -55101, -91742, -73931, -30321, -41222, -48895, -51491, -34742, -78275, -94914, -87347, -94279, -93069, -119716, -37397, -74689, -65851, -28523, -6912, -45684, -103221, -109811, -85607, -87762, -91636, -56225, -58600, 26672, -15164, -55030, -92386, -75246, -71499, -9732]
7474i732k7961j2460Q324k6966n5045l065N0745M5477n2395j2718K3886P6324
7462D414j4717j8864M7300p0402m4690k0949M5125O5190l5573j16123K5565L9745
7450i3979l0539J0892R0483j1228m420J875R705n958J4405l402M0076m5256k0338
7437d7684P9482j2931j6513l8922k4344K2872j6638K4772l8261K0364k136L2348
7425a7591P329q5404O0949M5510l7465K0785L1126l7590m7119n7327O1635K1967
7413c3195q475O007J6540j3527k9656m104K5388q8317K244P445L6922j100k1819
7400a05647N5189j0181k2949k2313L8774O7691j05845l9332N3704q89L8339K82
7388e3177q627M0197L8709P047L3218p6620J9819J7779m8342k2530L8898m490
$$ y = [-9732, -37693, -50153, -41829, -68795, -123840, -126905, -76160, -30683, -83078, -95796, -71910, 4414, -10303, -29167, 18133, -52269, -96959, -117908, -72783, -7593, -43166, -159289, -133724, -93979, -124518, -113626, -23143, -34371, -38791, -36916, -27211, -33169, -18764, -22166, 17910, -27346, -47684, 31798, 18867, 2354, -36568, -60912, -38040, -54678, -29906, -68167, -47803, -49939, -17591, -10262, -95666, -34717, 10793, -26672, -5887, 25239, -12351, -59470, -116797, -55162, -33195, -41670, -35663, -19123, -32650, -62306, -66410, -41022, -129339, -127095, -119650, -82728, -83828, -105647, -50458, -60639, -83588, -105901, -67127, 564, -105281, -144613, -90909, -91798, -53459, -53177, -61804, -21607, 17102, 24149, 57367, -19253, 566, 18345, -29997, -52527, -13629, -18119]
7376a8119J720j8042M4712j8441m6477N2287K7478o3805k9746L7105L9540K3386
7364C1598p968J9305o5313o4662q627n9035O7812N5800K1198R6241l5775n9472
7352h898J4846r470J6430p7812k5658P1138O348L1781J2152o0250J6319J0638
7340b436o0311l0106M1803M4889m8361o6529j0727O7430j650J5375L0825k6426
7328d6224K4285K6985l7493m0759P9471O213l4393j509J6771j00914j8471N1518
7316g4520J9034L2709K5734J2475m9379j2029R794K6193K533p2635m82O7317l5161
7303d8417J0935P420j8969L8173J7572j2762J2221J5816N2862j28095l3750P9891
7291g103J6921O24J2864K4102r430l5664j266l9975l4898N4L5672P5563K7835
$$ y = [-18119, -16399, -34441, 10271, -8170, -54647, -2360, 25118, -38687, -68433, -31328, 8212, 31598, 23630, 42935, -22378, -87040, -95667, -154702, -86890, -31090, -9892, 86349, 50574, -8898, 5948, -3522, 12908, -64904, -90562, -19424, -13076, 18705, 30857, -29393, -13074, -2436, -62747, -92853, -51050, -6161, -54522, -121051, -131778, -64348, -65998, -50623, -19798, -46224, -21939, 5046, -32447, -73206, 6265, 12478, -21915, -23424, -6653, -107567, -126038, -74520, -55486, -22777, 2957, 15432, -33947, -45976, -36182, -9989, -7456, -80091, -80573, -13256, -48417, -37482, -30062, -49031, -10858, 6714, -6048, 6173, 21989, 74851, -53244, -86994, -7103, 9818, 10442, 23306, 47408, 37978, 2314, 1048, -38927, -73825, -73771, -38099, 37464, 65299]
7278F5299r1816k0160j5595m9522M2511Q6473L9908p4713l220q802J1660k135
7266b0112K5541M7657J7187Q824r3740m7544O9722l0287l2365M1673l3522p419
7254e4385J5768R447M8652L4425n6844P460k1990l4993J043M7427O1917j0926
7242D7001n153l6963l6866l4101K7993o7053L9824M4928J237N040R403N1637k4922
7229B2005J0168l5885L4943m0070o4842l540L5892l5051L0943K3823N420O008
7217a0186j211K5143j5735J1002J676M797L1052j8285J1170k6502p500R376k3486
7204h689l4318L5700J9364j2868o0075L2504j2486M005K9903J7467M6162k8325
7192B8344j5224K9643k5534j0431j268l9268j3394J2972L4093l5669M4418K9488
$$ y = [65299, -26517, -46677, -62272, -111794, -69283, 17190, 57098, -17615, -20835, -29637, -17977, -20112, 5429, 53086, 70273, 79097, -14643, -62187, 7535, -22752, -55117, -13444, -46966, -54385, -38617, -29170, 19482, 53907, -2937, 4523, -17467, -52460, -51417, -3990, 57927, 47001, 41848, 4885, -31981, -66082, -38089, -105142, -65318, -20390, -19153, -14113, -4710, 46927, 22005, 32173, -3712, 31231, -8839, -73681, -77221, -41329, -76380, -45437, -21614, -16194, -10186, -11397, 13746, -1989, 9013, 10689, 15486, 46538, 28253, 39423, 12921, 5421, 14797, -8689, -43007, -7307, 12057, -811, -60886, -28382, -40868, -36863, -6960, 10507, 56669, 28344, 13120, 42763, 17229, 6798, 5530, -33738, -47132, -34160, -67, -35736, 8682, 38170]
7180C8170K3008l4231J729j2259L0388j2380q259O9013k1315o2271N1076o3105
7168d36M1184k4621M2256j2969j555l9321j8055M1048m4512J6461L6089N1847
7156H7416r894m5699m38j0929k2612K8852L3849n6878q9687K0041q38N2176J03802
7143H9161j4079m1228J8242n7133O036l2679k3473M7974L5021J1177P473j5252
7131C1240j9672L9761o057n7098L2911L2370M071K4435j8967p0392N7332m0435
7119I499p5086P9188K6885q532j51763M7736J22676l6879K7336P282k8805k1162
7107a625j4546K9881L2860p681n3667K9107O8230J7785j8270l5211j1734K7386
7095F2515k6131j9222Q484j2976n2928Q3963O0119l8373j9249k9451l1594K0433
$$ y = [38170, 61178, 26947, 28676, 16417, 46805, 34425, 26166, 95179, 73864, 11593, 62669, -436, 40748, 16127, 58383, 45414, 43859, 4538, -13517, 27531, -16981, -520, 35569, 87416, 77522, 31823, 31385, 20456, -2156, 26696, 60545, 3667, -86020, -65979, -66817, -14641, 89161, 75082, 33854, 52096, -5037, 999, -31680, -55153, -7179, 27842, 39019, 46492, 31240, 11568, 51329, 45272, -11826, 21085, 53455, 57526, 81961, 62994, -7398, 49934, 9499, -65587, 13601, 40486, 31954, -119809, -72073, 50603, 13724, 41060, 48342, 19537, -1625, -16171, 13710, 46570, 38889, -14778, 14329, 82559, 100344, 82074, 46863, 35129, 62515, 36384, 17162, 25646, 12670, -40258, 43705, 103824, 65451, 46202, 16751, -14843, 5590]
7083E590O9725J1767k4852j4191L8172j3540j7864k7842J6354M0966l7129R68
7071D8124J5333O2045k8781K5721K840k3923J7929o388N921o6167l0777j4694
7059G183P842K7214j0619L5749K226o6119R2161m8994m8877M2995l9807K3915
7047B4869L7164O5540M9749q6950m0650r888J4318p579J9905o6385O6111K0410
7035H6614K6745o4919Q796Q025J9921k9101R82L8653n5683j1213j7329K6523M8826
7022H6840j1104N2201J1449J0229n4336l9798J8976L1132R237L9270m0658k1797
7010I1641k863n5754M2187L6826K5465o2583N901k18L2510j903O841j6823l200
6997I8027o5243L9636P4294m698M4319n0439j3791K3938p1321K3951M1916m0605
$$ y = [5590, 75315, 87082, 62230, 48039, 86211, 72671, 54807, 26965, 43319, 84285, 47156, 48124, 63457, 125502, 96721, 122442, 125282, 101359, 119288, 112900, 118821, 52654, 21877, 7183, 15025, 42239, 31620, 67369, 69595, 3476, 95637, 46643, -2234, 40761, 954, 24869, 62033, 127573, 177322, 90372, 49722, 39834, 54152, 46573, 66478, 93, 66204, 86614, 113359, 48440, 57236, 65261, 85182, 56081, 57063, 95716, 40033, 28820, 11491, 38014, 86840, 75736, 127937, 139386, 149615, 95279, 55481, 74457, 105589, 114826, 154096, 113438, 91641, 88778, 33024, 75211, 112037, 137502, 74919, 80820, 80602, 113112, 111209, 118050, 101227, 98027, 32784, 72420, 146714, 142016, 186335, 135896, 122105, 146043, 74722, 98673, 140589, 99984]
6985I9984j3222N3167j254O273l5942n7775k4402j8022N9369Q964j9061L2743
6973I0822m6661Q4626l9075P250J2726L028J2462K4632k7288J2877N7945L6034
6961B29378m4693n5331l2244l5178j9766P0031J9391j9615k8030j1311n2923j1337
6949H372J04636L8490n506J7175K2762j9386O6202k4819m7624k5961N6610O8948
6937B59899n5266m9220n6395L8196J1105l5518q001M5478R5258j3346q2331m8189
6925A01670J9724j3935r199j5273q838K8251K1122J4799L1262K3595L2805j5653
6913B10330k2183J5850j2762Q658o8897l9491l3771L5022K7204m4448L3870J6178
6901A25560J135n7962r698M0348K0063p9580Q8116l5120J2046K9102Q22J4995
$$ y = [99984, 86762, 139929, 138675, 144948, 109006, 51231, 26829, 8807, 68176, 77140, 58079, 90822, 44161, 128787, 89712, 96962, 109688, 112716, 125178, 149810, 122522, 135399, 193344, 229378, 184685, 129354, 97110, 61932, 42166, 112197, 131588, 111973, 83943, 72632, 19709, 8372, 113008, 151498, 145992, 163167, 185929, 166543, 232745, 207926, 160302, 134341, 190951, 259899, 204633, 155413, 99018, 137214, 148319, 112801, 104800, 150278, 245536, 232190, 149859, 101670, 121394, 107459, 98260, 82987, 74149, 102400, 123522, 138321, 169583, 193178, 225983, 210330, 188147, 203997, 191235, 199893, 130996, 91505, 57734, 92756, 119960, 75512, 109382, 125560, 126695, 68733, 59035, 99383, 119446, 39866, 127982, 92862, 104908, 134010, 134832, 149827]
6889A49827N6414O254k3136j651l2685J3915n146L9895K105l1531R104k905k5795
6876A54665J3679J0340n3305J554K8123J5149j0886j6852L6682M5242O883j4529
6864B16745L049n3131L0374J5870K1365k8893p2070P479R255J9299N098P78K6073
6851B01291P2112o6911q4246O8700J9396K3160K2778M432L0373k8890j5032J8268
6839B65431k056N4127O991l9112o4784q0874L9066K6989j1081j8716M9734M6075
6827B71790m3330n5380L763K9372Q7917k878o6309J3147J0883R446P615j4930
6815B51106l0832L4262J8344o272o9329K7306J1037O2558n517k669n0471J883
6803B41406q908q807N081K9180O4975o2502J9792J4228L0569j7273K847l4670
$$ y = [149827, 206241, 212495, 189359, 187708, 155023, 168938, 163792, 203687, 205792, 174261, 183365, 180460, 154665, 168344, 178684, 125379, 126933, 155056, 170205, 159319, 142467, 179149, 224391, 231274, 216745, 219794, 166663, 197037, 212907, 234272, 205379, 133309, 140788, 150043, 169342, 174440, 175218, 201291, 273403, 206492, 122246, 190946, 210342, 233502, 256280, 260712, 291085, 262195, 247163, 265431, 263375, 317502, 324493, 285381, 220597, 139723, 178789, 205778, 194697, 175981, 225715, 271790, 228460, 173080, 176843, 206215, 294132, 291254, 224945, 238092, 248975, 258421, 266036, 251106, 220274, 254536, 272880, 266608, 197279, 224585, 235622, 298180, 292663, 289994, 239523, 241406, 232498, 223691, 228772, 257952, 322927, 260425, 280217, 294445, 325014, 307741, 310588, 275918]
6791B75918K501l3343k8116M6642N7103l3735L8896N1381m1264l0495m794P4996
6779C75690l7851l0054M005O7523K7870p0903M1340j5161n5938n8533m126M7535
6767B91397M2213l6044L5511P19n3978L5060K2118J7432P3155L7373r1701k3916
6755C49339K2941N245m577P404j6963O3956L1017m832l1681Q254K5661r911l3860
6742D11993J2831O9763K2242r02j9221q7031m5992L8663l1212P948L605n173l2543
6729C44971j7810L6918J03754J5465l1783m2499L8583J8359k2893K2698k1233
6718D44530j9198J6106M2929L2071n6432j9425L0871m4927O8975l8463n7254L2309
6706D32092L8329P9505o0017k0321M2958m751O0052n462k1578n0714K9741K4274
$$ y = [275918, 278419, 245076, 216960, 263602, 320705, 286970, 325866, 377247, 335983, 305488, 300694, 375690, 337839, 307785, 311790, 379313, 407183, 336280, 377620, 362459, 306521, 247988, 243862, 291397, 333610, 297566, 333077, 333796, 279818, 314878, 336996, 354428, 427583, 464956, 373255, 349339, 372280, 377525, 372948, 380352, 363389, 427345, 458362, 453530, 421849, 430103, 455764, 445853, 411993, 424824, 494587, 516829, 515927, 496706, 409675, 363683, 402346, 371134, 379082, 382687, 377514, 344971, 327161, 364079, 467833, 483298, 451515, 409016, 447599, 465958, 443065, 465763, 444530, 425332, 441438, 484367, 516438, 460006, 440581, 471452, 426525, 495500, 457037, 399783, 432092, 470421, 549926, 489909, 469588, 512546, 507795, 567847, 562385, 540807, 490093, 519834, 544108]
6694E44108l5160j9819J4145P6335L0705j12230k43J9611q36L2489J8881n9685
6682E08301j9456L0437K9041K8425N9058m1662k4692k1242j9488J3734l3827N5223
6670E63852n3017K7419L3961P2879n119J5125K4020q7349m8744N0333N5042l8201
6658F10201K7728M4144J4170L3394K4725l0207j4099j0699p412L3124J9571j02925
6646F41715N0032O7792K7883K7186J0342k2162j1224J1296N3792p862j7187J6697
6634H48300j5341K9763j5356J09636Q7501M7803l4660P8477J06832R8463L8009
6623A379427k2742l5039K6633q5934J3131p566m7715J5252k17J2296K3113k0634
6611A250005L4569M3088L4972K0453M6570k042L2038k0810k8954m6219q6582N2082
$$ y = [544108, 508948, 489129, 503274, 579609, 610314, 498084, 497841, 517452, 516616, 549105, 567986, 508301, 488845, 519282, 548323, 576748, 635806, 594144, 569452, 548210, 528722, 542456, 508629, 563852, 510835, 538254, 572215, 645094, 639975, 655100, 679120, 591771, 543027, 593360, 648402, 610201, 637929, 682073, 696243, 729637, 754362, 724155, 710056, 699357, 691945, 725069, 744640, 641715, 691747, 759539, 787422, 814608, 824950, 802788, 791564, 802860, 856652, 848790, 831603, 848300, 832959, 862722, 847366, 957002, 1044503, 1092306, 1057646, 1136123, 1242955, 1341418, 1379427, 1356685, 1321646, 1348279, 1262345, 1275476, 1267910, 1220195, 1235447, 1235230, 1247526, 1270639, 1250005, 1284574, 1327662, 1362634, 1383087, 1429657, 1427615, 1459653, 1438843, 1409889, 1363670, 1277088, 1329170]
6599A329170K3432K4546O46O0806m2766m0112j15963J3741J1129K101K1857P2123
6587A360710L5147L7292M7309l4951j04720m5465o1566q6486p827l4939o2290
6576A042214o3770k2938J00160P57P1314l0945n29N0681p4518L9620l0296m0359
6564A041391q2766L4485p022n1589O4851P9928K1351q468m1512n4987R121O2125
6552A066908q4316M1642L2602Q409m2760L7903k0263k173L1912O4756J773n4535
6540A081858J6356p94q1555k6020P6441m4912J6706J05865l464K2922K6025m6617
6528A142811O8193L8615R422p1120L0067L7186j5604l0467L6469K3943j3230l7977
6516A218308O5921J4196M4171j9363K1928J9960m7836r1840O0035O4182J423N0088
$$ y = [1329170, 1352602, 1377148, 1377794, 1438600, 1395834, 1355722, 1239759, 1253500, 1264629, 1266730, 1288587, 1360710, 1395857, 1433149, 1480458, 1445507, 1340787, 1295322, 1233756, 1147270, 1139443, 1104504, 1042214, 978444, 955506, 1055666, 1056423, 1127737, 1096792, 1096263, 1146944, 1072426, 1112046, 1081750, 1041391, 958625, 993110, 986088, 934499, 999350, 1079278, 1100629, 1092161, 1050649, 995662, 1004783, 1066908, 982592, 1024234, 1056836, 1065245, 1022485, 1060388, 1040125, 1037952, 1069864, 1134620, 1136393, 1081858, 1098214, 1097420, 1015865, 989845, 1066286, 1021374, 1038080, 1143945, 1140481, 1163403, 1189428, 1142811, 1211004, 1249619, 1259041, 1187921, 1217988, 1255174, 1239570, 1209103, 1245572, 1269515, 1256285, 1218308, 1284229, 1298425, 1342596, 1323233, 1345161, 1365121, 1317285, 1225445, 1285480, 1349662, 1351085, 1401173]
6504A401173l1460j431Q655j7962J8517M8236k9924L6815M4813m6671J9395J4990
6492A465146P6081j3599o5580P6086j0446j3554J7447L2683k3534k3908Q1337
6481A598159L5378m6626k7996J7504N9362l7525M9389J8811K5231o851j498j8840
6469A664498L9692O2302j0221O1638N4283j8281m3458O4393m8172P2088K2970
6458A921732M7688K4284o6050K5945j5540l5292L5148O0487L0789J6313L3642
6447B079146k7268L5884J06920r485o3142L3514O618j2734O4782L6434L3602L9137
6435B323408j3294m2531R08J5247J14040N2182k4770m5651O6353p540O6527O3205
6423B568084q337M2669K504k2023L4791m6475N3891M9220N6273K7542k9823N6547
$$ y = [1401173, 1369713, 1368282, 1376937, 1358975, 1377492, 1425728, 1395804, 1432619, 1477432, 1430761, 1450156, 1465146, 1541227, 1527628, 1462048, 1538134, 1527688, 1514134, 1531581, 1564264, 1540730, 1516822, 1598159, 1633537, 1586911, 1558915, 1576419, 1635781, 1598256, 1647645, 1666456, 1691687, 1684836, 1683338, 1664498, 1704190, 1766492, 1756271, 1817909, 1872192, 1853911, 1810453, 1874846, 1826674, 1898762, 1921732, 1969420, 1993704, 1927654, 1953599, 1938059, 1902767, 1937915, 1998402, 2029191, 2045504, 2079146, 2051878, 2087762, 2194682, 2185197, 2122055, 2155569, 2162187, 2149453, 2214235, 2250669, 2284271, 2323408, 2310114, 2267583, 2268491, 2283738, 2397778, 2449960, 2425190, 2379539, 2445892, 2438352, 2504879, 2568084, 2559747, 2602416, 2604920, 2582897, 2617688, 2571213, 2625104, 2674324, 2730597, 2758139, 2728316, 2784863]
6411B784863L3962K8323K9593L4968Q9115K4317N75J27000L9320k8887J6214M9493
6399C228856O5351Q2713K4088k114M6133P844P5029P3132K5548J13021Q8765Q4531
6387C912897Q3657P455P3651j2065M8002J62522J14051P1543Q5632J08170M0962
6376D696477N1983P4070J74126J51072N4991P4284J32640J53251P3990J22198
6366E759082J57758J21640J29280L4652J98035K19125J11191R3268P4790Q5764
6356F984585J10877R3737J07393J48120J40819J75557J82662J97548J81192J45936
6346H468426J85834K36895J75886K13425L31362K66623K82286K79199K92656K87447
6336A1020039K99895L58416L20975L84870L84688L63297L58492L76364L88749
$$ y = [2784863, 2818825, 2847148, 2876741, 2911709, 3000824, 3025141, 3025716, 3152716, 3192036, 3163149, 3179363, 3228856, 3294207, 3376920, 3401008, 3398894, 3445027, 3452871, 3527900, 3601032, 3626580, 3739601, 3828366, 3912897, 3996554, 4004009, 4077660, 4065595, 4113597, 4276119, 4390170, 4461713, 4547345, 4655515, 4696477, 4748460, 4822530, 4996656, 5147728, 5202719, 5277003, 5409643, 5562894, 5636884, 5759082, 5916840, 6038480, 6167760, 6202412, 6400447, 6619572, 6730763, 6824031, 6898821, 6984585, 7095462, 7189199, 7296592, 7444712, 7585531, 7761088, 7943750, 8141298, 8322490, 8468426, 8654260, 8891155, 9067041, 9280466, 9611828, 9878451, 10160737, 10439936, 10732592, 11020039, 11319934, 11678350, 11999325, 12384195, 12768883, 13132180, 13490672, 13867036, 14255785]
6327A4255785M32934M87390M92798M57415L92079M33798M67794N85119N62372
6318A8567484N86683N69688O35950P04978P03150P04501Q31879R16079R42182
6309B5162574J031503J183313J420463J636110J876507K049096K269937K564159
6301C9193662K725718K575604K019151J710912J942786K813683L775633M739600
6293F1496749N756152P050979P807439Q655244R976899J0104471O059874j150550
6285A15757257o806087q244050n989336k881143l57265J223711K027190K843352
6277I7573629M506455O340969N749395K642863P0124j87489J601455L585758N265177
6268A27148336N041732J749594l562309p393652p747395n400806k580854q4863
$$ y = [14255785, 14688719, 15176109, 15668907, 16126322, 16518401, 16952199, 17419993, 18005112, 18567484, 19154167, 19723855, 20359805, 21064783, 21767933, 22472434, 23304313, 24220392, 25162574, 26194077, 27377390, 28797853, 30433963, 32310470, 34359566, 36629503, 39193662, 41919380, 44494984, 46514135, 48225047, 50167833, 52981516, 56757149, 61496749, 67252901, 74303880, 82111319, 90766563, 100743462, 110847933, 116907807, 115757257, 108951170, 100707120, 94717784, 91836641, 91479376, 92703087, 94730277, 97573629, 102080084, 108421053, 114170448, 116813311, 116883435, 116695946, 118297401, 121883159, 127148336, 132190068, 133939662, 130377353, 122983701, 115236306, 109835500, 107254646, 107169783]
6260A07169783J981391K088289r34215m963326o987915n960042l048598k53409
6252H9091958K158627L619090M591741O121721P007121L727837m146406j1579625
6244A00592064j4618335j2929862r892454p530801n930443m749851l893580l272555
6236C7774183k735753k295411k053644j760992j626443j392100j302824j204959
6228B3402057r92570r83251q49899q17631p42855p36260p00865n59683o08987
6219A6410056n42915m98762n61885l49672l79411l76110m25816l44970m67264
6210A2463251l84957k92348l48246k86102j99978k33183k56534k23266k54652
6201I983985j73641j20454j93133k14307j46590j27522j47675j40995k07377r2403
$$ y = [107169783, 109151174, 111239463, 110305248, 105341922, 98354007, 92393965, 89345367, 89091958, 91250585, 94869675, 99461416, 105583137, 112590258, 116318095, 112171689, 100592064, 85973729, 73043867, 63151413, 55620612, 49690169, 44940318, 41046738, 37774183, 35038430, 32743019, 30689375, 28928383, 27301940, 25909840, 24607016, 23402057, 22409487, 21426236, 20576337, 19758706, 19015851, 18279591, 17578726, 17019043, 16410056, 15867141, 15368379, 14806494, 14456822, 14077411, 13701301, 13275485, 12930515, 12463251, 12078294, 11785946, 11437700, 11151598, 10951620, 10718437, 10461903, 10238637, 9983985, 9810344, 9689890, 9496757, 9282450, 9135860, 9008338, 8860663, 8719668, 8512291, 8419888]
6191H419888r4037j25123j14805j28397o9296m6152n7825m7278j32075j07837
6181G497063p2758k23738j83159j01337j23365j84604r6705n3850j14675q1174
6171F261698q8123n5925n9177j13483P453j351o9748j2028j0846r222L946j68329
6159E684865j26641r8562j32904j22086j7995m1969l9925m3994m0742n512j23778
6148D890757j22984j12283p7578j7634n3888o4192k1113l7042p9327n3694j1422
6137D239600k2834p5692J1508J2564l2051n2868n7839J8205m7134m2013n668j9010
6125C926768m6049K0802q2201L6411q4584k6679l9090j01589j0961L0378k120
6114C621086K2323o569J999j4586m4844q919q2249Q97m3452j2876k1463L1658
$$ y = [8419888, 8325851, 8200728, 8085923, 7957526, 7888230, 7842078, 7784253, 7736975, 7604900, 7497063, 7424305, 7200567, 7017408, 6916071, 6792706, 6608102, 6511397, 6457547, 6342872, 6261698, 6173575, 6117650, 6058473, 5944990, 5952443, 5951092, 5881344, 5869316, 5858470, 5849248, 5853194, 5684865, 5558224, 5459662, 5326758, 5204672, 5186677, 5144708, 5104783, 5060789, 5020047, 5014535, 4890757, 4767773, 4655490, 4577912, 4560278, 4506390, 4442198, 4421085, 4384043, 4304716, 4251022, 4239600, 4216766, 4141074, 4152582, 4165146, 4133095, 4080227, 4022388, 4040593, 3993459, 3951446, 3945778, 3926768, 3880719, 3901521, 3819320, 3855731, 3771147, 3744468, 3705378, 3603789, 3592828, 3623206, 3621086, 3643409, 3636840, 3638839, 3624253, 3579409, 3570490, 3488241, 3489138, 3445686, 3432810, 3411347, 3443005]
6102C443005k589J339L2133k4707o4673l5563q3916n3229j7175r680P3999k1734
6090C237210k8390j7265k3177M5299j3987M1792J9202k1649M4703j8959m6386
6079C218393M0192R7367J1598m423N2021K1658n4819k7328L3430L554M508M4175
6067C440326J1047j6761J2033l936m6285J8795j8328k1884M0062l2223K8088n643
6055C405291l361O0556l0866k6679j0933J8704m6329n622O3447n5269j9331n6592
6043C293016K2780q657J8621J2207o8767M69K7067n3508k0931l9260m1583K8018
6031C169472k656o0544N8346j9926M6949K1410n5127q3513k9673J776p4683j6470
6019B955361n6743n6656O7205M0805N832M5910m8276M6945j5984o029j6192K4384
$$ y = [3443005, 3440416, 3441755, 3473888, 3449181, 3384508, 3348945, 3265029, 3211800, 3194625, 3184945, 3258944, 3237210, 3208820, 3191555, 3168378, 3213677, 3199690, 3241482, 3260684, 3239035, 3283738, 3264779, 3218393, 3258585, 3355952, 3367550, 3363127, 3415148, 3436806, 3381987, 3354659, 3388089, 3391643, 3396151, 3440326, 3451373, 3434612, 3446645, 3442709, 3396424, 3415219, 3396891, 3375007, 3415069, 3382846, 3410934, 3405291, 3401930, 3462486, 3431620, 3404941, 3394008, 3412712, 3366383, 3360761, 3424208, 3368939, 3349608, 3293016, 3315796, 3307139, 3325760, 3337967, 3269200, 3269669, 3296736, 3243228, 3222297, 3183037, 3141454, 3169472, 3166816, 3106272, 3164618, 3144692, 3191641, 3213051, 3157924, 3074411, 3044738, 3046514, 2971831, 2955361, 2898618, 2841962, 2909167, 2949972, 2955804, 3001714, 2953438, 3000383, 2984399, 2978370, 2962178, 2986562]
6007B986562O2533N3486N3702K9284j4769r463j7964R1069P3036J1064N8082k0859
5995C355763k082Q5493l0069o7708j7837P973M4531q839M3682P5786R0515q82
5983C576326J1720N4911J0453J6253J5404Q3320R3433M2983N7397O0241k968o0384
5971C959089l2019k6053j3045k386o4773O2599M8452M3041K3842J4490N1313J6805
5959D081355N167R56N5393J8359K3909P6187r421K1412O101O1117J0540k0241
5947D330834M7308K9869N2011N833k8501P9421O65l589k4758r902m0915l9994
5935D398282j45L5180R4512N5921L2347P446O4576L2519j4443k6681L9070l4505
5923D684079J2058r120j6110m1623k7548P8731N9200j070K8573m3739m7652M3563
$$ y = [2986562, 3049095, 3102581, 3156283, 3185567, 3170798, 3161335, 3143371, 3234440, 3307476, 3318540, 3376622, 3355763, 3353681, 3439174, 3409105, 3341397, 3323560, 3331533, 3376064, 3367225, 3410907, 3486693, 3577208, 3576326, 3588046, 3642957, 3653410, 3669663, 3685067, 3768387, 3861820, 3904803, 3962200, 4022441, 4019473, 3959089, 3927070, 3901017, 3887972, 3885586, 3820813, 3883412, 3931864, 3974905, 3998747, 4013237, 4064550, 4081355, 4086522, 4087478, 4142871, 4161230, 4185139, 4261326, 4251905, 4273317, 4279418, 4340535, 4351075, 4330834, 4378142, 4408011, 4460022, 4465855, 4437354, 4516775, 4517440, 4513851, 4489093, 4479191, 4438276, 4398282, 4398137, 4433317, 4527829, 4583750, 4616097, 4623543, 4688119, 4720638, 4706195, 4679514, 4718584, 4684079, 4696137, 4687017, 4670907, 4629284, 4601736, 4680467, 4739667, 4738597, 4767170, 4723431, 4675779, 4719342]
5911D719342Q0089k0435L2103R8953O1167J12132N2973o7980j17573p7167K4809
5900D898413n3003n0577K240k6191l8148L6683R4675l6601J2972L7984K9831k0022
5888D888256r206R8290M6346L3831k2611N074l156K3296J08039Q0145j5262N0810
5876E283852O2147R501O6616L1144R216J04488J22775k1080Q5174O7066M0545
5865E861444O0766L487M383R4039O4441R8554J80Q6003R4621K5774J31412N0227
5853F575331J16530R5948Q2734J08111O6788R0258J23340Q7849J48865J17260
5843G613014J18644Q2432J88869R4298K5830P0301J17671K24744J24585Q7617
5833H748005J80453J26489J55143J41681L8538J56631J77155R7766J15045Q1953
$$ y = [4719342, 4799431, 4778996, 4811099, 4910052, 4971219, 5083351, 5136324, 5068344, 4950771, 4873604, 4898413, 4845410, 4794833, 4797073, 4770882, 4732734, 4769417, 4864092, 4827491, 4840463, 4878447, 4908278, 4888256, 4879050, 4977340, 5023686, 5057517, 5034906, 5039980, 5036824, 5060120, 5168159, 5248304, 5233042, 5283852, 5345999, 5355500, 5422116, 5453260, 5462476, 5566964, 5689739, 5668659, 5753833, 5820899, 5861444, 5922210, 5925697, 5930080, 6024119, 6088560, 6187114, 6187294, 6273297, 6367918, 6393692, 6525104, 6575331, 6691861, 6787809, 6870543, 6978654, 7045442, 7135700, 7259040, 7346889, 7495754, 7613014, 7731658, 7814090, 8002959, 8097257, 8123087, 8193388, 8311059, 8535803, 8660388, 8748005, 8928458, 9054947, 9210090, 9351771, 9390309, 9546940, 9724095, 9821861, 9936906, 10018859]
5823A0018859J14886J82576J40385K38107J74034J58562K41170J07355J92320
5814A1568254K45552K78660K47525J26638K15482K38222L08484L40487L30580
5805A3899884K92033L05075K82186L26719L99708M20969L49166M13137L40597
5796A7029474M17664M90654M34254L70701N73391N27785N64021N44269N43397
5787B1495610N32646N13975O27878N47464N76588O83373O40980P03209P06619
5778B7028342Q07829Q48260Q73467R29039R05558J156672J220859J260847J299705
5769C6330578J495685J671047J892625K118737K505361K888649L334561M056568
5761E6293811M649826N282014N790355O460269P067799O751017M694473J928440
$$ y = [10018859, 10133745, 10316321, 10456706, 10694813, 10868847, 11027409, 11268579, 11375934, 11568254, 11813806, 12092466, 12339991, 12466629, 12682111, 12920333, 13228817, 13569304, 13899884, 14191917, 14496992, 14779178, 15105897, 15505605, 15926574, 16275740, 16688877, 17029474, 17447138, 17937792, 18372046, 18742747, 19316138, 19843923, 20407944, 20952213, 21495610, 22028256, 22542231, 23170109, 23717573, 24294161, 24977534, 25618514, 26321723, 27028342, 27836171, 28684431, 29557898, 30486937, 31392495, 32549167, 33770026, 35030873, 36330578, 37826263, 39497310, 41389935, 43508672, 46014033, 48902682, 52237243, 56293811, 60943637, 66225651, 72016006, 78476275, 85544074, 92295091, 96989564, 98918004]
5753I8918004P31778J716586L624270N216269O882360Q264754P391763K996167
5745A35741951j905727n280836n725818m257271j848156R14869L145416N045166
5737A25829594O967954Q008747N905643J244026k806732l531974j379266J226569
5729A41464561L335538M619034L687703L09801l965184o723024o458048m132212
5721A32138169j073348J435125J989706L00105j598450k925568l815181m603655
5713A21846903m625831l243796j224366M24040J731355L138885K734973q47920
5705A19934243n733481q924047q897434p089855n422238m338939l433726k458228
5697G3636295j629851j255063j161040r50714o06333n44126q77634j117846j027333
$$ y = [98918004, 99649782, 101366368, 104990638, 110206907, 117089267, 125354021, 132745784, 135741951, 133836224, 128555388, 122829570, 118572299, 116724143, 117639012, 120784428, 125829594, 132797548, 140806295, 146711938, 147955964, 145149232, 141617258, 140237992, 141464561, 144800099, 149419133, 153106836, 153416637, 149451453, 142728429, 136270381, 132138169, 131064821, 132499946, 134489652, 134789757, 133191307, 130265739, 126450558, 121846903, 117221072, 113977276, 112752910, 113176950, 114908305, 118047190, 120782163, 119934243, 114200762, 105276715, 96379281, 89289426, 83867188, 79528249, 76094523, 73636295, 72006444, 70751381, 69590341, 68639627, 68033294, 67489168, 66611534, 65493688, 64466355]
5688F4466355n05891L2651O23955J156250J704642K442076L192813M007209M705007
5679H1825067N182315N590712N415668M173622J621384j338721l242774l212727
5671I6014546j754906J13460J420558K400456L407976M264202M448401L677692
5663A13992385K061678R74147J215780K739548M918647O731637P858809P122371
5655A47615002M333724O79109k835044m946302m750426k754269o88987k83857
5647A36368950n10639M68191K660155M062049K910883N6215k778969l354013j815824
5638A38066998M45834J931822K397996J911002J536441J870173J989945q460m636867
5629A45504884r289966j1259817r893780o683961l697115j392309j07335R37905
$$ y = [64466355, 63960464, 63993115, 64617070, 65773320, 67477962, 69920038, 73112851, 77120060, 81825067, 87007382, 92598094, 98013762, 102187384, 103808768, 102470047, 99227273, 96014546, 94259640, 94373100, 95793658, 98194114, 101602090, 105866292, 110314693, 113992385, 116054063, 117028210, 118243990, 120983538, 125902185, 132633822, 140492631, 147615002, 151948726, 152627835, 149792791, 144846489, 140096063, 137341794, 136652807, 136368950, 135858311, 136326502, 138986657, 143048706, 145959589, 146015804, 143236835, 139882822, 138066998, 138512832, 140444654, 142842650, 144753652, 146290093, 148160266, 150150211, 150141751, 145504884, 136214918, 124955101, 115061321, 108377360, 104680245, 103287936, 103180601, 104118506]
5621A04118506K151408K546510O82935l052379o470007p891061p244376n429055
5613G9412481l849979k831894k469953k100292j545327j086878j339405k032410
5605F2156343k469474k454744k002499k062655k395616k487482k135760j804656
5597D4343457j280743r60729p13805o16674n94954m55001l26975q2675O5269L30279
5587C9707449P26725R31467O13173l4556l75803o25442p02176j009865j427064
5578C7803908j717237j765412j623432j271082r51367o00657l31491j50394k60886
5569B9131950l48740n21075o00797p92776p09421n21362l89921k39714J09541
5560B5117685K28916K88604L30615K26552J84503J75693j80798m09254o28022
$$ y = [104118506, 106269914, 108816424, 109499359, 106446980, 99976973, 92085912, 84841536, 79412481, 75562502, 72730608, 70260655, 68160363, 66615036, 65528158, 64188753, 62156343, 59686869, 57232125, 55229626, 53166971, 50771355, 48283873, 46148113, 44343457, 43062714, 42101985, 41388180, 40771506, 40176552, 39721551, 39394576, 39311901, 39377170, 39707449, 40434174, 41365641, 41978814, 41944258, 41568455, 40943013, 40240837, 39230972, 37803908, 36086671, 34321259, 32697827, 31426745, 30475378, 29874721, 29543230, 29392836, 29131950, 28783210, 28262135, 27661338, 26868562, 26159141, 25637779, 25247858, 25008144, 25117685, 25346601, 25635205, 25965820, 26192372, 26376875, 26552568, 26371770, 25962516, 25334494]
5551B5334494o33674o56478p14681n78997n25074m94642n24847l48416m08666
5542B0449019m00220l45528m93305k95930j53269l8210m635j1374m5168k09091
5532A8452289k18570k06166j15164n0884q4234j95259l26884l49207l96068l37792
5522A6172061l02872l37438l14355k74136j55319j34960j59639j75386j96379
5513A4121577j79423j59006j14957J454m1303n9008o8177j47839p5271m6848J690
5502A3232889Q5854J03062R6236n206O3366j09936j65889J7279m193j09903n1215
5491A3152344R443N3518n3871L7625P739l7921N2758P7646M3084N6169K8260J17037
5479A3543831O5537Q5941J22042J58597K02680K46854K21012J60805K21268K56748
$$ y = [25334494, 24700820, 24044342, 23329661, 22750664, 22225590, 21730948, 21206101, 20857685, 20449019, 20048799, 19703271, 19209966, 18914036, 18760767, 18722557, 18717922, 18706548, 18661380, 18452289, 18233719, 18027553, 17912389, 17861505, 17777271, 17582012, 17255128, 16905921, 16509853, 16172061, 15869189, 15531751, 15217396, 14943260, 14787941, 14652981, 14493342, 14317956, 14121577, 13942154, 13783148, 13668191, 13669645, 13628342, 13569334, 13501157, 13353318, 13278047, 13231199, 13232889, 13318743, 13421805, 13518041, 13512835, 13576201, 13466265, 13300376, 13317655, 13313462, 13203559, 13152344, 13161787, 13215305, 13161434, 13199059, 13206798, 13168877, 13221635, 13299281, 13342365, 13398534, 13426794, 13543831, 13609368, 13695309, 13817351, 13975948, 14178628, 14425482, 14646494, 14807299, 15028567, 15285315]
5469A5285315K62400K62251J96396K42508K32737K65668L14989L33397L73334
5460A7768995M15743K60535L08691M23008M09622N45765M59005L90051M80949
5451B1462364M65365O04183N51432N36667N39729N75453O21935O03698P25444
5442B6686270P41019P97484Q17392Q08563R68561J011184J084617J107994J293903
5433C5316987J468015J602042J696449J870818K074043K285104K534329K854621
5425E1702408L232987L724422M241718M641816N315588N821451O265187O648976
5417I1594553O767175O285269N399461M225500L015179J911856O76094q00998
5409A19074089k289964l538545l971294l452422k641639j530429k93457R70372
$$ y = [15285315, 15547715, 15809966, 16006362, 16248870, 16481607, 16747275, 17062264, 17395661, 17768995, 18184738, 18445273, 18753964, 19176972, 19586594, 20132359, 20591364, 20981415, 21462364, 21927729, 22531912, 23083344, 23620011, 24159740, 24735193, 25357128, 25960826, 26686270, 27427289, 28224773, 29042165, 29850728, 30819289, 31830473, 32915090, 34023084, 35316987, 36785002, 38387044, 40083493, 41954311, 44028354, 46313458, 48847787, 51702408, 54935395, 58659817, 62901535, 67543351, 72858939, 78680390, 84945577, 91594553, 98361728, 104646997, 110046458, 114271958, 117287137, 119198993, 119875087, 119074089, 116784125, 113245580, 109274286, 105821864, 103180225, 101649796, 101356339, 102326711]
5401A02326711K227601L274189M244493N191623N698814N958424N885199N256940
5393A40063994M395630L051933J398945n31757k126565l443922m680662n815121
5385A32312475o884788p448407p228511o497239n478040m231732k998619j910722
5377H9634417j033421j93261O19424J043292J476967J638379J373091N93804l75197
5368I4777495j325498k513161l539847m652343n463700n802875n784632n400082
5360F0295357m805341m113423l570759l159976k673742k289157k027160j711359
5352C5944440j594419j398354j243324j091028j105160j122613r89244r74921
5344B6425377j045084r67990q95132p79214p07401o80993o32541n33220n03285
$$ y = [102326711, 104554312, 107828501, 112072994, 117264617, 122963431, 128921855, 134807054, 140063994, 144459624, 147511557, 148910502, 148378745, 146252180, 142808258, 138127596, 132312475, 125427687, 117979280, 110750769, 104253530, 98775490, 94543758, 91545139, 89634417, 88600996, 88407735, 89027159, 90070451, 91547418, 93185797, 94558888, 95152692, 94777495, 93451997, 90938836, 87398989, 82746646, 77282946, 71480071, 65695439, 60295357, 55490016, 51376593, 47805834, 44645858, 41972116, 39682959, 37655799, 35944440, 34350021, 32951667, 31708343, 30617315, 29512155, 28389542, 27400298, 26425377, 25380293, 24412303, 23517171, 22737957, 22030556, 21349563, 20717022, 20183802, 19680517]
5335A9680517m12496m65101l91685l78126k86921l27480l15337l32261k67203
5326A6503907j61701k53617k91490j41303j30130j02036l2066j00115n0213J2356
5316A5253592j653Q7758J11594k2596q6140k14401k72991l60459m10402m19155
5306A3665147k46135k86076l28590k01675k54593j29924j84450j06018k3557j7675
5296A1886454j4314P0945Q0858Q3262K1095J14507K15920J02365K85640L97986
5286A3244718M00146N45051O96347P49528Q67420O86354K64863j61118o52437
5277A6640872q20800p85242p12825o22646o13447n30051m89309m77430l50732
5268A1238390j98163j72134q0390m4525J9489P4380J14972K2326J29870J19512
$$ y = [19680517, 19268021, 18802920, 18411235, 18033109, 17746188, 17418708, 17103371, 16771110, 16503907, 16342206, 16088589, 15797099, 15655796, 15525666, 15423630, 15391564, 15291449, 15241236, 15253592, 15251939, 15339697, 15451291, 15428695, 15342555, 15128154, 14855163, 14494704, 14084302, 13665147, 13419012, 13132936, 12804346, 12602671, 12348078, 12218154, 12033704, 11927686, 11904129, 11886454, 11872140, 11943085, 12023943, 12107205, 12128300, 12242807, 12458727, 12561092, 12846732, 13244718, 13644864, 14189915, 14886262, 15635790, 16503210, 17189564, 17454427, 17293309, 16640872, 15820072, 15034830, 14322005, 13699359, 13085912, 12555861, 12066552, 11589122, 11238390, 11040227, 10868093, 10787703, 10743178, 10762667, 10837047, 10952019, 10974345, 11104215, 11223727]
5258A1223727J51709J04291K78590L51576L75579N23568P23632O84350P52044
5249A5169066P77965M65122j14507n95085q63746q58737p93741o45754o22446
5240A1918137n41535m91421l96589l30604k37525k38463j86301o8639q4847r3436
5230I248777p0959l1801k9752n5892k3298J57484J32503K5239M6152J30040L00721
5219I829214K51220K89077K31327J82373J20944q0938k12879j62780j98659j18250
5209A0130649j28758j25918j33521l1505j8559l5265j2181k5595N2289P9737R5010
5198I846383q072n868J2254p9839l0308n4705o0391k9552P4060r635P3328n644
5186I722011J0574Q3112J26259J33720J73569K01628R1379J53989J79957K52933
$$ y = [11223727, 11375436, 11479727, 11758317, 12109893, 12485472, 13009040, 13732672, 14417022, 15169066, 15947031, 16412153, 16297646, 15702561, 14838815, 13980078, 13186337, 12540583, 11918137, 11376602, 10885181, 10488592, 10157988, 9920463, 9682000, 9495699, 9427060, 9342213, 9248777, 9177818, 9146017, 9116265, 9060373, 9037075, 9194559, 9327062, 9352301, 9398453, 9528493, 9829214, 10080434, 10369511, 10600838, 10783211, 10904155, 10823217, 10610338, 10447558, 10248899, 10130649, 10001891, 9875973, 9742452, 9710947, 9692388, 9657123, 9644942, 9619347, 9671636, 9751373, 9846383, 9838311, 9832443, 9844697, 9764858, 9734550, 9679845, 9619454, 9589902, 9663962, 9654327, 9727655, 9722011, 9732585, 9815697, 9941956, 10075676, 10249245, 10450873, 10542252, 10696241, 10876198, 11129131]
5176A1129131K78883K60538K91628L20147L03738K77828K13950K19448K56215
5167A3551506L30758K78132L46758K38432L35293L94453M39431K83442J53819
5158A6352024J19238R0143R5837J76488J14850J56968J64069J71210J28440J94963
5148A7764230K27272L48004L61657N33674N17719O89795O17828O15315N78073
5139B2253567N99417N97494P87225P00473P65206Q43268R69769J008737J118958
5130B9644114J030696J136089J302116J516900J389698J138291Q63915R37829
5122C8959648Q62539R14151R41763J151313J176982J180518J158726J364521J428382
5113D9138543J684717J893371K097227K052368K215560K234338K577926L017962
$$ y = [11129131, 11408014, 11668552, 11960180, 12280327, 12584065, 12861893, 13075843, 13295291, 13551506, 13882264, 14160396, 14507154, 14745586, 15080879, 15475332, 15914763, 16198205, 16352024, 16471262, 16561405, 16657242, 16833730, 16948580, 17105548, 17269617, 17440827, 17569267, 17764230, 17991502, 18339506, 18701163, 19234837, 19752556, 20442351, 21060179, 21675494, 22253567, 22852984, 23450478, 24237703, 24938176, 25703382, 26546650, 27516419, 28525156, 29644114, 30674810, 31810899, 33113015, 34629915, 36019613, 37157904, 38021819, 38959648, 39822187, 40736338, 41678101, 42829414, 44006396, 45186914, 46345640, 47710161, 49138543, 50823260, 52716631, 54813858, 56866226, 59081786, 61316124, 63894050, 66912012]
5105F6912012L624191M322830N072616O434617Q240783R826780J0772870J1910783
5097A27117482J4604961J5015721R211846J122359k773862l36503O092755J1681708
5089A81736467J7336859K4144047L3792415M1836795M4931580N0373912O1183630
5082D55335705N5620880J2310564m3038342p9751676p8986786o0370932m2727990
5075B18391423l1224178k3996589j9005191j5237409j2388575j0248362q730599
5068I7560520p504707o464225n483248m639205m263597m086964l895844l532072
5060E7690658l218570k788105k618184k373198k344406k199656k141393k044415
5052C7962731j872398j422980j255539j014713r97538j037004j153748j139715
$$ y = [66912012, 70536203, 74859033, 79931649, 86366266, 94607049, 104433829, 115206699, 127117482, 141722443, 156738164, 165950010, 167072369, 164298507, 163962004, 170054759, 181736467, 199073326, 223217373, 257009788, 298846583, 343778163, 394152075, 455335705, 510956585, 523267149, 480228807, 400477131, 321490345, 261119413, 218391423, 187167245, 163170656, 144165465, 128928056, 116539481, 106291119, 97560520, 90055813, 83591588, 78108340, 73469135, 69205538, 65118574, 61222730, 57690658, 54472088, 51683983, 49065799, 46692601, 44348195, 42148539, 40007146, 37962731, 36090333, 34667353, 33411814, 32397101, 31399563, 30362559, 29208811, 28069096]
5044B8069096j065436q86365q25891p90561p54423p08520n86270n31528n46331
5035B1373771l57759k54750k01688k07595k21219l44099l09763n16040o33270
5026A8327588p74730n90621n76219m42097l98475l99821l67458k42624k37657
5017A4297886k30976k68001k53909l43867k34010l06014l28304k69188k25535
5008A1838082k17448j48756k37990k54963j73179j14517o5254k09341j40608k4901
4998A0251125j09127j55408q9438n1765r5091j97481k33962j67064j71423j24651
4988H855715j50988q6547j18762j02287j57158j30373j81974m9432m8740o0347
4978G769107n3567k8698r6686j08020q6143r365o4639n8108p9274m0437o9630
$$ y = [28069096, 27003660, 26117295, 25291404, 24500843, 23746420, 23037900, 22451630, 21920102, 21373771, 21016012, 20761262, 20559574, 20351979, 20130760, 19786661, 19476898, 18960858, 18327588, 17552858, 16962237, 16386018, 15943921, 15545446, 15145625, 14778167, 14535543, 14297886, 14066910, 13798909, 13545000, 13201133, 12967123, 12661109, 12332805, 12063617, 11838082, 11620634, 11471878, 11233888, 10978925, 10805746, 10691229, 10625975, 10416634, 10276026, 10251125, 10141998, 9986590, 9897152, 9845387, 9750296, 9552815, 9318853, 9151789, 8980366, 8855715, 8704727, 8618180, 8499418, 8397131, 8239973, 8109600, 7927626, 7878194, 7829454, 7769107, 7715540, 7686842, 7590156, 7482136, 7395993, 7386628, 7321989, 7263881, 7184607, 7144170, 7074540]
4967G074540j54137j78161j91404j87319j60025r1808r6639o4394l1116q6130
4957E833407j5717o9466o9903j29867j7335l6360m8078l3641K7020J807J9865
4946E461732K8704j15629Q427K91j1180L8305j1067q1565j31652p4204j9143l7565
4934E055454l932q0515m5911J328M819o3629j8501n6857q0715j01655j8298q0590
4922D510998m9052j6403J516k680l6546k1582J4367K1508n4370l9989R003j6413
4910D320357j4639m673k1534q6957L2425l8526k1385J1590Q5022N7306P7958J15074
4898D512018J13183O1319O9230Q4495M2873j0830o052N1485L6173P5461Q5816
4887E115171j3620O4213O9328J35252J45018J35276J49362J69111J28271K15530
$$ y = [7074540, 6920403, 6742242, 6550838, 6363519, 6203494, 6111686, 6015047, 5950653, 5919537, 5833407, 5817690, 5748224, 5678321, 5548454, 5531119, 5494759, 5446681, 5413040, 5440060, 5441867, 5461732, 5490436, 5374807, 5383234, 5383525, 5372345, 5410650, 5399583, 5318018, 5186366, 5112162, 5093019, 5055454, 5051522, 4971007, 4925096, 4926424, 4931243, 4867614, 4849113, 4792256, 4711541, 4609886, 4591588, 4510998, 4461946, 4445543, 4447059, 4444379, 4407833, 4386251, 4400618, 4422126, 4367756, 4327767, 4336770, 4320357, 4305718, 4301045, 4279511, 4192554, 4224979, 4186453, 4165068, 4176658, 4261680, 4318986, 4396944, 4512018, 4625201, 4686520, 4755750, 4840245, 4883118, 4872288, 4866236, 4917721, 4953894, 5029355, 5115171, 5101551, 5165764, 5235092, 5370344, 5515362, 5650638, 5800000, 5969111, 6097382, 6312912]
4877F312912K61048K69398L80937L66379L79677N85038O27491N71533O62734Q69378
4867A1286525J283315J712482J724423K000429K487109K665205J329749o33495
4859B3855742k202434k413521k108513k175904k060798j841964j365623j043973
4851H643012p82057p28983m96522m28922m11578l30864k83189k39246k13155j69386
4841D559110j43852k24121k18520j05027j30493j50564r5748n3971j62253j24772
4831C149789m123J6906j9077n2922m6218p0233m1840J5359p347m8404o3539j46933
4819B681418l3622n4061o1945n7965j51349m5328J7678o0626m3867m9586k302
4808B138445N623l8891J379j7716P770N3014l3699o4769l6944J1805k5139p206
$$ y = [6312912, 6573960, 6843358, 7224295, 7590674, 7970351, 8555389, 9182880, 9754413, 10417147, 11286525, 12569840, 14282322, 16006745, 18007174, 20494283, 23159488, 24489237, 23855742, 21653308, 19239787, 17131274, 14955370, 12894572, 11052608, 9686985, 8643012, 7860955, 7131972, 6635450, 6206528, 5794950, 5464086, 5180897, 4941651, 4728496, 4559110, 4415258, 4191137, 3972617, 3867590, 3737097, 3586533, 3490785, 3436814, 3274561, 3149789, 3145666, 3162572, 3143495, 3090573, 3044355, 2974122, 2932282, 2947641, 2940294, 2891890, 2828351, 2681418, 2647796, 2593735, 2531790, 2473825, 2322476, 2277148, 2294826, 2234200, 2190333, 2140747, 2138445, 2144068, 2105177, 2106556, 2088840, 2096610, 2149624, 2115925, 2051156, 2014212, 2026017, 2000878, 1993672]
4796A993672n3711K0674K0327m374J9317m9927K5686N3211l2000k0399M8156k0369
4784B000263j8126J6920n7300R4983J21837P5513O4568N4554J1727p4062j2389
4773B278488O4288K5810J51164J92442J79297K10331K49216K84651K80038J37677
4763D053402j14978m57426m89647l74222k47619j96203q8633j41699j02793j17265
4753A722917q4620n2972j3529m0753K366n2184m0240r462l0295J8026L822p7016
4741A346060l7561j1343o0060J6846n8609m0810j7423J9357o4946j4509m59L0351
4729A106894k9093K4320m3020o519m2748J1486l6466o4159p911Q1792l117l1989
4717I59470K7874q1830l1051m134j1255M2912o138n4964j7430P5983M4701k6239
$$ y = [1993672, 1939961, 1960635, 1980962, 1976588, 1995905, 1945978, 1971664, 2024875, 1992875, 1972476, 2020632, 2000263, 1982137, 1999057, 1941757, 2036740, 2158577, 2234090, 2298658, 2353212, 2364939, 2290877, 2278488, 2342776, 2368586, 2519750, 2712192, 2891489, 3101820, 3351036, 3635687, 3915725, 4053402, 3938424, 3480998, 2991351, 2617129, 2369510, 2173307, 2084674, 1942975, 1840182, 1722917, 1638297, 1585325, 1571796, 1531043, 1533409, 1481225, 1440985, 1431523, 1401228, 1419254, 1423076, 1346060, 1308499, 1297156, 1237096, 1253942, 1195333, 1154523, 1137100, 1156457, 1091511, 1077002, 1076543, 1106894, 1077801, 1102121, 1059101, 1052582, 1009834, 1021320, 984854, 920695, 912784, 994576, 991459, 959470, 987344, 905514, 874463, 870329, 859074, 901986, 895848, 840884, 823454, 899437, 944138, 917899]
4705I17899J4316p3069J374J8826J0510n4652L3784J3799K3415M2201p367l4646
4693I06390o8515K4964m3557M6494K4549k9678k0417J5810L7566o7604q2169N4650
4681G98483M1959k1147K0098M3422o9842n254J654k4572l5429o3014N0862o3537
4669F73683L3784L0696n7203K8117l2212L358M2443m6509M6468N6143m4326j8161
4657G16281m4255K7893j4617L2909l1561l1491m6113n4804P6290K0175l1347L0442
4645F49802K4023n7425J6736k701k2773N0237J280m6699n2997P2033P3435K9269
4633G34220p2723k4031r4775n7891N0584K2201m500Q0447K8139J020m669p808
4621F50214L8513j7628j9240l3659j1649j3798m262n070Q5982m8353o1386O7628
$$ y = [917899, 932215, 859146, 860520, 879346, 889856, 835204, 868988, 882787, 906202, 948403, 941036, 906390, 837875, 862839, 819282, 865776, 890325, 860647, 840230, 856040, 893606, 826002, 743833, 798483, 840442, 819295, 839393, 882815, 812973, 807719, 809373, 784801, 749372, 686358, 737220, 673683, 707467, 738163, 680960, 709077, 676865, 680223, 722666, 676157, 722625, 778768, 734442, 716281, 672026, 699919, 685302, 718211, 686650, 655159, 609046, 554242, 630532, 650707, 619360, 649802, 673825, 616400, 633136, 630435, 607662, 657899, 659179, 612480, 559483, 631516, 704951, 734220, 661497, 637466, 542691, 484800, 535384, 557585, 553085, 633532, 661671, 662691, 658022, 650214, 688727, 671099, 651859, 618200, 606551, 592753, 588491, 583421, 669403, 621050, 559664, 627292]
4609F27292R514k4529P902o1458l044l553m1468j8809P5693J905P427q1243L3220
4596E28849J1847R570q146Q54K9093J9818K1988l7600P6929m703n015m1364k3752
4583E78368j886k3491K8927l7653K3751L4934k2896q4939O1887L1496N302J4882
4571F08682p3769j8023O1279k8057j7779J6038L1802O911m1791k3307k1577j5497
4559D84912m2727L6491L4886j4075J8397M3473O77l5188L2655L4070q834J9300
4547F04037L1913J93q7947n064M0833j3018l8670m3039K3614o9516N761P4678
4535E23775K4544M7355n1782j5958P110L2805k8328L1641J095p1317m6295J3607
4523D68252j4300P194O284l8396M3856l564K3338O6938l7950j6063p8584k0548
$$ y = [627292, 636806, 612277, 620179, 558721, 555677, 552124, 510656, 491847, 567540, 569445, 576872, 495629, 528849, 540696, 550266, 542120, 542974, 572067, 591885, 613873, 576273, 653202, 648499, 643484, 602120, 578368, 576482, 552991, 581918, 544265, 568016, 602950, 580054, 495115, 557002, 588498, 593800, 608682, 534913, 516890, 578169, 550112, 532333, 548371, 580173, 587084, 545293, 521986, 500409, 484912, 442185, 478676, 513562, 499487, 517884, 561357, 562034, 526846, 559501, 593571, 584737, 604037, 635950, 636143, 548196, 543132, 583965, 570947, 532277, 489238, 512852, 443336, 449097, 523775, 548319, 595674, 543892, 527934, 535044, 567849, 539521, 571162, 572257, 500940, 454645, 468252, 453952, 461146, 467430, 429034, 472890, 469326, 492664, 559602, 521652, 505589, 427005, 406457]
4511D06457n4112Q4008J7524K3490j9292J0354R520j6843q1K8748q1135o9023
4499C39615K4338M0869M7397j2093K2367j9400k2583L0345l8477k6882o854L1316
4487D09958P3665m1427m2779K9630K2823r0150l0673K8124N9024L217m7044k3595
4475C50773L1156O358m7181m8258O1561l409j4243J8893J27347k6185n0331J3378
4463D19859l541L955L1594O1495k5537o2730N3389j0995k5416J5088K973r581
4451D50553m1358K78o5639k9326Q6940J4623o0587p8022j4763Q382J07463K6224
4439D04768j0877o4464J2906L4705L8038l6014O3723K7869k3260q1899k6177l2627
4427C06691J7821L6493k5508J0123j0334M9172k7653K288L1513j5541n484Q8755
$$ y = [406457, 352345, 436353, 453877, 477367, 458075, 468429, 477949, 461106, 461025, 489773, 408638, 339615, 363953, 404822, 452219, 440126, 462493, 443093, 420510, 450855, 412378, 385496, 378642, 409958, 483623, 442196, 399417, 429047, 451870, 361720, 331047, 359171, 418195, 421412, 374368, 350773, 381929, 388287, 341106, 292848, 354409, 351000, 336757, 355650, 482997, 456812, 406481, 419859, 416318, 420273, 451867, 513362, 487825, 425095, 478484, 467489, 442073, 457161, 460134, 450553, 409195, 409473, 343834, 314508, 401448, 416071, 355484, 277462, 262699, 271081, 378544, 404768, 393891, 329427, 342333, 377038, 415076, 379062, 442785, 470654, 447394, 365495, 339318, 306691, 324512, 361005, 335497, 345620, 335286, 384458, 356805, 359093, 390606, 375065, 369581, 458336]
4415D58336P644j5314o6005J19328k0045j49124n347K2911N9817k1498n7369R4422
4403D27756K480J169j6857o6004o8q397Q8779J0161j08365K9792M0257M2108j9441
4390D23370o485o1562K364J8503l2421K2628m7945O170L759N4303M0670r454O787
4377D20687M1167r497p8527k3685N6660P5948o0060n1535m0457J534M9119J6093
4365C97447m132K6219m3423n210J2800l8418l3274O3041N820n2492m421R944j0800
4352C23101k7027q551L3208J6629k916j8965K8952N7152N674m3007O1693N812
4340D31755p3001L0634M1581j8118j6727n177l0177n7644J3628J02952l7500n7181
4328C25025M8953P484p8741K1988M4839j924L3601k251M264N1321J3462l8075
$$ y = [458336, 465980, 450666, 384661, 503989, 483944, 334820, 329473, 352384, 412201, 390703, 333334, 427756, 430236, 431405, 414548, 348544, 348476, 340079, 428858, 439019, 330654, 360446, 400703, 442811, 423370, 416885, 355323, 357687, 376190, 343769, 366397, 318452, 324622, 328381, 382684, 423354, 413900, 420687, 461854, 452357, 373830, 350145, 406805, 482753, 422693, 371158, 330701, 332235, 381354, 397447, 393315, 419534, 376111, 370901, 383701, 345283, 312009, 375050, 380870, 328378, 323957, 333901, 323101, 296074, 287523, 320731, 337360, 334444, 315479, 344431, 401583, 407257, 364250, 425943, 431755, 358754, 389388, 430969, 412851, 396124, 390947, 360770, 303126, 316754, 419706, 382206, 325025, 373978, 381462, 302721, 324709, 369548, 367624, 401225, 398974, 403238, 454559, 468021, 429946]
4316D29946K654k5837Q429O509N0054k3848l1644N8185p4985p530K8236K3933
4304D44102N9679l7844p3016Q762j9210l0808O7810M0757k4465R265J1518O3723
4292E20273n558q2770Q853K2954k8833J7683p848k2197j4386q945P5738m1114
4280D33850N698j5736j4986k1160m6614J2663R4135n1465j3470O7337n0889m118
4268C95245l1798K4866k708Q4572m6722j6926k0674K6167K5955N9191m1375r748
4256D46045k3602N2607n725o0106o3175K1431j9958P865L6129o7713N1806N1998
4244D27602n4127k2047K635l3641j5252O5371M5545k1088J6529k457m2470m7787
4232C18813J2511N6549k3970M0582K4907P491j5019k8656l5759k4769n172P172
$$ y = [429946, 432600, 406763, 415192, 421701, 471755, 447907, 416263, 474448, 399463, 391933, 420169, 444102, 503781, 465937, 392921, 401683, 382473, 351665, 419475, 460232, 435767, 445032, 456550, 520273, 514715, 431945, 440798, 463752, 434919, 452602, 444754, 422557, 408171, 399226, 474964, 433850, 439548, 423812, 408826, 387666, 341052, 353715, 447850, 396385, 382915, 450252, 399363, 395245, 363447, 388313, 385605, 470177, 423455, 406529, 385855, 412022, 437977, 497168, 455793, 446045, 422443, 475050, 469325, 409219, 346044, 367475, 347517, 355382, 391511, 323798, 375604, 427602, 373475, 351428, 354063, 320422, 305170, 370541, 416086, 394998, 411527, 409070, 366600, 318813, 331324, 387873, 363903, 404485, 429392, 436883, 421864, 393208, 357449, 332680, 327508, 334680]
4220C34680K3576k4619J9848L9820J3264l8912q130o9070K5636L0353L4282J7239
4208C97967j6844l4513N0957P2387l489j09198m4039J3335N6291n284l4617P356
4196C50309R793J711l1338L723O6003Q597k4872N3565O4759J984J1249q496K713
4183E09700N6076J13271l455l8926m566l1891o3190m3796k9439k096P500K9037
4171D98225n2442l1088L4848j6090k3967p879o7344M2214Q1667m0816n6477P6777
4159D37628n2148o9357k3208O5223n2820K092N7703R3905N0434j08185m5992o262
4147C49013m014n659J6416J733l4167J4539m5102l6793O0659J1276K4553n9880
4135B92574m632M0553K6860o2193J1571K1700P4056K2978m0200k2199O3185l994
$$ y = [334680, 358256, 333637, 353485, 393305, 406569, 367657, 359527, 290457, 316093, 346446, 380728, 397967, 381123, 346610, 397567, 469954, 466465, 357267, 313228, 326563, 382854, 377570, 342953, 350309, 360102, 361813, 330475, 334198, 400201, 408798, 383926, 437491, 502250, 504234, 515483, 506987, 509700, 565776, 679047, 675592, 636666, 632100, 600209, 537019, 493223, 463784, 461688, 469188, 498225, 445783, 414695, 449543, 433453, 409486, 401607, 334263, 376477, 458144, 417328, 360851, 437628, 385480, 316123, 292915, 358138, 305318, 307410, 365113, 459018, 509452, 401267, 355275, 349013, 344999, 339340, 355756, 357489, 323322, 337861, 292759, 255966, 316625, 327901, 352454, 292574, 287942, 328495, 355355, 293162, 304733, 326433, 400489, 423467, 383267, 361068, 424253, 420259]
4123D20259J5138l2456m804J7488k1844J3709k6825m8402L4564M7310P16K1794
4111D36647l8908m0122j7408p789J21100q5493m7785Q0791N2867l1227m3017j2301
4099C67355K4651q319j6746K8458O0700O3007j06097M3218L2990l7745k284L2423
4087D81611J4741j5323J4417n6117p5676J7356M3363Q697K053j1478K6674Q70
4075D51188j0150l775K9864J7597k8767L0764j045L9631k9169k5978N4598j9492
4063E05266q529M5503J0790L1177k1724J6364L03L5297K9759n407O3225L3260
4051G35284N829J6103l4602k7270O480M0657o2950m5687O7394l6911L5937K6483
4039G26747M6837o088K9276J1561j9850m2524L7230M9789N8322M487J7021K1681
$$ y = [420259, 435397, 402941, 398137, 415625, 393781, 407490, 380665, 332263, 366827, 414137, 414853, 436647, 397739, 357617, 340209, 332420, 453520, 368027, 320242, 401033, 453900, 422673, 379656, 367355, 392006, 383687, 366941, 395399, 456099, 519106, 413009, 456227, 489217, 451472, 449188, 481611, 496352, 481029, 495446, 439329, 363653, 381009, 424372, 433069, 435122, 423644, 450318, 451188, 441038, 437263, 467127, 484724, 455957, 486721, 485676, 525307, 496138, 470160, 524758, 505266, 496737, 542240, 553030, 584207, 562483, 578847, 579150, 614447, 644206, 638799, 702024, 735284, 741113, 757216, 722614, 695344, 701824, 742481, 679531, 633844, 701238, 664327, 700264, 726747, 773584, 767496, 796772, 808333, 788483, 745959, 783189, 832978, 891300, 895787, 912808, 934489]
4027I34489J4152M8323m9367N8640Q9033M1074O1028K1346K617Q7662M4522N3043
4015A406562J6205K227l2465n4061M1254P0834J23546l813L102O1061Q4690P1988
4003A791130m3481j5689q673Q9310k5624L7260N8601O4986O9343J15411R4695
3992B227269R6357K06376J90573J93856K11918K96758L26552L48145L30854M32271
3982D860929N61076P02166R77714J223468J442668J800908K101792J649274K90863
3973A5610858j356229k005315j845504j468348j128207r39896p98616o93590m46437
3964D928716m21678l49714k91650k73703j97920q4375k05824k04453j49701j81590
3954B568108j80440r6097j25671r7583q6535j04638k4819p8618o2908p8412n0208
$$ y = [934489, 948641, 996964, 947597, 1006237, 1095270, 1136344, 1197372, 1218718, 1221335, 1308997, 1353519, 1406562, 1422767, 1424994, 1392529, 1338468, 1379722, 1450556, 1574102, 1570289, 1573391, 1634452, 1719142, 1791130, 1747649, 1731960, 1723287, 1812597, 1786973, 1824233, 1882834, 1947820, 2017163, 2132574, 2227269, 2323626, 2530002, 2720575, 2914431, 3126349, 3423107, 3749659, 4097804, 4428658, 4860929, 5422005, 6124171, 7101885, 8325353, 9768021, 11568929, 13670721, 15319995, 15610858, 14254629, 12249314, 10403810, 8935462, 7807255, 6867359, 6068743, 5375153, 4928716, 4507038, 4157324, 3865674, 3591971, 3394051, 3309676, 3103852, 2899399, 2749698, 2568108, 2387668, 2291571, 2165900, 2068317, 1981782, 1877144, 1852325, 1773707, 1710799, 1632387, 1582179]
3943A582179m7816m6245q8435j9553k396j3115p212j08913j5598M125L5885R368
3931A282274p4708o2897L791j7906j6992n9879m531m1035j6272J9016o8860L59
3919I42360L3907J6781o775K8875k1652k9260p7311o6596j6473K2768M0831K6054
3907H93509j2752o3995L486r545L5282L6193j1707O4149L7700n1406r1268k5803
3895H03843n4887j3630J7075M4406k7475l7573j718q869j5774P5412j9670m081
3883G57059M8002n465j8207k5509l2281J6339N4716L6974k5494m4967l2582L7666
3871G66251K9663k8402J1453o5334l6971L9734j7711o042M1939j4990L71M03J5580
3858G35944P335k0743N4927P191N0534K0118o901O270q2400n2504J7863M5742
$$ y = [1582179, 1534363, 1488118, 1399683, 1380130, 1377734, 1364619, 1357407, 1248494, 1232896, 1237021, 1272906, 1282274, 1207566, 1144669, 1148460, 1130554, 1113562, 1053683, 1049152, 1008117, 991845, 1010861, 942001, 942360, 976267, 993048, 986273, 1015148, 993496, 964236, 886925, 820329, 803856, 826624, 867455, 893509, 880757, 816762, 820248, 810703, 845985, 882178, 870471, 934620, 972320, 920914, 829646, 803843, 748956, 735326, 752401, 796807, 769332, 731759, 730041, 721172, 705398, 780810, 761140, 757059, 805061, 799596, 781389, 755880, 723599, 739938, 794654, 831628, 806134, 761167, 728585, 766251, 795914, 767512, 778965, 713631, 676660, 716394, 698683, 692641, 734580, 719590, 719961, 720364, 735944, 743279, 722536, 777463, 784654, 835188, 855306, 848405, 854675, 772275, 719771, 737634, 783376]
3846G83376r357K6320J9714l6713K194p1351q816K9258j9538N5962K8222J2727
3834H11998J2104k8553m081k3176m3816K9295P1690k7854m350N520J9031N8343
3822H76151m7697J5857L7169m5369r531L9629M6232J4586m4979K2704o6601J9177
3810H57328M0603K5361m0841J2598l7973j9725j0722L2651P085j0997M5938n8974
3798H42332j6548N8795M3081M7017O4345L3281M4035k4219l3560J1595N5376k9199
3786A096331L1944P8433N2240p2948k4938R2095k0445k3694o0501l0197l1041
3775A087279j2005M163N6554O266j1391M0940J10001j7725j5127l3012j1120Q7341
3763A292164R9737L7187k445m2214N4015J8569k7850L353O95l1161R2734M7677
$$ y = [783376, 774019, 800339, 820053, 783340, 785534, 714183, 705367, 734625, 715087, 771049, 799271, 811998, 824102, 795549, 791468, 768292, 724476, 753771, 825461, 797607, 793257, 798777, 817808, 876151, 828454, 844311, 881480, 836111, 826580, 866209, 912441, 927027, 882048, 904752, 838151, 857328, 897931, 923292, 882451, 895049, 857076, 837351, 826629, 859280, 866365, 855368, 901306, 842332, 825784, 884579, 927660, 974677, 1039022, 1072303, 1116338, 1092119, 1058559, 1070154, 1125530, 1096331, 1128275, 1206708, 1258948, 1186000, 1161062, 1253157, 1232712, 1209018, 1148517, 1118320, 1087279, 1075274, 1079437, 1135991, 1142257, 1130866, 1171806, 1281807, 1264082, 1248955, 1215943, 1204823, 1292164, 1391901, 1429088, 1426643, 1384429, 1438444, 1457013, 1429163, 1432516, 1433211, 1402050, 1494784, 1542461]
3751A542461l8039R2048k3588N023j7342l28j081J662q379L6018m7743o8910N937
3738A477739J8831L4898k2112o6116J5560P7496O2610k0592Q008Q7549K2084p3026
3726A622929K7180K3008L8460J0679N2623O34m0309k2287n879r082n4916k9777
3714A613263k3634M2815L7900m5357m0117l6639m9600o336K8673K8174K5272l6578
3702A537836j3737j0073J8648j2347J5742K7869r755J5077Q638n7394k0596K9403
3690A529311K2862J205J1862l1499K7946M96L1291j9219j00214J5300L0492k8242
3678A491591j742q48j5085o3152o7312Q259Q483R7450o2411m7241r259K0818K6261
3665A385812j2233l2133m9497K0209M4631Q37L9447N4605l6154m1514k0307K5580
$$ y = [1542461, 1504422, 1596470, 1572882, 1577905, 1560563, 1560235, 1559154, 1560816, 1552437, 1588455, 1540712, 1471802, 1477739, 1496570, 1531468, 1509356, 1443240, 1458800, 1536296, 1598906, 1578314, 1586322, 1673871, 1695955, 1622929, 1650109, 1673117, 1711577, 1722256, 1774879, 1775513, 1735204, 1712917, 1707038, 1697956, 1643040, 1613263, 1589629, 1632444, 1670344, 1624987, 1584870, 1548231, 1498631, 1492295, 1520968, 1549142, 1574414, 1537836, 1524099, 1514026, 1532674, 1520327, 1536069, 1563938, 1554183, 1569260, 1577898, 1520504, 1499908, 1529311, 1552173, 1553378, 1565240, 1533741, 1561687, 1562183, 1593474, 1574255, 1474041, 1489341, 1519833, 1491591, 1489849, 1489001, 1473916, 1410764, 1343452, 1351711, 1360194, 1457644, 1395233, 1347992, 1338733, 1359551, 1385812, 1373579, 1341446, 1291949, 1312158, 1356789, 1357626, 1397073, 1451678, 1415524, 1374010, 1353703, 1379283]
3653A379283n085M8623k4132m1741r7310L4995Q7395J0724l5007l283P777l2797
3641A329442Q1560O177m3303L675K6426M6372n1864j0204J6622n3078P06L2328
3629A384859J0856n5657L1973l4740N0333M4570M9201M0509J37912M7936q714
3618A699038K7033M7140P3962J3499M5492P1814p8758o5017M6807M2348K889j9514
3606A906733j09846q3853K2373q926l7060l9646M063n8824J2946R1694n583R5950
3594A790021j7015o2417j32N1862P8789o4162J21720J47846O4923J29667Q8689
3583B329791K47110N5753q9675j71052j15202j08896n5033m1385j28964J2734
3573A935181R215p309l9798p365J2047M4046j4603P4074k1501j7571J3886P6776
$$ y = [1379283, 1374198, 1422821, 1398689, 1356948, 1259638, 1294633, 1382028, 1392752, 1357745, 1354462, 1362239, 1329442, 1411002, 1417179, 1373876, 1377551, 1403977, 1450349, 1398485, 1388281, 1404903, 1351825, 1352531, 1384859, 1395715, 1340058, 1372031, 1337291, 1387624, 1432194, 1481395, 1521904, 1659816, 1707752, 1699038, 1726071, 1773211, 1847173, 1860672, 1906164, 1977978, 1899220, 1834203, 1881010, 1923358, 1926247, 1906733, 1796887, 1713034, 1735407, 1726481, 1689421, 1649775, 1653838, 1595014, 1607960, 1699654, 1694071, 1790021, 1773006, 1710589, 1710457, 1762319, 1841108, 1776946, 1898666, 2046512, 2111435, 2241102, 2329791, 2576901, 2632654, 2542979, 2371927, 2256725, 2147829, 2092796, 2051411, 1922447, 1935181, 1944396, 1937087, 1897289, 1889924, 1901971, 1946017, 1931414, 2005488, 1983987, 1966416, 1980302, 2057078]
3561B057078k4297P192J479m558J7140m3610K6104P309R3848Q5981R796R2655
3549B326117m151j04550j06881k6568m919Q161K7655R561j1514l6519O5536O7051
3537B208979J03778k5100M9324J07355O204K8575j882L9069j2775J3255j7003
3526B499779n5740l1550m0279J2046o7094k5365L3499j4119m1209j4275r438N2836
3514B299091K6108p302M961m4653P0680J27884O3598N0832M1763k8195P5044P2038
3502B751849K0883O7786J03668L1803n1025N4835p5775k0450K2886P8040J2071
3491B996571r216O8811l5709l5296L5289P173l3995r6871N2113Q2670J2767J04458
3479C148765N3814J9914M7694P6696j8655k9203J42358R7678Q6835J28869N2805
$$ y = [2057078, 2032781, 2039973, 2041452, 2036894, 2054034, 2010424, 2036528, 2043837, 2137685, 2223666, 2233462, 2326117, 2321966, 2217416, 2110535, 2083967, 2079048, 2087209, 2114864, 2124425, 2112911, 2076392, 2141928, 2208979, 2312757, 2287657, 2336981, 2444336, 2450540, 2479115, 2477233, 2516302, 2503527, 2516782, 2499779, 2444039, 2412489, 2372210, 2384256, 2317162, 2291797, 2325296, 2311177, 2269968, 2255693, 2246255, 2299091, 2325199, 2317897, 2322858, 2278205, 2348885, 2476769, 2540367, 2591199, 2632962, 2604767, 2679811, 2751849, 2772732, 2840518, 2944186, 2975989, 2924964, 2979799, 2904024, 2883574, 2906460, 2984500, 2996571, 2987355, 3056166, 3020457, 2985161, 3020450, 3027623, 2993628, 2896757, 2948870, 3031540, 3044307, 3148765, 3202579, 3222493, 3270187, 3346883, 3328228, 3299025, 3441383, 3539061, 3625896, 3754765, 3807570]
3468C807570R1054J22088K14247J18052L2232J07011J50536J57618P7809l0721
3458D847496L2695P801j4756K3720K7117K9280N4105N8424Q5520R0700K12857
3447E454959K08210N4264M6603K77096J85249K25076K55021K53217K95739L30763
3437G586197L74487L57545M26148N40419N12033N92978O67984P34628Q24416P78285
3427A3395120P34136Q23012Q66651N42815r4723n10218p99338o85898o59741o82516
3417A2929300p22068p41247o14542l92736k84541k06283j42819r161O6865P3843
3407I956611J29200K25171L05886K29959M31165M95252O22603O64879Q91529J078574
3397A5030829J297338J478497J549162J731418J972459J594694N89380n77185
$$ y = [3807570, 3898624, 4020712, 4234959, 4353011, 4385243, 4492254, 4642790, 4800408, 4878217, 4847496, 4880191, 4887992, 4873236, 4896956, 4924073, 4953353, 5007458, 5065882, 5151402, 5242102, 5454959, 5663169, 5717433, 5764036, 6041132, 6226381, 6451457, 6706478, 6959695, 7255434, 7586197, 7960684, 8318229, 8744377, 9284796, 9796829, 10389807, 11057791, 11792419, 12616835, 13395120, 14129256, 14952268, 15818919, 16361734, 16267011, 15756793, 14957455, 14271557, 13611816, 12929300, 12207232, 11465985, 10851443, 10458707, 10174166, 9967883, 9825064, 9815903, 9882768, 9956611, 10085811, 10310982, 10616868, 10846827, 11277992, 11773244, 12395847, 13060726, 13952255, 15030829, 16328167, 17806664, 19355826, 21087244, 23059703, 24654397, 25243777, 24666592]
3389B4666592j457987j652329j297463j250012j199026j114864q04413n94836
3381A5295662l79380j35862j7713J29426L34284N24275P17483J023653J394307
3372A8886135J635325J810119K036453K544714K251747Q01502r73067j713562
3364B7279366j259293n11669K64783Q73716J079694J263841R17058O03693R30142
3355C1441331J240641K88887j622011l117351l260763k400852j541356q69198
3347B0159328l92461J00769N48824R09967J095563J469762J790360J252808k82215
3338B6652705j849427k540567j958531j102775n05993r5276K30497N50841P60215
3329B0141689J058573J487091J420359R1779j796596l072808k984869k176664
$$ y = [24666592, 23208605, 21556276, 20258813, 19008801, 17809775, 16694911, 15890498, 15295662, 14916282, 14780420, 14762707, 14892133, 15226417, 15750692, 16468175, 17491828, 18886135, 20521460, 22331579, 24368032, 26912746, 29164493, 29965995, 28992928, 27279366, 26020073, 25508404, 25773187, 26646903, 27726597, 28990438, 29907496, 30511189, 31441331, 32681972, 32970859, 31348848, 28231497, 24970734, 22569882, 21028526, 20159328, 19766867, 19867636, 20416460, 21326427, 22421990, 23891752, 25682112, 26934920, 26652705, 24803278, 22262711, 20304180, 19201405, 18695412, 18600136, 18830633, 19381474, 20141689, 21200262, 22687353, 24107712, 24199491, 22402895, 19330087, 16345218, 14168554]
3321A4168554j611942j226865j060627q07436o13695n76059n00287m59411l90224
3312F922008k93606l53995k94087k35327k48791j96829j76552j73493o5038j85642
3302D698648j04198j87253j33215j94838q2277j57604q6643j02017l3358K4376
3292C641621j57005n5418q0278j57028k2810j4737j62928o9242o0688j68o469
3281B854850m4754j05520n5232K6484m8331r7245l8174m193k4227k2533o4628
3270B376497p319l2214K1902q5468j03074k8043l635j580o9687l0538j1855q143
3258B016843o8312J9779l0395n5898m5505M2797n3112m3009L900J1165R98j9882
3246A779369o5689q02J2262L4045l7809o8954K4745j5455k628N2563J4977p2183
$$ y = [14168554, 12556612, 11329747, 10269120, 9461684, 8847989, 8271930, 7771643, 7312232, 6922008, 6628402, 6274407, 5980320, 5744993, 5496202, 5299373, 5122821, 4949328, 4884290, 4698648, 4594450, 4407197, 4273982, 4079144, 3996867, 3839263, 3752620, 3650603, 3617245, 3641621, 3484616, 3429198, 3348920, 3191892, 3169082, 3154345, 2991417, 2922175, 2861487, 2861319, 2854850, 2810096, 2704576, 2649344, 2675828, 2627497, 2530252, 2492078, 2487885, 2463658, 2441125, 2376497, 2369178, 2336964, 2358866, 2273398, 2170324, 2142281, 2138646, 2137066, 2067379, 2036841, 2024986, 2016843, 1948531, 1968310, 1937915, 1882017, 1836512, 1879309, 1826197, 1783188, 1787088, 1798253, 1799251, 1779369, 1713680, 1712878, 1725140, 1759185, 1721376, 1652422, 1677167, 1661712, 1659084, 1711647, 1726624, 1654441]
3234A654441O891q2047o8118l1761J19562k365k0960o1825m0587L7363o773k1901
3222A481920o1200J7517M940O5501k5132n0742k0135P5466L588l2512Q825K7148
3210A495184L3684O914k7150k717K7952K0645K3004k6870j30297M918P4103K1406
3198A520776J8439R8185J04648j6041j6893J02296K7742N6763N4938K9047K9833
3187B009733L1206O7032K4295M9297J98105J88060J34564J28493J31163R2966
3177C054914K1740K2263j24363o9392o8075q4209o9789K3345K7666L5922j01284
3166B668738m7450m8343j09123p884j3564k6537l7180K2767M3536O3655Q3198
3155B591813L3697O0371J29750L2071J10787K05868K25229K13341K38277K10215
$$ y = [1654441, 1661332, 1579285, 1511167, 1479406, 1598968, 1596603, 1575643, 1513818, 1473231, 1510594, 1503821, 1481920, 1420720, 1438237, 1443177, 1508678, 1483546, 1432804, 1412669, 1488135, 1491723, 1459211, 1468036, 1495184, 1528868, 1535782, 1508632, 1505915, 1533867, 1554512, 1577516, 1550646, 1420349, 1425267, 1499370, 1520776, 1539215, 1637400, 1742048, 1726007, 1709114, 1811410, 1839152, 1895915, 1950853, 1979900, 2009733, 2040939, 2107971, 2132266, 2181563, 2379668, 2567728, 2702292, 2830785, 2961948, 3054914, 3076654, 3098917, 2974554, 2905162, 2837087, 2752878, 2683089, 2706434, 2734100, 2770022, 2668738, 2621288, 2572945, 2463822, 2455938, 2442374, 2415837, 2378657, 2401424, 2444960, 2508615, 2591813, 2625510, 2685881, 2815631, 2847702, 2958489, 3164357, 3389586, 3602927, 3841204, 4051419]
3145D051419J35788N4503q0205j50193k00781j90636j08526k6422l6307L4304
3135C482944r529j57317j41696j78732j40832j68910j56883p3702n8633j6852
3125B379858m660q8203j658N2105M8382M9219O2406J2846K8885M1720J28236O7274
3113B776410n087M0059m8722o2863l5612l5337n0335n6216j191L9822m679J5459
3101B571708j5104m7068m9317l7508j21306l9461M9829l1339L1440L7944L5907
3090B385725n5322j07743l8798J3311m7023n3568L5904j04567k1807k8894m9358
3079A927860k9831N857m6885k8534j3564L691k4151M8707Q5743j5309o7495K5599
3067A871688Q9823O9402m1862r4149M4247L9278j6372n0391k4743l246j0526j2183
$$ y = [4051419, 4187207, 4241710, 4161505, 4011312, 3810531, 3619895, 3511369, 3484947, 3448640, 3482944, 3473415, 3316098, 3174402, 2995670, 2854838, 2685928, 2529045, 2455343, 2396710, 2379858, 2375198, 2286995, 2285337, 2337442, 2385824, 2435043, 2497449, 2510295, 2539180, 2580900, 2709136, 2776410, 2771323, 2811382, 2762660, 2699797, 2664185, 2628848, 2578513, 2522297, 2521106, 2560928, 2556249, 2571708, 2556604, 2509536, 2460219, 2422711, 2301405, 2261944, 2311773, 2280434, 2311874, 2349818, 2385725, 2330403, 2222660, 2183862, 2197173, 2150150, 2096582, 2132486, 2027919, 2006112, 1977218, 1927860, 1898029, 1903886, 1857001, 1828467, 1814903, 1818594, 1794443, 1843150, 1928893, 1913584, 1846089, 1871688, 1961511, 2030913, 1989051, 1894902, 1939149, 1978427, 1962055, 1911664, 1886921, 1883675, 1873149, 1860966]
3055A860966o2362r3061k2071l4224m3487l8147k1554o4763K506o0813n2266o939
3043A363785J0439K1189O6905m6792m6209j02020j5177M9272o3304n8516o6737
3032A112835R749m8988m7938m0466k7958p701M3954k2714j5603J1634l2444o8547
3020H65813l9871l1880K8352n6065o2758K1045o288L9903K5867J401j882o0308
3008G23329J0334m9861j1190l8150L737m9984l6710K0041K0509l1348L4217J5716
2996F10640o8936M7741J5761j22969j0933j7930R261K4425k9547M2457K2489j0542
2984E11917o1998O7404k0002j7212J4554k8867j13494j7223K012j6162R8802J2159
2972D31890l3267l1129m0619P1473o5592m8219N7625M3992K171j3985j733P101
$$ y = [1860966, 1798604, 1705543, 1683472, 1649248, 1605761, 1567614, 1546060, 1481297, 1483803, 1422990, 1370724, 1363785, 1374224, 1395413, 1462318, 1415526, 1369317, 1267297, 1252120, 1301392, 1238088, 1179572, 1112835, 1122584, 1073596, 1025658, 985192, 957234, 949533, 993487, 970773, 955170, 966804, 934360, 865813, 825942, 794062, 822414, 766349, 703591, 724636, 718348, 758251, 784118, 785519, 783637, 723329, 733663, 683802, 672612, 634462, 638199, 588215, 551505, 571546, 592055, 560707, 594924, 610640, 541704, 589445, 605206, 482237, 471304, 453374, 462635, 487060, 457513, 499970, 522459, 511917, 449919, 517323, 497321, 480109, 494663, 465796, 352302, 335079, 337091, 320929, 419731, 431890, 398623, 367494, 326875, 398348, 332756, 284537, 342162, 386154, 388325, 374340, 372607, 379708]
2960C79708k998o094K8623o973l5120n657N0370m9365p5763L3999m4201k2971
2948B43558O6480M3105o8653k7813N18m6279k4552q686O4678J11920p5154j8256
2936B60866p86O3496q696p8686R0474N7701p9575q417K2262m3257n0655k072k7925
2923A94730j3072K6691J3450l1778r7947P4243K9745M5578l2187r3381l5880M5853
2911A26045J7071k7937N8731n345N029k1867N1422r164p3147J3461L4462N2081
2899B20842k4982m9398n837l9749j8563n85l619L3810r028K1881n2056n6619Q3396
2886I9493L4623O63o703n4586M522K9202L6580r998k1322K858K2642n2413m4061
2873D1500k0956K9765R8636n5699m2244K8422J8465K404J8169J3315n0336J5937
$$ y = [379708, 376710, 370616, 399239, 392266, 357146, 351489, 401859, 352494, 276731, 310730, 266529, 243558, 310038, 353143, 284490, 256677, 257195, 210916, 186364, 177678, 242356, 354276, 279122, 260866, 260080, 323576, 314880, 236194, 326668, 384369, 304794, 296377, 318639, 275382, 224727, 222655, 194730, 181658, 208349, 221799, 190021, 92074, 166317, 196062, 241640, 209453, 116072, 80192, 126045, 143116, 115179, 173910, 168565, 173594, 151727, 203149, 193985, 120838, 134299, 168761, 220842, 195860, 146462, 140625, 100876, 82313, 81728, 78109, 111919, 102891, 124772, 72716, 16097, 99493, 134116, 134779, 128076, 73490, 78012, 107214, 143794, 133796, 112474, 115332, 137974, 85561, 41500, 20544, 50309, 148945, 93246, 51002, 79424, 97889, 100293, 118462, 131777, 81441, 97378]
2861I7378K8484n3278k029J6041m6042K1993M4987K6899m6710l2099j6275J2917
2849E2266p561r340M1762p358N2807n3115k2831P916K6727N3907k4756J2294Q423
2836A31141m9497j4463j0311k0494k969M290j463R358J04548k4754K7384k3266
2824A29504j0690J1780j0757p7583k5759K2098l7545N1143m597l1896P9752J215
2812I6665j8987k3877k2755K2593L1763L391q8194M4568j3089R00N3815M1404
2800A28197K7867J1054o3545m7726m384J043N5104q4876k6322K3429j9595N6586
2788E6832R4962q7187p1893Q953J9602M4555J7258o2019M6348k8231l4602K9786
2776C4364p5221N3665J9921R003m0840m5005Q2334M5432l6991J8753l6482j3735
$$ y = [97378, 125862, 72584, 70555, 86596, 40554, 62547, 107534, 134433, 87723, 55624, 39349, 52266, 44705, 35365, 77127, 69769, 122576, 69461, 46630, 54546, 81273, 135180, 110424, 122718, 131141, 81644, 67181, 56870, 36376, 33407, 37697, 36234, 45592, 150140, 125386, 152770, 129504, 118814, 130594, 119837, 42254, 16495, 38593, 1048, 52191, 47594, 15698, 95450, 96665, 77678, 53801, 31046, 53639, 85402, 88793, 599, 45167, 32078, 32978, 86793, 128197, 156064, 167118, 103573, 55847, 51463, 52506, 107610, 22734, -3588, 19841, 246, 56832, 151794, 64607, -7286, 1667, 21269, 65824, 83082, 21063, 67411, 39180, 4578, 34364, -40857, 12808, 32729, 41732, 892, -44113, 38221, 83653, 46662, 65415, 28933, 15198]
2764A5198K1559l6234j0108J5566R495K137K9665o38M106j4475n567M0658r0158
2751a8796r4956K3594N5292N8178n3254l8679R45K7148O6397l2140L2374L8336
2739F4439J2721j8186j3844O0784R269p2984m0712K0467j528K4063K8252q4945
2727a2204R683M9320l8475K6316L5107L864m1060j6123N4422r710j7481q3915
2715d0256N0116O3403k2463k4098J5190o3074j8801O0171K4724j3539J4646J3573
2703E9592K2044J1178L069j6734M300K3315n508j6512m8519j8781l9337j8204
2691d0097m1807P9582J9265n3389K9036K0740j878L710m6023m380L1514L5026
2679C1299n6824m5334J06345M668o1801p907k4714k544k1074N5800j9144q9779
$$ y = [15198, 36757, 523, -9585, 5981, 15476, 17613, 47278, 46640, 50746, 36271, 30704, 71362, -18796, -113752, -90158, -34866, 23312, -29942, -68621, -67676, -40528, 25869, -6271, 26103, 64439, 77160, 58974, 45130, 105914, 115183, 42199, 1487, 21954, 20426, 44489, 72741, -12204, -2521, 46799, 8324, 34640, 69747, 73611, 32551, 16428, 70850, 61140, 43659, -40256, 9860, 73263, 50800, 26702, 41892, -21182, -39983, 20188, 44912, 31373, 46019, 59592, 81636, 92814, 95883, 79149, 83449, 106764, 101256, 84744, 36225, 17444, -21893, -40097, -81904, -2322, 16943, -36446, -7410, 13330, 11452, 15162, -30861, -35241, -3727, 31299, -25525, -70859, 35486, 40154, -21647, -29554, -54268, -56812, -77886, -22086, -41230, -131009]
2667a31009J9714j0108N8006m1397L318K5016L4447m0840K0700K4306J4217J5027
2655h603o13m1051J6781O228L5132J5998l4987M1261J5928L6987l7923K196p6809
2642b9475P735L0929J9005l2032m5273L1888l7110o696R4617J5585m5628m831
2630a286L3413p794J7820o694L2726n6628j6590M5639j3642m3738m3991O7012
2618F247O6969n0771l084m958m1146L5091p3627M9373N3636m250r209M382l6105
2605g452K9388J24J425M8499N997J0314p5992j2358l1765N9328j9699K5267m5456
2592a2380Q033L761j4313O555o484m9698P2378m9432l7510L750M846J3994J8058
2579c8442L5577l0870j5872L1012N1958N8587o4401m122K9882m3598L457n2582
$$ y = [-131009, -111295, -121403, -63397, -104794, -101476, -76460, -42013, -82853, -62153, -37847, -23630, -8603, -9216, -50267, -33486, -27258, 7874, 23872, -11115, 30146, 46074, 83061, 45138, 47334, -29475, -21740, 9189, 28194, -3838, -49111, -17223, -54333, -61029, 33588, 49173, 3545, -1286, 32127, 24333, 42153, 35459, 68185, 11557, -5033, 40606, 26964, -16774, -60765, 6247, 73216, 22445, 19361, 14403, -26743, 8348, -65279, -15906, 37730, 33480, 24271, 28653, -7452, 21936, 22060, 23485, 71984, 77981, 88295, 12303, -55, -31820, 27508, 7809, 33076, -12380, -4347, -586, -14899, -8344, -14828, -64526, 7852, -41580, -79090, -75340, -70494, -56500, -38442, -2865, -33735, -49607, -18595, 33363, 91950, 27549, 23427, 53309, 9711, 13168, -39414]
2567c9414N9402J6274k8474l4876K1443N5802M1777m3816N0865K2968J6407N5520
2555A93878l2636J0091p360r4794m5642J6533m1904O2614l1173k7461m6846J3322
2543c1378O9893k3382J9222J23525l7399j45130n91J3117M3299k4578M6868J8548
2531G2014n425L6886J5201o5758m2837l0761j7175L4008M2773M6812K3755k1457
2519H8036k8168o15k309k063L5633J4330K0219q1792J9969l4016k242o5991M8664
2506I655M6742N991R460n1508n7430K2729K7443P3310k1603p0358q015L2743L872
2493B3031J6987j5344q488r786j8868o843J4217L7738Q2283l5288m3967M557J0467
2480E0696l7040R1313m0553n2606k4684L4278P4625j9780N4228k7004o8839m22
$$ y = [-39414, 19988, 36262, 7788, -27088, -5645, 50157, 91934, 48118, 98983, 121951, 138358, 193878, 161242, 171333, 163973, 69179, 23537, 40070, -1834, 60780, 29607, 2146, -44700, -31378, 38515, 15133, 34355, 157880, 120481, -24649, -25240, -12123, 31176, 6598, 53466, 72014, 66589, 103475, 118676, 52918, 10081, -20680, -37855, -3847, 38926, 85738, 109493, 88036, 59868, 59253, 56944, 54881, 90514, 104844, 125063, 43271, 63240, 29224, 26982, -39009, 9655, 56397, 62388, 71848, 20340, -37090, -14361, 13082, 86392, 64789, -5569, -13584, 19159, 23031, 40018, 24674, 16186, 6400, -12468, -19311, -5094, 32644, 114927, 79639, 35672, 40229, 50696, 13656, 104969, 64416, 11810, -12874, 21404, 96029, 76249, 130477, 103473, 34634, 34212]
2468C4212J6829j57j5865n2561K5531j0875N6412J1022l1192j3014Q030K726M0540
2455G1638k1186J1376J1451l0196l3415j6194J6140K343m6827O547j3925P1193
2443B8945M0107J5850m6745P746J0005R4203l7994j8523l2205m9301N2323M618
2431F9029j5588K0256K0334l512k2800j4869O9956Q7262m1363k5218J5041l2596
2419A25932m7358m806L4266J9381r29n866n1055K1282J3822J2168J3125L5632
2407A65594p0414k5726K9470O1888q6441N1517m858n162j166P5270O8197k2757
2395B35412p0581n7877K6472r45O9651M4020k3524k2923L175L7573j7923o8556
2383A53974K9070o7590J0662Q3633J5063N6902L9804m2648k4364L0900j0316L6699
$$ y = [34212, 51041, 50884, 35019, -17542, 7989, -2886, 53526, 64548, 33356, 20342, 28372, 31098, 71638, 50452, 61828, 73279, 43083, 9668, -6526, 9614, 11957, -34870, -28323, -42248, 28945, 69052, 84902, 38157, 45903, 55908, 150111, 112117, 93594, 61389, 12088, 64411, 69029, 53441, 73697, 94031, 90519, 67719, 52850, 122806, 210068, 168705, 143487, 158528, 125932, 78574, 73768, 108034, 127415, 126486, 120620, 69565, 90847, 104669, 116837, 129962, 165594, 95180, 69454, 98924, 160812, 74371, 125888, 121030, 115868, 114702, 189972, 258169, 235412, 164831, 106954, 133426, 132481, 202132, 246152, 222628, 199705, 202880, 240453, 222530, 153974, 183044, 115454, 126116, 209749, 224812, 281714, 321518, 278870, 254506, 285406, 275090, 311789]
2371C11789K2484k9390q262k2715L6442P7135N1299k7832k4520o2148L2610l948
2359C52944M3947J088N2724j1799K8583m7596Q8302M242m0675J1461M3959K3002
2347E50182m0628N3556K0248r944N2976K4857L0546L1195J2029K4439N9331M5067
2335H53854N2218J03695P1628K8603l0654k0285J4966k8333N6537R6130N7900
2324A256259l8229L9302M5506L7874M0013O3923O1319O0440Q6476J8548K2054
2313A693485R9626J23844J41309O4140J45084J67117J67943K60228K94592J82652
2303C340020K31622K81405K87430M28676N63600O66764Q64454J077399J580923
2294I322293J655216J573572K057604K454515R24791j444544l026551l017829
$$ y = [311789, 334273, 304883, 296621, 273906, 310348, 387483, 438782, 410950, 386430, 324282, 356892, 352944, 396891, 397979, 450703, 438904, 467487, 419891, 508193, 512435, 471760, 483221, 527180, 550182, 509554, 563110, 583358, 573414, 626390, 651247, 681793, 712988, 725017, 749456, 808787, 853854, 906072, 1009767, 1081395, 1109998, 1079344, 1059059, 1074025, 1045692, 1102229, 1198359, 1256259, 1218030, 1257332, 1302838, 1340712, 1380725, 1444648, 1505967, 1566407, 1652883, 1671431, 1693485, 1793111, 1916955, 2058264, 2122404, 2267488, 2434605, 2602548, 2862776, 3157368, 3340020, 3571642, 3853047, 4140477, 4569153, 5132753, 5799517, 6663971, 7741370, 9322293, 10977509, 12551081, 14608685, 17063200, 17987991, 16543447, 13516896, 10499067]
2286A0499067j942494j485696r76933p97472n44306n30548l48830l11769k23156
2277C337863k49295j77321q7429j95193k27684j51766k01702p8552j10849j91429
2267A666643j31571q5886q9994n0575q201o8157l7406j56248n9109J597k0351
2256I60742J135m6772o5331j02164k0433k4372j2839N3591n7074m3328K6775K020
2244F71950r4231q6282P0570N686n781m4455l4833k8602K2712l9240m0398O3982
2232D61078l4547q3110Q191L6085j8950p906Q001q078m1772K9369L293m3202O1092
2219C69544j8183m3624k9427l0956M7552j4090m9186L5016K5420O7388n9779r1985
2207B07690L5448L8017j4113l872j0567L2912J8174n2977r158m0201J2432K134
$$ y = [10499067, 8556573, 7070877, 6093944, 5296472, 4752166, 4221618, 3872788, 3561019, 3337863, 3088568, 2911247, 2823818, 2628625, 2400941, 2249175, 2047473, 1968921, 1858072, 1666643, 1535072, 1449186, 1359192, 1308617, 1300416, 1232259, 1194853, 1038605, 979496, 981093, 960742, 961877, 915105, 849774, 747610, 727177, 702805, 689966, 743557, 686483, 643155, 669930, 671950, 577719, 491437, 562007, 567693, 561912, 517457, 482624, 454022, 476734, 437494, 397096, 461078, 426531, 343421, 351612, 387697, 368747, 360841, 368842, 360764, 318992, 348361, 351654, 308452, 369544, 351361, 307737, 278310, 247354, 294906, 280816, 231630, 266646, 292066, 359454, 299675, 207690, 243138, 281155, 267042, 263170, 252603, 285515, 303689, 250712, 241554, 201353, 213785, 215919]
2195B15919K0203k7923J0053o005O562q4319L2964Q935J9670M3472q4201O050
2183A61380o0698n1192J9685M9671n2875L7374k320J3553j6957l3774R033M0845
2171A13725J6187n0344K1526J3581M5925K3804k9929J479k5387m1291l2879j3913
2159D2484M9974P0739J7982n2041l1144o5453p760J4319n248m6628M8902R4193
2147A30319J6665o1405k1265L483M3851j1948l7609k6223J8737k4678l7631K5792
2135A8088O1995o241Q471l708p8597k1860J5016N2195J9330n8450l0229P3867
2123D9877J5389O480m0677M6712L4218m333q5166j1070l5755o5904P1289J3569
2111e371M555j9585K5706J5310O2978P07o5979L9534M1828Q362j5751n7028J927
$$ y = [215919, 236122, 208199, 218252, 212247, 218809, 134490, 167454, 176389, 196059, 239531, 155330, 161380, 100682, 49490, 69175, 118846, 65971, 103345, 101025, 114578, 97621, 63847, 72880, 113725, 129912, 79568, 101094, 114675, 160600, 184404, 154475, 155954, 130567, 89276, 56397, 42484, 92458, 163197, 181179, 129138, 97994, 32541, 24781, 39100, 33852, -12776, 36126, 130319, 146984, 85579, 64314, 67797, 111648, 99700, 62091, 35868, 54605, 29927, -7704, 18088, 80083, 73842, 82313, 78605, 8, -21852, -6836, 45359, 64689, 6239, -23990, 49877, 65266, 71746, 31069, 77781, 111999, 107666, 22500, 11430, -24325, -90229, -18940, -5371, -816, -20401, 5305, 20615, 83593, 84300, 18321, 57855, 99683, 108045, 92294, 35266, 37193]
2098C7193j9511k9059n299J3351k2991O203J5452k0345k6763L6681k1388M2244
2086E768N260o4793k4609P0339P8331J1434n0792L7463l1434q2245J3392M3727
2074A1841n5548j9708Q1515L0134n2005m0534L0290J0048K3543k5900J4264n1664
2062d3724J1860L8013J9591k6127l5267n1069l3473O0394P2578l4365j3328m053
2050c8970N286M4323K5200j06371N087n43k335Q8327j6034L8195L2833p5303O0419
2037F0114L4790P132o1916m1141q115n7667N8148M3767L0996k7205N010M6410
2025I0323Q020q1138J4288L7910l9423J4137k4209k3937K4293K8867N644k1677
2013C3098m9173N614q247M9605m1693O6882L638l8571l041n5123K5001L5073Q215
$$ y = [37193, 17682, -11377, -16676, -3325, -26316, -20113, -4661, -25006, -51769, -15088, -36476, 5768, 11028, -53765, -78374, -8035, 70296, 81730, 30938, 68401, 36967, -45278, -31886, 11841, -43707, -63415, 18100, 48234, -3771, -44305, -14015, -3967, 19576, -6324, 7940, -43724, -31864, 6149, 25740, -387, -35654, -86723, -120196, -59802, 12776, -21589, -34917, -38970, -33684, 10639, 35839, -70532, -65445, -65988, -68323, 20004, 3970, 42165, 74998, -305, 60114, 94904, 102036, 40120, -1021, -9136, -66803, -8655, 35112, 66108, 38903, 43913, 90323, 98343, 17205, 31493, 69403, 29980, 44117, 19908, -4029, 20264, 49131, 54775, 33098, -16075, -10461, -18708, 30897, -10796, 56086, 59724, 21153, 18112, -37011, -12010, 23063, 31278]
2000C1278q2062K3229J3111p0401m3945M7514P1164l4138l1218N5040J7665M9056
1988D6293m9502j7416p1683m5209M5866J2331O7326m3487l9495N136L7480L237
1976d9123K8863K5582r3816m9592k7283M5713M6725N2239K4916j0382L6826l6790
1964f122m1932l5027Q630m4611J1729M3306J8125K5157K6985q661l1226j3410
1952d7057m7773l235M8287M4833m441K1362j7396n2190l949K7313j8221M700k8780
1939g6547J7125Q1569O485q8446Q770o972m518K9273o926o1038P0946P4021j121
1926D2621J7667P789j1277m6890M1002j2710K8730l2522k457j0824L2522N916
1914E9567p7176K3315L7082j8414k0164J3852J045n5321n237j1530J6204J5610
$$ y = [31278, -50784, -27555, -14444, -84845, -128790, -81276, -10112, -44250, -75468, -20428, -2763, 46293, -3209, -20625, -92308, -137517, -91651, -79320, -11994, -55481, -94976, -89840, -52360, -49123, -20260, 5322, -88494, -138086, -165369, -119656, -72931, -20692, 4224, -6158, 30668, -6122, -48054, -83081, -74451, -119062, -107333, -64027, -45902, -20745, 6240, -2421, -33647, -47057, -94830, -98065, -49778, -4945, -9386, 11976, -5420, -57610, -61559, -34246, -52467, -47767, -76547, -59422, 22147, 28632, -59814, -51044, -58016, -62534, -33261, -40187, -101225, -30279, 43742, 42621, 60288, 68077, 56800, 9910, 50912, 38202, 66932, 34410, 31953, 21129, 53651, 59567, -17609, 5706, 42788, 24374, 4210, 18062, 19107, -36214, -41451, -52981, -36777, -21167]
1902b1167n7394k411L2584k3195J5397J6118J099p819k7512O8056m5326P780j2386
1889e6176J3539L8191L7472o3642n4416M691k597N1968l4658Q908k0702k6350
1877a03772J3998M1001J7487J7268K9347M093l7649l0799J783j6743J0422R930
1865d3634K6583K7962m9764M2571n1311p5174K3084j6762M3882L2050J7474j8518
1853d1557k6202Q317K7204j9614Q0814l3800j8291K1179M988L9257j5736l553
1841B3006K0448p8314j0553M9516n6451O597L246q1670l8386N9089M2437m0264
1829a01299j1583m07J1258O171k3067j091L1781M9514J6088l322n9j1868N951
1816c1933R134m5201R049l3453m896j0842J6332K4676P608j0201M3498Q590j9118
$$ y = [-21167, -78561, -80972, -48388, -71583, -56186, -40068, -38969, -46788, -74300, -6244, -51570, -43790, -56176, -42637, -4446, 33026, -30616, -85032, -80341, -82938, -30970, -65628, -56720, -77422, -103772, -89774, -48773, -31286, -14018, 15329, 19422, -18227, -49026, -47243, -63986, -53564, -43634, -17051, 10911, -38853, 3718, -47593, -122767, -99683, -116445, -72563, -40513, -23039, -41557, -67759, -59442, -32238, -51852, 28962, -4838, -23129, -1950, 3038, 42295, 26559, 23006, 43454, -34860, -45413, 4103, -52348, -45751, -42505, -124175, -162561, -103472, -61035, -101299, -112882, -113289, -102031, -95860, -118927, -120018, -88237, -38723, -22635, -25957, -26016, -37884, -31933, -22799, -68000, -58951, -92404, -97300, -108142, -91810, -67134, -59526, -69727, -26229, -17639, -36757]
$$ [...]
##END NTUPLES=NMR SPECTRUM
##END=
