##TITLE=1H_DE-80H_X3
 200.13MHz, d2o
 8 sc
 
 19ns.26.2.2025
##JCAMPDX= 6.0         $$ Bruker NMR JCAMP-DX V2.0
##DATA TYPE= NMR SPECTRUM
##DATA CLASS= NTUPLES
##ORIGIN= UXNMR, Bruker Analytische Messtechnik GmbH
##OWNER= pz
$$ XWIN-NMR		Version 3.5
$$ Fri Apr 10 11:08:37 2026 Russian Standard Time (UT+4h)  Yarkov@DPX200
##.OBSERVE FREQUENCY= 200.1313
##.OBSERVE NUCLEUS= ^1H
##.ACQUISITION MODE= SIMULTANEOUS
##.ACQUISITION SCHEME= undefined
##.AVERAGES= 8
##.DIGITISER RES= 18
##SPECTROMETER/DATA SYSTEM= spect
##.PULSE SEQUENCE= zg30
##.SOLVENT NAME= DMSO
##.SHIFT REFERENCE= (INTERNAL, DMSO, 0, 15.4891)
##AUDIT TRAIL= $$ (NUMBER, WHEN, WHO, WHERE, WHAT)
$$ ##TITLE= Audit trail, XWIN-NMR		Version 3.5
$$ ##JCAMPDX= 5.01
$$ ##ORIGIN= Bruker BioSpin GmbH
$$ ##OWNER= Yarkov
$$ C:/Bruker/XWIN-NMR/data/yarkov2/nmr/H-C/1/pdata/1/auditp.txt
$$ ##AUDIT TRAIL=  $$ (NUMBER, WHEN, WHO, WHERE, WHAT)
(   1,<2026-04-10 11:07:52.50 +0400>,<Yarkov>,<DPX200>,
      <created by zg, POWCHK disabled, PULCHK disabled
       configuration hash MD5:
       00 E9 B6 7A A2 85 ED C7 34 08 36 98 17 FE 4E 26
       data hash MD5: 16K
       F9 84 44 E4 29 F3 2E 6C 08 4B B2 8E D5 DA 6D 16>)
(   2,<2026-04-10 11:07:59.42 +0400>,<Yarkov>,<DPX200>,
      <Start of raw data processing
       efp BC_mod = 2 LB = 0.25 FT_mod = 6 PKNL = 1 PHC0 = -5301.948 PHC1 = 6.821927 SI = 16K 
       data hash MD5: 16K
       68 13 11 A5 07 C0 7E 9C 7B 6A FE E6 A4 5F 73 27>)
$$ ##END=
$$ 
$$ hash MD5
$$ 1F 10 60 4B 87 EF 99 31 E9 FC 3E 21 02 27 EC BB
##$RELAX= 
##$RELAX= 
##$RELAX= 
##$RELAX= 
##$RELAX= 
##$RELAX= 
$$ Bruker specific parameters
$$ --------------------------
##$DU= <C:/Bruker/XWIN-NMR>
##$EXPNO= 1
##$NAME= <H-C>
##$PROCNO= 1
##$TYPE= <nmr>
##$USER= <yarkov2>
##$AMP= (0..31)
100 100 100 100 100 100 100 100 100 100 100 100 100 100 100 100 100 100 
100 100 100 100 100 100 100 100 100 100 100 100 100 100 
##$AQSEQ= 0
##$AQ_mod= 1
##$AUNM= <au_zg>
##$AUTOPOS= <>
##$BF1= 200.13
##$BF2= 200.13
##$BF3= 200.13
##$BF4= 200.13
##$BF5= 200.13
##$BF6= 200.13
##$BF7= 200.13
##$BF8= 200.13
##$BYTORDA= 1
##$CFDGTYP= 0
##$CFRGTYP= 5
##$CHEMSTR= <none>
##$CNST= (0..31)
1 1 145 1 1 1 1 1 1 1 1 1 1 1 1 1 1 1 1 1 1 1 1 1 1 1 1 1 1 1 1 1 
##$CPDPRG= <>
##$CPDPRG1= <>
##$CPDPRG2= <>
##$CPDPRG3= <>
##$CPDPRG4= <mlev>
##$CPDPRG5= <mlev>
##$CPDPRG6= <mlev>
##$CPDPRG7= <mlev>
##$CPDPRG8= <mlev>
##$CPDPRGB= <>
##$CPDPRGT= <>
##$D= (0..31)
0 0.7 0 0 0 0 0 0 0 0 0 0.03 0 0 0 0 0 0 0 0 0 0 0 0 0 0 0 0 0 0 0 0 
##$DATE= 1775804871
##$DBL= (0..7)
120 120 120 120 120 120 120 120 
##$DBP= (0..7)
150 150 150 150 150 150 150 150 
##$DBP07= 0
##$DBPNAM0= <>
##$DBPNAM1= <>
##$DBPNAM2= <>
##$DBPNAM3= <>
##$DBPNAM4= <>
##$DBPNAM5= <>
##$DBPNAM6= <>
##$DBPNAM7= <>
##$DBPOAL= (0..7)
0.5 0.5 0.5 0.5 0.5 0.5 0.5 0.5 
##$DBPOFFS= (0..7)
0 0 0 0 0 0 0 0 
##$DE= 6
##$DECBNUC= <off>
##$DECIM= 32
##$DECNUC= <off>
##$DECSTAT= 4
##$DIGMOD= 1
##$DIGTYP= 9
##$DL= (0..7)
0 120 120 120 120 120 120 120 
##$DP= (0..7)
$$ [...]
##$SUBNAM2= <"">
##$SUBNAM3= <"">
##$SUBNAM4= <"">
##$SUBNAM5= <"">
##$SUBNAM6= <"">
##$SUBNAM7= <"">
##$SUBNAM8= <"">
##$SUBNAM9= <"">
##$SW= 18.0517328524113
##$SWIBOX= (0..15)
0 0 2 0 0 0 0 0 0 0 0 0 0 0 0 0 
##$SW_h= 3612.71676300578
##$TD= 16384
##$TD0= 1
##$TE= 0
##$TE2= 300
##$TE3= 300
##$TEG= 300
##$TL= (0..7)
0 120 120 120 120 120 120 120 
##$TP= (0..7)
150 150 150 150 150 150 150 150 
##$TP07= 0
##$TPNAME0= <>
##$TPNAME1= <>
##$TPNAME2= <>
##$TPNAME3= <>
##$TPNAME4= <>
##$TPNAME5= <>
##$TPNAME6= <>
##$TPNAME7= <>
##$TPOAL= (0..7)
0.5 0.5 0.5 0.5 0.5 0.5 0.5 0.5 
##$TPOFFS= (0..7)
0 0 0 0 0 0 0 0 
##$TUNHIN= 0
##$TUNHOUT= 0
##$TUNXOUT= 0
##$USERA1= <user>
##$USERA2= <user>
##$USERA3= <user>
##$USERA4= <user>
##$USERA5= <user>
##$V9= 5
##$VALIST= <valist>
##$VCLIST= <CCCCCCCCCCCCCCC>
##$VD= 0
##$VDLIST= <DDDDDDDDDDDDDDD>
##$VPLIST= <PPPPPPPPPPPPPPP>
##$VTLIST= <TTTTTTTTTTTTTTT>
##$WBST= 1024
##$WBSW= 4
##$XGAIN= (0..3)
0 0 0 0 
##$XL= 0
##$YL= 0
##$YMAX_a= 54476
##$YMIN_a= -57496
##$ZGOPTNS= <>
##$ZL1= 120
##$ZL2= 120
##$ZL3= 120
##$ZL4= 120
##$ABSF1= 0
##$ABSF2= 0
##$ABSG= 0
##$ABSL= 0
##$ALPHA= 0
##$AQORDER= 0
##$ASSFAC= 0
##$ASSFACI= 0
##$ASSFACX= 0
##$ASSWID= 0
##$AUNMP= <proc_1d>
##$AZFE= 0.1
##$AZFW= 0.1
##$BCFW= 0
##$BC_mod= 2
##$BYTORDP= 0
##$COROFFS= 0
##$CY= -3
##$DATMOD= 1
##$DC= 0
##$DFILT= <>
##$DTYPP= 0
##$F1P= 0
##$F2P= 0
##$FCOR= 1
##$FTSIZE= 16384
##$FT_mod= 6
##$GAMMA= 0
##$GB= 0
##$INTBC= 1
##$INTSCL= 3.241238e-09
##$ISEN= 128
##$LB= 0.25
##$LEV0= 0
##$LPBIN= 0
##$MAXI= 10000
##$MC2= 0
##$MEAN= 0
##$ME_mod= 0
##$MI= 1.114404
##$NCOEF= 0
##$NC_proc= -8
##$NLEV= 6
##$NOISF1= 3.799351
##$NOISF2= 2.8
##$NSP= 0
##$NTH_PI= 0
##$NZP= 0
##$OFFSET= 15.48907
##$PC= 1
##$PHC0= -5301.948
##$PHC1= 6.821927
##$PH_mod= 1
##$PKNL= yes
##$PPARMOD= 0
##$PSCAL= 0
##$PSIGN= 0
##$REVERSE= no
##$SF= 200.130006531354
##$SI= 16384
##$SIGF1= 3
##$SIGF2= 2
##$SINO= 0.751879
##$SIOLD= 32768
##$SREGLST= <19F.Aceton>
##$SSB= 0
##$STSI= 16384
##$STSR= 0
##$SW_p= 3612.71676300578
##$SYMM= 0
##$S_DEV= 0
##$TDeff= 16384
##$TDoff= 0
##$TI= <>
##$TILT= no
##$TM1= 0
##$TM2= 0
##$TOPLEV= 0
##$USERP1= <user>
##$USERP2= <user>
##$USERP3= <user>
##$USERP4= <user>
##$USERP5= <user>
##$WDW= 1
##$XDIM= 16384
##$YMAX_p= 524761532
##$YMIN_p= -1752798
$$ End of Bruker specific parameters
$$ ---------------------------------
##NTUPLES= NMR SPECTRUM
##VAR_NAME=  FREQUENCY,     SPECTRUM/REAL,   SPECTRUM/IMAG
##SYMBOL=    X,             R,               I
##VAR_TYPE=  INDEPENDENT,   DEPENDENT,       DEPENDENT
##VAR_FORM=  AFFN,          ASDF,            ASDF
##VAR_DIM=   16384,         16384,           16384
##UNITS=     HZ,            ARBITRARY UNITS, ARBITRARY UNITS
##FACTOR=    0.220516191357247, 1,           1
##FIRST=     3099.82766798856, 0,            0
##LAST=      -512.889095017222, 0,           0
##MIN=       -512.889095017222, -1752798,    0
##MAX=       3099.82766798856, 524761532,    0
$$ Real data points
##PAGE= N=1
##DATA TABLE= (X++(R..R)), XYDATA
$$ [...]
12099E68080k88913P5209L36334r6163l35509j43618N4771j80040j99824N20567
$$ 568080 279167 354376 690710 594547 259038 115420 170191 -9849 -209673 310894
12089C10894k2523P785K33094k8238j17615J31591k07281j53258K75140P2633
$$ 310894 288371 296156 529250 501012 383397 514988 307707 154449 429589 502222
12079E02222J38526P3802j46246j61874K3881r2125n2398k04616o8397Q2574J70418
$$ 502222 640748 714550 568304 406430 430311 338186 285788 81172 12775 95349 265767
12068B65767J33208J00817m9250l40697j63623L07509O2307R2657p8699j71942
$$ 265767 398975 499792 450542 109845 -53778 253731 316038 408695 329996 158054
12058A58054j50226K46051J78005j27599m8320L5176k9371o8516q0460J45407
$$ 158054 7828 253879 431884 304285 255965 291141 261770 193254 112794 258201
12048B58201n2598j21699m6188K25779j27870K28983P9894m8539k9552j42550
$$ 258201 205603 83904 37716 263495 135625 364608 444502 395963 366411 223861
12038B23861j38718n0875j58747P5998K78872J12256J484J7566J7425j66791J38310
$$ 223861 85143 34268 -124479 -48481 230391 342647 344131 361697 379122 212331 350641
12027C50641j46343l48692J4588J38996J41204Q9111K27166m7338q8756m16371
$$ 350641 204298 -144394 -129806 9190 150394 239505 466671 419333 330577 -85794
12017h5794L39354J05027k38127L4696R9619l3049N368Q0941l79854J50675J13579
$$ -85794 253560 358587 120460 155156 254775 221726 227094 308035 -71819 78856 192435
12006A92435j62295K47805m2626j39875J75931k38877J28969k4286J92694R4220
$$ 192435 30140 277945 235319 95444 271375 32498 161467 137181 329875 424095
11996D24095R1300k2464M3563j82157K95966k18600l30509j572J48412J56407
$$ 424095 515395 492931 536494 354337 650303 431703 101194 99622 248034 404441
11986D04441Q3137p628k28264p1864k13069m2282L75573P1262k8758M3612m482
$$ 404441 487578 479950 251686 179822 -33247 -75529 300044 371306 342548 386160 381678
11975C81678j51524q7935K09927q9564R6635j75527K8446J08671j46446J7464
$$ 381678 230154 142219 352146 262582 359217 183690 212136 320807 174361 191825
11965A91825K9096j03526K23954j8415k1310K4864J15p556R4987J24479k33688
$$ 191825 220921 117395 341349 322934 301624 326488 326603 319047 414034 538513 304825
11954C04825j21039J59749K72798k06269j22055J90174n0965j69557J83201j17454
$$ 304825 183786 343535 616333 410064 288009 478183 427218 257661 440862 323408
11944C23408J46392l05049p9096M86776P7594j66916j34451J87406k48340k15226
$$ 323408 469800 164751 85655 572431 650025 483109 348658 536064 287724 72498
11934G2498k5023J26408J45000J7917N9224M3992k20047k08619j4162N6251K3041
$$ 72498 47475 173883 318883 336800 396024 440016 219969 11350 -2812 53439 76480
11923G6480N3811J36459j12234l6078J22052o0311J15576m4253m8118N9316L79666
$$ 76480 130291 266750 154516 118438 240490 180179 295755 251502 203384 262700 642366
11912F42366k35684l23943n4573k1960M0312K73367r037P9560J57361q076l75531
$$ 642366 406682 82739 28166 6206 46518 319885 310848 390408 547769 539693 164162
11901A64162n7690J49951j1585J75358j8648J6597m11011Q0998m0455m7543J04917
$$ 164162 106472 256423 244838 420196 401548 418145 7134 88132 47677 134 105051
11890A05051j3971J11799J43596k41844j69650K90115L0018m5919j35336J41910
$$ 105051 91080 202879 346475 104631 -65019 225096 255114 209195 73859 215769
11880B15769J4430L49176K19452k59188j01584q3224K2981j06670K5395K20958
$$ 215769 230199 579375 798827 539639 438055 354831 377812 271142 296537 517495
11870E17495j76823J4781m3666k77705J66934J56206m0970q5660j2231J55746
$$ 517495 340672 355453 311787 34082 201016 357222 316252 230592 218361 374107
11860C74107P5004j15996j6225R5864M370m3889O3084l5738p2769k45222k39316
$$ 374107 449111 333115 316890 412754 417124 373235 436319 400581 327812 82590 -156726
11849a56726K20352J89204J8039J42018l47007j00548K34444K14127Q6511p2482
$$ -156726 63626 252830 270869 412887 65880 -34668 199776 413903 500414 427932
11839D27932j00169j25551p901J0479j24012j27518J60360j35177j05638L12322
$$ 427932 327763 202212 194311 204790 80778 -46740 113620 -21557 -127195 185127
11829A85127J23640m0490R0843L9872p2166J34166k77102J09261J337j00383J59042
$$ 185127 308767 268277 359120 398992 326826 460992 183890 293151 294488 194105 353147
11818C53147J44334j81446l84496R3981R4429m0848J91233K3213K28989j1978
$$ 353147 497481 316035 -68461 25520 119949 79101 270334 293547 522536 510558
11808E10558j44311J36932l6461j68048j29995K0187J31811p7167R7821N9324
$$ 510558 366247 503179 466718 298670 168675 188862 320673 243506 341327 400651
11798D00651r3239J94782j16434k97551r5782J02676Q8356N5672J26851j40522
$$ 400651 307412 502194 385760 88209 -7573 95103 183459 239131 365982 225460
11788B25460j52429l9532J69543J97410q3896j15931J24995p1827r8217J30852
$$ 225460 73031 33499 203042 400452 316556 200625 325620 253793 155576 286428
11778B86428j28143j75976J14129J31193o6528L52110n5967n8476K7403j2055
$$ 286428 158285 -17691 96438 227631 161103 513213 457246 398770 426173 414118
11768D14118r5492J15053N7304j01174j48556M3942j53826j47070M96309k71296
$$ 414118 318626 433679 490983 389809 241253 285195 131369 -15701 480608 209312
11758B09312j61778J66219K91014K7669k02912n2029K26420P7363k41349o9912
$$ 209312 47534 213753 504767 532436 329524 277495 503915 581278 339929 270017
11748B70017k98571K36521K79408K46441j21190k09798O2548k33699K25403j45650
$$ 270017 -28554 207967 487375 733816 612626 402828 465376 231677 457080 311430
11738C11430j41442p8295Q1821K91119K8125k00501m3925L6873k15689M2977K40329
$$ 311430 169988 91693 173514 464633 492758 292257 248332 285205 69516 112493 352822
11727C52822J41900k41387k6871q2353L5978j8666J02209p1304K86013J53103
$$ 352822 494722 253335 226464 144111 180089 161423 263632 192328 478341 631444
11717F31444m72709J0179J24273Q2851j60133j37918K11159J26865J14020j17095
$$ 631444 158735 168914 293187 376038 215905 77987 289146 416011 530031 412936
11707D12936j22173O7390k3316l9788r4302J28025L88785l59774j99918J33220
$$ 412936 290763 358153 334837 295049 200747 328772 717557 357783 157865 291085
11697B91085n6870j22537J37254k32322p088J14385L67708k49831m00383N9195
$$ 291085 234215 111678 248932 16610 9522 123907 491615 241784 -158599 -99404
11687i9404N2696J37005J64505L52295k40111l9094J6070l9991j17266n638j06606
$$ -99404 -46708 90297 254802 607097 366986 327892 343962 303971 186705 181067 74461
11676G4461J4421j0140J12231q9131R9383P3852l0245K31135j76227J0934k29175
$$ 74461 88882 78742 190973 101842 201225 275077 244832 475967 299740 310674 81499
11665H1499j03696J74731J82519J33046q4774n9389o2758J93126J93413k47093
$$ 81499 -22197 152534 335053 468099 383325 323936 261178 454304 647717 400624
11655D00624r2655J21169k7173j29287j02189K218J95900K39871L5420J9550M6423
$$ 400624 307969 429138 401965 272678 170489 172707 368607 608478 643898 663448 709871
11644G09871j96557l50934K71604n4309k48960j20750R2368J72489N1573J01296
$$ 709871 513314 162380 433984 379675 130715 9965 102333 274822 326395 427691
11634D27691m0761L0820j33487j4994K29443L9230j77944l15134R0205j890K57924
$$ 427691 386930 417750 284263 269269 498712 537942 359998 44864 135069 133179 391103
11623C91103j25756j9654J22433q5064Q0500K80092J2656k64563k13168J10220
$$ 391103 265347 245693 368126 283062 363562 643654 656310 391747 178579 288799
11613B88799M2587o574n5538N645M2306N6125K46717K708K0498k0621k23709K3482
$$ 288799 331386 324812 269274 274919 317225 373350 620067 622775 643273 622652 398943 422425
11601D22425q8097n8187K6659J00773p5190q4628P5693k4013O4027k29489j05401
$$ 422425 334328 276141 302800 403573 328383 243755 319448 295435 359462 129973 24572
11590B4572j83960K38763K23816M2770l2165j93717J37829J91923k52489J83402
$$ 24572 -159388 79375 303191 345961 313796 120079 257908 449831 197342 380744
11580C80744N0889K727L0162j00242p6222J52921K7993m5890L6999M1109l510
$$ 380744 431633 434360 464522 364280 288058 440979 468972 423082 460081 501190 497680
11569D97680k23671j12805j39144J11815K85994n9741J30671k2247j38795k85404
$$ 497680 274009 161204 22060 133875 419869 360128 490799 468552 329757 44353
11559D4353K07117J35251j47154L34284k40974O1298r2484o7033K11102j6540
$$ 44353 251470 386721 239567 573851 332877 394175 301691 234658 445760 429220
11549D29220j10325k59321k14687K50897J76964k02982J00695m9248J69142N3088
$$ 429220 318895 59574 -155113 95784 272748 69766 170461 121213 290355 343443
11539C43443j01173j43321P1092N0795R7403J55230k29687p294N3118j90048P8599
$$ 343443 242270 98949 170041 220836 318239 473469 243782 236488 289606 99558 178157
11528A78157J62858K5980j21733l10189o246N3114l0905q095L35809m8646Q8205
$$ 178157 341015 366995 245262 -64927 -71173 -18059 -48964 -57059 278750 230104 318309
11517C18309k24614N2128p4922J65151Q6801l87805n411j1979K49689J99274j02107
$$ 318309 93695 145823 70901 236052 322853 -64952 -70363 -82342 167347 366621 264514
11506B64514J43175K87933n0340r7104j46956K4985k7282n7448j85062O6419J21582
$$ 264514 407689 695622 645282 548178 401222 426207 398925 341477 156415 222834 344416
11495C44416J08618J61184j07966j84753k8458n2873j75732O5366K00560k29561
$$ 344416 453034 614218 506252 321499 293041 240168 64436 129802 330362 100801
11485A00801P4533k93903L01233J88433J0593J04262j99445J47687q1079j41178
$$ 100801 175334 -118569 182664 371097 381690 485952 286507 434194 353115 211937
11475B11937O7896Q1523j77236o1287j12117N0238K75935j9112o3511o3010j72103
$$ 211937 279833 361356 184120 122833 10716 60954 336889 317777 254266 191256 19153
11464A9153m3280n3450j43190j2884K13111J28749K75997k21224n4106k1845J11459
$$ 19153 -24127 -77577 -220767 -233651 -20540 108209 384206 162982 108876 87031 198490
11453A98490J21948J78312K211k94823p992J84915J35941J7944k08703l49096
$$ 198490 320438 498750 500961 206138 198146 383061 519002 536946 328243 -20853
11443b0853m3662J27395J68445P6555J86897k54827k8419j03801j8635K09080
$$ -20853 -64515 62880 231325 307880 494777 239950 211531 107730 89095 298175
11433B98175J14731j08093j0286J45958P9687l4700J9351j43490L430j13231r5187
$$ 298175 412906 304813 294527 440485 520172 485472 504823 361333 364763 251532 156345
11422A56345J39094j20439O8003J49897J4163n6528p6920j06433r816M3258K37317
$$ 156345 295439 175000 243003 392900 407063 350535 273615 167182 157366 200624 437941
11411D37941j76565k85246K11580m0154k19664l4247K63972K83162r0557o8242
$$ 437941 261376 -23870 187710 147556 -72108 -106355 157617 440779 350222 281980
11401B81980J75795q7939l66373L2348j644K93251q7407O2927l03968k9190K75624
$$ 281980 457775 369836 3463 35811 34167 327418 240011 302938 -1030 -30220 245404
11390B45404K90729Q3196k10084l0205r8084J26506J05050J18779J27948k12608
$$ 245404 536133 619329 409245 379040 280956 407462 512512 631291 759239 546631
11380E46631l2446L0184k10737L07336o0414k68740J4409J00100k0108j85668
$$ 546631 514185 544369 333632 640968 580554 311814 326223 426323 406215 220547
11370B20547K35059j71098n6202K93209M8093j77148k00755L9177j27648K67249
$$ 220547 455606 284508 228306 521515 569608 392460 191705 230882 103234 370483
11360C70483k4469n7200j06905J02836L4681l3761j06317K39903j38552p9757
$$ 370483 346014 288814 181909 284745 319426 285665 179348 419251 280699 200942
11350B00942j8252Q3082l9690j09358K22253n9067L13552L0852q8701k08297j36507
$$ 200942 182690 265772 226082 116724 338977 279910 593462 624314 535613 327316 190809
11339A90809j16081R8301K63969K4781n8816k32494k12543p5943K48005m1773
$$ 190809 74728 173029 436998 461779 402963 170469 -42074 -118017 129988 88215
11329H8215m5030K20190r8087o5952O911O4331N0818N527L35124q9235j39134
$$ 88215 43185 263375 165288 99336 106247 170578 221396 226923 562047 472812 333678
11318C33678l035K0937k60581n4385N6280O5683K40373k12918J41870j00994J40022
$$ 333678 330643 351580 90999 36614 92894 158577 398950 186032 327902 226908 366930
11307C66930j05819m347L48395k73892l17079J73136K03710J15403m23199j3974
$$ 366930 261111 256764 605159 331267 14188 187324 391034 506437 83238 69264
11297F9264K13743n854R2706J49792k75252J00055r1713K00j04630k83835K02386
$$ 69264 283007 277153 369859 519651 244399 344454 252741 252941 148311 -135524 66862
11286F6862k4404L96331o5339p0740j80703M9990j2787j45109K61666J63297J04820
$$ 66862 42458 438789 373450 302710 122007 171997 159210 14101 275767 439064 543884
11275E43884k85721M975J86299j28304p2139L9701k09633P21J86859J75066j98000
$$ 543884 258163 263138 449437 321133 248994 288695 79062 79783 266642 441708 243708
11264B43708j11106R0264N6978J1644J25025p1953n645Q5904p9759j07621q7084
$$ 243708 132602 222866 279844 291488 416513 344560 338915 424819 345060 237439 150355
11253A50355j24408J65210J53821k52906O6196J30506N3598j00150M1994j8276
$$ 150355 25947 191157 344978 92072 158268 288774 342372 242222 284216 265940
11243B65940j74335q8813J79786j34779j74192K52997R3017j56218j02379k12620
$$ 265940 91605 2792 182578 47799 -126393 126604 219621 63403 -38976 -251596
11233b51596L14126L00986j2011J71294l815k44437j62522P3112J62327q0173
$$ -251596 62530 363516 351505 522799 518984 274547 112025 185137 347464 267291
11223B67291k71214K34323M63474j84930j73521j00552J22909k14355n9276j21029
$$ 267291 -3923 230400 693874 508944 335423 234871 357780 143425 84149 -36880
11213c6880K03980K63145P4335j31860J05701O9091J05404j91172n06603J32824
$$ -36880 167100 430245 504580 372720 478421 547512 652916 461744 -44859 87965
11203H7965L5339m0067m4469J95135K1477n9708J02543k53267J96728K47170p6088
$$ 87965 123304 83237 38768 233903 255380 195672 298215 44948 241676 488846 412758
11192D12758k89487J2241M6986o944M8974l17110l359K66997L238l3739M1096
$$ 412758 123271 135512 182498 175554 224528 -92582 -95941 171056 174294 140555 181651
11181A81651j3850R6744p9501r8721j01929J62088P3876j41289K68967P894O9350
$$ 181651 167801 264545 185044 86323 -15606 146482 220358 79069 348036 355930 425280
11170D25280N161l69608J50734l5111l9750j59447K35500L48457j10236j68372
$$ 425280 430441 60833 211567 176456 136706 -22741 212759 561216 450980 282608
11160B82608j62964K1700J31156j9887r8822j23237K95668K62090k59791N5765
$$ 282608 119644 141344 272500 252613 153791 30554 326222 588312 328521 384286
11150C84286K26120r5539R4502k11732j21872q3066Q7785o9734J01364q0005j02094
$$ 384286 610406 514867 609369 397637 275765 192699 280484 210750 312114 232109 130015
11139A30015N1961J20101k2283r3957L14894j9462j96352R9699K4282j14792R5293
$$ 130015 181976 302077 279794 185837 500731 481269 284917 384616 408898 294106 389399
11128C89399K17215k98249Q9175j28332k28057K07603m9628L8742J30422j83967
$$ 389399 606614 308365 397540 269208 41151 248754 199126 237868 368290 184323
11118A84323j0297n2871k0171J26583O9546j65236l9915L03356n6984k60704r530
$$ 184323 174026 121155 100984 227567 297113 131877 91962 395318 338334 77630 68100
11107F8100J84076K12947j6200l15471k6092K94456P2945j0404O6410k82826O9302
$$ 68100 252176 465123 448923 133452 107360 401816 474761 464357 530767 247941 317243
11096C17243J23069j24007j58087J30570J6202j39591j40395L61836J8504Q0525
$$ 317243 440312 316305 158218 288788 304990 165399 25004 386840 405344 485869
11086D85869J40757q4067k19892m3109P54k18856J07051L6647l7606J90616r6135
$$ 485869 626626 542559 322667 279558 280312 61456 168507 205154 167548 358164 262029
11075B62029L925J57026j37166J35634J62221k76951J61065m7487k79195J34934
$$ 262029 265954 422980 285814 421448 583669 306718 467783 420296 141101 276035
11065B76035J5194J13971q80Q0943j37366k55512l7113K19737J64149j67985j33638
$$ 276035 291229 405200 404320 485263 347897 92385 55272 275009 439158 271173 137535
11054A37535O8700K79013r426l78288J01600K59188l19474K75483j35507r3494
$$ 137535 206235 485248 475822 97534 199134 458322 138848 414331 278824 185330
11044A85330K67347n1916K0592K01536j38934k36068M8510R5526M0129P6404L3636
$$ 185330 452677 400761 421353 622889 483955 247887 296397 391923 432052 508456 542092
11033E42092P6868k46285l53679M3087K78758R498m4489Q9999j62310j00253L8548
$$ 542092 618960 372675 18996 62083 340841 350339 305850 395849 233539 133286 171834
11022A71834L6147j70030J99684j17361J55399Q0700J30531K19106j13915N8824
$$ 171834 207981 37951 237635 120274 275673 356373 486904 706010 592095 650919
11012F50919q5033j88784K61901j28131j26877o8100m7541j99180O5017J3952
$$ 650919 565886 377102 639003 510872 383995 315895 268354 69174 134191 148143
11002A48143J41437O4035j8124K160l05091R3852P7384K68176m4532k24847J60231
$$ 148143 289580 353615 335491 337651 32560 126412 203796 471972 427440 202593 362824
10991C62824k44432j1373K97332j98275j38183O2804J83552J47799J45698r3831
$$ 362824 118392 107019 404351 206076 67893 130697 314249 462048 607746 513915
10981E13915k3623k96682M763J58101K22985q6881m7735J00616j88399R248r2621
$$ 513915 490292 193610 198373 356474 579459 492578 444843 545459 357060 366308 273687
10970B73687j15319l7683R9434q391j5681q5383J64736q3710J38292q5376K5055
$$ 273687 158368 120685 220119 211728 196047 110664 275400 191690 329982 244606 269661
10959B69661J13848O8686k741l85742K67268k03122N7609q2253O4848J22386K30531
$$ 269661 383509 452195 449454 63712 330980 127858 185467 103214 168062 290448 520979
10948E20979O0491k06722n5924L8327K20465j81742j31439l7361K4647M9047K7064
$$ 520979 581470 374748 318824 357151 577616 395874 264435 227074 251721 300768 327832
10937C27832k5680L6855J6959k08169m9672r1356J76020J1034o5853j33561P6362
$$ 327832 302152 339007 355966 147797 98125 6769 182789 193823 127970 -5591 70771
10926G0771K61471L6569k681r4429j12126J17985J40754n6539L3707j28521k22398
$$ 70771 332242 368811 366130 271701 159575 277560 418314 361775 395482 266961 44563
10915D4563K22704M88393k10124k43021R6557J5561P6453k4245o4930K4410O9455
$$ 44563 267267 755660 545536 302515 399072 414633 491086 466841 401911 426321 495776
10904D95776j59168j67386K15258j49883j36897J65569L3600J17850J45630j60689
$$ 495776 336608 169222 384480 234597 97700 263269 296869 414719 560349 399660
10894C99660k62277J25700M03616j76392j50776J10980k75580J77757L90891k0593
$$ 399660 137383 263083 666699 490307 339531 450511 174931 352688 743579 722986
10884G22986k43504j35412j25835O2404J33460R6490r4969J5567r0533q8531L56685
$$ 722986 479482 344070 218235 280639 414099 510589 415620 431187 340654 252123 608808
10873F08808j77581K1707q8479k06084J44901M80620j87682j06704Q970m5774
$$ 608808 431227 452934 364455 158371 303272 783892 596210 489506 498476 452702
10863D52702j5614J68171j54117n538J2202R4653k02154J20717M2550Q4939O6280
$$ 452702 437088 605259 451142 445604 457806 552459 350305 471022 513572 598511 664791
10852F64791j89490k09209J41396N2068N4636L77112j02151j55093l6963j98995
$$ 664791 475301 266092 407488 459556 514192 891304 789153 634060 597097 398102
10842C98102j25940k2498M9768o9734R0832K35787K1609J87659j76402j34517
$$ 398102 272162 249664 299432 229698 320530 556317 577926 765585 589183 454666
10832D54666j27670n5682K08736L0192j08267k20515l5311Q2422j56950J07978
$$ 454666 326996 271314 480050 510242 401975 181460 146149 228571 71621 179599
10822A79599p9222L6277p5393N8589n463K75290R885K01890j71375p4245k3361
$$ 179599 100377 136654 61261 119850 114387 389677 399562 601452 430077 355832 332471
10811C32471l1652L31089J0198l94372k14844J00930q882j98432O3302K66409
$$ 332471 300819 631908 642106 247734 32890 133820 124938 -73494 -10192 256217
10801B56217r811J36303j68859k45031K68630p1404J54136K20951j12082M778
$$ 256217 246406 382709 213850 -31181 237449 166045 320181 541132 429050 433828
10791D33828R431j39606R392q5650K08919k0115k7895J86515Q9324j86767k19079
$$ 433828 443259 303653 313045 227395 436314 416199 388304 574819 664143 477376 258297
10780B58297M6215M0468J93231j06449k43273L67742R0462j42827k46510j31809
$$ 258297 304512 344980 538211 431762 188489 556231 646693 503866 257356 125547
10770A25547L19031J37821r4156Q2017k24292R9496j29983K718o0155J23547M1079
$$ 125547 444578 582399 488243 570260 345968 445464 315481 318199 258044 381591 422670
10759D22670j57959R7911L5418J222p5172j13492j60320K32563j28422L41505
$$ 422670 264711 362622 398040 399262 324090 210598 50278 282841 154419 495924
10749D95924j89846n7442Q7213j46880j12566K08518m2048m435j69289J48278
$$ 495924 306078 248636 335849 188969 76403 284921 242873 238438 69149 217427
10739B17427J11639q9818l6510P9972J27011j03590K4292R2206l21769K39383
$$ 217427 329066 239248 202738 282710 409721 306131 330423 422629 100860 340243
10729C40243J15676k31790K50868k3150J2569j25711k89060K70582K83982k16561
$$ 340243 455919 224129 474997 451847 464416 338705 49645 320227 604209 387648
10719C87648K1661j2677m10476K53690l6087K4810K2827J801j34631k67456L13314
$$ 387648 409309 396632 -13844 239846 203759 228569 251396 253197 118566 -148890 164424
10708A64424R53L30865P778l12249Q3125p0254P6946N1897J02886N055k11215
$$ 164424 165377 496242 504020 191771 274896 204642 281588 333485 436371 441426 230211
10697B30211J96398j73803r2441K48051j41817R0935J04498M7097O4509k05229
$$ 230211 426609 252806 160365 408416 266599 357534 462032 509129 573638 368409
10687C68409M513j53775J90124j5310j0632r0635M0294N1581K56962m9544l7709
$$ 368409 372922 219147 409271 393961 383329 292694 332988 384569 641531 591987 554278
10676E54278J3931P8182m6325m5471N1896q8667j08907Q204R8967L4044j8863
$$ 554278 568209 646391 600066 554595 606491 517824 408917 417121 516088 550132 531269
10665E31269k80718l630j51626J94333J88573n8997j84286j6950j48082K18842
$$ 531269 250551 246921 95295 289628 478201 419204 234918 217968 69886 288728
10655B88728K48996k52412l33005N0972J81262K8253K52147J76563j94618m2666
$$ 288728 537724 285312 -47693 3279 184541 212794 464941 641504 446886 404220
10645D04220j40188l309J83692j003P5291p7322j3358j22135K80162j30373K5771
$$ 404220 264032 260723 444415 443412 518703 441381 428023 305888 586050 455677 481448
10634D81448L25239l39951J95632J17057k11621k54118J32145n2698J13664j16570
$$ 481448 806687 466736 662368 779425 567804 313686 445831 393133 506797 390227
10624C90227j345m853j02134k5122j89323M3723J70036J43161R146j96108J07166
$$ 390227 388882 384029 281895 256773 67450 111173 281209 424370 433516 237408 344574
10613C44574p5989n4835O8597k3998J4184J49537J05474m0655J04278L7473j05466
$$ 344574 268585 213750 282347 258349 272533 422070 527544 486889 591167 628640 523174
10602E23174j37064N4929o4099j42966P3597N8245K69668j34155k3706P0669P3781
$$ 523174 386110 441039 376940 233974 307571 365816 635484 501329 477623 548292 622073
10591F22073L4818m6947M4441m07160K8002K8116j10405k16P8138L23533J43785
$$ 622073 656891 609944 654385 247225 275227 303343 192938 192722 270860 594393 738178
10580G38178j64168j63768q989K28446j94497M5440r6773J06336l98432q2395
$$ 738178 574010 410242 401253 629699 435202 480642 383869 490205 91773 9378
10570I378J59863J16998j75550J25370J53902J2237k13052K1734J06827R3064
$$ 9378 169241 286239 110689 236059 389961 402198 189146 210880 317707 410771
10560D10771K23732j87332l86271J44732J78877r8588J77300J67967Q4552k01995
$$ 410771 634503 447171 60900 205632 384509 285921 463221 631188 715740 513745
10550E13745k10207n4576l61281K87887J97472O9778K84253J38580r2131k34395
$$ 513745 303538 248962 -112319 175568 373040 442818 727071 865651 773520 539125
10540E39125M9066k81727R8749N8053r1344M8041J73683M9022k18852l27520K00606
$$ 539125 588191 306464 405213 463266 371922 419963 593646 642668 423816 96296 296902
10529B96902J28110k96865L47583Q9397O5521j83735K11834m533j91141m5181
$$ 296902 425012 128147 475730 565127 630648 446913 658747 654214 463073 417892
10519D17892l06984O7967J51176p0895k6209J72423K3984l3942R0524M04593l04081
$$ 417892 110908 178875 330051 259156 232947 405370 429354 395412 485936 890529 586448
10508E86448r3420O1324n3516l79959K20790L25806l90882j92881K32088J73321
$$ 586448 493028 554352 500836 120877 341667 667473 276591 83710 315798 489119
10498D89119j69688J84235P3013k16768K52229j03221R916p6952K7881k0683J40721
$$ 489119 319431 503666 576679 359911 612140 508919 518835 441883 469764 449081 589802
10487E89802j35801N1600K18755k0811l14938O1454m0151j19620j2386K69724
$$ 589802 454001 505601 724356 703545 388607 450061 409910 290290 277904 547628
10477E47628n9024o5339j06526o7479M2290j9846K26614L8028K9976k62424p6841
$$ 547628 488604 423265 316739 249260 291550 271704 498318 536346 566322 303898 227057
10466B27057K9426K59647K63096k39250K1378k76652k37341j08374M39261K14136
$$ 227057 256483 516130 779226 539976 561354 284702 47361 -61013 378248 592384
10456E92384j40365J64348k67824Q5116j55405n9690Q5560K10260M2028L9664
$$ 592384 452019 616367 348543 433659 278254 218564 304124 514384 556412 596076
10446E96076k5065n5828p2796J18197j30749O3435j86793J3662R0069J72509K32328
$$ 596076 571011 515183 442387 560584 429835 493270 306477 320139 410208 582717 815045
10435H15045l50260k47823J3516J48271N741n1602J82617k97628J10552K40843
$$ 815045 464785 216962 230478 378749 384490 332888 515505 217877 328429 569272
10425E69272r1940K36964p1228M2484K2219p4655p9783K33861M2566j73923j70636
$$ 569272 477332 714296 643068 685552 707771 633116 553333 787194 829760 655837 485201
10414D85201p1370k68346n4605L98983j35919J9163P0656n3175R9260J20433Q9573
$$ 485201 413831 145485 90880 489863 353944 373107 443763 390588 489848 610281 699854
10403F99854j36381N7567p7254q7275q3432j91501L05314R6587R4616j69591J18351
$$ 699854 563473 621040 543786 456511 373079 181578 486892 583479 678095 508504 626855
10392F26855k34117n0729K02708k72273N8299R9172p1425J22258P1727j11472
$$ 626855 392738 342009 544717 272444 330743 429915 358490 480748 552475 441003
10382D41003j48040L2430j5416J00849k1666j18385P0942J51586j08483J37462
$$ 441003 292963 325393 309977 410826 389160 270775 341717 493303 384820 522282
10372E22282J43803j98151N8174j36278K63679K59293J4335j48617k92596j45667
$$ 522282 666085 467934 526108 389830 653509 912802 927137 778520 485924 340257
10362C40257Q8718m7912j40623J63278r8426Q5329J72522j50970j2489R8835o8901
$$ 340257 428975 381063 240440 403718 305292 390621 563143 412173 399684 498519 429618
10351D29618j81856m2479K95927J39481l2205k1083l5476J96869m31486k3609
$$ 429618 247762 205283 501210 640691 608486 587403 551927 748796 317310 293701
10341B93701J51718J63273j79496J19748N8075j08076K67237P1874l41746j00760
$$ 293701 445419 608692 429196 548944 607019 498943 766180 838054 496308 395548
10331C95548J53593K3613l3211k44287J51062Q026J57112K53783l9269p7744j17620
$$ 395548 549141 572754 539543 295256 446318 454344 611456 865239 825970 748226 630606
10320F30606N7009R9170L4718j80128j21201M8651K43287Q6649j1389L9323K566
$$ 630606 687615 786785 821503 641375 520174 568825 812112 898761 887372 926695 929261
10309I29261j18195k85210j20588L95164j4p5158K07639j546R2395j03647j35996
$$ 929261 811066 525856 405268 800432 800418 725260 932899 931353 1023748 920101 784105
10298G84105J0431j44454j23740L50298k0323q0960J62178L83119K56592K45461
$$ 784105 794536 650082 526342 876640 856317 775357 937535 1320654 1577246 1822707
10288A822707r9583J95022n4185j07248j5613K24710J37526k16835K9386p9981
$$ 1822707 1723124 1918146 1863961 1756713 1741100 1965810 2103336 1886501 1915887 1835906
10278A835906N5890j38541o9130k11485j59240k9059j61415k8011k23921j18965
$$ 1835906 1891796 1753255 1684125 1472640 1313400 1284341 1122926 1094915 870994 752029
10268G52029k2687j61516O5428J58P5908O3325j97395K7388J12833l2815k0902
$$ 752029 729342 567826 633254 633412 709320 772645 575250 602638 715471 682656 661754
10257F61754k07867l4101j13614l7561K69576R9862m7141j8211N00845j67335
$$ 661754 453887 419786 306172 268611 538187 638049 590908 572697 1073542 906207
10247I06207l56925L4413j49464j46334L56921M2509o8922J32265j23089K63320
$$ 906207 549282 583695 434231 287897 644818 687327 618405 750670 627581 890901
10237H90901J20451K8978j83299k7948Q1954R841k33006K3588k6912J76576J85364
$$ 890901 1011352 1040330 857031 829083 911037 920878 687872 711460 684548 861124 1046488
10226A046488O4070k55873k4105J69001k98646r5164J05970Q8455L4215k61009
$$ 1046488 1110558 854685 830580 999581 700935 605771 711741 800196 834411 573402
10216E73402K74293L2771k6068K5375J19745q268K4845k2601k83081J38293n9392
$$ 573402 847695 880466 854398 879773 999518 991250 1016095 993494 710413 848706 789314
10205G89314L6935j87541p108j40678K73957K00810R562k96870L7914p0003j8175
$$ 789314 826249 638708 631600 490922 764879 965689 975251 678381 716295 646292 628117
10194F28117K87122M6368k334J16941K3835j24731o9232M7282j09310j50409n7967
$$ 628117 915239 961607 959273 1076214 1100049 975318 906086 953368 844058 693649 635682
10183F35682m2876K75130M5137r2652n7067j37167R4652J50451k37000j24739
$$ 635682 592806 867936 913073 820421 763354 626187 720839 871290 634290 509551
10173E09551L30382O4329n7626j7601k15208K63303l7840J39868r8824j09295
$$ 509551 839933 904262 846636 829035 613827 877130 839290 979158 880334 771039
10163G71039K33202J6092r9082j46532r2450j30815L38695J94221j73723j9192
$$ 771039 1004241 1020333 921251 774719 682269 551454 890149 1084370 910647 891455
10153H91455O5303k4775j77826R9323K2603j57820j61062J70503K29708J75878
$$ 891455 956758 931983 754157 853480 876083 718263 557201 727704 957412 1133290
10143A133290k28834j95736k61637L6406J86642Q6860l7311K4049J80190m5822
$$ 1133290 904456 708720 447083 483489 670131 756991 719680 743729 923919 878097
10133H78097J8960M5329m7906l26938L89507J32181J07391l05870M6057J2757
$$ 878097 897057 942386 894480 567542 957049 1089230 1196621 890751 936808 949565
10123I49565J27538K70112N3404J46152j0154J38641J73891j61221J02868K23571
$$ 949565 1077103 1347215 1400619 1546771 1536617 1675258 1849149 1687928 1790796 2014367
10113B014367J5127m45881M0197K56448o2177O1685l518J24133j37609p8845n13150
$$ 2014367 2029494 1583613 1623810 1880258 1818081 1879766 1876248 2000381 1862772 1783927 1270777
10102A270777j2005J8172P4059J39878L1877l64966j98570J23759O0645q5539
$$ 1270777 1258772 1276944 1351003 1490881 1522758 1157792 959222 1082981 1143626 1058087
10092A058087j18648n3745j68348q2500J94915k54685J44298L00560j53999K75792
$$ 1058087 939439 885694 717346 634846 829761 575076 719374 1019934 865935 1141727
10082A141727m7886l28774N8003k30399L03977K92764j85024p3747k69520J72451
$$ 1141727 1093841 765067 823070 592671 896648 1189412 1004388 930641 661121 833572
10072H33572K40908j32782k34631k2008m8492J9679K48025q4920j56961L56247
$$ 833572 1074480 941698 707067 685059 636567 656246 904271 819351 662390 1018637
10062A018637l1031J31898r9795n7013J14635j58105l9336R4694r081m6471j0577
$$ 1018637 987606 1119504 1019709 962696 1077331 919226 879890 974584 965503 919032 908455
10051I08455O1250m5968N8657j6717N2422m8256j61103l2854J05162j22873M12919
$$ 908455 969705 923737 982394 965677 1018099 969843 808740 775886 881048 758175 1171094
10040A171094j031k70595j5313J32273M7692k81171j49947J23539K36250J21325
$$ 1171094 1170063 899468 884155 1016428 1064120 782949 633002 756541 992791 1114116
10030A114116j85203J26546J12316k73220q8051J06424K29491j31058L0319M5943
$$ 1114116 928913 1055459 1167775 894555 806504 912928 1142419 1011361 1041680 1087623
10020A087623J11152q2603j86088m5302K07767L51055Q0903k74101j74365j19387
$$ 1087623 1198775 1116172 930084 884782 1092549 1443604 1524507 1250406 1076041 956654
10010I56654J98398K53420Q5324n5715L8805k5263L1696M8360q4526k36668K8561
$$ 956654 1155052 1408472 1493796 1438081 1476886 1451623 1483319 1531679 1447153 1210485 1239046
9999A239046j11824k65979k2022K79773k59327J30450J03968j39252J38500O5964
$$ 1239046 1127222 861243 839221 1118994 859667 990117 1094085 954833 1093333 1159297
9989A159297R3266K15432j95220j91059K67813j49951J39529k0194j49208o7208
$$ 1159297 1252563 1467995 1272775 1081716 1349529 1199578 1339107 1318913 1169705 1102497
9979A102497q510L28428Q4472k4379k09942K0389q4222J37057L09338j51037j80280
$$ 1102497 1093987 1422415 1506887 1482508 1272566 1292955 1208733 1345790 1655128 1504091 1323811
9968A323811K10142K3560p2206j32080m29466L71332L55204L1904j5769k10291
$$ 1323811 1533953 1557513 1485307 1353227 923761 1295093 1650297 1682201 1666432 1456141
9958A456141j03426k03150j27456J08450J48697J24921k8386J83895k33458j25528
$$ 1456141 1352715 1149565 1022109 1130559 1279256 1404177 1375791 1559686 1326228 1200700
9948A200700J32090R4377o8623K10513q0963j9129k49092J60716J63202p1342
$$ 1200700 1332790 1427167 1358544 1569057 1488094 1468965 1219873 1380589 1543791 1472449
9938A472449K1651o0289K8289l35J85845L49478j27305j88040K48443M4370q314
$$ 1472449 1494100 1433811 1462100 1461765 1647610 1997088 1869783 1681743 1930186 1974556 1966242
9927A966242q1168m7612J5478K121M4248j3415R9732k9825l06234J65005R0711
$$ 1966242 1885074 1837462 1852940 1855061 1899309 1885894 1985626 1955801 1649567 1814572 1905283
9916A905283p2186j87791K74262l2945m7315j72662l4752J49236j28606R7884
$$ 1905283 1833097 1645306 1919568 1886623 1839308 1666646 1631894 1781130 1652524 1750408
9906A750408n2348m6350K71094j44037n2124l7197l8472K5827J84398O7014j3843
$$ 1750408 1698060 1651710 1922804 1778767 1726643 1689446 1650974 1676801 1861199 1928213 1914370
9895A914370r0393Q7382k2552j77151J20506j46864L00599J59324j39314j73144
$$ 1914370 1823977 1911359 1888807 1711656 1832162 1685298 1985897 2145221 2005907 1832763
9885A832763K33157j10234j331O1378l7941J08539J00818K76582l07400l0802
$$ 1832763 2065920 1955686 1954355 2015733 1977792 2086331 2187149 2463731 2156331 2125529
9875B125529o9809j44011M05391L55994k92540k42022J79104J82207J8934q5520
$$ 2125529 2055720 1911709 2317100 2673094 2380554 2138532 2317636 2499843 2518777 2433257
9865B433257N5959m1709J66725r3551J00985L26641L49579j13339J8646l9162
$$ 2433257 2489216 2447507 2614232 2520681 2621666 2948307 3297886 3184547 3203193 3164031
9855C164031K85598K41580M7506l9217m1991K16389P3531K80382j21741j92761
$$ 3164031 3449629 3691209 3738715 3699498 3657507 3873896 3947427 4227809 4106068 3913307
9845C913307K51663K31030J62686j36178P4268K19662K40987K53357K5820L00714
$$ 3913307 4164970 4396000 4558686 4422508 4496776 4716438 4957425 5210782 5236602 5537316
9835E537316R7003M96565N9966N61588L29605K91111P94989J075518J181090J386413
$$ 5537316 5634319 6130884 6190850 6752438 7082043 7373154 8168143 9243661 10424751 11811164
9825A1811164J915988J985082K228203J616631J210873K93030k05860l10688J53094
$$ 11811164 13727152 15712234 17940437 19557068 20767941 21060971 20855111 20544423 20697517
9816B0697517N75378N63024J80675n44806j234919j871062k088209k215730j480398
$$ 20697517 21272895 21835919 22016594 21471788 20236869 18365807 16277598 14061868 12581470
9807A2581470j120467r96087r70625n38559l86401l62233k37458k4491k7937R2551
$$ 12581470 11461003 10464916 9494291 8955732 8569331 8207098 7969640 7945149 7917212 8009763
9797H009763j0057j92489J45768K60772k61423J06660L11195R2898L93976J17799
$$ 8009763 7999706 7807217 7952985 8213757 7952334 8058994 8370189 8463087 8857063 8974862
9787H974862K86629j7332L11265N19252K87237r6394K59629L56084L79927L91352
$$ 8974862 9261491 9244159 9555424 10074676 10361913 10265519 10525148 10881232 11261159 11652511
9777A1652511Q02770O15384O75689J110393J398985J376108J129294R77281R24520
$$ 11652511 12455281 13070665 13746354 14856747 16255732 17631840 18761134 19738415 20662935
9768B0662935R58421P97344J114241J058895J182575J451592Q59052J412035J041365
$$ 20662935 21621356 22418700 23532941 24591836 25774411 27226003 28085055 29497090 30538455
9759C0538455Q93778J079941J649317K281118K211897L068124M159146M714237
$$ 30538455 31432233 32512174 34161491 36442609 38654506 41722630 45881776 50596013
9751E0596013O206413Q678431J1472920J5394643J9611603K2366620K3028551
$$ 50596013 56802426 65480857 76953777 92348420 111960023 134326643 157355194
9744A57355194K1816170J9154035J6128221J2914723J0277580P102894M164417
$$ 157355194 179171364 198325399 214453620 227368343 237645923 244748817 248913234
9737B48913234j59627m807928q597020j2843609j7734106k1255637k2965431k3406647
$$ 248913234 248753607 243945679 235348659 222505050 204770944 183515307 160549876 137143229
9729A37143229k2419565j9135924j6073395j2880007j0022478p686915n707395
$$ 137143229 114723664 95587740 79514345 66634338 56611860 48924945 43217550
9722D3217550m683910l654175k529128k525461j937811j571358j392029j466803
$$ 43217550 38533640 34879465 32350337 29824876 27887065 26315707 24923678 23456875
9714B3456875j222920r63793j272242j221485r81164r96230j121868q80859r73432
$$ 23456875 22233955 21270162 19997920 18776435 17795271 16799041 15677173 14796314 13822882
9705A3822882o49414o33991q32018m82233l49737n46267o24348k36596m01038
$$ 13822882 13173468 12539477 11707459 11225226 10875489 10329222 9704874 9468278 9067240
9696I067240m34859k32716q5179l00911j96781k10536k02255l83356j09521j27347
$$ 9067240 8632381 8399665 8314486 8013575 7816794 7606258 7404003 7020647 6911126 6783779
9686F783779k93651l83492j87172l7059j69889j79547k15567K1363o4878j51021
$$ 6783779 6490128 6106636 5919464 5882405 5712516 5532969 5317402 5338765 5273887 5122866
9676E122866k02383l35836k20553J35579J82786j4304j10520q6626l01311q7764
$$ 5122866 4920483 4584647 4364094 4499673 4682459 4668155 4557635 4471009 4169698 4081934
9666D081934j16070J70434k15194k272j18605N9874K9751k99310m94995O1854
$$ 4081934 3965864 4136298 3921104 3918832 3800227 3860101 3889852 3590542 3095547 3157401
9656C157401k8292K47693K6228j73453j86807J40402k39035j71075M7721q9399
$$ 3157401 3129109 3376802 3403030 3229577 3042770 3183172 2944137 2773062 2820783 2731384
9646B731384j34292J388j33615j15266P6934q2237k4504J02297m6233j80023L98748
$$ 2731384 2597092 2598480 2464865 2349599 2426533 2344296 2319792 2422089 2375856 2195833 2594581
9635B594581J47861L8264n7553R5492k76256l00242j55231k01635K95281N0095
$$ 2594581 2742442 2780706 2723153 2818645 2542389 2242147 2086916 1885281 2180562 2230657
9625B230657K21215l50439l46058K27255k97853K17419J60334o9535p5752m9590
$$ 2230657 2451872 2101433 1755375 1982630 1684777 1902196 2062530 1992995 1917243 1867653
9615A867653J66898j84693j4210J88521J61119J5715o920q3287N4665p0622K33916
$$ 1867653 2034551 1849858 1835648 2024169 2185288 2201003 2194083 2110796 2165461 2094839 2328755
9604B328755L29085j09202M1506K02910K45693j5481K13508K30422L40556N4192
$$ 2328755 2657840 2548638 2590144 2793054 3038747 3023266 3236774 3467196 3807752 3861944
9594C861944K40494M56706P58709M46420O44397P78302Q60602P55437Q16901P81074
$$ 3861944 4102438 4559144 5317853 5764273 6408670 7186972 8047574 8803011 9619912 10400986
9584A0400986L14534K17853K84043m9553n54515m72263p05262q11191r52168p94337
$$ 10400986 10715520 10933373 11217416 11167863 10613348 10141085 9435823 8624632 7672464 6878127
9574F878127q24957p87262m42098m89257m59274j13803k98963L2581M1301j81977
$$ 6878127 6053170 5265908 4823810 4334553 3875279 3761476 3462513 3495094 3536395 3354418
9564C354418o8698J41300L49088L74291L61465J74125K13185M72659O79132R43675
$$ 3354418 3285720 3427020 3776108 4150399 4511864 4685989 4899174 5371833 6050965 6994640
9554F994640J054490J252885J124066J544311K008859J927258J680044R07040
$$ 6994640 8049130 9302015 10426081 11970392 13979251 15906509 17586553 18493593
9546A8493593n36527j937447k322402j803234j790673j736174j238321p97376
$$ 18493593 17957066 16019619 13697217 11893983 10103310 8367136 7128815 6331439
9538F331439p42237j031010l76503n30808l46223l75980l40417k89219j90885
$$ 6331439 5589202 4558192 4181689 3650881 3304658 2928678 2588261 2299042 2108157
9529B108157j38816J61632q5477j45236l5831p4416j49469j06196q4465O6282
$$ 2108157 1969341 2130973 2045496 1900260 1864429 1790013 1640544 1534348 1449883 1516165
9519A516165j11550J08646p6935o0691J38877q7942k7507J02314j5670q215Q4991
$$ 1516165 1404615 1513261 1436326 1375635 1514512 1426570 1399063 1501377 1485707 1477492 1562483
9508A562483k5425j23383j14308j22326M7863M52943l82235k75714P7752M7289
$$ 1562483 1537058 1413675 1299367 1177041 1224904 1677847 1295612 1019898 1097650 1144939
9498A144939K35284j99766k30125M11046N493K72049k3890j47184J16521p958
$$ 1144939 1380223 1180457 950332 1361378 1366871 1638920 1615030 1467846 1584367 1576409
9488A576409M2170j09660K66086J72353m33687J75622L05187j28447L1634j81438
$$ 1576409 1618579 1508919 1775005 1947358 1513671 1689293 1994480 1866033 1897667 1716229
9478A716229K14364K39945r3435p6238Q8244L38783J67391J35632L98500K13306
$$ 1716229 1930593 2170538 2077103 2000865 2089109 2427892 2595283 2730915 3129415 3342721
9468C342721L05110q0899k79942j03229k88418j64591m43763k82040O2062N4902
$$ 3342721 3647831 3566932 3286990 3183761 2895343 2730752 2286989 2004949 2067011 2121913
9458B121913j18304J11250l45496J64347R3982j70661j49146O4663J30111j97395
$$ 2121913 2003609 2114859 1769363 1933710 2027692 1857031 1707885 1772548 1902659 1705264
9448A705264l5667L05J9438j52735j33835j8306Q9819K3373m7472J17407j56001
$$ 1705264 1669597 1669902 1689340 1536605 1402770 1384464 1474283 1497656 1450184 1567591 1411590
9437A411590L57553J19292n6510J28297J2792J57415K46544j0011l83243k28591
$$ 1411590 1769143 1888435 1831925 1960222 1973014 2130429 2376973 2366962 1983719 1755128
9427A755128R687P6579J48529j23496k67980M14581N0360M0312j05164l7085l4486
$$ 1755128 1764815 1841394 1989923 1866427 1598447 2013028 2063388 2103700 1998536 1961451 1926965
9416A926965J49703Q2248j8583k90428O031R8610L34202m5872k17507n1409J4833
$$ 1926965 2076668 2158916 2140333 1849905 1855936 1954546 2288748 2242876 2025369 1973960 1988793
9405A988793M30984K89683J60340Q3884l3568k6178N278J11191K72897O1090K37429
$$ 1988793 2419777 2709460 2869800 2953684 2920116 2893938 2899216 3010407 3283304 3344394 3581823
9394C581823L11157j06740j36101l54365m13595k37413m92077k31565M1405J4800
$$ 3581823 3892980 3786240 3650139 3295774 2882179 2644766 2152689 1921124 1962529 1977329
9384A977329O047K35184p8983K0021j50854L5331K47393R2097k83118j96007J71876
$$ 1977329 1983376 2218560 2139577 2159598 2008744 2044075 2291468 2383565 2100447 1904440 2076316
9373B076316J30541j26580K24131J96102k4262K94311J9988k9109L27751J49330
$$ 2076316 2206857 2080277 2304408 2500510 2476248 2770559 2790547 2761438 3089189 3238519
9363C238519m0918j98151K0978o1129J07796k86764K881J46455p9940j25212k13395
$$ 3238519 3197601 2999450 3020428 2959299 3067095 2780331 2783212 2929667 2849727 2724515 2511120
9352B511120m0835J7131J98991J35064j6173j14802L8757j04375m9099J35394
$$ 2511120 2470285 2487416 2686407 2821471 2805298 2690496 2729253 2624878 2575779 2711173
9342B711173J57254j06017J79322Q8200L88948K73570o1416K40536J06263n2970
$$ 2711173 2868427 2762410 2941732 3029932 3418880 3692450 3631034 3871570 3977833 3924863
9332C924863M0029L2498L97389N21097K42042K19379M51416L26306O89261J202911
$$ 3924863 3964892 3997390 4394779 4915876 5157918 5377297 5828713 6155019 6844280 8047191
9322H047191J396595K440521L301910L380000K388895K61706j144362j699718
$$ 8047191 9443786 11884307 15186217 18566217 20955112 21216818 20072456 18372738
9314A8372738j049373L98067J394030J539715N95897j009794k444846l024501
$$ 18372738 17323365 17721432 19115462 20655177 21251074 20241280 17796434 14771933
9306A4771933k344038k041074j910572j428279j019196n89288m23742l17442l95388
$$ 14771933 12427895 10386821 8476249 7047970 6028774 5439486 5015744 4698302 4302914
9297D302914l82929p8440m46209l05692K69847r3934R2882M3326l81840K451j09419
$$ 4302914 3919985 3841545 3395336 3089644 3359491 3265557 3358439 3401765 3019925 3022376 2912957
9286B912957r1529J49668J90497m7286j94727k87198k63905K16921J66393J56019
$$ 2912957 2821428 2971096 3161593 3114307 2919580 2632382 2368477 2585398 2751791 2907810
9276B907810O0524k27333J25796J60942k0841K92779O30M25357K37290K18206
$$ 2907810 2968334 2741001 2866797 3027739 3006898 3299677 3300307 3725664 3962954 4181160
9266D181160Q67059P94338Q11687K69752j65838l45478k14018m167J67233L98772
$$ 4181160 5048219 5842557 6654244 6923996 6758158 6412680 6198662 6194495 6361728 6760500
9256F760500J77165k05789l38499n27473l34211m67390m99507p79861j57396K8245
$$ 6760500 6937665 6731876 6393377 5865904 5531693 5064303 4564796 3784935 3627539 3655784
9246C655784k08301j20481q6271j45754o0629L9585R4773n6163k39265j9317R2835
$$ 3655784 3447483 3327002 3240731 3094977 3034348 3073933 3168706 3112543 2873278 2853961 2946796
9235B946796j8554l4588N1034J35216L20362r6467j34719K67505n8819l04273
$$ 2946796 2928242 2893654 2944688 3079904 3400266 3303799 3169080 3436585 3377766 3073493
9225C073493K22877K84117n8835j0072m63062l04433K2032k43495J52349Q91j34790
$$ 3073493 3296370 3580487 3521652 3511580 3048518 2744085 2766117 2522622 2674971 2675862 2541072
9214B541072P6620l789O5601M08835P0941l09627M4697Q2459j99263p0493J63361
$$ 2541072 2617692 2613903 2679504 3088339 3159280 2849653 2894350 2976809 2777546 2707053 2870414
9203B870414J88428k14349K18639K48229M2106m20602m4602K31308K73405o8754
$$ 2870414 3058842 2844493 3063132 3311361 3353467 2932865 2888263 3119571 3392976 3324222
9193C324222l2915J20525L20860Q9580J43422r4972R898J21104j43271J70155
$$ 3324222 3291307 3411832 3732692 3822272 3965694 3870722 3880620 4001724 3858453 4028608
9183D028608J47222n27464K86503M21598q3912J82628J36882J60782p0019Q9063
$$ 4028608 4175830 3648366 3934869 4356467 4272555 4455183 4592065 4752847 4682828 4771891
9173D771891R9851M2724J84840L05915j44648J38932M65840Q3516J24004J85159
$$ 4771891 4871742 4914466 5099306 5405221 5260573 5399505 5865345 5948861 6072865 6258024
9163F258024K06420N16589J16961j27214K2076j43515L03076K36916l54442l32743
$$ 6258024 6464444 6981033 7097994 6970780 6992856 6849341 7152417 7389333 7034891 6702148
9153F702148M5010j00610J0305K01309r0487L84971j53138K9927J03999j41595
$$ 6702148 6747158 6646548 6656853 6858162 6767675 7152646 6999508 7029435 7133434 6991839
9143F991839j07576J61116L9718L4097J83420L93665L71184J19296J18454K90245
$$ 6991839 6884263 7045379 7085097 7119194 7302614 7696279 8067463 8186759 8305213 8595458
9133H595458L73272J18288M28899P86629L08096L11382N07865Q27307J189058
$$ 8595458 8968730 9087018 9515917 10302546 10610642 10922024 11429889 12257196 13446254
9124A3446254J079329J309843R07104R43470J147957P54194L69385O6863M1566
$$ 13446254 14525583 15835426 16742530 17686000 18833957 19588151 19957536 20024399 20065965
9115B0065965j47455j71410k82515J26491N97731P68688P12198N26328M29258
$$ 20065965 19918510 19747100 19464585 19591076 20188807 20957495 21669693 22196021 22625279
9106B2625279Q02755J335437J677992K836754L553595L178814K113256P73962
$$ 22625279 23428034 24763471 26441463 29278217 32831812 36010626 38123882 38897844
9098C8897844k72316p34864k66657R04008J142012N43088j73477q37144j448010
$$ 38897844 38625528 37890664 37624007 38528015 39670027 40213115 40039638 39202494 37754484
9089C7754484j236990j133148j017172q00422n04354j88415N12778J115336J106206
$$ 37754484 36517494 35384346 34367174 33566752 33062398 32873983 33386761 34502097 35608303
9080C5608303J631313J567463K022367K067494L030583L274665L809260M553755
$$ 35608303 37239616 38807079 40829446 42896940 45927523 49202188 53011448 57565203
9072E7565203N191517O332610P033897Q782731J0578136J3457659J7725865K4004822
$$ 57565203 62756720 69089330 76123227 84905958 95484094 108941753 126667618 150672440
9064A50672440L2095167L8259124L7938210L0666337J8956738J0557677J2808678
$$ 150672440 182767607 221026731 258964941 289631278 308588016 319145693 331954371
9057C31954371K5276525M1332621M9685216M5733016K7928269K851514j7832059
$$ 331954371 357230896 398563517 448248733 493981749 521910018 524761532 506929473
9050E06929473l1542079m2234164n2515794n7849500n5195582m8175324l8964419
$$ 506929473 475387394 433153230 380637436 322787936 267592354 219417030 180452611
9043A80452611l0258487k3681157j8448830j4317299j1206442q802915o570062
$$ 180452611 150194124 126512967 108064137 93746838 82540396 73737481 67167419
9036F7167419m885228m139409l472831l202367k338377j750499j902724j755112
$$ 67167419 62282191 58142782 54669951 51467584 49129207 47378708 45475984 43720872
9028D3720872k029633k215907k198827j602915j710872j337101q64043q75499
$$ 43720872 41691239 39475332 37276505 35673590 33962718 32625617 31761574 30886075
9020C0886075j63248J00528O41900J782911K547612K625533J844205Q41967r05210
$$ 30886075 30722827 30823355 31465255 33248166 35795778 38421311 40265516 41107483 40202273
9011D0202273j603694k017367l124317l249825l142153l228581k381049j720187
$$ 40202273 38598579 36581212 33456895 30207070 27064917 23836336 21455287 19735100
9003A9735100j681180j134907j063846p07346n18025p30300m24909l57666J40077
$$ 19735100 18053920 16919013 15855167 15147821 14629796 13899496 13474587 13116921 13256998
8994A3256998N3112M2156L04727K12422K93879J89772J4463J86479j4544j05581
$$ 13256998 13310110 13352266 13656993 13869415 14163294 14353066 14367529 14554008 14539464 14433883
8984A4433883j49435k66745m84013p08686r94482n56455r70629o23035p02068
$$ 14433883 14284448 14017703 13533690 12825004 11830522 11274067 10303438 9680403 8978335
8975H978335p26169r5457l57943k40703p1664k79522j58441j42234k67566r9841
$$ 8978335 8252166 8156709 7798766 7558063 7486399 7206877 7048436 6906202 6638636 6538795
8965F538795l666P9887j8429O9605K28676L40643N83389P33500N24571O10088
$$ 6538795 6535129 6615016 6596587 6666192 6894868 7235511 7818900 8552400 9076971 9687059
8955I687059N93340J00026J06235L00293j922m19229k76553n54441r91119n77760
$$ 9687059 10280399 10380425 10486660 10786953 10785031 10365802 10089249 9534808 8543689 7965929
8945G965929q79201p70078p07110o54648m73602m09138j37630l61137r9787j65946
$$ 7965929 7086728 6316650 5609540 4954892 4481290 4072152 3934522 3573385 3473598 3307652
8935C307652J59143j09681k40690N0466K09884K19900j03067L0330R9114P0405
$$ 3307652 3466795 3357114 3116424 3166890 3376774 3596674 3493607 3523937 3623051 3693456
8925C693456q045P070J89582J89300N55852P20892J7357K78540k00194j04428
$$ 3693456 3685411 3692481 3882063 4071363 4627215 5348107 5365464 5644004 5443810 5339382
8915E339382K23195l25019m34419l16759k64053n63737n90246m79966n05398l0713
$$ 5339382 5562577 5237558 4803139 4486380 4222327 3658590 3068344 2588378 2082980 2052267
8905B052267j14162K6026m2891R443k79422m9542l7530J54994K40037j0599q1942
$$ 2052267 1938105 1964131 1921240 1930683 1651261 1601719 1564189 1719183 1959220 1948621 1866679
8894A866679N9133l22987p5702k41234k193K15733j18787l06427K82800k50662
$$ 1866679 1925812 1602825 1527123 1285889 1283696 1499429 1380642 1074215 1357015 1106353
8884A106353l95942j58461J10457m2345k20377r638j87231M4106Q8811J40060
$$ 1106353 710411 551950 662407 620062 399685 390047 202816 246922 335733 475793
8874D75793K0548K26412l07264k26699J98012N1210j27789k2764j7481L45060
$$ 475793 496341 722753 415489 188790 386802 438012 310223 287459 269978 615038
8864F15038k22442j32884Q6250L45893J55332j80148k5492o9804J5234l07889
$$ 615038 392596 259712 345962 691855 847187 667039 641547 571743 586977 279088
8854B79088k3683m3378k80307M29501R4823N2697j27904O3028L7544J09051l16925
$$ 279088 255405 212027 -68280 361221 456044 508741 380837 443865 481409 590460 273535
8843B73535k09704J06810J22901j15588J75680p6596m8203Q2860j92029J04316
$$ 273535 63831 170641 293542 177954 353634 277038 228835 311695 119666 223982
8833B23982k81951J0121L73519k63975J14540M85131N3148k80106m672K26698
$$ 223982 -57969 -47848 325671 61696 176236 661367 714515 434409 429737 656435
8823F56435j64951j66642l3268P6586q9870p2515M1306M74695j58132k34110N07007
$$ 656435 491484 324842 291574 368160 278290 205775 247081 721776 563644 329534 836541
8812H36541J39733m11186M41088K21003o0420K84792J68492p6228J14722M1781
$$ 836541 976274 565088 1006176 1227179 1166759 1451551 1620043 1543815 1658537 1700318
8802A700318q4600r6697j4086n3868q1467l7653M336J33765K19313M14487N59437
$$ 1700318 1615718 1519021 1504935 1451067 1369600 1331947 1336283 1470048 1689361 2103848 2663285
8791B663285Q91100O83235L29479L70972M56670K12103K24343j20580j01472l29336
$$ 2663285 3554385 4237620 4567099 4938071 5394741 5606844 5831187 5710607 5609135 5279799
8781E279799p20350m00151j84524l55322k64427k32914j50484k0920K86887k46688
$$ 5279799 4559449 4159298 3974774 3619452 3355025 3122111 2971627 2950707 3237594 2990906
8771B990906o3273k64714k05486M2448P9087j26911l25799j16838O1917L97118
$$ 2990906 2927633 2662919 2457433 2499881 2578968 2452057 2126258 2009420 2071337 2468455
8761B468455M52020L35476M76262Q68368P59131Q24285L87146Q59559P48568K97020
$$ 2468455 2920475 3255951 3732213 4600581 5359712 6183997 6571143 7430702 8179270 8476290
8751H476290k87651m00063j82402m48606o71079p44346q91323o68449p97887k91975
$$ 8476290 8188639 7788576 7606174 7157568 6486489 5742143 4850820 4182371 3384484 3092509
8741C092509n74138L2116N5680m16066l46289j10126J20194n9492q1013j57464
$$ 3092509 2518371 2550487 2606167 2190101 1843812 1733686 1853880 1794388 1713375 1555911
8731A555911o3154k37293j22274J82729K20812L25810L93139M13385O98948R4931
$$ 1555911 1492757 1255464 1133190 1315919 1536731 1862541 2255680 2669065 3368013 3462944
8721C462944K80558J95759J24994J88900L1196k09803J62867l74292n36132l58992
$$ 3462944 3743502 3939261 4064255 4253155 4284351 4074548 4237415 3863123 3326991 2967999
8711B967999n18563n17636j96591J4518k50714J94280R4301l61424m30286P0735
$$ 2967999 2449436 1931800 1735209 1749727 1499013 1693293 1787594 1426170 995884 1066619
8701A066619j18808J64797p4421p5576Q7818k513J7899k0170m1353J36764J84345
$$ 1066619 947811 1112608 1038187 962611 1050429 1047916 1065815 1045645 1004292 1141056 1325401
8690A325401L7927J86384J10581j42701k06381P7301p0816q6106m45928q1980
$$ 1325401 1363328 1549712 1660293 1517592 1311211 1388512 1317696 1231590 785662 703682
8680G03682N3179j67692J13721R5567M6014n4965j77263K99964j97881q2378L69239
$$ 703682 756861 589169 702890 798457 844471 789506 612243 912207 714326 631948 1001187
8669A001187K0326L5029j26210l24750r6091j23687J86883L5346J63995j15966
$$ 1001187 1021513 1056542 930332 605582 509491 385804 572687 608033 772028 656062
8659F56062j96365J96565j25275J4340N5882L58202J89912q8475K6726l3306l14041
$$ 656062 459697 656262 530987 545327 601209 959411 1149323 1060848 1087574 1054268 740227
8648G40227l4924K3176K18410N7721l43705k44746K20693K3247j02385J7653k85496
$$ 740227 705303 728479 946889 1004610 660905 416159 636852 660099 557714 575367 289871
8637B89871j82809J38987K56359j04595j9374K3895R6744O9881k29788j86926
$$ 289871 107062 246049 502408 397813 378439 402334 499078 568959 339171 152245
8627A52245q790k68706M15224L45606k64127J07140J13580R8799r9933j44198
$$ 152245 143455 -125251 289973 635579 371452 478592 592172 690971 591038 446840
8617D46840j10899j1095K24458R6491M2751j81852o0763K93599j07002o9643J16796
$$ 446840 335941 324846 549304 645795 688546 506694 445931 739530 632528 562885 679681
8606F79681K1652j54471J29638K72371N2447L7215K13711M7960J58592l8423L50940
$$ 679681 701333 546862 676500 948871 1001318 1038533 1252244 1300204 1458796 1420373 1771313
8595A771313j57013J38888L55095K38021O11335L38475M76003J158008K130812
$$ 1771313 1614300 1753188 2108283 2346304 2957639 3296114 3772117 4930125 7060937
8586G060937K475933K916756M279381L422875l1833k928361l737800k796545k535180
$$ 7060937 9536870 12453626 16733007 20155882 20124049 17195688 13457888 10661343 8126163
8577H126163j855422j466198q69996q93653q50316l20536l78861j96404l09684
$$ 8126163 6270741 4804543 3934547 3040894 2190578 1870042 1491181 1294777 985093
8568I85093j11475K41985m06237l24766J03699J79920n5765k2750J4212K83449
$$ 985093 873618 1115603 709366 384600 488299 668219 612454 589704 603916 887365
8558H87365J20414q8856r5932j61214j9088j6998k65109j09944L5162M2434m6913
$$ 887365 1007779 918923 822991 661777 642689 625691 360582 250638 285800 328234 281321
8547B81321K9892J82635k79140O6960k2475j68865J32610J91554J8491k13054
$$ 281321 311213 493848 214708 281668 259193 90328 222938 414492 432983 219929
8537B19929J68102j52919o2277j36891J1062P4849l42759o8095k06561J99202
$$ 219929 388031 235112 172835 35944 47006 121855 -220904 -288999 -495560 -296358
8527b96358K34294J53955m1118j09315J72865J59652j88124j63302O3962j31670
$$ -296358 -62064 91891 50773 -58542 114323 273975 85851 -77451 -13489 -145159
8517a45159m4263M9708J11443N2637j37743L14398J16898K2555l1859l49967j32251
$$ -145159 -189422 -139714 -28271 24366 -113377 201021 317919 340474 308615 -41352 -173603
8506a73603m7992j2141M13518j02670M7632j09972P199j09610o0699J14872o2631
$$ -173603 -221595 -233736 179782 77112 124744 14772 21971 -87639 -148338 -33466 -96097
8495i6097J20202P4316j44592j15137J28128j44054N1400J05612k7508k7669k6189
$$ -96097 24105 98421 -46171 -161308 -33180 -177234 -125834 -20222 -47730 -75399 -101588
8484a01588M1042m2619m2153K9868K4372J18198j43900J12325j13999m326j83256
$$ -101588 -60546 -103165 -145318 -115450 -91078 27120 -116780 -4455 -118454 -122780 -306036
8473c06036K46225K80851j37274j01627r7445P4553O0937J32887j13415p4426
$$ -306036 -59811 221040 83766 -17861 -115306 -40753 20184 153071 39656 -34770
8463c4770K19705j29917j00131R0732N2288k5997r2529J6470J20944K4142k05226
$$ -34770 184935 55018 -45113 45619 97907 71910 -20619 -4149 116795 140937 -64289
8452f4289k37471J67801j9213j39489K54464q0459j54533Q8183K61874j94633
$$ -64289 -301760 -133959 -153172 -292661 -38197 -118656 -273189 -185006 76868 -117765
8442a17765K8934K11876j14257j73682j99311M1716K40160k8710O7133Q5437N7496
$$ -117765 -88831 123045 8788 -164894 -364205 -322489 -82329 -111039 -43906 41531 99027
8431I9027j71206P2607L49939r8617k38284j66867P2519O4743Q4141K46303m18881
$$ 99027 -72179 428 350367 251750 13466 -153401 -80882 -16139 68002 314305 -104576
8420a04576k9155j74239k45073M12761N2382m2863L5953j5708k15019L4230n582
$$ -104576 -133731 -307970 -553043 -140282 -87900 -130763 -94810 -110518 -325537 -291307 -296889
8409b96889J49391J03175K45579j13771J35580m9377l28161j81473K79702J37955
$$ -296889 -147498 -44323 201256 87485 223065 173688 -154473 -335946 -56244 81711
8399H1711r2252J56030j06874J0344K8181q2774j1171K5454Q865N459l41902K16700
$$ 81711 -10541 145489 38615 48959 77140 -5634 -16805 8649 17514 22973 -318929 -102229
8387a02229J20224J3918O6181k22882r6247P584K73494j84231J50928P2697N0692
$$ -102229 17995 31913 98094 -124788 -221035 -213451 60043 -124188 26740 99437 150129
8376A50129J25336r9294l7349j48294j02540o5711j49751J41018L42630K31115
$$ 150129 275465 176171 138822 -9472 -112012 -177723 -327474 -186456 156174 387289
8366C87289n011l58956l89378J42413L02405k8808l9041j57939j0817J47208K04698
$$ 387289 382278 23322 -366056 -223643 78762 49954 10913 -147026 -157843 -10635 194063
8355A94063j50339o7596J73126O1573j32927Q0138K7849J03504j29294j75799
$$ 194063 43724 -23872 149254 210827 77900 158038 185887 289391 160097 -15702
8345a5702K0500j21165L6153k642K83027J6804k59524R6085k14344j57332j24689
$$ -15702 4798 -116367 -80214 -82856 200171 216975 -42549 53536 -160808 -318140 -442829
8334d42829P4865K30149Q2284r6709J53034j40690J73131M3978L20208K2519r0620
$$ -442829 -367964 -137815 -55531 -152240 794 -139896 33235 77213 397421 419940 329320
8323C29320j9268k03229l4934K5662P7189l8598K2389m9767j18931q9590k8091
$$ 329320 310052 106823 71889 97551 174740 136142 158531 108764 -10167 -99757 -127848
8312a27848p6095N1682l0804O7403n3659o6337M13246P0930j76741m3652j89481
$$ -127848 -203943 -152261 -183065 -115662 -169321 -235658 177588 248518 71777 28125 -161356
8301a61356P6967J02978J21815r6482l01676J6590L15751M2420j04390K6847L06166
$$ -161356 -84389 18589 140404 43922 -257754 -241164 74587 117007 12617 39464 345630
8290C45630n8255k97369J72763K01222k26602J12222R5147l50916p9506R9763
$$ 345630 287375 -9994 162769 363991 137389 249611 344758 -6158 -85664 14099
8280A4099n5871j2049l09425K74575k42257K07837J25701j9864L5930M4090R5973
$$ 14099 -41772 -53821 -363246 -88671 -330928 -123091 2610 -17254 18676 62766 158739
8269A58739N7284N2465n9557j03422k18491O9430m2510K5445J2693L4893L0759
$$ 158739 216023 268488 208931 105509 -112982 -43552 -86062 -60617 -47924 -13031 17728
8258A7728m076R6036J74731j32960j21082L8127l6258l86555J74489J52522o8743
$$ 17728 13652 109688 284419 151459 30377 68504 32246 -354309 -179820 -27298 -96041
8247i6041J48556j64748r3698J87655n220k9663n7793J20787J17741j77687j54310
$$ -96041 52515 -112233 -205931 -18276 -23496 -53159 -110952 9835 127576 -50111 -204421
8236b04421R354J21230J93019j13408o2339K00194J8242j90964J30981J9189R8801
$$ -204421 -195067 -73837 119182 5774 -56565 143629 161871 -29093 101888 121077 219878
8225B19878q5913m2877J34802J73293o6840m62685J44653K50929l29727p6017
$$ 219878 133965 91088 225890 399183 332343 -130342 14311 265240 -64487 -140504
8215a40504J6306K15614L3420O6313J66870q7942r7675j66766L39352L9954k24243
$$ -140504 -124198 91416 124836 191149 358019 270077 172402 5636 344988 384942 160699
8204A60699N9788Q925J51343J18714j61365O6299J07919j66960p1990J35717K84861
$$ 160699 220487 229412 380755 499469 338104 404403 512322 345362 273372 409089 693950
8193F93950N00204k202451p44501J132509j40547J72198L91841j47121m8720J06888
$$ 693950 1194154 -1008297 -1752798 -620289 -760836 -588638 -196797 -343918 -392638 -285750
8183b85750k4002J04448j55026m9129q9348j07451K98293O892l07718K95886J31968
$$ -285750 -309752 -205304 -360330 -409459 -498807 -606258 -307965 -301073 -608791 -312905 -180937
8172a80937j38626r6494J72542K99413k045j73362o9712n3740K73626m236N3045
$$ -180937 -319563 -416057 -243515 55898 53853 -119509 -189221 -242961 30665 26429 79474
8161G9474k00742q0569j85413n1414L97542j72241l08504N4034L77358M23018
$$ 79474 -121268 -201837 -387250 -438664 -41122 -213363 -521867 -467833 -90475 332543
8151C32543L338k78494J03040k02736k58733j88686J164L49807R7802M1475J09676
$$ 332543 335881 57387 160427 -42309 -301042 -489728 -488564 -138757 -40955 520 110196
8140A10196k71167l85897j22137L39668J66824j46179J69017J02080p1715l9777
$$ 110196 -160971 -546868 -669005 -329337 -162513 -308692 -139675 -37595 -109310 -149087
8130a49087J62304K17108k65960k88105J68199K62818n9304p0280j57675R8353
$$ -149087 13217 230325 -35635 -323740 -155541 107277 47973 -22307 -179982 -81629
8120h1629K26147J25033L7674j60600k2293k33131J14411K86597j26248k57134
$$ -81629 144518 269551 307225 146625 124332 -108799 5612 292209 165961 -91173
8110i1173L8757o435J93111j41439j21949K5302Q2160J65871l1907j89681k28723
$$ -91173 -52416 -58851 134260 -7179 -129128 -103826 -21666 144205 112298 -77383 -306106
8099c06106J45960K00896O6694m2405j87098L42629L9688l60165R542M6867J38467
$$ -306106 -160146 40750 107444 65039 -122059 220570 260258 -99907 -90365 -43498 94969
8088I4969k00951P6570K75246l6674k3017m13193j23789k2354n0501J23693Q4216
$$ 94969 -105982 -29412 245834 209160 186143 -227050 -350839 -373193 -423694 -300001 -215785
8077b15785p7932J10661J17418k4712K85793k46901j38757r2036K30616j4450
$$ -215785 -293717 -183056 -65638 -90350 195443 -51458 -190215 -282251 -51635 -66085
8067f6085n3191o6624o5534k6123J16483L26226r0684l0289M8606r4074K13040
$$ -66085 -119276 -185900 -251434 -277557 -161074 165152 74468 44179 92785 -1289 211751
8056B11751l7174l01102J16875m209j8002j28367r0044j10769N6999K43671L32027
$$ 211751 174577 -126525 -9650 -13859 -31861 -160228 -250272 -361041 -304042 -60371 271656
8045B71656N0434n0663O0360j19146K6339o7577j9105k12837k48000K16479j3285
$$ 271656 322090 271427 331787 212641 238980 171403 152298 -60539 -308539 -92060 -105345
8034a05345j4637m7874Q5860Q9426r1797K32994j14557K9204l22008K25309M06074
$$ -105345 -119982 -167856 -81996 7430 -84367 148627 34070 63274 -258734 -33425 372649
8023C72649j74359L472J74053O0332l43466J15695J2015j4644j0519q8047o7444
$$ 372649 198290 201762 375815 436147 92681 208376 220391 205747 195228 107181 39737
8012C9737p238p8689O0507J0534l5183r448j40876L1807K10672K23512j47389
$$ 39737 32499 -46190 14317 24851 -10332 -19780 -160656 -128849 81823 305335 157946
8001A57946j18495o0553J65797J1463j9165k05096J9651L6720J61256L56077j60053
$$ 157946 39451 -21102 144695 156158 136993 -68103 -48452 -11732 149524 505601 345548
7990C45548N8455k0837j22000n9837j07199k38632J72826O5904n2895j59287j03097
$$ 345548 404003 383166 261166 201329 94130 -144502 28324 94228 41333 -117954 -221051
7979b21051M6216k6536K05712L44292j24916j28809l6563k8424K00293o0793j32062
$$ -221051 -174835 -201371 4341 348633 223717 94908 58345 29921 230214 169421 37359
7968C7359J86340O8937j22513o7975j20625p8219n0169R8803M7279Q4816O1878
$$ 37359 223699 292636 170123 102148 -18477 -96696 -146865 -48062 -783 84033 145911
7957A45911R8526n808j65451k78594m419L93351j63449m3948J88804k52695k78835
$$ 145911 244437 238629 73178 -205416 -209835 183516 20067 -23881 164923 -87772 -366607
7946c66607K59326L28097Q503P8037n112j90053k38936K84678J94142p9746q3346
$$ -366607 -107281 220816 229319 307356 302244 112191 -126745 157933 352075 272329 188983
7935A88983Q5139O2186k162j46807k00356j67368N503j68058K11453j7281R2615
$$ 188983 274122 336308 334146 187339 -13017 -180385 -174882 -342940 -131487 -148768 -56153
7924e6153O1089J27217R5192j84596n7158K1778P5080m05456K69667O7464J19681
$$ -56153 4936 132153 227345 42749 -14409 7369 82449 -323007 -53340 14124 133805
7913A33805n2392k03711M1297O6224n5029Q3224L09003j7246k48964j31772K4655
$$ 133805 81413 -122298 -81001 -14777 -69806 13418 322421 305175 56211 -75561 -50906
7902e0906J22355K56046J24343k81500q4975Q6541k18423J33118r2533O165n9478
$$ -50906 71449 327495 451838 170338 85363 171904 -46519 86599 -5934 231 -59247
7891e9247N0268l6016J09284J1906k29402Q9065J4133J15786p9414k1795m9569
$$ -59247 -8979 -44995 64289 76195 -153207 -64142 -50009 65777 -13637 -35432 -85001
7880h5001o5294L7604j04519J28602L37778j42560N4156o206M1456j63820K5118
$$ -85001 -150295 -112691 -217210 -88608 249170 106610 160766 154560 196016 32196 57314
7869E7314J30183j12875j664Q7967K37259l85484j44262L08248j3834M0842j01869
$$ 57314 187497 74622 72958 160925 398184 12700 -131562 176686 162852 203694 101825
7858A01825o2643j61974O2061J4495O7305L42730j77443P301J39890l15694k35055
$$ 101825 39182 -122792 -60731 -46236 21069 363799 186356 193657 333547 17853 -217202
7847b17202O4048P1885J25351J08943N9714R7461q6785j96312m748K19263N868
$$ -217202 -153154 -81269 44082 153025 212739 310200 223415 27103 22355 241618 247486
7836B47486k46288J7984J94949j19527K17913k49168o3477M9537j9212J19312
$$ 247486 1198 19182 214131 94604 312517 63349 -128 49409 30197 149509
7826A49509Q6637k2602J14203j0700R980O8140j85131l07257K08330j22296k00141
$$ 149509 236146 213544 327747 317047 327027 395167 210036 -97221 111109 -11187 -211328
7815b11328K50835o6807J71307L2594J1549k12186j00464J88449M396J09087J80393
$$ -211328 39507 -27300 144007 176601 188150 -24036 -124500 63949 68345 177432 357825
7804C57825j21488K19451J31411K33879n27311m41226L20666j14980O7433K00536
$$ 357825 236337 455788 587199 821078 293767 -147459 173207 58227 125660 326196
7794C26196j73944J87260p402k33530K4611m5037n9310p2593K75691L07123k4963
$$ 326196 152252 339512 332110 98580 123191 78154 18844 -53749 221942 529065 504102
7783E04102Q1876K07056L71897Q9573j21916l55604p9463j12113j87253k3338
$$ 504102 585978 793034 1164931 1254504 1132588 776984 697521 585408 398155 374817
7773C74817P7351k61829j49145K02347K20094o4590L3498N4369J94017j84947
$$ 374817 452168 190339 41194 243541 463635 399045 432543 486912 680929 495982
7763D95982k54337j4820L6706J93442J64790o0645L3214R2005J37674M5409K52665
$$ 495982 241645 226825 263531 456973 621763 561118 594332 686337 824011 869420 1122085
7752A122085L10291L33026O53338J31932r4328m96074l67118j79486j98380l14264
$$ 1122085 1432376 1765402 2418740 2550672 2456344 1960270 1593152 1413666 1215286 901022
7742I01022j59071L00557J8242n9441j79596k70557K5348J1074j10964m5258M5503
$$ 901022 741951 1042508 1060750 1001309 821713 551156 576504 587578 476614 431356 476859
7731D76859N8361p1182j25557K36818j13619J47475K44733j66309J89305L95411
$$ 476859 535220 464038 338481 575299 461680 609155 853888 687579 876884 1272295
7721A272295L58165P63819L34482j70112m4761m59995k93142k51924j47267r7910
$$ 1272295 1630460 2394279 2728761 2558649 2513888 2053893 1760751 1508827 1361560 1263650
7711A263650m59149l18143R1415p7684m7207J01949l07131o9784J03023J59048
$$ 1263650 804501 486358 577773 500089 452882 554831 247700 177916 280939 439987
7701D39987k19516K10260p759j23164p1213K19222J06977k39576k0518j30079
$$ 439987 220471 430731 422972 299808 228595 447817 554794 315218 294700 164621
7691A64621K89675J35691K82427J73053o5867o120m9372k83373j35297J02873
$$ 164621 454296 589987 872414 1045467 979600 973480 924108 640735 505438 608311
7681F08311J07821k45261l01791K06615P7854o7501j78851l31615K1295K24900
$$ 608311 716132 470871 169080 375695 453549 386048 207197 -124418 -103123 121777
7671A21777j40393O0808J0534J21640J2678n8044j09905K85108o9593m8791j07214
$$ 121777 -18616 42192 52726 174366 187044 129000 19095 304203 234610 185819 78605
7660G8605r548o6312j96637J26033J21097K52226k42244j42155L80860N0732j25455
$$ 78605 69057 2745 -193892 -67859 53238 305464 63220 -78935 301925 352657 227202
7649B27202j00846K176q702J92340o7179l0910K06582k92420k37212K47614Q8187
$$ 227202 126356 128532 119830 312170 244991 214081 420663 128243 -108969 138645 226832
7638B26832N5427R3450j36381k31010j52254K47273j6134n2991J26724K3089Q4389
$$ 226832 282259 375709 239328 8318 -143936 103337 87203 34212 160936 184025 268414
7627B68414R4996j68639p7882K941k96015j6209K46073j96060j5397J87006j38533
$$ 268414 363410 194771 116889 119830 -176185 -192394 53679 -142381 -157778 29228 -109305
7616a09305j20343J24168l8199J52921K63868Q9369r6244j68536O7694P1781j41537
$$ -109305 -229648 -105480 -143679 9242 273110 362479 266235 97699 165393 237174 95637
7605I5637K39998R8140j67254k29779j0359J24968Q831q615o2972J53370J22085
$$ 95637 335635 433775 266521 36742 26383 151351 160182 151567 88595 241965 364050
7594C64050k05626j07878m5920J57777l13225j22092M6691J6654J26670M30010
$$ 364050 158424 50546 4626 162403 -150822 -272914 -226223 -209569 -82899 347111
7584C47111n9176k24592n5245N5099N3808K624J15790K6390j07762k8345p7680
$$ 347111 287935 63343 8098 63197 117005 119629 235419 261809 154047 125702 48022
7573D8022M5868m7079K42264P3140m5891q7025K1847J24059q9301P6726k28798
$$ 48022 93890 46811 289075 362215 316324 229299 251146 375205 285904 362630 133832
7562A33832o5124J5052J94425Q4552m8784J22319j15399j19798N9289R3710j1792
$$ 133832 68708 83760 278185 362737 313953 436272 320873 201075 260364 354074 342282
7551C42282l80645J21207M2692J57526l8636j72697P131K4199j31519J62796O6914
$$ 342282 -38363 82844 125536 283062 244426 71729 78860 103059 -28460 134336 201250
7540B01250j40463J424j0567N5850O0071M3106k35651j43037l4437K76231q1465
$$ 201250 60787 62211 51644 107494 167565 210671 -24980 -168017 -202454 73777 -7688
7529g688J9871L7011O8092K20790p0725J2518K380j76835P9160K11201k61347
$$ -7688 12183 49194 117286 338076 267351 279869 282249 105414 184574 395775 134428
7518A34428j19971J34164O5076j2860J71048r1573n5950K28925j54257r986j05981
$$ 134428 14457 148621 213697 200837 371885 280312 224362 453287 299030 289044 183063
7507A83063j61650J83079o5130p3392j377l9581K16151J91090j64975j35402q1272
$$ 183063 21413 204492 139362 65970 64593 25012 241163 432253 267278 131876 50604
7496E0604Q9345L5877K93030J81620m3624j87625l6371j19465k92466P2361J03972
$$ 50604 139949 175826 468856 650476 606852 419227 382856 263391 -29075 43286 147258
7485A47258j04441L03794r5423l01336r4524J74453R1543J15830r8263j33111
$$ 147258 42817 346611 251188 -50148 -144672 29781 121324 237154 138891 5780
7475E780j7296m1936Q5455J8212j76182o7799M25722J07381j73592j35796J72720
$$ 5780 -11516 -53452 32003 50215 -125967 -193766 231956 339337 165745 29949 202669
7464B02669k8351j43107Q8343J40321K63224j66010k58676j83225K3296K78118
$$ 202669 174318 31211 119554 259875 523099 357089 98413 -84812 -61516 216602
7454B16602J79850j52900k63943j17377J87253K09707j14875q9298P3970K13040
$$ 216602 396452 243552 -20391 -137768 49485 259192 144317 55019 128989 342029
7444C42029q8886j8569j94936J86351K3684P4663L7549j46593P2812R145r5564
$$ 342029 253143 234574 39638 225989 249673 324336 361885 215292 288104 297249 201685
7433B01685l8828j53038o4793o7472J37965K19260j64904K65039M1864O6436k70549
$$ 201685 162857 9819 -54974 -122446 15519 234779 69875 334914 376778 443214 172665
7422A72665n7914O6797n5286o8852j16532N5180L9092L8775N5103M14680l07098
$$ 172665 114751 181548 126262 57410 -59122 -3942 35150 73925 129028 543708 236610
7411B36610m46923J41556M36679R2056N2736k61861j68846n7009J83462l0565
$$ 236610 -210313 -68757 367922 459978 512714 250853 82007 24998 208460 177895
7401A77895R6353k4266n6728r038R1763j56420j19233L02199l9532o9647j68475
$$ 177895 274248 249982 193254 184216 275979 119559 326 302525 262993 193346 24871
7390B4871J87377N9563k01068K68158R972k36276p7787p3296L74921k28701m4943
$$ 24871 212248 271811 70743 338901 348873 112597 34810 -38486 336435 107734 62791
7379F2791J59211M0899L6285m32555P6450M37144j28845q3794j49048J41455j21990
$$ 62791 222002 262901 299186 -133369 -56919 380225 251380 167586 18538 159993 38003
7368C8003k1293l44J05432K61731K58771k11053j56979K34149m7942k95986O9361
$$ 38003 16710 16366 121798 383529 642300 431247 274268 508417 460475 164489 233850
7357B33850J28517j23841K14187p5813o3739l52382n0026L9654J79559k1167P2672
$$ 233850 362367 238526 452713 376900 313161 -39221 -89247 -49593 129966 108799 181471
7346A81471M20654l52610K1386Q2923j1402J69869K2669j84333j86285J99251
$$ 181471 602125 249515 270901 353824 342422 512291 534960 350627 164342 363593
7336C63593n0813m7227k9215j58122M0969Q620l0098L39829Q9892j00075N9151
$$ 363593 312780 265553 236338 78216 119185 127805 97707 437536 527428 427353 486504
7325D86504p0992K54667M24361N3689K73135n2381j58354m9341k50651j99052
$$ 486504 415512 670179 1094540 1148229 1421364 1368983 1210629 1161288 910637 711585
7315G11585O8522m65529j44332j81432l1183M78599k9911j69811l0548P6266m00462
$$ 711585 780107 314578 170246 -11186 -42369 436230 406319 236508 205960 282226 -118236
7304a18236M852K55238K11619j46864K87872l6736O624l01p907J73706l38889
$$ -118236 -113384 141854 353473 206609 494481 457745 464369 464068 456161 629867 290978
7293B90978k1454p8741j09855p6629P9894K6988r2199n0037J93218O8091q4238
$$ 290978 269524 190783 80928 4299 84193 111181 18982 -31055 162163 230254 146016
7282A46016k37799J25594K71194J34158j38085q6903j36718l9529O1605j13316
$$ 146016 -91783 33811 305005 439163 301078 214175 77457 37928 99533 -13783
7272a3783j3868L33790K82711j81833k35715N3945l5211r8530j18810k5414M13392
$$ -13783 -27651 306139 588850 407017 171302 225247 190036 91506 -27304 -52718 360674
7261C60674Q3250k34516P1085O5386j81054K70231l00754K2955K8863M591j91857
$$ 360674 443924 209408 280493 345879 164825 435056 134302 157257 186120 190711 -1146
7250a146k4575K77918J866l34998l6969l9082l6587K62525K1792n4918J91980
$$ -1146 -25721 252197 254063 -80935 -117904 -156986 -193573 68952 90744 35826 227806
7239B27806k06864k05969N00527K94120l25574k34456j5276j1216K08353n1485
$$ 227806 20942 -185027 315500 609620 284046 49590 34314 23098 231451 179966
7229A79966l6816K48208q4844k53051J46280k3793j72591J78990k2386k42499
$$ 179966 143150 391358 306514 53463 199743 175950 3359 182349 159963 -82536
7219h2536J25406K59430j75935j57010K780M6553K99528j75777j15383p334N1462
$$ -82536 42870 302300 126365 -30645 -27865 18688 318216 142439 27056 19722 71184
7208G1184j18248K39218j68877l3203J83441m1897j00974Q2694J32765L98045
$$ 71184 -47064 192154 23277 -9926 173515 131618 30644 113338 246103 644148
7198F44148k3285j23651l31639k34960M52190p4589j00785q1433j2239j9186k0881
$$ 644148 620863 497212 165573 -69387 382803 308214 207429 125996 113757 94571 73690
7187G3690M961K00527J07693r4482k62047J23977O9155j75486J59242l634j12467
$$ 73690 78651 279178 386871 292389 30342 154319 223474 47988 207230 203596 91129
7176I1129L63814j20095m93371P1439Q4921r0900K03836j66956J753K06691J48619
$$ 91129 454943 334848 -158523 -87084 -2163 -93063 110773 -56183 -54430 152261 300880
7165C00880j12074k0461R3286r0700j5025q4391m02875J35620J95470L7905K17916
$$ 300880 188806 168345 261631 170931 155906 71515 -331360 -195740 -270 37635 255551
7154B55551j91043k1075J11296L23271l8941j05254j74317j42455l6860J05528
$$ 255551 64508 43433 154729 478000 439059 333805 159488 17033 -19827 85701
7144H5701j15319J57118O956J6306J6244l49952J04712K61959n1626N7320K4766
$$ 85701 -29618 127500 134456 150762 167006 -182946 -78234 183725 132099 189419 214185
7133B14185l61709Q3364R9840R3061P4438r3586M7793J5567q9570J4445K76439
$$ 214185 -147524 -64160 35680 128741 203179 109593 157386 172953 83383 97828 374267
7122C74267m6296K4433J05100l12543J70607J8407J58943j09477j29106Q9754
$$ 374267 327971 352404 457504 144961 315568 333975 492918 383441 254335 344089
7112C44089M114J64571l02939O0595N4723j00014j89568n0518K13201J23907k92053
$$ 344089 348203 512774 209835 270430 325153 225139 35571 -14947 198254 322161 30108
7101C0108L01479r747j70934j40060L0308j00112j45253L91090K40231q4033j86585
$$ 30108 331587 321840 150906 10846 41154 -58958 -204211 186879 427110 343077 156492
7090A56492Q3175J05388L1281j27890r1530L7559j57409o975J47952J51441j37189
$$ 156492 239667 345055 376336 248446 156916 194475 37066 30091 178043 329484 192295
7079A92295j29332R0936J15585n6540j22714M9296K6811p2329K1205L42201j85809
$$ 192295 62963 153899 269484 212944 90230 139526 166337 94008 115213 457414 271605
7068B71605J99083j77957M1249j61492J44761j58673j91347J13373n1100Q8523
$$ 271605 470688 292731 333980 172488 317249 158576 -32771 80602 29502 118025
7058A18025L79869r8733k83312M8126K2476J19226o2614K3739J55679O8785J10483
$$ 118025 497894 399161 115849 163975 186451 305677 243063 266802 422481 491266 601749
7047F01749L4800j30571k83646J21384p7364m8049J20192P2740j8969l2601m3260
$$ 601749 636549 505978 222332 343716 266352 218303 338495 411235 392266 359665 316405
7036C16405k28435k97405j15431L70526J21090O5113J97426m3607j43371J4252
$$ 316405 87970 -209435 -324866 45660 166750 231863 429289 385682 242311 256563
7026B56563r6401J07631j08037K140j6534P3073K32577p3413N5536n1494j81231
$$ 256563 160162 267793 159756 161896 145362 218435 451012 377599 433135 381641 200410
7015B00410J52457j03541k148M2610N6493J03882l14701j34881M5319J26250l5008
$$ 200410 352867 249326 247178 289788 346281 450163 135462 581 45900 172150 137142
7004A37142j71812K19311j31097j1581K6204j39144l7913J01180M4817M06320
$$ 137142 -34670 184641 53544 41963 68167 -70977 -108890 -7710 37107 443427
6994D43427o2679j23623j01425J1965r7956o2975J14365o6830J51662q006L4636
$$ 443427 380748 257125 155700 167665 69709 6734 121099 54269 205931 197925 232561
6983B32561r8320j71498K00495J72937N8970o5679j75457j20359O3099k75367
$$ 232561 134241 -37257 163238 336175 395145 329466 154009 33650 96749 -178618
6973a78618j0553L26868L22649R1619k63472l6827j10197J72103o5655k71919
$$ -178618 -189171 137697 460346 551965 288493 251666 141469 313572 247917 -24002
6963b4002J15840p5262J03451J25076j4982k49876n0816L3517R6785K44596r3954
$$ -24002 91838 16576 120027 245103 230121 -19755 -70571 -37054 59731 304327 210373
6952B10373r0490J65270J50102j35210k24928L9498j6298J10430j12061M2248
$$ 210373 119883 285153 435255 300045 75117 114615 98317 208747 96686 138934
6942A38934m4132M6833k2178m3002J86840j88474J32303N4141K75260j56515P6122
$$ 138934 94802 141635 119457 76455 263295 74821 207124 261265 536525 380010 456132
6931D56132P2921k07152p1224M7481R698K21699k044k62838r8870q1940N1788
$$ 456132 529053 321901 250677 298158 307856 529555 527511 264673 165803 83863 135651
6920A35651K82796J99743k93428k47305J64420j65885J06778m44k7219K7299K41667
$$ 135651 418447 618190 324762 77457 241877 75992 182770 182326 155107 182406 424073
6909D24073j4545N0348J18677J26517m74105k70136K56020p5549L43562k30065
$$ 424073 409528 459876 578553 705070 230965 -39171 216849 141300 484862 254797
6899B54797J37772J37612j90102R4675m29137j01862M13135j57906j05571K51933
$$ 254797 392569 530181 340079 434754 5617 -96245 316890 158984 53413 305346
6889C05346j11131j79122J16436J45265q4616k8498k2340j28815K01989K50111
$$ 305346 194215 15093 131529 276794 192178 163680 141340 12525 214514 464625
6879D64625j20089O7374j18632q5720K27012j20152k50972R0987K96556L03594
$$ 464625 344536 411910 293278 207558 434570 314418 63446 154433 450989 754583
6869G54583j73421k66240k44437J14025o6097J5178L29801j3740n9685k39277
$$ 754583 581162 314922 70485 184510 118413 133591 463392 449652 389967 150690
6859A50690J66172l7264J17163o0661L1923K19871j74873k3382m5359R3760k59682
$$ 150690 316862 279598 396761 336100 368023 587894 413021 389639 344280 438040 178358
6848A78358j91015N8058j11609p9957J34127K88461J9340K04094j54216j92485
$$ 178358 -12657 45401 -66208 -146165 -12038 276423 295763 499857 345641 153156
6838A53156M0104j85017l7159K2091K84457K2251k1237J52885Q6885J5631l15602
$$ 153156 193260 8243 -28916 -6825 277632 299883 278646 431531 518416 534047 218445
6827B18445k22509K45396J56651K4554L39783k07987P0242k85324L1031N9214
$$ 218445 -4064 241332 397983 422537 762320 554333 624575 339251 370282 429496
6817D29496P3241k12458K5377J07111q7082O7509O3645p5651l26818R5112K17627
$$ 429496 502737 290279 315656 422767 335685 403194 466839 391188 64370 159482 377109
6806C77109L3007N4449l9294J27743J68634m23815j55781m7721Q4087n3805J07175
$$ 377109 410116 464565 425271 553014 721648 297833 142052 94331 178418 124613 231788
6795B31788p0218R490j9001J79503J65156j52048j0757O655L4487p802l0194q4084
$$ 231788 161570 171060 152059 331562 496718 344670 333913 340568 375055 367253 337059 252975
6783B52975j90333L9848M4188K4568K17802j71981k03602j49925P1463j12820
$$ 252975 62642 102490 146678 171246 389048 217067 13465 -136460 -64997 -177817
6773a77817K91499K64892R5921j49364m7005r6012J77978k89144Q8837M68805
$$ -177817 113682 378574 474495 325131 278126 182114 360092 70948 159785 628590
6763F28590j02020K6561Q904j78098k00535N4316k0968J22762M418P2218K6997
$$ 628590 526570 553131 562035 383937 183402 237718 216750 339512 343930 416148 443145
6752D43145J33127j82095j27881j30531k3487J59337Q3304K3151j13958K97001
$$ 443145 576272 394177 266296 135765 112278 271615 354919 378070 264112 561113
6742E61113K4321k92006m8443k22266J3656R7981O8874j5323J72272J36801J3587
$$ 561113 585434 293428 244985 22719 36375 134356 203230 187907 360179 496980 510567
6731E10567j25331R3859k19094j32542J58003J67736k59286m7139K73107J10163
$$ 510567 385236 479095 260001 127459 285462 453198 193912 146773 419880 530043
6721E30043k05002m37800J12330L36204p9038K7184j75975K39685j2454N3488
$$ 530043 325041 -112759 -429 335775 256737 283921 107946 347631 335177 388665
6711C88665K03024k80052j66948R2206J18741J26105R2973j91768J40267q1211
$$ 388665 591689 311637 144689 236895 355636 481741 574714 382946 523213 442002
6701D42002q6295N7253J36200n31093l75914J55278J48571L08496Q2743k35354
$$ 442002 355707 412960 549160 18067 -357847 -202569 -53998 254498 337241 101887
6691A01887q0505N7785L29610j67729K2643r0016J01662j67263r189J80867j52522
$$ 101887 21382 79167 408777 241048 263691 173675 275337 108074 98885 279752 127230
6680A27230K38010J23190K5751j54380j09114r8081K25644M1087p5978R0412j47404
$$ 127230 365240 488430 514181 359801 250687 152606 378250 419337 343359 433771 286367
6669B86367j23783O9744l20800R7379K2929J26453J42077J840J45539Q0904K5599
$$ 286367 162584 232328 -88472 8907 31836 158289 300366 302206 447745 528649 554248
6658E54248k16493M6666O4797O5817K22189k94249m1129k94344J167J88087J15742
$$ 554248 337755 384421 449218 515035 737224 442975 401846 107502 108669 296756 412498
6647D12498j20865l5047N4703j83703J2423q9526l4066Q5967J81376n342j54236
$$ 412498 291633 256586 311289 127586 140009 50483 16417 102384 283760 278418 124182
6636A24182K04754J98503o3056R9816m4499l0295j00907j52284q4009L93065N0952
$$ 124182 328936 527439 464383 564199 519700 489405 388498 236214 152205 545270 596222
6625E96222J68072j08541k10022k5267j52569N2453J15450n7363j24573l3413
$$ 596222 764294 655753 445731 420464 267895 320348 435798 378435 253862 220449
6615B20449P4526L0690L4807k1758j57762P6445L08429j42005n6607j15850j85144
$$ 220449 294975 325665 360472 338714 180952 257397 565826 423821 367214 251364 66220
6604F6220J26806Q9982r9576Q61K03555M8676O4515K5527j09065j70076m9740
$$ 66220 193026 283008 183432 184293 387848 436524 501039 526566 417501 247425 197685
6593A97685K51396k81742o9213K62252j3993n4924n3965J11748O8714l204m1460
$$ 197685 449081 167339 98126 360378 346385 291461 237496 349244 417958 414754 373294
6582C73294p472j37594j76488K46450J72199r1331n7858j41515m074n7759j45492
$$ 373294 365822 228228 51740 298190 470389 379058 321200 179685 175611 117852 -27640
6571b7640j50952K89079K60835k22040J3802j60529K21258K68443q1993r4434
$$ -27640 -178592 110487 371322 149282 163084 2555 223813 492256 410263 315829
6561C15829K51159j48521j67916N3679K65279L0453k08660n3534Q7950l3833l1987
$$ 315829 566988 418467 250551 304230 569509 599962 391302 337768 425718 391885 359898
6550C59898R9271j05165K4629J52798O4137p5675r6059m19510K06952L9752r3778
$$ 359898 459169 354004 378633 531431 595568 519893 423834 4324 211276 251028 157250
6539A57250M9285J03786O101J24511j41423j55245R9295M27128p1144j81641n0235
$$ 157250 206535 310321 316422 440933 299510 144265 243560 670688 599544 417903 367668
6528C67668l41894M4867N6496K18462J17219J40272j47057j26803k8588j53929
$$ 367668 25774 70641 127137 345599 462818 603090 456033 329230 300642 146713
6518A46713K49177Q1004k17029J5968J76625n648j93605j76960Q0537M9212L9566
$$ 146713 395890 476894 259865 275833 452458 446810 253205 76245 156782 205994 245560
6507B45560p7432J00672O9925O9965K40303K97484j59151l46262p4254J0920k89174
$$ 245560 168128 268800 338725 408690 648993 946477 787326 441064 366810 377730 88556
6496H8556j98054L05140K21726j81306P2442J77276j086J67161j16788j58490
$$ 88556 -109498 195642 417368 236062 308504 485780 484694 651855 535067 376577
6486C76577M2035j28143Q1096r0095J45585n7410k01947L90621j85264Q7081j56802
$$ 376577 418612 290469 371565 281470 427055 369645 167698 558319 373055 460136 303334
6475C03334J09014R0551k41777j51292r9235K42845n1099r7376L1125K75686l2352
$$ 303334 412348 502899 261122 109830 10595 253440 202341 104965 136090 411776 379424
6464C79424o9128J37060j26393r3242J23395j71720J43604n3142j41579j6196
$$ 379424 310296 447356 320963 227721 351116 179396 323000 269858 128279 112083
6454A12083J15261J40817o4565K58133N2852q3504P54k10320J9417N3997J01304
$$ 112083 227344 368161 303596 561729 614581 531077 531831 321511 340928 394925 496229
6443D96229j30112j02863K001K25245P9919j70025m45468J73967P6128J30836
$$ 496229 366117 263254 265255 490500 570419 400394 -45074 128893 205021 335857
6433C35857J99038j58950j75333Q1866L05282J63071j26940m16791K63077K38873
$$ 335857 534895 375945 200612 282478 587760 750831 623891 207100 470177 709050
6423G09050K44574l06727l4804k01327o6955J2427l9225j36601K01548K75311
$$ 709050 953624 646897 612093 410766 343811 356238 317013 180412 381960 657271
6413F57271j37863j45293l7346j77827L42958j00523n3723m4077j0342P6297k2757
$$ 657271 519408 374115 336769 158942 501900 401377 347654 303577 293235 369532 346775
6402C46775P3109j95620j16268J34257J2562j6059j41302J74575J88178J52380
$$ 346775 419884 224264 107996 242253 254815 238756 97454 272029 460207 612587
6392F12587J9580k14894l1124K04876j1395k06485k54351J10366K59432j05170
$$ 612587 632167 417273 386149 591025 579630 373145 118794 229160 488592 383422
6382C83422k2000K2393o2806R2350J65920k43518R7236j1296J545j6055p3067
$$ 383422 361422 383815 321009 413359 579279 335761 432997 421701 423246 407191 334124
6371C34124p3967K79654J0361l03126J56977q8099q7807L6750k24637m2456l9370
$$ 334124 260157 539811 550172 247046 404023 315924 228117 264867 40230 -2226 -41596
6360d1596J44425K45568K55350j46369j2520P0329j91125j22323M55427Q0194
$$ -41596 102829 348397 603747 457378 444858 515187 324062 201739 657166 737360
6350G37360k98749j74568J88846j9466k6641k19901K01094q2422k16441L00315
$$ 737360 438611 264043 452889 433423 406782 186881 387975 305553 89112 389427
6340C89427k73419L10768L378l34567l4447K03732L3441m7181J41611j5295o3685
$$ 389427 116008 426776 430154 95587 61140 264872 298313 251132 392743 377448 313763
6329C13763J24298n8441l3075J01786O0118k22024k44819K19444J8493K46770
$$ 313763 438061 379620 346545 448331 508449 286425 41606 261050 279543 526313
6319E26313l9274Q9037m7191m2531J18610l2579k06269k4069K02558k7510l3220
$$ 526313 487039 576076 528885 486354 604964 572385 366116 342047 544605 517095 483875
6308D83875n9210O6327l9779q4768J60579J77968j82531o5118j01353J94010R9636
$$ 483875 424665 490992 451213 366445 527024 704992 522461 457343 355990 550000 649636
6297F49636n6327j27093K84725n671j71195q7216O0822J057J33927r7966m7592
$$ 649636 593309 466216 750941 745270 574075 486859 547681 548738 682665 584699 537107
6286E37107j38613K77826m2933k67310L51752j98852k24939k1984J43486J34363
$$ 537107 398494 676320 633387 366077 717829 518977 294038 272054 415540 549903
6276E49903R5918J57408j17505j48364R4802m01491P6511N54126l39466l55454
$$ 549903 645821 803229 685724 537360 632162 230671 307182 861308 521842 166388
6266A66388J12620j180J70727r0623k74108K33184r5999K3337K38422R1978o6601
$$ 166388 279008 277828 448555 357932 83824 317008 221009 244346 482768 574746 508145
6255E08145k839O729K2017k6236m3698P8784p3104j07853M5424J45772K860J59886
$$ 508145 505306 512035 534052 507816 464118 542902 469798 361945 407369 553141 556001 715887
6243G15887k78405j85790Q5945j4884N1086J32956O9981j72290m30482J85602
$$ 715887 437482 251692 337637 322753 373839 506795 576776 404486 -25996 159606
6233A59606N7342r0468l577J82318J0063J94619J50736L7613j53973j23763J16075
$$ 159606 216948 126480 122903 305221 315284 509903 660639 698252 544279 420516 536591
6222E36591P557j86370j49655M84512K71149l46429l06113M5283J24436N261L41924
$$ 536591 544148 357778 208123 692635 963784 617355 311242 356525 480961 486222 828146
6211H28146k62865l33397o5305L81283J13951p9510p7803j93066l1595M07711
$$ 828146 565281 231884 166579 547862 661813 582303 504500 311434 279839 687550
6201F87550m109l2374m0507j01434k5188J04493q826p4710P4507N3563O1222K3718
$$ 687550 683441 651067 610560 509126 483938 588431 579605 504895 579402 632965 694187 717905
6189G17905J52658j38008j3121l574J82353o6045j65653l4957M7152k19026J2582
$$ 717905 870563 732555 719434 715860 898213 832168 666515 631558 678710 459684 472266
6178D72266K49924J24728m02810j26324J81006N6329j02959J12435j16026J53773
$$ 472266 722190 846918 444108 317784 498790 555119 452160 564595 448569 602342
6168F02342J49073l00114m4592R3845R6849J16126j30690J68380K2813j0509P4228
$$ 602342 751415 451301 406709 500554 597403 713529 582839 751219 774032 763523 837751
6157H37751j07399k17571N4396r2476J37109j59581o094J24179n2769j03798J05473
$$ 837751 730352 512781 567177 474701 611810 452229 446135 570314 517545 413747 519220
6146E19220M1104N6637k0620J81777K16393j82546N7368q45M9634o2608K1978
$$ 519220 560324 616961 596341 778118 994511 811965 869333 868488 918122 855514 877492
6135H77492j53023r2590j83814N6435K12958m3333k4310r8556j0704K44235j9749
$$ 877492 724469 631879 448065 504500 717458 674125 649815 551259 540555 784790 765041
6124G65041r2007j5888N76M4782J25732k5311j05369O6752r3971q0982J60403
$$ 765041 673034 657146 657722 702504 828236 802925 697556 764308 670337 589355 749758
6113G49758l9103m2863M034J40631r9966j14702j32700k6662K43539q5937j77117
$$ 749758 710655 667792 671826 812457 712491 597789 465089 438427 681966 596029 418912
6102D18912J17731j60725j48438L75397K79614L03585k68328k21638m5581j9867
$$ 418912 536643 375918 227480 602877 882491 1186076 917748 696110 650529 630662
6092F30662J00338O3350j23190K04865j38483L0322K5882l629r7393k24317M8618
$$ 630662 731000 794350 671160 876025 737542 767864 793746 790117 692724 468407 517025
6081E17025O8740J3895j72633J66365K35392j64925l2512O6804N998Q5012K9719
$$ 517025 585765 599660 427027 593392 828784 663859 631347 698151 704149 789161 818880
6070H18880N0440R7364j05303j76680l96561L1019M49797J21838k48221J35326
$$ 818880 869320 966684 861381 684701 288140 319159 768956 890794 642573 777899
6060G77899m3134O9237J13587j50136j1311k50228J04927q7324J54529m3914J80134
$$ 777899 734765 804002 917589 767453 756142 505914 610841 523517 678046 634132 814266
6049H14266K01519k3252k52523o7936j60028K96040Q7715p8034P8554K39933m5833
$$ 814266 1015785 992533 740010 672074 512046 808086 895801 817767 896321 1136254 1090421
6038A090421j75927k08636J07252P7700o2953r3839p3275K43240J57758J32502
$$ 1090421 914494 705858 813110 890810 827857 734018 660743 903983 1061741 1194243
6028A194243K81668n61478J16997j95829k59177J55494K44014l11513Q1727J72158
$$ 1194243 1475911 914433 1031430 835601 576424 731918 975932 664419 746146 918304
6018I18304l0548L26586k90101j97130j08252M4463J66399k97742J37769J12723
$$ 918304 887756 1214342 924241 727111 618859 663322 829721 531979 669748 782471
6008G82471K14499K21063o1706J16841l58914l1648K0772J18050K5629j07570
$$ 782471 996970 1218033 1156327 1273168 914254 882606 903378 1021428 1047057 939487
5998I39487J27122k12815n9069L77779o0503R1071j99106j09759J35228K71873
$$ 939487 1066609 853794 794725 1172504 1112001 1203072 1003966 894207 1029435 1301308
5988A301308j89102k18983K22371k24932j61544O9404Q0786J38842P6391n6021
$$ 1301308 1112206 893223 1115594 890662 729118 798522 879308 1018150 1094541 1038520
5978A038520k90328O7812L8282K77770J10J32060J11143J1936n8885l20332j13307
$$ 1038520 748192 816004 854286 1132056 1132166 1264226 1375369 1387305 1328420 1008088 894781
5967H94781P1237j94553R9644K04206K4932q9175j94363j53626K40J83874M38034
$$ 894781 966018 771465 871109 1075315 1100247 1011072 816709 663083 663323 847197 1285231
5956A285231r4467o2014o9728m2271j55803J77033k88821j56073J9957J65577
$$ 1285231 1190764 1128750 1059022 1016751 860948 1037981 749160 593087 613044 778621
5946G78621J25649L00711j41928k49294n0243J90469L9407l5401J13583l59717
$$ 778621 904270 1204981 1063053 813759 763516 953985 993392 957991 1071574 711857
5936G11857L31237J49054r8390j82809m7634J27458L53118k49577j21304K20449
$$ 711857 1043094 1192148 1093758 910949 863315 990773 1343891 1094314 973010 1193459
5926A193459l28190j38584K68012M586J832l6108l90006J483J91589l19670M17795
$$ 1193459 865269 726685 994697 999283 1001115 965007 575001 576484 768073 448403 866198
5915H66198K29545J03024J62261j46944l37050J84903J43774k2160N1925L7057
$$ 866198 1095743 1198767 1361028 1214084 877034 1061937 1205711 1183551 1235476 1272533
5905A272533K66150q0155M1617m4987q1545k34083k6676j10440k6067M32566j01587
$$ 1272533 1538683 1458528 1500145 1455158 1373613 1139530 1112854 1002414 976347 1408913 1307326
$$ [...]
##END NTUPLES=NMR SPECTRUM
##END=
