##TITLE=1H_DE-80H_X3
 200.13MHz, d2o
 8 sc
 
 19ns.26.2.2025
##JCAMPDX= 6.0         $$ Bruker NMR JCAMP-DX V2.0
##DATA TYPE= NMR SPECTRUM
##DATA CLASS= NTUPLES
##ORIGIN= UXNMR, Bruker Analytische Messtechnik GmbH
##OWNER= pz
$$ XWIN-NMR		Version 3.5
$$ Wed Jul  9 11:03:14 2025 Russian Standard Time (UT+4h)  Yarkov@DPX200
##.OBSERVE FREQUENCY= 200.1313
##.OBSERVE NUCLEUS= ^1H
##.ACQUISITION MODE= SIMULTANEOUS
##.ACQUISITION SCHEME= undefined
##.AVERAGES= 8
##.DIGITISER RES= 18
##SPECTROMETER/DATA SYSTEM= spect
##.PULSE SEQUENCE= zg30
##.SOLVENT NAME= DMSO
##.SHIFT REFERENCE= (INTERNAL, DMSO, 0, 15.5034)
##AUDIT TRAIL= $$ (NUMBER, WHEN, WHO, WHERE, WHAT)
$$ ##TITLE= Audit trail, XWIN-NMR		Version 3.5
$$ ##JCAMPDX= 5.01
$$ ##ORIGIN= Bruker BioSpin GmbH
$$ ##OWNER= Yarkov
$$ C:/Bruker/XWIN-NMR/data/yarkov2/nmr/H-C/1/pdata/1/auditp.txt
$$ ##AUDIT TRAIL=  $$ (NUMBER, WHEN, WHO, WHERE, WHAT)
(   1,<2025-07-09 11:02:08.71 +0400>,<Yarkov>,<DPX200>,
      <created by zg, POWCHK disabled, PULCHK disabled
       configuration hash MD5:
       00 E9 B6 7A A2 85 ED C7 34 08 36 98 17 FE 4E 26
       data hash MD5: 16K
       1D FA FD D5 3E 56 BA 0B B1 E0 BA F2 59 69 82 43>)
(   2,<2025-07-09 11:02:17.43 +0400>,<Yarkov>,<DPX200>,
      <Start of raw data processing
       efp BC_mod = 2 LB = 0.25 FT_mod = 6 PKNL = 1 PHC0 = -1361.51 PHC1 = 16.2495 SI = 16K 
       data hash MD5: 16K
       21 97 99 F8 8E 19 39 F6 05 10 43 DD A9 6A 5A ED>)
(   3,<2025-07-09 11:02:33.50 +0400>,<Yarkov>,<DPX200>,
      <pk PHC0 = -3.8 PHC1 = 0 
       data hash MD5: 16K
       A0 53 8D 2C 0E 57 E6 6D 3F 4B C8 A8 69 8C EE 04>)
(   4,<2025-07-09 11:02:36.68 +0400>,<Yarkov>,<DPX200>,
      <abs ABSG = 5 
       data hash MD5: 16K
       3F 71 08 73 B1 56 B4 DC E6 CA F2 98 E5 82 C9 06>)
$$ ##END=
$$ 
$$ hash MD5
$$ B1 F9 F1 21 6A 04 A2 AC 5C 65 C9 F6 CD ED 08 4C
##$RELAX= 
##$RELAX= 
##$RELAX= 
##$RELAX= 
##$RELAX= 
##$RELAX= 
$$ Bruker specific parameters
$$ --------------------------
##$DU= <C:/Bruker/XWIN-NMR>
##$EXPNO= 1
##$NAME= <H-C>
##$PROCNO= 1
##$TYPE= <nmr>
##$USER= <yarkov2>
##$AMP= (0..31)
100 100 100 100 100 100 100 100 100 100 100 100 100 100 100 100 100 100 
100 100 100 100 100 100 100 100 100 100 100 100 100 100 
##$AQSEQ= 0
##$AQ_mod= 1
##$AUNM= <au_zg>
##$AUTOPOS= <>
##$BF1= 200.13
##$BF2= 200.13
##$BF3= 200.13
##$BF4= 200.13
##$BF5= 200.13
##$BF6= 200.13
##$BF7= 200.13
##$BF8= 200.13
##$BYTORDA= 1
##$CFDGTYP= 0
##$CFRGTYP= 5
##$CHEMSTR= <none>
##$CNST= (0..31)
1 1 145 1 1 1 1 1 1 1 1 1 1 1 1 1 1 1 1 1 1 1 1 1 1 1 1 1 1 1 1 1 
##$CPDPRG= <>
##$CPDPRG1= <>
##$CPDPRG2= <>
##$CPDPRG3= <>
##$CPDPRG4= <mlev>
##$CPDPRG5= <mlev>
##$CPDPRG6= <mlev>
##$CPDPRG7= <mlev>
##$CPDPRG8= <mlev>
##$CPDPRGB= <>
##$CPDPRGT= <>
##$D= (0..31)
0 0.7 0 0 0 0 0 0 0 0 0 0.03 0 0 0 0 0 0 0 0 0 0 0 0 0 0 0 0 0 0 0 0 
##$DATE= 1752044528
##$DBL= (0..7)
120 120 120 120 120 120 120 120 
##$DBP= (0..7)
150 150 150 150 150 150 150 150 
##$DBP07= 0
##$DBPNAM0= <>
##$DBPNAM1= <>
##$DBPNAM2= <>
$$ [...]
##$SUBNAM3= <"">
##$SUBNAM4= <"">
##$SUBNAM5= <"">
##$SUBNAM6= <"">
##$SUBNAM7= <"">
##$SUBNAM8= <"">
##$SUBNAM9= <"">
##$SW= 18.0517328524113
##$SWIBOX= (0..15)
0 0 2 0 0 0 0 0 0 0 0 0 0 0 0 0 
##$SW_h= 3612.71676300578
##$TD= 16384
##$TD0= 1
##$TE= 0
##$TE2= 300
##$TE3= 300
##$TEG= 300
##$TL= (0..7)
0 120 120 120 120 120 120 120 
##$TP= (0..7)
150 150 150 150 150 150 150 150 
##$TP07= 0
##$TPNAME0= <>
##$TPNAME1= <>
##$TPNAME2= <>
##$TPNAME3= <>
##$TPNAME4= <>
##$TPNAME5= <>
##$TPNAME6= <>
##$TPNAME7= <>
##$TPOAL= (0..7)
0.5 0.5 0.5 0.5 0.5 0.5 0.5 0.5 
##$TPOFFS= (0..7)
0 0 0 0 0 0 0 0 
##$TUNHIN= 0
##$TUNHOUT= 0
##$TUNXOUT= 0
##$USERA1= <user>
##$USERA2= <user>
##$USERA3= <user>
##$USERA4= <user>
##$USERA5= <user>
##$V9= 5
##$VALIST= <valist>
##$VCLIST= <CCCCCCCCCCCCCCC>
##$VD= 0
##$VDLIST= <DDDDDDDDDDDDDDD>
##$VPLIST= <PPPPPPPPPPPPPPP>
##$VTLIST= <TTTTTTTTTTTTTTT>
##$WBST= 1024
##$WBSW= 4
##$XGAIN= (0..3)
0 0 0 0 
##$XL= 0
##$YL= 0
##$YMAX_a= 153897
##$YMIN_a= -119865
##$ZGOPTNS= <>
##$ZL1= 120
##$ZL2= 120
##$ZL3= 120
##$ZL4= 120
##$ABSF1= 15.53314
##$ABSF2= -2.518711
##$ABSG= 5
##$ABSL= 3
##$ALPHA= 0
##$AQORDER= 0
##$ASSFAC= 0
##$ASSFACI= 0
##$ASSFACX= 0
##$ASSWID= 0
##$AUNMP= <proc_1d>
##$AZFE= 0.1
##$AZFW= 0.1
##$BCFW= 0
##$BC_mod= 2
##$BYTORDP= 0
##$COROFFS= 0
##$CY= -3
##$DATMOD= 1
##$DC= 0
##$DFILT= <>
##$DTYPP= 0
##$F1P= 0
##$F2P= 0
##$FCOR= 1
##$FTSIZE= 16384
##$FT_mod= 6
##$GAMMA= 0
##$GB= 0
##$INTBC= 1
##$INTSCL= 3.241238e-09
##$ISEN= 128
##$LB= 0.25
##$LEV0= 0
##$LPBIN= 0
##$MAXI= 10000
##$MC2= 0
##$MEAN= 0
##$ME_mod= 0
##$MI= 1.114404
##$NCOEF= 0
##$NC_proc= -7
##$NLEV= 6
##$NOISF1= 3.799351
##$NOISF2= 2.8
##$NSP= 0
##$NTH_PI= 0
##$NZP= 0
##$OFFSET= 15.50339
##$PC= 1
##$PHC0= -1365.31
##$PHC1= 16.2495
##$PH_mod= 1
##$PKNL= yes
##$PPARMOD= 0
##$PSCAL= 0
##$PSIGN= 0
##$REVERSE= no
##$SF= 200.130003664394
##$SI= 16384
##$SIGF1= 3
##$SIGF2= 2
##$SINO= 0.751879
##$SIOLD= 32768
##$SREGLST= <19F.Aceton>
##$SSB= 0
##$STSI= 16384
##$STSR= 0
##$SW_p= 3612.71676300578
##$SYMM= 0
##$S_DEV= 0
##$TDeff= 16384
##$TDoff= 0
##$TI= <>
##$TILT= no
##$TM1= 0
##$TM2= 0
##$TOPLEV= 0
##$USERP1= <user>
##$USERP2= <user>
##$USERP3= <user>
##$USERP4= <user>
##$USERP5= <user>
##$WDW= 1
##$XDIM= 16384
##$YMAX_p= 386391017
##$YMIN_p= -1474522
$$ End of Bruker specific parameters
$$ ---------------------------------
##NTUPLES= NMR SPECTRUM
##VAR_NAME=  FREQUENCY,     SPECTRUM/REAL,   SPECTRUM/IMAG
##SYMBOL=    X,             R,               I
##VAR_TYPE=  INDEPENDENT,   DEPENDENT,       DEPENDENT
##VAR_FORM=  AFFN,          ASDF,            ASDF
##VAR_DIM=   16384,         16384,           16384
##UNITS=     HZ,            ARBITRARY UNITS, ARBITRARY UNITS
##FACTOR=    0.220516191357247, 1,           1
##FIRST=     3102.69355999008, 0,            0
##LAST=      -510.023203015699, 0,           0
##MIN=       -510.023203015699, -1474522,    0
##MAX=       3102.69355999008, 386391017,    0
$$ Real data points
##PAGE= N=1
##DATA TABLE= (X++(R..R)), XYDATA
$$ [...]
8335a76593M3811O8636O5974n1327j48833J0466M606L2464j3331J2381J26426
$$ -176593 -132782 -64146 1828 -49499 -198332 -187866 -183260 -150796 -164127 -151746 -25320
8324b5320J37111k1823J3444m6722j36562j4301J6252J43104n4558j1155j8530
$$ -25320 111791 89968 103412 56690 -79872 -94173 -77921 65183 10625 -530 -19060
8313a9060m2712r32P4734k7410n3056J44502L936j96113k7303Q6979k733L8131
$$ -19060 -61772 -62704 12030 -15380 -68436 76066 80002 -116111 -143414 -56435 -59168 -21037
8301b1037n6786J936L1233k00282K24446l7860L39L1915j6106o7539j51067K15017
$$ -21037 -77823 -75887 -44654 -244936 -20490 -58350 -58011 -26096 -42202 -109741 -260808 -45791
8289d5791k6395N7272j349j20922o4181j871J75512O2952j15888J316J11979J38830
$$ -45791 -72186 -14914 -16263 -137185 -201366 -203237 -27725 35227 -80661 -79345 32634 171464
8277A71464j95705n8450J77169l2507p3699L168j48913Q9618L0454j15694J43474
$$ 171464 -24241 -82691 94478 61971 -11728 -8560 -157473 -67855 -37401 -153095 -9621
8266i621j04111P0382P7177r0062j02855R2230q581M9819m74m4611m6268J58999
$$ -9621 -113732 -43350 33827 -56235 -159090 -66860 -75441 -25622 -26096 -70707 -116975 42024
8254D2024J7609m9p3316M9383l9845O1191l0543j07098K2556p9910J90540p59
$$ 42024 59633 59584 -13732 35651 -4194 56997 26454 -80644 -58088 -137998 52542 51783
8242E1783k62505L8919M2804P3539Q9044q1865L8704k2443J7254j56281q5907
$$ 51783 -210722 -171803 -128999 -55460 33584 -48281 -9577 -32020 -14766 -171047 -256954
8231b56954J06599M8066l3216p092j4592n2450J08278Q111p5979J05795J78476
$$ -256954 -150355 -102289 -135505 -142597 -157189 -209639 -101361 -93250 -169229 -63434 115042
8220A15042n3252l5270l7630q4328K47267j35508j03022j01409O5421q9134K3456
$$ 115042 61790 26520 -11110 -95438 151829 16321 -86701 -188110 -122689 -211823 -188367
8209a88367M2406J63092k154j07144j5319J00964r7364k26593j20433Q3450j8193
$$ -188367 -145961 17131 14977 -92167 -107486 -6522 -103886 -330479 -450912 -367462 -385655
8198c85655J64065m5115n1484l27063p3369p55901M57439J648130k23488m3024
$$ -385655 -221590 -266705 -318189 -645252 -718621 -1474522 -1017083 631047 407559 364535
8188C64535j94613k8235K0681J79246N0004o0826l51953J19315O736k2332m2730
$$ 364535 169922 141687 162368 341614 391618 330792 -21161 98154 104890 82558 39828
8177C9828o6952k230J23872o4695k8981J2699j40553J7957r4572P0917J70641
$$ 39828 -27124 -29354 94518 29823 842 13541 -127012 -109055 -203627 -132710 37931
8166C7931n6315R0639J22637j74260n0300O2155P6703q3722r5831k3370l3960
$$ 37931 -18384 72255 194892 20632 -29668 32487 109190 25468 -70363 -93733 -127693
8155a27693K12760K0654j62342Q247j04497J88708L9818K1829j56207j938N3066
$$ -127693 85067 105721 -56621 -48374 -152871 35837 75655 97484 -58723 -60661 -7595
8144g595J8074o0002J905J12071k1740j06643K6099R2752j9373M3799L8064j11778
$$ -7595 10479 -49523 -47618 64453 42713 -63930 -37831 54921 35548 79347 117411 5633
8132E633o8123j7252k7774J30829Q2590J1818q8756j67897M278n8959Q7096J49478
$$ 5633 -62490 -79742 -107516 23313 105903 117721 28965 -138932 -134654 -193613 -106517 42961
8120D2961p8373p0777L6043J9863J1172o3090L8681M8614p050K3396m6906M1603
$$ 42961 -35412 -106189 -70146 -50283 -39111 -102201 -63520 -14906 -21956 1440 -45466 -3863
8108c863N2139j6659P7307M848r6011R6178j5796q7672j6096K8968p6152p6453
$$ -3863 48276 31617 108924 113772 17761 113939 98143 10471 -5625 23343 -52809 -129262
8096a29262P9993N7074J6348o4203L0338j26107j7837J45984R5002j74374o5434
$$ -129262 -49269 7805 24153 -40050 -9712 -135819 -153656 -7672 87330 -87044 -152478
8085a52478R6067J7347O458J5219q1880l2532M7792O3599O269L2374R1422j7201
$$ -152478 -56411 -39064 -32606 -17387 -99267 -131799 -84007 -20408 -14139 18235 109657 92456
8073I2456L2804j04363n4980m9787J12705q861M6156k282Q955o7745j1406p2924
$$ 92456 125260 20897 -34083 -83870 28835 19974 66130 63848 72803 5058 -6348 -79272
8061g9272j03539J45122K26288j06800p3968k5574J387n9263K2272J42982P15
$$ -79272 -182811 -37689 188599 81799 7831 -17743 -16356 -75619 -53347 89635 90350
8050I0350Q5253j00414j14782R4843M1388j08196j333P9028j17139P5760Q1677
$$ 90350 175603 75189 -39593 55250 96638 -11558 -12891 66137 -51002 24758 106435
8039A06435O4896j17509m3687q01M4699N8235J7750m5745P8444n2558l9212R5827
$$ 106435 171331 53822 10135 9334 54033 112268 130018 84273 162717 110159 70947 166774
8027A66774j63485L8805K8280r9726j35550J30187R6567k8983j39772J23546m467
$$ 166774 3289 42094 70374 -29352 -164902 -34715 61852 32869 -106903 16643 12176
8016A2176l4687O0919j28502j96138Q6123J65579J43207j14604j18594J65670
$$ 12176 -22511 38408 -90094 -286232 -200109 -34530 108677 -5927 -124521 41149
8006D1149L18k1496q6120k4972J56293L5452j04092m5608O0180n0912Q0655O7560
$$ 41149 41467 19971 -66149 -91121 65172 100624 -3468 -49076 11104 -39808 40847 108407
7994A08407J026r2744l1382j07149n4535j9621K0865J7223J6850R7263J5386k9630
$$ 108407 109433 16689 -14693 -121842 -176377 -195998 -175133 -157910 -141060 -43797 -28411 -58041
7982e8041j93963N4417j1894k5174N2557J19641K1155Q2076r4050p6196J12647
$$ -58041 -252004 -197587 -209481 -234655 -182098 -62457 -41302 40774 -53276 -129472 -16825
7971a6825Q7081P443o3174N312k911M9725m21m5469O337L2672n8811Q1926p0951
$$ -16825 70256 77699 14525 19837 16926 66651 66230 20761 27098 59770 959 82885 11934
7958A1934L1449J12314l5751k26805K7820j6344k3817J84414q3993J5530L7271
$$ 11934 43383 155697 119946 -106859 -79039 -95383 -119200 65214 -18779 -3249 34022
7947C4022j7753r5942q475O8346Q4089R0403K8614j58854o2488L4545M5564l531
$$ 34022 16269 -79673 -88148 -19802 64287 154690 183304 24450 -38038 -3493 42071 38540
7935C8540J7199N049k1338q1232m8691k4028m3558J65717p2999K820N5416N6261
$$ 38540 55739 60788 39450 -41782 -90473 -114501 -158059 7658 -65341 -62521 -7105 49156
7923D9156j11191q2012N4516J34745j04480K8866J16152R892n2187o519L7726
$$ 49156 -62035 -144047 -89531 45214 -59266 -30400 85752 95644 43457 36938 74664
7912G4664p5013O0746M8824L0818l3825r1339L9277L9305k6345M4469M520j8086
$$ 74664 -349 60397 109221 140039 106214 14875 54152 93457 67112 111581 116101 98015
7900I8015k8018L9228p6161q1378O4492p3689k7053P7109R5793k5154j07937J19345
$$ 98015 69997 109225 33064 -48314 16178 -57511 -84564 -7455 88338 63184 -44753 74592
7888G4592o0130K3495k3629o8273O3858p4978m69P7019q6549k4965J3155J23641
$$ 74592 14462 37957 14328 -53945 9913 -65065 -65534 11485 -75064 -100029 -86874 36767
7876C6767R4344m6899O373m6689p2087K3061l249J3489l226r5846J30687r9600
$$ 36767 131111 84212 90585 43896 -28191 -5130 -8379 5110 1884 -93962 36725 -62875
7864f2875k1469Q5187q9948J8524N6901j1428n5265J06941Q8375k3823l4255J4071
$$ -62875 -84344 843 -89105 -70581 -13680 -25108 -80373 26568 114943 91120 56865 70936
7852G0936r246M6547o7757R5649K9472n8866n7358m589r0716k5009k9480P0740
$$ 70936 61690 108237 40480 136129 165601 106735 49377 44788 -45928 -70937 -100417 -29677
7840b9677J8593K703M9106k0497o6083p057Q9029M2877k4436l5172n6606L5830
$$ -29677 -11084 -8381 40725 20228 -45855 -52912 36117 78994 54558 19386 -37220 -1390
7828a390K4312J3794N0825j47680L1738m97N1221K17363q8169n7822r7947J39142
$$ -1390 22922 36716 87541 -60139 -28401 -28898 22323 239686 151517 93695 -4252 134890
7816A34890R7358O9627l7609k0501p1811l2063Q6869J90206j61079p06021K41718
$$ 134890 232248 301875 264266 243765 171954 139891 226760 416966 255887 -450134 -208416
7805b08416J28667j60526O7948J25879l1469M5364P8132l2159L0728o6369n9936
$$ -208416 -79749 -240275 -172327 -46448 -77917 -32553 45579 13420 44148 -22221 -82157
7794h2157j2445P5226M9227K8512M6185q0333R6582r5225o2739m6774N7354j19178
$$ -82157 -94602 -19376 29851 58363 104548 24215 120797 25572 -37167 -83941 -26587 -145765
7782a45765k0387P9160P7623o6081r471P9767j51544J05740O6054L9958m4985
$$ -145765 -166152 -86992 -9369 -75450 -84921 -5154 -156698 -50958 15096 55054 10069
7771A0069j5822J4188L0064M0125j87364M0472l5803P1768P7985R08k3443l7666
$$ 10069 -5753 8435 38499 78624 -108740 -68268 -104071 -32303 45682 46590 23147 -14519
7759a4519Q3757M6759L6370m2100o9066j45809r4828R3404L7623k2287P3394J24358
$$ -14519 69238 115997 152367 110267 41201 -104608 -199436 -106032 -68409 -90696 -17302 107056
7747A07056N388o5657j79901J02635O1984q5685o6950l634N7085k2342J37719
$$ 107056 112444 46787 -133114 -30479 31505 -54180 -121130 -124764 -67679 -90021 47698
7736D7698K7787Q0255j22571J6059o8341K6486J03819m1282l0925r3864P8593
$$ 47698 75485 155740 33169 49228 -19113 7373 111192 69910 38985 -54879 23714
7725B3714L8066j28618j8429Q3305r1634J26258O115n6943J28516O5632k6886
$$ 23714 61780 -66838 -85267 -1962 -93596 32662 38777 -18166 110350 175982 149096
7714A49096J3463j48042j53269J32679L3357k4818k3013M0724o7416P3981P4847
$$ 149096 162559 14517 -138752 -6073 27284 2466 -20547 20177 -47239 26742 101589
7703A01589j17594L3847o6582N6190O395Q9874J7383M038j75302o2093N8572k374
$$ 101589 -16005 17842 -48740 7450 13845 103719 121102 125140 -50162 -112255 -53683 -56057
7691e6057R8893j6406O0617r3547J0201O3705m6234j64174P2244Q7067q7946K2266
$$ -56057 42836 26430 87047 -6500 3701 67406 21172 -143002 -70758 16309 -71637 -49371
7679d9371L7584J49770n0612j46777J74456k3255k0224J6330N5663r4173j20437
$$ -49371 -11787 137983 87371 -59406 115050 91795 71571 87901 143564 49391 -71046
7668g1046q6222P6036p2145R9565P2566m7266K413M4805l5109L2535J3987Q7560
$$ -71046 -157268 -81232 -153377 -53812 18754 -28512 -26099 18706 -16403 16132 30119 117679
7656A17679K3319J30464m3317j19154k017k4481p7294q4633O0724J00013j3473
$$ 117679 140998 271462 228145 108991 106974 82493 5199 -79434 -18710 81303 67830
7645F7830M062p4111m2056J27543j67925k4272m3269J26211J76174j09800m4565
$$ 67830 71892 -2219 -44275 83268 -84657 -108929 -152198 -25987 150187 40387 -4178
7634d178K3978j2363n900n6559J2866K7482J815j30500J27523Q4293j15115Q6555
$$ -4178 19800 7437 1537 -55022 -42156 -14674 -12859 -143359 -15836 68457 -46658 39897
7622C9897K5373K5001l5244o8918J43191k8226k0034l5745K282r4244J43092r5458
$$ 39897 65270 90271 55027 -13891 129300 101074 81040 45295 47577 -46667 96425 967
7610I67p7161K04216p1614P1083j1977m6167j20822l0957J23024n8670O5791J98850
$$ 967 -76194 128022 56408 127491 115514 69347 -51475 -82432 40592 -18078 47713 246563
7598B46563j03202n4916N88j41717Q1551m0684p4059Q8919J53353j9709m1016
$$ 246563 143361 88445 89033 -52684 28867 -11817 -85876 3043 156396 136687 95671
7587I5671J78k7921o2693N3358p3091o0356p2101N9976J47837M5302j46095N8765
$$ 95671 95849 67928 5235 58593 -14498 -74854 -146955 -86979 60858 106160 -39935 18830
7575A8830J29719O5223r5222j07523N6650j5859k1754m4726K28900q2418o0955
$$ 18830 148549 213772 118550 11027 67677 51818 30064 -14662 214238 131820 70865
7564G0865Q857k8122J00132J08217J61667q6504L6739J1849n8815R0644p2654
$$ 70865 79722 51600 151732 259949 421616 335112 371851 383700 324885 415529 342875
7553C42875J9101J27986O3451K7751J84511N1461k1110j6465J49098K51254J93191
$$ 342875 361976 489962 553413 581164 765675 817136 796026 779561 928659 1179913 1373104
7542A373104M87121M38130j12935l37538k90366m24606j19484m3540n225k55330
$$ 1373104 1860225 2298355 2185420 1847882 1557516 1132910 1013426 969886 964661 709331
7532G09331j88352q7164Q481M6090p7094m5685n9385N2277L6240m1474o5080l3717
$$ 709331 520979 433815 442296 488386 411292 365607 306222 358499 394739 353265 288185 254468
7520B54468L2682O000l9662k0083J9582o352k38633N4478J63093J11846j61435
$$ 254468 287150 293150 253488 233405 252987 246635 8002 62480 225573 337419 175984
7509A75984R4668p0912j86437Q5569Q7880J41202k2110n0820j5569j41171l033
$$ 175984 270652 199740 13303 98872 186752 327954 305844 255024 239455 98284 95251
7498I5251R9343n354j2808N4262j24749m1865M2990J39168j08190k0737J9471
$$ 95251 194594 189240 176432 230694 105945 64080 107070 246238 138048 117311 136782
7487A36782l2870K9016j40600j02554O3356l8836J94190M5070l3376K1554k2107
$$ 136782 103912 132928 -7672 -110226 -46870 -85706 108484 153554 120178 141732 119625
7476A19625j7319k1090m4989j4831J39070q5763j9869O8050L4115q1453Q716p933
$$ 119625 102306 81216 36227 21396 160466 74703 54834 122884 156999 75546 84262 76329
7464G6329o0554O8519j0392q9564R2042J27604n8802Q694K8351j33420L2893J4407
$$ 76329 15775 84294 73902 -15662 76380 203984 145182 153876 182227 48807 81700 96107
7452I6107Q783j12562p6585N3391J04901j61176J05025R0658j9386K0145n2435
$$ 96107 104890 -7672 -84257 -30866 74035 -87141 17884 108542 89156 109301 56866
7441E6866m9989k6686M0020J6755M337M5771J7672J3371q0036L5946Q1862O1973
$$ 56866 6877 -19809 20211 36966 41303 87074 104746 118117 38081 74027 155889 217862
7429B17862j65889p8418M7680J5342l6155O6120K5941K5772k3379j03958N0964
$$ 217862 51973 -26445 21235 36577 422 66542 92483 118255 94876 -9082 41882
7418D1882K11861o2240k17599j5724m699K19651L0687L9513L8807j00796j40595
$$ 41882 253743 191503 -26096 -41820 -46519 173132 203819 243332 282139 181343 40748
7407D0748J0635L5457L6897M9318m2787j04584l1133j8323K1304J06600N1870
$$ 40748 51383 86840 123737 173055 130268 25684 -5449 -23772 -2468 104132 156002
7396A56002j21034K8459R4212o3647k6566M0085p2635n1757j2448P3710K9740
$$ 156002 34968 63427 157639 93992 67426 107511 34876 -16881 -29329 44381 74121
7385G4121r3752P7398Q5241j9615r358j52712l4733O465J07589K3421l0165j2702
$$ 74121 -19631 57767 143008 123393 114035 -38677 -73410 -66945 40644 64065 33900 21198
7373B1198j4802Q6370K5432k5148k9274k873j9010K2225N4029N4436J8074k1537
$$ 21198 6396 92766 118198 93050 63776 60903 41893 64118 118147 172583 190657 169120
7361A69120o2675M0033P7914l3156m3014l1698j1154K2777L7202j68128J00231
$$ 169120 106445 146478 224392 191236 148222 116524 105370 128147 165349 -2779 97452
7350I7452N7970j49045N9719n8827O8476N4171J1851r5081j33376J53298Q093
$$ 97452 155422 6377 66096 7269 75745 129916 141767 46686 -86690 66608 74701
7339G4701M6643J43408r7481n8606J5605k548J557N633L8879k9404j20381J4226
$$ 74701 121344 264752 167271 108665 124270 121722 123279 128912 167791 138387 18006 32232
7327C2232r1229n6419J00834J65413M7608R117J9461j09234L2878k3245L0791
$$ 32232 -58997 -115416 -14582 150831 198439 207556 227017 117783 150661 127416 158207
7316A58207j2605n9688r2716O9399J73732j0217j50933j8233j19274L3655J38644
$$ 158207 145602 85914 -6802 62597 236329 226112 75179 56946 -62328 -28673 109971
7305A09971m4719J98407j71641R5196R0988j69855K067o8546O981J0082M2498
$$ 109971 65252 263659 92018 187214 278202 108347 110414 41868 48849 58931 101429
7294A01429J62881n4675q6893k8786J5542j8472n9225P269J40712j2045K5299
$$ 101429 264310 209635 122742 93956 109498 91026 31801 39070 179782 167737 193036
7283A93036L647m8105o0587j24659k0716J04996l2353q139P1847p6208j0201m3687
$$ 193036 196683 148578 87991 -36668 -57384 47612 15259 7120 78967 2759 -7442 -51129
7271e1129P0532J9596M018m5744j22160Q0995J12589M5577o2681K3767j01047
$$ -51129 19403 38999 43017 -2727 -124887 -43892 68697 114274 51593 75360 -25687
7260b5687k7634l0059L4507N5756j68961J05304R1809k9970L5095l8440P3072
$$ -25687 -53321 -83380 -48873 6883 -162078 -56774 35035 5065 40160 1720 74792
7249G4792r8154l4445J08392Q6102R0182j05953O4017k695o6912l0487O5o521
$$ 74792 -23362 -57807 50585 136687 226869 120916 184933 182238 115326 84839 84904 78383
7237G8383O8242K65j58084n0431J23322J04750j2954n704j63646j2442J13720
$$ 78383 146625 146890 -11194 -61625 61697 166447 153493 147789 -15857 -28299 85421
7226H5421k0790J20265j40935j56328J75974J06352p9967N3152j924K7272n5696
$$ 85421 64631 184896 43961 -112367 63607 169959 89992 143144 141220 168492 112796
7215A12796l6458k1163K4766m0693Q741O4010m9761M9510K5925k8050L7139n930
$$ 112796 76338 55175 79941 39248 47989 111999 62238 111748 137673 109623 146762 140832
7203A40832j08865l4976l6627M8924L6452l8054m305J276J19516Q6423l6440n8215
$$ 140832 31967 -3009 -39636 9288 45740 7686 3381 4657 124173 210596 174156 115941
7191A15941K9700n4743J4214l8865P916N6107m6605j47052J27754K7488K1835
$$ 115941 145641 90898 105112 66247 74163 130270 83665 -63387 64367 91855 113690
7180A13690P4852J22680o5286j87615J6947q7684k4338n4730J61673J19012r7010
$$ 113690 188542 311222 245936 58321 75268 -12416 -36754 -91484 70189 189201 92191
7169I2191k5143k0129N6164n3845j7910p1908o5584R1774q677L3832J1437j2743
$$ 92191 67048 46919 103083 49238 31328 -40580 -106164 -14390 -23067 10765 22202 9459
7157I459J20317p5568O2025Q451q1440J00109l5416J35727k2714N2305R1436n9882
$$ 9459 129776 54208 116233 124684 43244 143353 107937 243664 220950 273255 364691 304809
7145C04809j24118L3513n2825p1291k3532J54598j37778n010j07017K8738N4816
$$ 304809 180691 214204 161379 90088 66556 221154 83376 78366 -28651 87 54903
7134E4903J0162O3513m0086L0439Q2425o6582N985q4981j3978j5918k0077J00314
$$ 54903 65065 128578 88492 118931 201356 134774 140759 55778 41800 25882 5805 106119
7122A06119k8101R3494P690m9315K0254q8684J01717J0168j54961J02846Q9548
$$ 106119 78018 171512 179202 129887 150141 61457 163174 173342 18381 121227 210775
7111B10775M2871j68366J5788L5839J1977o8069L4710M45j4708j04288k4517Q4140
$$ 210775 253646 85280 101068 136907 148884 80815 115525 115970 101262 -3026 -27543 56597
7099E6597Q6277O8090l0463j34637l4965J1637J02888M7175j30157n7004P8569
$$ 56597 142874 210964 180501 45864 10899 22536 125424 172599 42442 -14562 64007
7088F4007m6183N0781J07145r3018r407J6726Q8276J5302P5409K8023J6415j58260
$$ 64007 17824 68605 175750 82732 73325 90051 178327 193629 269038 297061 313476 155216
7076A55216k801K6457k4789R0305O584j43574j10290j1559N6705R603r138q9070
$$ 155216 152415 178872 154083 244388 250972 107398 -2892 -14451 42254 51857 42719 -46351
7064d6351K9186K14323n7091Q449j2596o4380Q3218O6865M778L6077P435j23593
$$ -46351 -17165 197158 140067 148516 135920 71540 154758 221623 226401 262478 269913 146320
7052A46320o1981M2713R814j2142l7205p1681J84799N4333q5426q0505n1559J50453
$$ 146320 84339 127052 136866 124724 87519 15838 200637 254970 169544 89039 37480 187933
7040A87933p153k2189l6860L905j0574O7277l1871K9348O1971j123j4469p2956
$$ 187933 180780 158591 121731 125636 115062 182339 150468 179816 241787 240664 226195 153239
7028A53239l2243o2299J6349j299k5709O1844K4148M9494N8703j13672R0362J51358
$$ 153239 120996 58697 75046 73747 48038 109882 134030 183524 242227 128555 218917 370275
7016C70275j64211j2914j53034O7407N9621p9359O282Q5937R6113m9837n9678
$$ 370275 206064 193150 40116 107523 167144 87785 94067 180004 276117 226280 166602
7005A66602Q2061k8560j20319k0176J39765o1164N4224l0193j50818M8692P0433
$$ 166602 248663 220103 99784 79608 219373 158209 212433 182240 31422 80114 150547
6994A50547o949O4436K0713r5590J34316o6767p526j5533p0936k7898r5637K4149
$$ 150547 143598 208034 228747 133157 267473 200706 193180 177647 106711 78813 -16824 7325
6982G325K9664N482q9654m692O3936R0940P1211p5039K5237Q5552Q3963o3917
$$ 7325 36989 42471 -47183 -51875 12061 103001 174212 99173 124410 209962 293925 230008
6970B30008k7126q11Q0871l7173J815p6530n8721j9508n3652N7129L6291L9937
$$ 230008 202882 202071 282942 245769 247584 171054 112333 92825 39173 96302 132593 172530
6958A72530k823j31509k199q0645R5875J30936M1892O7714n5423j02418k3847
$$ 172530 169707 38198 35999 -44646 51229 182165 224057 291771 236348 133930 110083
6947A10083r909Q8008L2954k3448K2031k3592l0299L6361o8353m7304J69599j09892
$$ 110083 100174 188182 221136 197688 219719 196127 165828 202189 133836 86532 256131 146239
6935A46239j11793m2916O2266P2408Q0083j1376l1363J11871n7090j00111P5436
$$ 146239 34446 -8470 53796 126204 206287 194911 163548 275419 218329 118218 193654
6924A93654M155k4380k8086R433K2773J8583r0424j19249N1390k4639o5230P1979
$$ 193654 197809 173429 145343 154776 177549 196132 105708 -13541 37849 13210 -52020 19959
6912A9959J11677J4810l8875L5126N7990P4026k2211K2159M3240m1004j00161
$$ 19959 131636 146446 107571 142697 200687 274713 252502 274661 317901 276897 176736
6901A76736m7825L2506j41532J23500O3308J23785K6419j53096m2709j1966j02967
$$ 176736 128911 161417 19885 143385 206693 330478 356897 203801 161092 149126 46159
6890D6159J02999J28948j29455Q281J22710K8515J7657K4868K2143j90967m4179
$$ 46159 149158 278106 148651 156932 279642 308157 325814 350682 372825 181858 137679
6879A37679p9856K6719m8855J12341P3930j1140L4608l0169R437m3713n3568p6865
$$ 137679 57823 84542 35687 148028 221958 210818 245426 215257 224694 180981 127413 50548
6867E0548J26162M5239j05103N5565K12637n0751L0240R069j04015O6461M9568
$$ 50548 176710 221949 116846 172411 385048 334297 364537 373606 269591 336052 385620
6856C85620n3069M1269l9528P461N0058q0223o4507J63989p1698K0738j384j13015
$$ 385620 332551 373820 334292 341753 391811 311588 247081 411070 339372 360110 358726 245711
6844B45711K3303r0378q4393J16225P1133m928l5870m2695l6033J25128m9464
$$ 245711 269014 178636 94243 210468 281601 276673 240803 198108 162075 287203 237739
6833B37739K471j0365K5037j22223K9284n1845p4213K9391M0487K4256n7114O5078
$$ 237739 240210 229845 254882 132659 161943 110098 35885 65276 105763 130019 72905 137983
6821A37983N9633m7520n6782K13193p2499q6287o0985L390J11739o902m8059p5882
$$ 137983 197616 150096 93314 306507 234008 147721 86736 90126 201865 194963 146904 71022
6809G1022R9412J35079K094j13918N1543l725l4589m8729r1760J06605L7566P6738
$$ 71022 170434 305513 307607 193689 245232 241507 206918 158189 66429 173034 210600 287338
6797B87338K981K6683p6293j21777N1715J17020N773N807n9569r5793k0450R3566
$$ 287338 290319 317002 240709 118932 170647 287667 293440 299247 239678 143885 123435 217001
6785B17001p1613j9623O0652O9310L8217Q3878j76018n6551K0823Q89J65637p7325
$$ 217001 145388 125765 186417 255727 293944 377822 201804 145253 166076 166965 332602 255277
6773B55277q1909M9967q2198o3551L9578k7393o5799J05097P4482K3642p6639
$$ 255277 173368 223335 141137 77586 117164 89771 23972 129069 203551 227193 150554
6762A50554j8991J17041j60756L4971N921L8068M8205Q9960m1907p4808r2538
$$ 150554 131563 248604 87848 122819 128740 166808 215013 304973 263066 188258 95720
6751I5720J96283q6140j63328n4592J02837R565o44J03721Q9149J3491q1851N0991
$$ 95720 292003 205863 42535 -12057 90780 100345 99701 203422 292571 306062 224211 275202
6739B75202j12339n9020Q7266j7050M2105R4344m6391P3706j15900l4992q005
$$ 275202 162863 103843 191109 174059 216164 310508 264117 337823 221923 186931 178926
6728A78926N2855n1541q0594O1591N7551j41185K2923J6486k7513M5049Q7201
$$ 178926 231781 180240 99646 161237 218788 77603 100526 117012 89499 134548 221749
6717B21749J8448j6229O7022j82049m9895Q5270J24245k4896j02135J23268M4151
$$ 221749 240197 223968 290990 108941 59046 144316 268561 243665 141530 264798 308949
6706C08949M6127J9615p2550o6652p3051J17091L4132j56157Q4257r0182l8594
$$ 308949 355076 374691 302141 235489 162438 279529 313661 157504 241761 151579 112985
6695A12985L3069K27049J4383r7956N8462n7350o748j12297j3578J33307O0439
$$ 112985 146054 373103 387486 289530 347992 290642 283894 171597 158019 291326 351765
6684C51765l8029N4421J08627k36312j11142M2940O3171m6512J9407l3354J3403
$$ 351765 313736 368157 476784 240472 129330 172270 235441 188929 208336 174982 188385
6673A88385J3597K6209r5712Q7848K1818J6105J69141l8275k358p2538O125J7139
$$ 188385 201982 228191 132479 220327 242145 258250 427391 389116 386758 314220 320345 337484
6661C37484j4410n6225m8698K2961o6112q308m1204N3051J1127l6804J26497Q8209
$$ 337484 323074 266849 218151 241112 175000 166692 125488 178539 189666 152862 279359 367568
6649C67568J48659j34683M8490o9343k6160n0805M3750J24417m9051j62774q2297
$$ 367568 516227 381544 430034 360691 334531 283726 327476 451893 402842 240068 157771
6638A57771Q4383Q6713j8708k072p3913J23618n7064l6810m2159M287m603R6250
$$ 157771 242154 328867 310159 308087 234174 357792 300728 263918 221759 226046 221443 317693
6626C17693N0265J03879j521N4504j29079j56117P6222N6089J4722p7346N5664
$$ 317693 367958 471837 470316 524820 395741 239624 315846 371935 386657 309311 364975
6615C64975q1345j1756L5694l959P7347o3766n6220N2368J18542R6876j25923
$$ 364975 283630 271874 307568 303609 380956 317190 260970 313338 431880 528756 402833
6604D02833l2990j09441N1285P3986j4884J9143J01637j28586K6244R4180k7552
$$ 402833 369843 260402 311687 385673 370789 389932 491569 362983 389227 483407 455855
6593D55855O946o5367r1758Q8189m5165J9246j50579J20306J57308n2298j8887
$$ 455855 462801 397434 305676 393865 348700 367946 217367 337673 494981 442683 423796
6582D23796k75023R2456J18851J941J8199J03299M920p2960Q0781r314n857o0437
$$ 423796 148773 241229 360080 362021 380220 483519 488439 415479 496260 486946 481089 420652
6570D20652l5269n4654P7357Q1539p8890p0948K4121N4636j58035K0810M7811
$$ 420652 385383 330729 408086 489625 410735 339787 363908 418544 260509 281319 329130
6559C29130k2353K6434j8498q0492J28031m9539N1032k0590r912P2218P5060J03124
$$ 329130 306777 333211 314713 234221 362252 312713 363745 343155 333243 405461 480521 583645
6547E83645n7515m8835o4482n667p1992l5895J06339Q9416M1506m3623j03972
$$ 583645 526130 477295 412813 407146 335154 299259 405598 495014 536520 492897 388925
6536C88925P7253J05791o4524J6409J29806R349J03785p912N980l1521j29958
$$ 388925 466178 571969 507445 523854 653660 663009 766794 758882 764862 733341 603383
6525F03383M7250N0327o4622j2304K5305M1681m5198J4321J02599L6783l3054
$$ 603383 650633 700960 636338 624034 649339 691020 645822 660143 762742 799525 766471
6514G66471j7913J508l9380l8209M4134O6554K1094k5645n2299Q6776L7382L7795
$$ 766471 748558 750066 710686 672477 716611 783165 804259 778614 726315 813091 850473 888268
6502H88268J7028J26030J51383m6484r3854j84735L351n3355J0606J26206Q6738
$$ 888268 905296 1031326 1182709 1136225 1042371 857636 860987 807632 818238 944444 1031182
6491A031182l3985r9529p6426R1602p4612k8666M9864k1316J097m8269P5233K7342
$$ 1031182 997197 897668 821242 912844 838232 809566 859430 838114 839211 790942 866175 893517
6479H93517j42017J1497J00353l7541q9600J2990o1384O3816j2389J3339m1527
$$ 893517 751500 762997 863350 825809 736209 749199 687815 751631 739242 752581 711054
6468G11054j1313o3179k0360K29551l2832k2323j18654K2835j7147M9600J04010
$$ 711054 699741 636562 616202 845753 812921 790598 671944 694779 677632 727232 831242
6457H31242j80076q352J33732m1837j1661J29232j55858n9493J00227m6045O3763
$$ 831242 651166 642814 776546 734709 723048 852280 696422 636929 737156 691111 754874
6446G54874m6589N7542j06165Q039m67q246O0643m4223j44635O8953Q1783R3465
$$ 754874 708285 765827 659662 667701 667234 658988 719631 675408 530773 599726 681509 774974
6434G74974r3722J8572J32927j03793o6722k3926O4927O8860r9019l749K6743
$$ 774974 681252 699824 832751 728958 662236 638310 703237 772097 673078 669329 696072
6423F96072j820J22696P0807p7912j05476m1305Q4578q7659L3533L6582O5832
$$ 696072 694252 816948 887755 809843 704367 663062 747640 659981 693514 730096 795928
6412G95928J5390q0942J2562k2988N2522n5300J89351L8743K5675q397m7775j1813
$$ 795928 811318 730376 742938 719950 772472 717172 906523 945266 970941 962544 914769 902956
6400I02956r6380j44434R9563m713m3634J31982L8861L5886J41354j0924M7749
$$ 902956 806576 662142 761705 756992 713358 845340 884201 920087 1061441 1050517 1098266
6389A098266K7200q3601L4433n9279n5863l3764o322J07120M993P9341p455j06994
$$ 1098266 1125466 1041865 1076298 1017019 961156 927392 921070 1028190 1033183 1112524 1105069 998075
6377I98075j43802J51750J25705J8733j3772j69756o202O3840R842L0322n3611
$$ 998075 854273 1006023 1131728 1150461 1136689 966933 960731 1024571 1034413 1064735 1011124
6366A011124j1438J6911L4936N3056N091J5660j3878N0593k2848O9753m7567J6994
$$ 1011124 999686 1016597 1051533 1104589 1109680 1125340 1111462 1162055 1139207 1208960 1161393 1178387
6354A178387l2698j6180p7742p1007J79429K148m976J81212l5598j66183R8066
$$ 1178387 1145689 1129509 1051767 980760 1160189 1162337 1157361 1338573 1302975 1136792 1234858
6343A234858J303l786Q3664L5735k9682l2095O4431m2630k3845L5054J16822j6298
$$ 1234858 1236161 1232375 1316039 1351774 1322092 1289997 1354428 1311798 1287953 1323007 1439829 1423531
6331A423531j25346j73466J07318L8420J46898j0292Q6621m4829p0407J47674
$$ 1423531 1298185 1124719 1232037 1270457 1417355 1407063 1493684 1448855 1378448 1526122
6321A526122O3603m2761o8924P923j09025K8855J88502j2575j6969J7458P0641
$$ 1526122 1589725 1546964 1478040 1485963 1376938 1405793 1594295 1581720 1564751 1582209 1652850
6310A652850r7454N8733K8935K1355P3161r105J55274j09495r3420R9817j0388
$$ 1652850 1555396 1614129 1643064 1664419 1737580 1728475 1883749 1774254 1680834 1780651 1770263
6299A770263K552j9622Q0086J81335l0466J0918q2447K1829J2765P1334j10J22765
$$ 1770263 1772815 1753193 1833279 2014614 1984148 1995066 1912619 1934448 1947213 2018547 2018437 2141202
6287B141202M0423r4929j68781N9820Q3655R5448o630p130l6369R5564K1731j05879
$$ 2141202 2181625 2086696 1917915 1977735 2061390 2156838 2150208 2143078 2106709 2202273 2224004 2118125
6275B118125J08641K0158j16602K23369o476J66880q79M5O9350J46860Q0524N2544
$$ 2118125 2226766 2246924 2130322 2353691 2347215 2514095 2513216 2513261 2582611 2729471 2809995 2862539
6263B862539N9733m0732K1131N99J11114k2210K09676j8601o9397L5024K38515
$$ 2862539 2922272 2881540 2902671 2903270 3014384 2992174 3201850 3183249 3113852 3148876 3387391
6252C387391J77776J65056R2230j40855J14184N5285l6772J48043J70905J56053
$$ 3387391 3565167 3730223 3822453 3681598 3795782 3851067 3814295 3962338 4133243 4289296
6242D289296K9063r7721J31208R0282P7454J19206J45718J92086J52623K91289
$$ 4289296 4318359 4220638 4351846 4442128 4519582 4638788 4784506 4976592 5129215 5420504
6232E420504J15690J26713N2306J62033J67074K32180K86198K64355K50647K38359
$$ 5420504 5536194 5662907 5715213 5877246 6044320 6276500 6562698 6827053 7077700 7316059
6222G316059K55535L86358J78152K59117L27754K49107L94316L95534N55998M41000
$$ 7316059 7571594 7957952 8136104 8395221 8722975 8972082 9366398 9761932 10317930 10758930
6212A0758930L89401N45808N76474O61626P46541N85041N86128O99793P59706
$$ 10758930 11148331 11694139 12270613 12932239 13678780 14263821 14849949 15549742 16309448
6203A6309448Q35619P64298Q31542R60195R41037Q75873J107448J448496J442608
$$ 16309448 17145067 17909365 18740907 19701102 20642139 21518012 22625460 24073956 25516564
6194B5516564J547063K153580K468556K601542K732387K937939K722507K162592
$$ 25516564 27063627 29217207 31685763 34287305 37019692 39957631 42680138 44842730
6186D4842730J654100J388436J368160J384035J151133J145001J038917J222754
$$ 44842730 46496830 47885266 49253426 50637461 51788594 52933595 53972512 55195266
6178E5195266J542635J531061J776213J894926K073788J955284J926971K071571
$$ 55195266 56737901 58268962 60045175 61940101 64013889 65969173 67896144 69967715
6170F9967715J841954J729899K077040K241453K447537K962829L225807L639039
$$ 69967715 71809669 73539568 75616608 77858061 80305598 83268427 86494234 90133273
6162I0133273L706304L123056J134034j737755l538849l862714l423959k992936
$$ 90133273 93839577 96962633 98096667 96358912 92820063 88957349 85533390 82540454
6154H2540454k329064j924459j780990j684086j521342j608260j741067j815220
$$ 82540454 80211390 78286931 76505941 74821855 73300513 71692253 69951186 68135966
6146F8135966j795566j722937j588169j361752j255772j135602j021360q38980
$$ 68135966 66340400 64617463 63029294 61667542 60411770 59276168 58254808 57415828
6138E7415828j048864j203708j231350j353490j548292j768804k403363k773750
$$ 57415828 56366964 55163256 53931906 52578416 51030124 49261320 46857957 44084207
6130D4084207k815893k815118k297893k148881j759061j450640j415828j062869
$$ 44084207 41268314 38453196 36155303 34006422 32247361 30796721 29380893 28318024
6122B8318024j061057j031452p14195p86798r06890r85148p54751r21079p27400
$$ 28318024 27256967 26225515 25511320 24724522 23817632 22832484 22077733 21156654 20429254
6113B0429254p52609p38714m84122q04086n94271n10350n87970m72944m04265
$$ 20429254 19676645 18937931 18453809 17649723 17055452 16545102 15957132 15484188 15079923
6104A5079923n39575l56416l70130l79026k64352k87507k70690m70167m54976
$$ 15079923 14540348 14183932 13813802 13434776 13170424 12882917 12612227 12142060 11687084
6095A1687084l16956l41801k97386j54033l72379j90006j20363k78497k08225
$$ 11687084 11370128 11028327 10730941 10576908 10204529 10014523 9894160 9615663 9407438
6086I407438l18378k60770q5420j68597j28836k59335k75285k5733k1776k1185
$$ 9407438 9089060 8828290 8742870 8574273 8445437 8186102 7910817 7885084 7863308 7842123
6076G842123j90046j27490j05987r5630k26082k64294j24242M4398l2245j19556
$$ 7842123 7652077 7524587 7418600 7322970 7096888 6832594 6708352 6752750 6720505 6600949
6066F600949k29288j65107k51137k4397k0163j1999n8907k55487k163j6340j53065
$$ 6600949 6371661 6206554 5955417 5931020 5910857 5898858 5839951 5584464 5582301 5565961 5412896
6055E412896j32524R646l3107j28365k00203J4879p2385q7672r7925r9908l8730
$$ 5412896 5280372 5290018 5256911 5128546 4928343 4943222 4870837 4783165 4685240 4585332 4546602
6044D546602J8590n3897n2035j3162p6002j29028j13677j71623K6251r5948J7279
$$ 4546602 4565192 4511295 4459260 4446098 4370096 4241068 4127391 3955768 3982019 3886071 3903350
6033C903350Q6771j19851k18071j5755J10038o6514k0781M2133m9582j95702j03446
$$ 3903350 3990121 3870270 3652199 3636444 3746482 3679968 3659187 3701320 3651738 3456036 3352590
6022C352590K7682j06544j14077j5744J0949p0575m2406n8599k6424J07529p7763
$$ 3352590 3380272 3273728 3159651 3143907 3154856 3084281 3041875 2983276 2956852 3064381 2986618
6011B986618p3002O5423N0044n0085O9148L9594k49260L2502J12291j61862j99133
$$ 2986618 2913616 2979039 3029083 2978998 3048146 3087740 2838480 2870982 2983273 2821411 2622278
6000B622278m5291K0707p4940J30661N6198j32339n8133l9480j14232j5332K68
$$ 2622278 2576987 2597694 2522754 2653415 2709613 2577274 2519141 2479661 2365429 2350097 2350365
5989B350365k7865n3755r9659N4096R9432q8848j40764K4503O5666k0811J0951
$$ 2350365 2322500 2268745 2169086 2223182 2322614 2233766 2093002 2117505 2183171 2162360 2173311
5978B173311k3053J52752k0695n7344r3575O5579p0385j8253k78j2105o8156K7997
$$ 2173311 2150258 2303010 2282315 2224971 2131396 2196975 2126590 2108337 2108059 2095954 2027798 2055795
5966B055795o3869p0989J7537j71385N4380n6764J57627J33589q9788l8161J2649
$$ 2055795 1991926 1920937 1938474 1767089 1821469 1764705 1922332 2055921 1966133 1927972 1940621
5955A940621j55607p7393J34455p7542j41798R6279N887L0329r3975J07426M3552
$$ 1940621 1785014 1707621 1842076 1764534 1622736 1719015 1724902 1755231 1661256 1768682 1812234
5944A812234j41309L2371j6879P1558q3688r2441N3889o3029N9508K4101n9163
$$ 1812234 1670925 1703296 1686417 1757975 1674287 1581846 1635735 1572706 1632214 1656315 1597152
5933A597152n9797J61169J9965r4307j11123o001K8072r4010J17291j42208L6701
$$ 1597152 1537355 1698524 1718489 1624182 1513059 1507058 1535130 1441120 1558411 1416203 1452904
5922A452904N6609k3163j6341o5873R9199R3190L8123K9818j47827o7187m1731
$$ 1452904 1509513 1486350 1470009 1404136 1503335 1596525 1634648 1664466 1516639 1449452 1407721
5911A407721M1111N0282K7297o1800R214q2079L071N4766N5398j42395P5186o9478
$$ 1407721 1448832 1499114 1526411 1464611 1473825 1391746 1394817 1449583 1504981 1362586 1437772 1368294
5899A368294k5590J28524M7265J42531q1971q6870K0754p3256l3998K5376r5166
$$ 1368294 1342704 1471228 1518493 1661024 1579053 1492183 1512937 1439681 1405683 1431059 1335893
5888A335893k6020j31694P4741J08094O1910j46240R9814M1352j54007J04533
$$ 1335893 1309873 1178179 1252920 1361014 1422924 1276684 1376498 1417850 1263843 1368376
5878A368376m9408l0643J93924K839r8396o4659O2597n259o2245J34995o283j35720
$$ 1368376 1318968 1288325 1482249 1485088 1386692 1322033 1384630 1379371 1317126 1452121 1445838 1310118
5866A310118P7397J6784P186N2186J02361k02063N4418l9323j13195M4217Q7016
$$ 1310118 1387515 1404299 1411485 1463671 1566032 1363969 1418387 1379064 1265869 1310086 1397102
5855A397102P1584m6519O5223n6381n383N3531o201q2424K17J17609O2162p23
$$ 1397102 1468686 1422167 1487390 1431009 1425626 1479157 1472956 1390532 1390749 1508358 1570520 1569797
5843A569797p6607l7730N0617J8498R9090J27653n5041M870N370P5805O1428k50939
$$ 1569797 1493190 1455460 1506077 1524575 1623665 1751318 1696277 1701147 1706517 1782322 1843750 1592811
5831A592811j47368k0858J61762J21931N6710L8884j16197J2851j5659J48888
$$ 1592811 1445443 1424585 1586347 1708278 1764988 1803872 1687675 1700526 1684867 1833755
5821A833755J81938p9052o5111n7797N7910R8682n3597O1956N8093j3806k28219
$$ 1833755 2015693 1936641 1871530 1813733 1871643 1970325 1916728 1978684 2036777 2022971 1794752
5810A794752p7934J3488J8982p5102J39846P1812j14675m806r7342J04748N0409
$$ 1794752 1716818 1730306 1749288 1674186 1814032 1885844 1771169 1766363 1669021 1773769 1824178
5799A824178j05114n6741O61q3002O9573J58190q8385n4251M8186N5616N0524
$$ 1824178 1719064 1662323 1662984 1579982 1649555 1807745 1719360 1665109 1713295 1768911 1819435
5788A819435J7178N887j41750j31548Q9748j6717j43505N4312k7161J69602m3766
$$ 1819435 1836613 1842500 1700750 1569202 1658950 1642233 1498728 1553040 1525879 1695481 1651715
5777A651715L1811M8906K0076P531Q6510L1926p0103k7965r5117n2871Q2831m0026
$$ 1651715 1683526 1732432 1752508 1760039 1846549 1878475 1808372 1780407 1685290 1632419 1715250 1675224
5765A675224p530n294O714N4990K2274L0170o1836L7294P332l6024M7707Q5249
$$ 1675224 1667694 1662400 1669114 1724104 1746378 1776548 1714712 1752006 1759338 1723314 1771021 1856270
5753A856270n6087l2506o9788R5946L141J5775n058Q37N4944J7902l5672J04434
$$ 1856270 1800183 1767677 1697889 1793835 1796976 1812751 1807693 1808530 1863474 1881376 1845704 1950138
5741A950138J12768j39262L0527l5814L8803r1319P2101K8858J104o9268O2591
$$ 1950138 2062906 1923644 1954171 1918357 1957160 1865841 1937942 1966800 1967904 1898636 1961227
5730A961227J2398o019j7499j06891M1637P6310K3346j1347N0068M4082J01864
$$ 1961227 1973625 1967606 1950107 1843216 1884853 1961163 1984509 1973162 2023230 2067312 2169176
5719B169176l7727o5233J3337J25285P7361n6324N8560r555j08724l1349M0560
$$ 2169176 2131449 2066216 2079553 2204838 2282199 2225875 2284435 2274880 2166156 2134807 2175367
5708B175367m0229J10738M5943k846J00421j4139O4311K1422j24915N3963R9083
$$ 2175367 2135138 2245876 2291819 2288973 2389394 2375255 2439566 2460988 2336073 2390036 2489119
5697B489119K8543J4301J9912P5048L8938P0230j92565J50114L5275n4168l3095
$$ 2489119 2517662 2531963 2551875 2626923 2665861 2736091 2543526 2693640 2728915 2674747 2641652
5686B641652O5029J561J33331L7111O6474j4434J16044j25625o8338J56368N2630
$$ 2641652 2706681 2708242 2841573 2878684 2945158 2930724 3046768 2921143 2852805 3009173 3061803
5675C061803o0541K958N2399N4475l3620j32326K14985P7744J0929L9596K3626
$$ 3061803 3001262 3004220 3056619 3111094 3077474 2945148 3160133 3237877 3248806 3288402 3312028
5664C312028J2710n9982q8552J80189J17324P3009Q5367J24722K225P2432r0555
$$ 3312028 3324738 3264756 3176204 3356393 3473717 3546726 3632093 3756815 3759040 3831472 3740917
5653C740917j23100L3429J30125O1110M6817J06546q235j07410J17801m0381J45463
$$ 3740917 3617817 3651246 3781371 3842481 3889298 3995844 3987609 3880199 3998000 3957619 4103082
5642D103082M5248k5675O5753j43973P9111M1002k7216p5531r793J02179J20404
$$ 4103082 4148330 4122655 4188408 4044435 4123546 4164548 4137332 4061801 4052008 4154187 4274591
5631D274591K8319L421L7851O142M1261Q7593J22541m1399j7390M5582J1596r1050
$$ 4274591 4302910 4306331 4344182 4350324 4391585 4479178 4601719 4560320 4542930 4588512 4600108 4509058
5619D509058J3400L9816K0108J259J34958J17227o1069J60899J71636j7224l7403
$$ 4509058 4522458 4562274 4582382 4583641 4718599 4835826 4774757 4935656 5107292 5090068 5052665
5608E052665l3973Q1089R8703L884J73768q1876J00847O2229m4043R8180J25876
$$ 5052665 5018692 5099781 5198484 5202368 5376136 5294260 5395107 5457336 5413293 5511473 5637349
5597E637349L2044P2882P7813J31804P0124J15863R7692k5786P4690N1896K2896
$$ 5637349 5669393 5742275 5820088 5951892 6022016 6137879 6235571 6209785 6284475 6336371 6359267
5586F359267K0622K7210J33939J55448J29398J03383r5828r2685O4347J66843
$$ 6359267 6379889 6407099 6541038 6696486 6825884 6929267 6833439 6740754 6805101 6971944
5576F971944K7807L9188J23364q283R2769J15344J24501J5898O2861J79894J64016
$$ 6971944 6999751 7038939 7162303 7154020 7246789 7362133 7486634 7502532 7565393 7745287 7909303
5565G909303R8257r0005K41273J10178N4596J55685L4941J02000K83911Q1466
$$ 7909303 8007560 7917555 8158828 8269006 8323602 8479287 8514228 8616228 8900139 8981605
5555H981605Q1070J55682P2082K01130J14384J09642J08515J18987K09250L56272
$$ 8981605 9062675 9218357 9290439 9491569 9605953 9715595 9824110 9943097 10152347 10508619
5545A0508619R4377J72055J47152N2876K68610K20569J7758K02333M23183J68429
$$ 10508619 10602996 10775051 10922203 10975079 11243689 11464258 11482016 11684349 12107532 12275961
5535A2275961K36355K07302J57319K51912K26899L16967L24874L72497M12280
$$ 12275961 12512316 12719618 12876937 13128849 13355748 13672715 13997589 14370086 14782366
5526A4782366L87288L19417L59242L51820L95624M22921N82889M73638M06877
$$ 14782366 15169654 15489071 15848313 16200133 16595757 17018678 17601567 18075205 18482082
5517A8482082O49020P12733M00114K30878L01323L32828K83036L04039M60323
$$ 18482082 19131102 19843835 20243949 20474827 20776150 21108978 21392014 21696053 22156376
5508B2156376L15757N69719O13169M65894M33937Q07724P08186M99536O94457
$$ 22156376 22472133 23041852 23655021 24120915 24554852 25362576 26070762 26570298 27264755
5499B7264755P15503P00410R60464Q24833Q77195J032440J025045R42507J235752
$$ 27264755 27980258 28680668 29641132 30465965 31343160 32375600 33400645 34343152 35578904
5490C5578904J224015J133240J179485J224972J498191J497953J601282J572746
$$ 35578904 36802919 37936159 39115644 40340616 41838807 43336760 44938042 46510788
5482D6510788J646098J769970J888074K045809K174699K284894K285415K466845
$$ 46510788 48156886 49926856 51814930 53860739 56035438 58320332 60605747 63072592
5474F3072592K572869K726151K887638K977815L201266L409525L542600L481109
$$ 63072592 65645461 68371612 71259250 74237065 77438331 80847856 84390456 87871565
5466H7871565L939144M008466M185006M616095M749270M864119N176058N376212
$$ 87871565 91810709 95819175 100004181 104620276 109369546 114233665 119409723 124785935
5458A24785935N661288N735750O027844O289730O381860O822895O910676P323584
$$ 124785935 130447223 136182973 142210817 148500547 154882407 161705302 168615978 175939562
5450A75939562P566129P791526Q062576Q649991R164873R455129R664013R822658
$$ 175939562 183505691 191297217 199359793 208009784 217174657 226629786 236293799 246116457
5442B46116457J0123328R988464R714486R524151Q754192P775928O555677N284674
$$ 246116457 256239785 266228249 275942735 285466886 294221078 301997006 308552683 313837357
5434C13837357M122723K661719J364297J5760j023518k233782l536739m763536
$$ 313837357 317960080 320621799 321986096 322001856 320978338 318744556 315207817 310444281
5426C10444281o250952p907872r663592j1113807j2436600j3298522j3823197
$$ 310444281 304193329 296285457 286621865 275508058 263071458 249772936 235949739
5419B35949739j3853234j3688621j3172516j2298254j1550131j0916030r902114
$$ 235949739 222096505 208407884 195235368 182937114 171386983 160470953 150568839
5412A50568839q975919q342473p776066p201608o695113o159089n551221n222168
$$ 150568839 141592920 133250447 125474381 118272773 111577660 105418571 99867350 94645182
5404I4645182m929415m467541m255491l887552l496007l353077l111684k857416
$$ 94645182 89715767 85248226 80992735 77105183 73609176 70256099 67144415 64286999
5396F4286999k759028k671363k310265k131760j993292j933387j897622j723136
$$ 64286999 61527971 58856608 56546343 54414583 52421291 50487904 48590282 46867146
5388D6867146j426271j726458j631075j463022j179715j308125j085442j134559
$$ 46867146 45440875 43714417 42083342 40620320 39440605 38132480 37047038 35912479
5380C5912479j233313r99081r55340r38349q30112q55111q38069q02757o53853
$$ 35912479 34679166 33680085 32724745 31786396 30956284 30101173 29263104 28460347 27806494
5371B7806494o75808p51244o89877n55162o98469n93726m94857o51827n13432
$$ 27806494 27130686 26379442 25689565 25134403 24435934 23842208 23347351 22695524 22182092
5362B2182092m70723m92001k82413l74053m77139m79607n69325j94122k73217
$$ 22182092 21711369 21219368 20936955 20562902 20085763 19606156 19036831 18842709 18569492
5353A8569492m11130l02427k72142m78674m14046k29793l14431k25606j64803
$$ 18569492 18158362 17855935 17583793 17105119 16691073 16461280 16146849 15921243 15756440
5344A5756440j49585j86392m46206l71724k40297j91275l43745k73175j02670
$$ 15756440 15606855 15420463 14974257 14602533 14362236 14170961 13827216 13554041 13451371
5335A3451371j89045k80564k41309l03238j45110k21563k65888r7175l8040j63742
$$ 13451371 13262326 12981762 12740453 12437215 12292105 12070542 11804654 11707479 11669439 11505697
5325A1505697p4572j62083j39454k74439j84907L8666j30724P898j16089k05652
$$ 11505697 11431125 11269042 11129588 10855149 10670242 10708908 10578184 10586082 10469993 10264341
5315A0264341j73020j98681m0842J0780n01o3098k11305j02939j7376r9731j18792
$$ 10264341 10091321 9892640 9851798 9862578 9862077 9798979 9587674 9484735 9467359 9367628 9248836
5304I248836k8527j18226j26042M4822K050k25433p3477j44K0916P7037j66075
$$ 9248836 9220309 9102083 8976041 9020863 9022913 8797480 8724003 8723859 8744775 8821812 8655737
5293H655737q9552n3411m3639P7621M4910m4798N4652N3242M3981l2991o4987
$$ 8655737 8566185 8512774 8469135 8546756 8591666 8546868 8601520 8654762 8698743 8665752 8600765
5282H600765j22323r76L7328N1617K41818L1215K9102M6151m6755J08104J78635
$$ 8600765 8478442 8477466 8514794 8566411 8808229 8839444 8868546 8914697 8867942 8976046 9154681
5271I154681O5629R4852K87319J15855J15934m3182K30699K32524Q8657n6625
$$ 9154681 9220310 9315162 9602481 9718336 9834270 9791088 10021787 10254311 10342968 10286343
5261A0286343O8399L55230J15253J47292J76626K36743J95717J79489K57108K86394
$$ 10286343 10354742 10709972 10825225 10972517 11149143 11385886 11581603 11761092 12018200 12304594
5251A2304594K42864K90333L26793M03882M87327M08169N88347N89563N34167
$$ 12304594 12547458 12837791 13164584 13568466 14055793 14463962 15052309 15641872 16176039
5242A6176039N97111O42597N51731P05533P61145P06958P06783R92022J001153
$$ 16176039 16773150 17415747 17967478 18673011 19434156 20141114 20847897 21839919 22841072
5233B2841072J213466J332787J298731J469680J664789J733327J889684K118460
$$ 22841072 24054538 25387325 26686056 28155736 29820525 31553852 33443536 35561996
5225C5561996K283453K606445K720529L142600L507604L811383M062136M735156
$$ 35561996 37845449 40451894 43172423 46315023 49822627 53634010 57696146 62431302
5217F2431302N598723O353808O898508P719810R057166J0242904J1757128J3833646
$$ 62431302 68030025 74383833 81282341 89002151 98059317 108302221 120059349 133892995
5209A33892995J6869994K0985005K6098385L3436195M2162138M7795709M3911624
$$ 133892995 150762989 171747994 197846379 231282574 273444712 321240421 365152045
5202C65152045K1238972j6094764m2609644m8569089m2383246l3695346k6389966
$$ 365152045 386391017 370296253 327686609 279117520 236734274 203038928 176648962
5195A76648962k0937514j6182344j2699493j0357061r036235q077831p037330
$$ 176648962 155711448 139529104 126829611 116472550 107436315 99358484 92321154
5188I2321154o253465n449047m899343m242503l652346l353176l071272l009592
$$ 92321154 86067689 80618642 75719299 71476796 67824450 64471274 61400002 58390410
5180E8390410k936377k925088k604510k115299j813147j763696j798784j572702
$$ 58390410 55454033 52528945 49924435 47809136 45995989 44232293 42433509 40860807
5172D0860807j372361j324938j238072j167907j085568r35529r17277r43962r15091
$$ 40860807 39488446 38163508 36925436 35757529 34671961 33736432 32819155 31875193 30960102
5163C0960102p99063r80370p74826q68843r28353r25499p29254q46500q09041
$$ 30960102 30161039 29180669 28405843 27537000 26608647 25683148 24953894 24107394 23298353
5154B3298353n57826m86519o22639o05542n47250p02179m57121m56337n38766
$$ 23298353 22740527 22254008 21631369 21025827 20478577 19776398 19319277 18862940 18324174
5145A8324174n59204m73815l70829m39206m80985l63177k41769l24472l64157
$$ 18324174 17764970 17291155 16920326 16481120 16000135 15636958 15395189 15070717 14706560
5136A4706560j68352p4643k25391k65677l18025j14024r3008l45511l18672j20895
$$ 14706560 14538208 14463565 14238174 13972497 13654472 13540448 13447440 13101929 12783257 12662362
5126A2662362j60836k12436j42126j40532j45971j47250l32127q6056q5208q1473
$$ 12662362 12501526 12289090 12146964 12006432 11860461 11713211 11381084 11295028 11209820 11128347
5116A1128347k05184q7563k18817j74629j46017l39127j80651o2624j18410k50868
$$ 11128347 10923163 10835600 10616783 10442154 10296137 9957010 9776359 9713735 9595325 9344457
5106I344457j83808m3317j44443j07984j90591j30089M2932j00727j05405j19702
$$ 9344457 9160649 9117332 8972889 8864905 8674314 8544225 8587157 8486430 8381025 8261323
5096H261323p8977j08949j1804q6057O7660J9895j70981j31862k03368j47336
$$ 8261323 8182346 8073397 8061593 7975536 8043196 8063091 7892110 7760248 7556880 7409544
5086G409544l826j01590r1532j32857r1987j45534M3915m5686j37351o3027j41990
$$ 7409544 7405718 7304128 7212596 7079739 6987752 6842218 6886133 6840447 6703096 6640069 6498079
5075F498079o2209k48042q2302p2861r4306n8443j55489k2928r9962k18919l3820
$$ 6498079 6435870 6187828 6105526 6032665 5938359 5879916 5724427 5701499 5601537 5382618 5348798
5064E348798r2082o561j48416j72100j4946r9866k2261o6820o4745l9322j71611
$$ 5348798 5256716 5250155 5101739 4929639 4914693 4814827 4792566 4725746 4661001 4621679 4450068
5053D450068k34880l9704Q2166P054n5429j13919M2840j17146n8348j23227j50848
$$ 4450068 4215188 4175484 4257650 4264704 4209275 4095356 4138196 4021050 3962702 3839475 3688627
5042C688627J16536j2449O2391J30693j07660m1087r1470j69721j23450k7084
$$ 3688627 3805163 3792714 3855105 3985798 3878138 3837051 3745581 3575860 3452410 3425326
5032C425326R6114k9135j88261j56278p6300j9920J32478p4925L1612M7526P7749
$$ 3425326 3521440 3492305 3304044 3147766 3071466 3051546 3184024 3109099 3140711 3188237 3265986
5021C265986n1748m7199j08810j24464N4361j70571Q528J58240r7818m7905l2964
$$ 3265986 3214238 3167039 3058229 2933765 2988126 2817555 2826083 2984323 2886505 2838600 2805636
5010B805636R7628j82157j14311p674j0646n7652r962P6474p5919o0982j07179
$$ 2805636 2903264 2721107 2606796 2599122 2588476 2530824 2520862 2597336 2521417 2460435 2353256
4999B353256n0679K0390j43386q18J87910o5337O4481o4411m8453j15315J2399
$$ 2353256 2302577 2322967 2179581 2178763 2366673 2301336 2365817 2301406 2252953 2137638 2150037
4988B150037o0162r7167j6520L5299j0280j59152L3518J45130j1112j78852P3431
$$ 2150037 2089875 1992708 1976188 2011487 2001207 1842055 1875573 2020703 2009591 1830739 1904170
4977A904170k2550J38006O3052J7163N8253q2280J4255m9264p7272M0051j11135
$$ 1904170 1881620 2019626 2082678 2099841 2158094 2075814 2090069 2040805 1963533 2003584 1892449
4966A892449J2245M5480p9950P1105J29302l1248j03261R6126L1393j1142K5491
$$ 1892449 1904694 1950174 1870224 1941329 2070631 2039383 1936122 2032248 2063641 2052499 2077990
4955B077990K7773J64042L4774J17875K09948j13491J39390R5771J44937K91216
$$ 2077990 2105763 2269805 2304579 2422454 2632402 2518911 2658301 2754072 2899009 3190225
4945C190225K42451K76741L55199N00177M52177N52930M62216L37496l39503m80463
$$ 3190225 3432676 3709417 4064616 4564793 5016970 5569900 6032116 6369612 6030109 5549646
4935E549646o13899o87042n46592k81251k12701l22627r4279j17640r142j36266
$$ 5549646 4935747 4248705 3702113 3420862 3208161 2885534 2791255 2673615 2664473 2528207
4925B528207k15081j16324l0226k07997P9086J3536K1832O8903j8633j78338l0497
$$ 2528207 2313126 2196802 2166576 1958579 2037665 2051201 2073033 2141936 2123303 1944965 1914468
4914A914468P9615l3145L4672K673p7788J7925L5170J18824p173j13013m4449
$$ 1914468 1994083 1960938 1995610 1998283 1920495 1938420 1973590 2092414 2085241 1972228 1927779
4903A927779K6516J0188m9501Q1194J8993J15812l187q1193p039N9784P3546m5902
$$ 1927779 1954295 1964483 1914982 1996176 2015169 2130981 2127794 2046601 2039562 2099346 2172892 2126990
4891B126990Q3245J76225J95037J44164J24247K04243L6593j08553j85615l03270
$$ 2126990 2210235 2386460 2581497 2725661 2849908 3054151 3090744 2982191 2796576 2493306
4881B493306k28226j47303j15050j00485j09096l8709j97305q862m7695j30879
$$ 2493306 2265080 2117777 2002727 1902242 1793146 1754437 1557132 1548270 1500575 1369696
4871A369696m6136R7863j47326N9629L3862q1964m6917J3322l1795J1326n7450
$$ 1369696 1323560 1421423 1274097 1333726 1367588 1285624 1238707 1252029 1220234 1231560 1174110
4860A174110N4272l4222p0360R8123j50617J0111O160J06133p4207R927m7421
$$ 1174110 1228382 1194160 1123800 1221923 1071306 1081417 1087577 1193710 1119503 1129430 1082009
4849A082009m331K9094q8396J9433l1371o6671L3821K8845o5041N0146o7490j4510
$$ 1082009 1077678 1106772 1018376 1037809 1006438 939767 973588 1002433 937392 987538 920048 905538
4837I05538R4059r8146J8099R5051j9910j58018J04884L8592k4332p9928K28496
$$ 905538 999597 901451 919550 1014601 994691 836673 941557 980149 955817 875889 1104385
4826A104385o992K7847m6665k850J31332j037J5450p4177k6738L8721L6067J6561
$$ 1104385 1097393 1125240 1078575 1075725 1207057 1206020 1221470 1147293 1120555 1159276 1195343 1211904
4814A211904L3914O2475J4932J1415O8592P1586N7357M4795O8535J50625J58843
$$ 1211904 1245818 1308293 1323225 1334640 1403232 1474818 1532175 1576970 1645505 1796130 1954973
4803A954973K1203K6701L09725K61220K99744L28908M90050M89051N40038O23975
$$ 1954973 1976176 2002877 2312602 2573822 2873566 3202474 3692524 4181575 4721613 5345588
4793E345588J22215j08747l96614l50272p29710m50949l71375m01901l12237k87913
$$ 5345588 5467803 5359056 4962442 4612170 3882460 3431511 3060136 2658235 2345998 2058085
4783B058085j38522o4446j36711K8591J14412q8689j15787j37078j38549K37420
$$ 2058085 1919563 1855117 1718406 1746997 1861409 1772720 1656933 1519855 1381306 1618726
4773A618726m8069p1732J03905p2375j10353k1585L1069j06077n0009J59954n851
$$ 1618726 1570657 1498925 1602830 1530455 1420102 1398517 1429586 1323509 1273500 1433454 1427603
4762A427603Q8240l0752P8982q8354j75988O4683r9236L5527J9017J0368o8556
$$ 1427603 1515843 1485091 1564073 1475719 1299731 1364414 1265178 1300705 1319722 1330090 1261534
4751A261534m8766R4714k4066j23149k7978j42989j3739O7851R1052p8118n9437
$$ 1261534 1212768 1307482 1283416 1160267 1132289 989300 975561 1043412 1134464 1056346 996909
4740I96909n8865M6843J13823j11575m8755p2209J38154J26269j32552r1768q1530
$$ 996909 938044 984887 1098710 987135 938380 866171 1004325 1130594 998042 906274 824744
4729H24744J60040Q3113j29508J7810N9609m4986k779P928M0778o391P5387j3655
$$ 824744 984784 1067897 938389 956199 1015808 970822 968043 975971 1016749 1010358 1085745 1072090
4717A072090j44821J00046P8406j10428L0248N8899P3029j19198R637P6776j4265
$$ 1072090 927269 1027315 1105721 995293 1025541 1084440 1157469 1038271 1047908 1124684 1110419
4706A110419O1856k4325o2680P4389J31727l6143q7600p772Q6883O1749P0079
$$ 1110419 1172275 1147950 1085270 1159659 1291386 1255243 1167643 1159871 1246754 1308503 1378582
4695A378582m1065J1628O1858m2425M8781L4154n7097k8397Q7535m0159O3516
$$ 1378582 1337517 1349145 1411003 1368578 1417359 1451513 1394416 1366019 1453554 1413395 1476911
4684A476911L7750R8797M7260j3641l5136J07351L7267J42415J07008j32730O8818
$$ 1476911 1514661 1613458 1660718 1647077 1611941 1719292 1756559 1898974 2005982 1873252 1942070
4673A942070J34934R8175n9460J16975L5518j15536K9913J78901K04533J51141
$$ 1942070 2077004 2175179 2115719 2232694 2268212 2152676 2182589 2361490 2566023 2717164
4663B717164O7257J30785j8878J97930R8709J29320J48702J38253J76561K50247
$$ 2717164 2784421 2915206 2896328 3094258 3192967 3322287 3470989 3609242 3785803 4036050
4653D036050K39637J82514K90921J65629L69059J97062J0789P8488K32650K96294
$$ 4036050 4275687 4458201 4749122 4914751 5283810 5480872 5491661 5570149 5802799 6099093
4643F099093K14917L20174K90561L95161M57892O52807N95983O31594O26574Q69694
$$ 6099093 6314010 6634184 6924745 7319906 7777798 8430605 9026588 9658182 10284756 11154450
4633A1154450Q43795R89942J276983J465942J861106K423771L276847L816420
$$ 11154450 11998245 12988187 14265170 15731112 17592218 20015989 23292836 27109256
4625B7109256L857800J881148j683137l287052k924492k040665j343321q77877
$$ 27109256 30967056 32848204 31165067 27878015 24953523 22912858 21569537 20691660
4617B0691660k04996M657L64596O75952R25905J001426J477833J727526K019128
$$ 20691660 20486664 20491321 20855917 21531869 22457774 23459200 24937033 26664559 28683687
4608B8683687K521392K567133K371699K038133J758678J699479J776289K372385
$$ 28683687 31205079 33772212 36143911 38182044 39940722 41640201 43416490 45788875
4600D5788875L191603L584611L338229K467668J242045K64021K04879M28269J503040
$$ 45788875 48980478 52565089 55903318 58370986 59613031 59877052 60081931 60510200 62013240
4591F2013240K411883K462983J655275j47399j970861l117712k833051j938707
$$ 62013240 64425123 66888106 68543381 68395982 66425121 63307409 60474358 58535651
4583E8535651j171715o74337n79846j340073k467978l684525l758344l328973
$$ 58535651 57363936 56689599 56109753 54769680 52301702 48617177 44858833 41529860
4575D1529860k492477j970517j855495j783387j947676k617981k767639k526541
$$ 41529860 39037383 37066866 35211371 33427984 31480308 28862327 26094688 23568147
4567B3568147k299667j905464j581633j342447j239167j095376q93817p20424
$$ 23568147 21268480 19363016 17781383 16438936 15199769 14104393 13210576 12490152
4559A2490152p84586n38870o06281o28553l78455m89562m30730k85005m74468
$$ 12490152 11705566 11166696 10560415 9931862 9553407 9063845 8633115 8348110 7873642
4550G873642l29623l36411l30915l14703j24035k05092j93778l34670k24070j22126
$$ 7873642 7544019 7207608 6876693 6561990 6437955 6232863 6039085 5704415 5480345 5358219
4540E358219l00890q0342l17439j90598k9960j70167r8781j04386j66373q7508
$$ 5358219 5057329 4976987 4659548 4468950 4438990 4268823 4170042 4065656 3899283 3811775
4530C811775j3712j42305j89933j1119O0173j62101q4228j87100J64617o7467
$$ 3811775 3798063 3655758 3465825 3454706 3514879 3352778 3268550 3081450 3246067 3178600
4520C178600k09354k14299j57004J00347M3609n1088j61092K1629l6551k62995
$$ 3178600 2969246 2754947 2597943 2698290 2741899 2690811 2529719 2551348 2514797 2251802
4510B251802j17138J56494M6418j00252m8250J4692j31738k5552l3853Q440J1430
$$ 2251802 2134664 2291158 2337576 2237324 2189074 2203766 2072028 2046476 2012623 2021063 2032493
4499B032493j15753j35534J62845j0877j34794j77534P5987R1953M0979K2556
$$ 2032493 1916740 1781206 1944051 1933174 1798380 1620846 1696833 1788786 1829765 1852321
4489A852321q0702r5865J1914j02021r7517J53817r7650k3532L4164p2188M058
$$ 1852321 1771619 1675754 1687668 1585647 1488130 1641947 1544297 1520765 1554929 1482741 1486799
4478A486799P3937j67252Q8847M5833J0334k6555p4807j2471O3258O8049R2323
$$ 1486799 1560736 1393484 1482331 1528164 1538498 1511943 1437136 1424665 1487923 1555972 1648295
4467A648295p6701m7826J6400q7309j17645O29P5747L6129l9200J2601M561K7895
$$ 1648295 1571594 1523768 1540168 1452859 1335214 1335843 1411590 1447719 1408519 1421120 1425681 1453576
4455A453576r1130J12317N759P5789K3670o6970K2177K8956P956K7406J34300
$$ 1453576 1362446 1474763 1480522 1556311 1579981 1513011 1535188 1564144 1572100 1599506 1733806
4444A733806j2l3386P8750J65298Q4063l8728J39099K29862l8282K71296L64950
$$ 1733806 1733794 1700408 1779158 1944456 2028519 1989791 2128890 2358752 2320470 2591766 2956716
4433B956716K88521J22469L26604L47230L84629L79164M74451O88863N99894M74186
$$ 2956716 3245237 3367706 3694310 4041540 4426169 4805333 5279784 5968647 6568541 7042727
4423G042727Q2175l79725m24127p54571q98170n38898m54805m69042k39736k41514
$$ 7042727 7124902 6745177 6321050 5566479 4668309 4129411 3674606 3205564 2965828 2724314
4413B724314k01048l19543j67424K556k0210k16266k6041j10163j19829l8145
$$ 2724314 2523266 2203723 2036299 2038855 2018645 1802379 1776338 1666175 1546346 1508201
4403A508201K1874m8917j53621L0625l4778r4326K1364J5352q4536r0758m2395
$$ 1508201 1530075 1481158 1327537 1358162 1323384 1229058 1250422 1265774 1181238 1090480 1048085
4392A048085j30964Q05K0036l4221q1824j45123R4296M2119j6996j0468K9409
$$ 1048085 917121 917926 937962 903741 821917 676794 771090 813209 796213 785745 815154
4381H15154r5192l7322j9152M711J1354R106k9859J9114Q2210n0041q9721o1145
$$ 815154 719962 682640 663488 668199 679553 688659 658800 677914 760124 710083 620362 559217
4369E59217k3849O8492r131k8610Q3723O0763l4892n6489j22003n0682R5597L2108
$$ 559217 535368 603860 594729 566119 649842 710605 675713 619224 497221 446539 542136 574244
4357E74244R1063p0757N6816N8519P077j01953k0389q2808r7221R3868M9288q570
$$ 574244 665307 594550 651366 709885 716962 615009 594620 511812 414591 508459 557747 549177
4345E49177q8450J10528o2420P4737m8900L2738J7684n2841l4851p0039P7312
$$ 549177 460727 571255 508835 583572 534672 567410 585094 532253 497402 427363 504675
4334E04675K6364Q3030q1076k231l4543o5970J36585J65034j1634l25829J03118
$$ 504675 531039 614069 532993 530762 496219 430249 566834 731868 720234 394405 497523
4323D97523J05758p7088J7319l0599j12420J35742j938n2346K8991L2953Q8754
$$ 497523 603281 526193 543512 512913 400493 536235 534297 481951 510942 543895 632649
4312F32649j4374n513Q0874j05026n2660n7544L7048Q6637M0776k0920j21983
$$ 632649 618275 612762 693636 588610 535950 478406 515454 602091 642867 621947 499964
4301D99964j17321J03326J58664n7897o7184J42087m1508p2065N9514k6404J03891
$$ 499964 382643 485969 644633 586736 519552 661639 620131 548066 607580 581176 685067
4290F85067J04390j678p8453L7491l5620Q4020P501Q4093k4415j45247k10895
$$ 685067 789457 787779 709326 746817 711197 795217 802718 886811 862396 717149 506254
4279E06254Q748R4209R157j1043J29905J50167j41083M7500q4599j03753J16530
$$ 506254 515002 609211 618368 607325 737230 887397 746314 793814 709215 605462 721992
4268G21992O4161j1888k8319p5130l8537J2901k1510J9762m8016L4264K109j26679
$$ 721992 786153 774265 745946 670816 632279 645180 623670 643432 595416 629680 631789 505110
4256E05110O2680J20100r3279n4702N6517M3016L8677J5284q5544k4806j42779
$$ 505110 567790 687890 594611 539909 596426 639442 678119 693403 607859 583053 440274
4245D40274r830J30031M3427J11914q222q0276k5367n368J0349L1332m7514K76
$$ 440274 430444 560475 603902 715816 707594 627318 601951 596583 606932 638264 590750 591026
4233E91026L6866M2497Q057j12753j22009l9239P716j8183J36707L6350M3186
$$ 591026 627892 670389 678446 565693 443684 404445 412161 393978 530685 567035 610221
4222F10221m1391j34776O1358J08262Q4228L9568q5074l5367l2481P7648J61431
$$ 610221 568830 434054 495412 603674 687902 727470 642396 607029 574548 652196 813627
4211H13627N5209j66423O6006R2605k5464j9585K3538r0125M4236Q3733K9823
$$ 813627 868836 702413 768419 861024 835560 815975 839513 749388 793624 877357 907180
4200I07180L6687k31523J39253J60136j67676r2108o6603R5656R4646q1655J89261
$$ 907180 943867 712344 851597 1011733 844057 751949 685346 781002 875648 793993 983254
4189I83254q4841j90143j9782N2304p0393k2417K0523p1247J91704P1879p624
$$ 983254 898413 708270 688488 740792 670399 647982 668505 597258 788962 860841 853217
4178H53217l0082j01560J77418j87847J397R7177Q352Q8648l3146K2156q2876
$$ 853217 823135 721575 898993 711146 712543 809720 818072 906720 873574 895730 812854
4167H12854k8351O9268Q8473J2248Q9346L8093N3160o13j69103M3612J20257k3369
$$ 812854 784503 853771 942244 954492 1043838 1081931 1135091 1134478 965375 1008987 1129244 1105875
4155A105875j26657j03471q3220R4145j2587q0739o2711Q2696J1322M2886K8268
$$ 1105875 979218 875747 792527 886672 874085 793346 730635 813331 824653 867539 895807
4144H95807K6604n6615n9097l5267P1129K00213j1275q7345O455o3018l2474j9371
$$ 895807 922411 865796 806699 771432 842561 1042774 1031499 944154 950609 887591 855117 835746
4132H35746O6764m6495o0832J6621K2182Q0619r6134O1331J03383l9579k076P633
$$ 835746 902510 856015 795183 811804 833986 914605 818471 879802 983185 943606 941530 949163
4120I49163k3216J2982l3188n9528N4929J33492j44846n2165J55947Q7512j32906
$$ 949163 925947 938929 905741 846213 901142 1034634 889788 837623 993570 1081082 948176
4109I48176O3343Q9358L7683p5033O3827j5045J9666j26289J29618J7845m3732
$$ 948176 1011519 1100877 1138560 1063527 1127354 1112309 1131975 1005686 1135304 1153149 1109417
4098A109417m5297K1069Q6165q1125J06688o9630P6303Q2368M2606O6790j11926
$$ 1109417 1064120 1085189 1171354 1090229 1196917 1127287 1203590 1285958 1328564 1395354 1283428
4087A283428J67689J8756m3608Q9349o0063L1027J71426R9310j08399P1363J27148
$$ 1283428 1451117 1469873 1426265 1515614 1455551 1486578 1658004 1757314 1648915 1720278 1847426
4076A847426O457K14690J72760m0272J98833R6687P2604J1796R6371K49439J28823
$$ 1847426 1853883 2068573 2241333 2201061 2399894 2496581 2569185 2580981 2677352 2926791 3055614
4065C055614L3674K87781K23378J69605L06666K96646L67407N51366M18297M16955
$$ 3055614 3089288 3377069 3600447 3770052 4076718 4373364 4740771 5292137 5710434 6127389
4055F127389P60453P97527J042412J387363J668965J914743J851871O87502j383904
$$ 6127389 6887842 7685369 8727781 10115144 11784109 13698852 15550723 16238225 14854321
4046A4854321k321465j998797j432253r29130p84215o35356l91083k35373j84751
$$ 14854321 12532856 10534059 9101806 8172676 7388461 6753105 6362022 6126649 5941898
4037E941898j09994j44510k28883k39128k91083k31436k40117P4509K0819j38225
$$ 5941898 5831904 5687394 5458511 5219383 4928300 4696864 4456747 4531256 4552075 4413850
4027D413850n9432p4603k26606j65319q7725j88855j52491p2250Q3576k22902
$$ 4413850 4354418 4279815 4053209 3887890 3800165 3611310 3458819 3386569 3470145 3247243
4017C247243l5571m9929N3323M6547n6508o4011K6066R8376L8025p5461j43724
$$ 3247243 3211672 3161743 3215066 3261613 3205105 3141094 3167160 3265536 3303561 3228100 3084376
4006C084376K51662J42656N1281j3687J23164m3431o8611Q1051O9868L7825R0170
$$ 3084376 3336038 3478694 3529975 3516288 3639452 3596021 3527410 3608461 3678329 3716154 3806324
3995C806324J17695K19093J16830L1868K7627J11843J4095K45868M8529J7811
$$ 3806324 3924019 4143112 4259942 4291810 4319437 4431280 4445375 4691243 4739772 4757583
3985D757583J60489J09834J16965J29441K07394M3372J62369K62844J92586J20456
$$ 4757583 4918072 5027906 5144871 5274312 5481706 5525078 5687447 5950291 6142877 6263333
3975F263333R1869L31356L87452L33026K99591L10860L92405K55637K00057O4736
$$ 6263333 6355202 6686558 7074010 7407036 7706627 8017487 8409892 8665529 8865586 8930322
3965H930322P9969K54643K94120J71232L81246L89800K47586N85890M81120N74379
$$ 8930322 9010291 9264934 9559054 9730286 10111532 10501332 10748918 11334808 11815928 12390307
3955A2390307N85206N02942R40689R54857Q60466Q16177R88943P20219Q35663
$$ 12390307 12975513 13478455 14419144 15374001 16234467 17050644 18039587 18759806 19595469
3946A9595469J120498J106864J289686J588715J538343J893603K263333K554276
$$ 19595469 20715967 21822831 23112517 24701232 26239575 28133178 30396511 32950787
3938C2950787K513923K628085K607933K163612J835528J434734J280489J317030
$$ 32950787 35464710 38092795 40700728 42864340 44699868 46134602 47415091 48732121
3930D8732121J347178J493049J709797J888340K116108K525085K585112K419013
$$ 48732121 50079299 51572348 53282145 55170485 57286593 59811678 62396790 64815803
3922F4815803K039992J630629J268804P43449Q85314J249545J349026J930921
$$ 64815803 66855795 68486424 69755228 70498677 71383991 72633536 73982562 75913483
3914G5913483K489491K886766L313077L710277M057029L472053J798903r42654
$$ 75913483 78402974 81289740 84602817 88313094 92370123 95842176 97641079 96698425
3906I6698425l405103m280730m149391l470177k741376k202317j505682j141260
$$ 96698425 93293322 89012592 84863201 81393024 78651648 76449331 74943649 73802389
3898G3802389r02013p29572o47217p85905j374766j629112j996867k404868k455670
$$ 73802389 72900376 72170804 71523587 70737682 69362916 67733804 65736937 63332069 60876399
3889F0876399k255946j708258j548045j467147j287196j158482j239566j432517
$$ 60876399 58620453 56912195 55364150 53897003 52609807 51451325 50211759 48779242
3881D8779242j538849j892572k357644k571437k505854k307541k086230j903877
$$ 48779242 47240393 45347821 42990177 40418740 37912886 35605345 33519115 31615238
3873C1615238j448817j384935j293445j053244r19444p93403q38085p62822r61558
$$ 31615238 30166421 28781486 27488041 26434797 25515353 24721950 23883865 23121043 22159485
3864B2159485r71886r03248p94960p95652o03220m56628n10107n92057l28887
$$ 22159485 21187599 20284351 19489391 18693739 18090519 17633891 17123784 16531727 16202840
3855A6202840l98486m60402k86474l77342j85260k91882k47360j73172k20404
$$ 16202840 15804354 15343952 15057478 14680136 14494876 14202994 13955634 13782462 13562058
3846A3562058n28039m48998l16414m20873n39551k49060j13939m57162k99141
$$ 13562058 13034019 12585021 12268607 11847734 11308183 11059123 10945184 10488022 10188881
3837A0188881k20137k31643l47755p0209q5056k14329j98772j8654j26535j41832
$$ 10188881 9968744 9737101 9389346 9319137 9234081 9019752 8820980 8802326 8675791 8533959
3827H533959k04132J0904j68671l12323k13346j57047q8819k69914j14880p4344
$$ 8533959 8329827 8340731 8172060 7859737 7646391 7489344 7400525 7130611 7015731 6941387
3817F941387j57739k25468k2609j49650k97800l3679l7266k98364j57909l0775
$$ 6941387 6783648 6558180 6535571 6385921 6088121 6054442 6017176 5718812 5560903 5530128
3807E530128J10122j48998j95004o6745p8507j47290J9532l3154r5343K2847j72185
$$ 5530128 5640250 5491252 5296248 5229503 5150996 5003706 5023238 4990084 4894741 4917588 4745403
3796D745403m5274J481n2840j06581j76556k3180j18558n232r9588J02766l3858
$$ 4745403 4700129 4701610 4648770 4542189 4365633 4342453 4223895 4218663 4119075 4221841 4187983
3785D187983r6447J1501j18335r7566k30651M0734j4069m709n3167o4962j32951
$$ 4187983 4091536 4103037 3984702 3887136 3656485 3697219 3683150 3678441 3625274 3560312 3427361
3774C427361p5844j25148p4043j30560p4856R3619j0916o4237r0279J7604k5691
$$ 3427361 3351517 3226369 3152326 3021766 2946910 3040529 3029613 2965376 2875097 2892701 2867010
3763B867010p1963O9968L1347n7939r2244J41413p4647j52536N5246L8178j08980
$$ 2867010 2795047 2865015 2896362 2838423 2746179 2887592 2812945 2660409 2715655 2753833 2644853
3752B644853n1426n6035j27117L4123k8334m0499j59871n1827R6613M6466j01350
$$ 2644853 2593427 2537392 2410275 2444398 2416064 2375565 2215694 2163867 2260480 2306946 2205596
3741B205596q9012p3981J30609O7689K7794o718n8747l6462m9125q3600j41752
$$ 2205596 2116584 2042603 2173212 2240901 2268695 2261977 2203230 2166768 2117643 2034043 1892291
3730A892291K4614l8438j27819O2898n0765l1116m2122L6012O9684Q4475j12081
$$ 1892291 1916905 1878467 1750648 1813546 1762781 1731665 1689543 1725555 1795239 1879714 1767633
3719A767633J2029r0871k05311R8034R046M7102J3153N8220L2916n0729k07005
$$ 1767633 1779662 1688791 1483480 1581514 1590560 1637662 1650815 1709035 1741951 1691222 1484217
3708A484217M4643J215p5162n8116K1709K0280N2467j9663J28299m2833k46629
$$ 1484217 1528860 1530075 1454913 1396797 1418506 1438786 1491253 1471590 1599889 1557056 1310427
3697A310427R1112L4897n6948N2576k8878j7748J1959j1580K0610o7685J5358
$$ 1310427 1401539 1436436 1379488 1432064 1403186 1385438 1397397 1385817 1406427 1338742 1354100
3686A354100m9223K160J35948j00165L5213O7503j09537M4982Q0847l7929q3849
$$ 1354100 1304877 1307037 1442985 1342820 1378033 1445536 1335999 1380981 1461828 1423899 1340050
3675A340050n5660n9982M7498J36214p3908o7617N1170l3412N1348k760l0678
$$ 1340050 1284390 1224408 1271906 1408120 1334212 1266595 1317765 1284353 1335701 1332941 1302263
3664A302263r3372Q5240K1004r273m9876Q4425r9790n5240P9127P8729k5841r9556
$$ 1302263 1208891 1294131 1315135 1305862 1255986 1340411 1240621 1185381 1264508 1343237 1317396 1217840
3652A217840K4785j4866L460J0784k5132M1121p5999n9243N7152j55923O166L0417
$$ 1217840 1242625 1227759 1231219 1242003 1216871 1257992 1181993 1122750 1179902 1023979 1030145 1060562
3640A060562L1191J46407j13655l0812J968J01118k4893n9174L5054J06064r0303
$$ 1060562 1091753 1238160 1124505 1093693 1095661 1196779 1171886 1112712 1147766 1253830 1163527
3629A163527j87570j6637j0414K299J06503p1055N7095l7734J26778k5318k21451
$$ 1163527 975957 959320 948906 951205 1057708 986653 1043748 1006014 1132792 1107474 886023
3618H86023k1124j98629J85085J02729L4790l9651Q8417p458q6452m8345L97M6459
$$ 886023 864899 666270 851355 954084 988874 949223 1037640 1030182 943730 895385 895782 942241
3606I42241P185n37k1765R673L8808p3347j4155j258L7814j7273j07449j30570
$$ 942241 949426 948889 927124 936797 975605 902258 888103 886845 924659 907386 799937 669367
3594F69367J06743l3868k5072J2674J03191j24605j11966j2155L8166P9457L9262
$$ 669367 776110 742242 717170 729844 833035 708430 596464 584309 622475 701932 741194
3583G41194m6483J2467K7183m4255l2303J13585j34410k9363m0795J10831j3162
$$ 741194 694711 707178 734361 690106 657803 771388 636978 607615 566820 677651 664489
3572F64489j62913R3901K0436l168k2989K8506k8736j6997J1351M6888l9266K3154
$$ 664489 501576 595477 615913 612745 589756 618262 589526 572529 583880 630768 591502 614656
3560F14656J03127r5767j71955N2152m7158K7977M7487j2185L7491K5109q9317
$$ 614656 717783 622016 450061 502213 455055 483032 530519 518334 555825 580934 491617
3549D91617p3620K9713J01101l4870m3248j9712J23160K4521K3450m6891j84343
$$ 491617 417997 447710 548811 513941 470693 450981 574141 598662 622112 575221 390878
3538C90878k2240J00895J52443p1704l7310q4674L6425K7286j04514N9252n3966
$$ 390878 368638 469533 621976 550272 512962 428288 464713 491999 387485 446737 392771
3527C92771n6807O5738O5029P4070p0679l9410J81857j07484K5805p309l8444
$$ 392771 335964 401702 466731 540801 470122 430712 612569 505085 530890 523581 485137
3516D85137j4632R465L2391k4397j41606L8902Q2478M6225k3020j69718M7139
$$ 485137 470505 479970 512361 487964 346358 385260 467738 513963 490943 321225 368364
3505C68364J47297j19395K14777q2678m1800q6914p2780Q7447J041J47513J02456
$$ 368364 515661 396266 611043 528365 486565 399651 326871 414318 415359 562872 665328
3494F65328J07825r3976M1948J53790o144q1480j27365r2029j3670n0372L5596
$$ 665328 773153 679177 721125 874915 868771 787291 659926 567897 554227 503855 539451
3483E39451j0048P5821m5300j62732o1962l639R8476J2893o1863O9376P9192O8534
$$ 539451 529403 605224 559924 397192 335230 331591 430067 442960 381097 450473 529665 598199
3471E98199j9835n2432l4331J03538R587j22808j7402q082J42045J39826J6781
$$ 598199 578364 525932 491601 595139 604726 481918 464516 456434 598479 738305 755086
3460G55086j06516P9336N7633o6572N7158J2095q1292j01176P4383R1836r3934
$$ 755086 648570 727906 785539 718967 776125 788220 706928 605752 680135 771971 678037
3449F78037O8829N2881k7733L4317o9035J39760K9349J75207N409J3106p0286
$$ 678037 746866 799747 772014 806331 737296 877056 906405 1081612 1087021 1100127 1029841
3438A029841j8507K0607R1655M7673P968K6086J3292l0053Q8129R1005k13487
$$ 1029841 1011334 1031941 1123596 1171269 1179237 1205323 1218615 1188562 1276691 1367696 1154209
3427A154209j28330J22501N2361m9267P3962Q1539M9606l6484m299J34111J92565
$$ 1154209 1025879 1148380 1200741 1151474 1225436 1306975 1356581 1320097 1315798 1449909 1642474
3416A642474J90861Q0786P2321r4926k43241m37n5618j80912j75962K1347l9564
$$ 1642474 1833335 1914121 1986442 1891516 1648275 1647838 1592220 1411308 1235346 1256693 1217129
3405A217129q4493j04331L9703k9144q7661O6575Q9709O0574m7881j0039J17942
$$ 1217129 1132636 1028305 1068008 1038864 951203 1017778 1107487 1168061 1120180 1110141 1228083
3394A228083L5790J15235L5319r3584M9682K02459K28513J42775K04364K86785
$$ 1228083 1263873 1379108 1414427 1320843 1370525 1572984 1801497 1944272 2148636 2435421
3384B435421J93770J21611J92872J26663j96798k66211k63373l14030k34300o9512
$$ 2435421 2629191 2750802 2943674 3070337 2873539 2607328 2343955 2029925 1795625 1726113
3374A726113p0519M0585p8242k19555n5991j40782K1712n7000Q1478N5556j0565
$$ 1726113 1655594 1696179 1617937 1398382 1342391 1201609 1223321 1166321 1247799 1303355 1292790
3363A292790L0982q2561J69976L1424q9259n5426J64392J01762k1412J681R0887
$$ 1292790 1323772 1241211 1411187 1442611 1353352 1297926 1462318 1564080 1542668 1544349 1635236
3352A635236J57092Q263j0290J37339j8993k09588j3660k09875j40300j51064
$$ 1635236 1792328 1800591 1790301 1927640 1908647 1699059 1685399 1475524 1335224 1184160
3342A184160K516j17921r5744r5689L6078L3610j74186O806j1343P266j9336j24867
$$ 1184160 1186676 1068755 973011 877322 913400 947010 772824 779630 768287 775553 756217 631350
3330F31350m0389Q7975o254l0020j52540p4191l0196R7788K5383k6982q3640J43128
$$ 631350 590961 678936 672682 642662 490122 415931 385735 483523 508906 481924 398284 541412
3318E41412o0691j9346J29325k2449R3233j01721q4627j56591j12114Q2153J06943
$$ 541412 480721 461375 590700 568251 661484 559763 475136 318545 206431 288584 395527
3307C95527l1274r4355k254N9040n12J00384m1645q916l88q0906J4377K9627K844
$$ 395527 364253 269898 267644 326684 326172 426556 384911 375995 375607 294701 309078 338705 341549
3294C41549r3356J68840Q5903o1240n7051P249j55792j45034J79361M6814Q57
$$ 341549 248193 417033 502936 441696 384645 391894 236102 91068 270429 317243 318100
3283C18100r0133j8073J9837l1658J73270j915k11307N367L8612Q9410O9978l8874
$$ 318100 227967 209894 229731 198073 371343 369428 158121 163488 202100 291510 361488 322614
3271C22614L1301j00332R3712j42162n4819J04239r0948J18155l3395o6329j1960
$$ 322614 353915 253583 347295 205133 150314 254553 163605 281760 248365 182036 170076
3260A70076J22994q2241n2429J5050J1867p281n6300L1551r266n1J0918J5764
$$ 170076 293070 210829 158400 173450 185317 178036 121736 153287 144021 143970 154888 170652
3248A70652J8189O1115j13668R7770J6907l2557J4869K2503N4834m630O5352n8340
$$ 170652 188841 249956 136288 234058 250965 218408 233277 255780 310614 305984 371336 312996
3236C12996k31059o1212R5164N6315R2564j3293j03130J6029j5698j43417l3270
$$ 312996 81937 20725 115889 172204 264768 251475 148345 164374 148676 5259 -28011
3225b8011J40273o043l2881O6488p8865q1050R956P5221J5409m482o7387O9677
$$ -28011 112262 106219 73338 139826 60961 -20089 -10133 65088 80497 76015 8628 78305
3213G8305r4561N2275J28813j11668m9728K4696M3139m126P954k5667n0491J43840
$$ 78305 -16256 36019 164832 53164 3436 28132 71271 67145 75099 49432 -1059 142781
3201A42781L2617N3522L7165j38626j7613m7960q6512m2644O6162K3281P3635
$$ 142781 175398 228920 266085 127459 109846 61886 -24626 -67270 -1108 22173 95808
3190I5808l3447P9936j0418j83180j2023m826K5175N4114m2715P8110q890O3071
$$ 95808 62361 142297 131879 -51301 -63324 -68150 -42975 11139 -31576 46534 37644 100715
3178A00715J23862K4945j17498K3587J1592l6096m5866R4602n9646k36527J36357
$$ 100715 224577 249522 132024 155611 167203 131107 85241 179843 120197 -116330 20027
3167B0027j2445K5078J3642M0419J4094P0143O3043k19764k22238O8233J07869
$$ 20027 7582 32660 46302 86721 100815 170958 234001 14237 -208001 -139768 -31899
3156c1899O0505O8323n725J22460M0220j37239J7027O0573j8023j94j19336J55287
$$ -31899 28606 96929 91204 213664 253884 116645 133672 194245 176222 176028 56692 211979
3144B11979j7326k9262j2708l69J7040N0292m99n1164J13007K9445N0892j38153
$$ 211979 194653 165391 152683 152314 169354 219646 219147 167983 280990 310435 361327 223174
3132B23174j21299K05269r0910L2637l3652p3436J40388j58702O7043r1706q5053
$$ 223174 101875 307144 216234 248871 215219 141783 282171 123469 190512 98806 13753
3121A3753M5518J20615n7124J2942k7052K5956o9339J15430j7994L1830j03146
$$ 13753 59271 179886 122762 135704 108652 134608 65269 180699 162705 194535 91389
3110I1389R9023L1574n8732O6206j047N6975J51191K2590j55511j09709j14717
$$ 91389 190412 221986 163254 229460 228413 285388 436579 459169 303658 193949 79232
3099G9232K32320M804p7283j2630J53926P705r8688J4602p7896j00411k697K36380
$$ 79232 311552 316356 239073 226443 380369 388074 289386 303988 226092 125681 122984 359364
3087C59364n7342l3207P3899j40886j18750L2900l8814r279K24881o0956k9612
$$ 359364 302022 268815 342714 201828 83078 115978 77164 67885 292766 231810 202198
3076B02198J20316J08131j05144l2664n0803o0555l858J06422Q1386j75417J1863
$$ 202198 322514 430645 325501 292837 242034 181479 177621 284043 365429 190012 201875
3065B01875J25831j8342N8318o5142m3369q7919J76515l4469o5703L5602r94p0284
$$ 201875 327706 309364 367682 302540 259171 171252 347767 313298 247595 283197 282203 211919
3053B11919K2510O2126p1510m685M0405k3203K5878j57185Q2096J09695j1822
$$ 211919 234429 296555 225045 220360 260765 237562 263440 106255 188351 298046 286224
3042B86224o5831L0979K6473j30030J00904j52786O9607r1199N9051j23986l2665
$$ 286224 220393 251372 277845 147815 248719 95933 165540 74341 133392 9406 -23259
3031b3259J00837O8154k3609j5193R4093j01406p9750O1329O7708m6319p0612
$$ -23259 77578 145732 122123 106930 201023 99617 19867 81196 148904 102585 31973
3020C1973k3015l5101Q1826l1520k8258J51575p6242j28583N0504J53967k0123
$$ 31973 8958 -26143 55683 24163 -4095 147480 71238 -57345 -6841 147126 127003
3009A27003q2974M3549K8396j4146Q8770O4996j99854p3991K0286j4741M3513
$$ 127003 44029 87578 115974 101828 190598 255594 55740 -18251 2035 -12706 30807
2998C0807k5943j26736M4641J12915p8273j3077K45528m1122k03916n4078J7813
$$ 30807 4864 -121872 -77231 35684 -42589 -55666 189862 148740 -55176 -109254 -91441
2987i1441O5601O10O3997j57123K2704L283l2568L6071J13157m0177q665J3957
$$ -91441 -25840 -25230 38767 -118356 -95652 -92369 -124937 -88866 24291 -15886 -24551 -10594
2975a0594k7004L6540R3178p3421K6740l6610l1175k265O6036l3089r3741J45438
$$ -10594 -37598 -1058 92120 18699 45439 8829 -22346 -24611 41425 8336 -85405 60033
2963F0033Q217P946j1657j71j61207M1129o7478p960J29224m4216K21j50264k6575
$$ 60033 68250 76196 64539 64368 -96839 -55710 -123188 -131148 -1924 -46140 -45919 -196183 -222758
2950b22758K4866J00367q6878Q3435J1297J0311P4532j6532k9411m1843r95o936
$$ -222758 -197892 -97525 -184403 -100968 -89671 -79360 -4828 -21360 -50771 -92614 -93609 -100545
2938a00545K3449L2672j3113j02748j96587J42934J36526l4463J14786q1368O8045
$$ -100545 -77096 -44424 -57537 -160285 -356872 -213938 -77412 -111875 2911 -78457 -10412
2927a0412R6734r2212r3424j2625R69J21139M3680K6090q9893k8655P4919O1813
$$ -10412 86322 -5890 -99314 -111939 -110970 10169 53849 79939 -9954 -38609 36310 98123
2915I8123j46551K87m8015J20147J38729Q0842r6209j81284O976O4516m0057n0328
$$ 98123 -48428 -48141 -96156 23991 162720 243562 147353 -33931 -26955 37561 -2496 -52824
2903e2824j11844K4928l2466k8716m4747O147K58378N9103j69454l4236L5238
$$ -52824 -164668 -139740 -172206 -200922 -245669 -239522 18856 77959 -91495 -125731 -90493
2892i0493J16814K89o165J095j7569l447q5533m4751p5140p1658J13514R2630
$$ -90493 26321 26610 20445 21540 3971 524 -85009 -129760 -204900 -276558 -163044 -70414
2880g0414J10976k1808m0226J09200j07388J9074m5947l1940l4185l9136O9774
$$ -70414 40562 18754 -21472 87728 -19660 -586 -46533 -78473 -112658 -151794 -82020
2869h2020L4384j6957K1765o1589j1789j3263K6208K3331k1320M6510p465J7433
$$ -82020 -47636 -64593 -42828 -104417 -116206 -129469 -103261 -79930 -101250 -54740 -62205 -44772
2857d4772k9088n5114J1024J45914j4015l0667l7970N334q8914J62053L7817j29015
$$ -44772 -73860 -128974 -117950 27964 13949 -16718 -54688 -49354 -138268 23785 61602 -67413
2845f7413l7470K1206N9996M2781j7448J0098L369j6104p5004q3194M2953m0778
$$ -67413 -104883 -83677 -23681 19100 1652 11750 15119 -985 -75989 -159183 -116230 -157008
2833a57008J21405j11695j06140p0110J34790Q5548J42869j60292n8874l5239
$$ -157008 -35603 -147298 -253438 -323548 -188758 -103210 39659 -120633 -179507 -214746
2823b14746J50727J00721m3161k1847j1659J4230L529q2620j9969m250J29390
$$ -214746 -64019 36702 -6459 -28306 -39965 -25735 -22206 -104826 -124795 -129045 345
2812C45M7671m758n9874n0010M8037P0695o6662j9920n45J66310n7909j57267
$$ 345 48016 43258 -16616 -66626 -18589 52106 -14556 -34476 -35021 131289 73380 -83887
2800h3887J64713j62527r3696M8893l0044P7052L5420n8282O2008J4582P2086
$$ -83887 80826 -81701 -175397 -126504 -156548 -79496 -44076 -102358 -40350 -25768 46318
2789D6318o0028J8384j55705j4J34572P9050K2549j20112J467n4415J6354J38818
$$ 46318 -13710 4674 -151031 -151045 -16473 62577 85126 -34986 -33519 -87934 -71580 67238
2777F7238p88j45367M0867P6709N4124Q6640o0642j45546p1124J75830L4569j67098
$$ 67238 66450 -78917 -38050 38659 92783 179423 118781 -26765 -97889 77941 112510 -54588
2765e4588K5105j02908l4779L6736J35147l7952p160q926j25796N9667L8406n8002
$$ -54588 -29483 -132391 -167170 -130434 4713 -33239 -40399 -49325 -175121 -115454 -77048 -135050
2753a35050M4010N7239k5054Q9901o2242N8545l815p0619k9073P1895q2031r981
$$ -135050 -91040 -33801 -58855 31046 -31196 27349 23534 -47085 -76158 -4263 -86294 -96275
2741i6275J0076m1352M7524R0410n2134j1312M7010n5810J50548l5000p8971n8303
$$ -96275 -86199 -127551 -80027 10383 -41751 -53063 -6053 -61863 88685 53685 -25286 -83589
2729h3589l3619R2485M5214l576j97195J32048J59372j36369n5631P7041n331
$$ -83589 -117208 -24723 20491 16915 -180280 -48232 111140 -25229 -80860 -3819 -9150
2718i150J45491j9793j24954j28465J44100M652j953l3312j33366P6044M9627
$$ -9150 136341 116548 -8406 -136871 7229 11881 9928 -23384 -156750 -80706 -31079
2707c1079q1884Q1912j00538m0709j8752K7981Q076Q5050o1976r4946J12394L1468
$$ -31079 -112963 -31051 -131589 -172298 -191050 -163069 -154993 -69943 -131919 -226865 -114471 -83003
2695h3003R103K3396n7054j1411J45730M3906j64266l138m3760o1627j6275J41402
$$ -83003 -73900 -50504 -107558 -118969 26761 70667 -93599 -96737 -140497 -202124 -218399 -76997
2683g6997k7385n8283J68392P1725L2315j24247k1997n7965q3484K3376J60035
$$ -76997 -104382 -162665 5727 77452 109767 -14480 -36477 -94442 -177926 -154550 5485
2672E485k0145O5673p7086o637M3064p9450J7751Q2350r5974j20705o1021J82488
$$ 5485 -14660 51013 -26073 -32710 10354 -69096 -51345 31005 -64969 -185674 -246695 -64207
2660f4207k7240J15230m1369Q321P9584K8875N5337L2352p1444L3431k28035r3595
$$ -64207 -91447 23783 -17586 -9265 70319 99194 154531 186883 115439 148870 -79165 -172760
2648a72760M9778L8934K3750r7398k5892J15106J20872m9990k7735J7673K0130
$$ -172760 -122982 -84048 -60298 -157696 -183588 -68482 52390 2400 -25335 -7662 12468
2637A2468J98222q4604q8368p9302j7531N2014M9165o6788n2824n1079m7356P2008
$$ 12468 210690 126086 37718 -41584 -59115 -7101 42064 -24724 -77548 -128627 -175983 -103975
2625a03975Q7170N6563j13564l1007k8133J50383O9645K4044j55695l0571o2700
$$ -103975 -16805 39758 -73806 -104813 -132946 17437 87082 111126 -44569 -75140 -137840
2614a37840P6886l5434P3493J44556j50845P7654L9759K6747j3547j10750N5516
$$ -137840 -60954 -96388 -22895 121661 -29184 48470 88229 114976 101429 -9321 46195
2603D6195m1193L3173r8025j3443M7327P5586J50991j60906j90897M0555J70113
$$ 46195 5002 38175 -59850 -73293 -25966 49620 200611 39705 -151192 -110637 59476
2592E9476p7542j02996O213L047j0929M7379L9683p0478m449R7735L5667k9627
$$ 59476 -18066 -121062 -114849 -111802 -122731 -75352 -35669 -106147 -110596 -12861 22806 -6821
2580f821m7914L7420J24918m9576n3354m7542J65008o9078n4839j45051M4895
$$ -6821 -54735 -17315 107603 58027 4673 -42869 122139 53061 -1778 -146829 -101934
2569a01934n1108K5012J22795r8494J75194j2360r6883j36234J13951L6910N7948
$$ -101934 -153042 -128030 -5235 -103729 71465 59105 -37778 -174012 -60061 -23151 34797
2558C4797m8630q9781n2961P560L545J20414n4453j378J2009P656P1286P5682
$$ 34797 -13833 -103614 -156575 -149015 -145470 -25056 -79509 -80887 -68878 -61222 10064 85746
2546H5746K0058j22583N4414J2809o4138l8505J78756q1774j4211p2414l3557
$$ 85746 105804 -16779 37635 50444 -13694 -52199 126557 44783 30572 -41842 -75399
2535g5399J1399J00358J2277l1470j19833q016Q2770k5207J07173p1430m962R3988
$$ -75399 -64000 36358 48635 17165 -102668 -110684 -27914 -53121 54052 -17378 -22340 71648
2523G1648o9185K3572k6192J1216k1226l4103n2503M7639r2388J06224o9894L2356
$$ 71648 2463 26035 -157 11059 -10167 -44270 -96773 -49134 -141522 -35298 -105192 -72836
2511g2836J5323n0368L5715k3416J14318j6076K7125n3493M1186l027J8961k5629
$$ -72836 -57513 -107881 -72166 -95582 18736 2660 29785 -23708 17478 14451 33412 7783
2499G783O488L5835q6949K2147M9809l8588R7474L0151p4046j85441K4904J35174
$$ 7783 14271 50106 -36843 -14696 35113 -3475 93999 124150 50104 -135337 -110433 24741
2487B4741j53834L575J00328j28960J12169p4318j08m5936O893N3443M0784J33938
$$ 24741 -129093 -125518 -25190 -154150 -41981 -116299 -116407 -162343 -155450 -102007 -61223 72715
2475G2715o952j66444J77991n1665o5331j0709K4236R734l3275m297n3395p8472
$$ 72715 65763 -100681 77310 25645 -39686 -50395 -26159 -16425 -49700 -53997 -107392 -185864
2463a85864K7806P5644J21744J6340L3733q0722r6941O9215K3517j04806j30254
$$ -185864 -158058 -82414 39330 55670 89403 8681 -88260 -19045 4472 -100334 -230588
2452b30588J30714P1848J2679k2958R1197l8002n0301l1288p4703q0136R6740
$$ -230588 -99874 -28026 -15347 -38305 52892 14890 -35411 -66699 -141402 -221538 -124798
2441a24798L3942K9161n0459Q7818K0257r6285j3549J12042N1498n3940j13809
$$ -124798 -90856 -61695 -112154 -24336 -4079 -100364 -113913 -1871 49627 -4313 -118122
2430a18122o4842N438M5411J06819M5285p6972j3346r467L9781K9289l4913K4184
$$ -118122 -182964 -177526 -132115 -25296 19989 -56983 -70329 -79796 -40015 -10726 -45639 -21455
2418b1455R8910j33983k5914L6814M9181L3851J1865N2452p8134k2297O0244K2241
$$ -21455 77455 -56528 -82442 -45628 3553 37404 49269 101721 23587 1290 61534 83775
2406H3775n1589n2235o2696q0078P9456J82276R6798L948k54861l6319J8328M2148
$$ 83775 32186 -20049 -82745 -162823 -83367 98909 195707 199655 -55206 -91525 -73197 -31049
2394c1049J0674q1027R8936L5355j6397l6680Q512J30520M7599k9879n6254j45384
$$ -31049 -20375 -101402 -2466 32889 16492 -20188 -11676 118844 166443 136564 80310 -65074
2382f5074n9714J54918M8642L427j54880L143K0526M5247j8143L6472R8577p1364
$$ -65074 -124788 30130 78772 82199 -72681 -69538 -49012 -3765 -21908 14564 113141 41777
2370D1777o4189n6114R765J48068P804o3435m3024J3473K13983r0978j83487N185
$$ 41777 -22412 -78526 -68761 79307 87111 23676 -19348 -5875 208108 117130 -66357 -61172
2358f1172P8609r6282J5270Q3501l3477j3554R8818J7363j7674l4771M6996P0979
$$ -61172 17437 -78845 -63575 19926 -13551 -27105 71713 89076 71402 36631 83627 154606
2346A54606q7065J393L7322j09587J06067J27358J08560l4946k11789l4328L4979
$$ 154606 67541 68934 106256 -3331 102736 230094 338654 303708 91919 57591 92570
2335I2570O3418q0643M347q4882O2023J37563J24311J17083L8967j4209M9767
$$ 92570 155988 75345 79692 -5190 56833 194396 318707 435790 474757 460548 510315
2324E10315k1320j5684R6672J11611N9987l826J91740Q6976J74616L06370L09003
$$ 510315 488995 473311 569983 681594 741581 737755 929495 1016471 1191087 1497457 1806460
2313A806460M18204J38783m34188l95383k00237k15777j36358p1763j45775j49972
$$ 1806460 2224664 2363447 1929259 1533876 1333639 1117862 981504 909741 763966 613994
2303F13994j5788j64706J619N0163j35879K3155j13896l0753O6481k6541j14138
$$ 613994 598206 433500 435119 485282 349403 372558 258662 227909 294390 267849 153711
2292A53711n8495N846n7528J08118j8701l2716K4615l784N4742J2283r7416j14050
$$ 153711 95216 101062 43534 151652 132951 100235 124850 121066 175808 188091 90675 -23375
2280b3375m1497Q9905m7617m5886J82390q477P3877j25152k7613k6195O3723j9513
$$ -23375 -64872 25033 -22584 -68470 113920 105443 179320 54168 26555 360 64083 44570
2268D4570k1077l877l42M1419r0466K0247k6944l5870N8836J14387o9412r1471
$$ 44570 23493 19616 19274 60693 -29773 -9526 -36470 -72340 -13504 100883 31471 -60000
2256f0000J2572Q3609n6944m044m162O3858O1590k42604P037J24020R8297k2213
$$ -60000 -47428 36181 -20763 -24807 -28969 34889 96479 -146125 -139088 -15068 83229 61016
2244F1016m6606k08411K4622N8008j22959R2095N745p737o9263L9878k786J05021
$$ 61016 14410 -194001 -169379 -111371 -234330 -142235 -136490 -144227 -213490 -173612 -176398 -71377
2232g1377k621N5491m6245r173L6791L6502j21156j0617N8548P0637m0907J1016
$$ -71377 -73998 -18507 -64752 -73925 -37134 -632 -121788 -132405 -73857 -3220 -44127 -33111
2220c3111N2071l2600p6656L4915j0810M4947Q0521o6150r5001q9792n1681Q1008
$$ -33111 18960 -13640 -90296 -55381 -66191 -21244 59277 -6873 -101874 -191666 -243347 -162339
2208a62339J33362m1474J37267N7291o1045j4351n453j3196K1253K0921j177j3400
$$ -162339 -28977 -70451 66816 124107 63062 48711 43258 30062 51315 72236 71059 57659
2196E7659o3734n9118Q6731l163K9215P5312L3774O1966j16584j67205o724M5018
$$ 57659 -6075 -65193 21538 18375 47590 122902 156676 218642 102058 -65147 -71871 -26853
2184b6853j8269q402m7422k5919J08387k0442j28891J11349O4680q1615P0214
$$ -26853 -45122 -53524 -100946 -126865 -18478 -38920 -167811 -56462 8218 -73397 -3183
2173c183j70144J15239L2098q9215N2862P6323o0202N8839j15553Q001J24329
$$ -3183 -173327 -58088 -25990 -115205 -62343 13980 -46222 12617 -102936 -94935 29394
2162B9394j28277J34315r3833l6664N8263n2841l9612K6460n7782o568R6415J02054
$$ 29394 -98883 35432 -58401 -95065 -36802 -89643 -129255 -102795 -160577 -167145 -70730 31324
2150C1324N95J2062R2395j18704l0921K8320K6122l3494r8561L8534J51806o1311
$$ 31324 31919 43981 136376 17672 -13249 15071 41193 7699 -90862 -52328 99478 38167
2138C8167q8184P1400o2788j5418q0226J68467J72066q0746O275K6297K3027O6465
$$ 38167 -50017 21383 -41405 -56823 -137049 31418 203484 122738 129013 155310 178337 244802
2126B44802n0837k13648n0538j20880J10208n9412J09924Q27j02873j26523Q0670
$$ 244802 193965 -19683 -70221 -191101 -80893 -140305 -30381 -29554 -132427 -258950 -178280
2115a78280M5455k7495L6772M2934K5072p0517J13128n994L3240j7293K6583M4268
$$ -178280 -132825 -160320 -123548 -80614 -55542 -126059 -12931 -18925 14315 -2978 23605 67873
2103F7873n2269m6388O37j51600P6779P5466o9777m3387k8363J5673J08941L9436
$$ 67873 15604 -30784 -30147 -181747 -104968 -29502 -99279 -142666 -171029 -155356 -46415 -6979
2091f979o8581o8677N6690J9860J10435k2113K9280q0183p0733M7585k2788j60417
$$ -6979 -75560 -144237 -87547 -67687 42748 20635 49915 -30268 -101001 -53416 -76204 -236621
2079b36621l817L3334J35564K282N9606O672J71077J6103j77995k7385N1353J12088
$$ -236621 -240438 -207104 -71540 -69258 -9652 -2980 168097 184200 6205 -21180 30173 142261
2067A42261m4439N3823q8999p3450q968m1384K9164M5520K1316J06958r4908J06352
$$ 142261 97822 151645 62646 -10804 -19772 -61156 -31992 13528 34844 141802 46894 153246
2055A53246Q4693L6078k41696j76872j11869R2942r2472O7911J66039k3156M1874
$$ 153246 237939 274017 32321 -144551 -256420 -163478 -255950 -188039 -22000 -45156 -3282
$$ [...]
##END NTUPLES=NMR SPECTRUM
##END=
