##TITLE=1H_DE-80H_X3
 200.13MHz, d2o
 8 sc
 
 19ns.26.2.2025
##JCAMPDX= 6.0         $$ Bruker NMR JCAMP-DX V2.0
##DATA TYPE= NMR SPECTRUM
##DATA CLASS= NTUPLES
##ORIGIN= UXNMR, Bruker Analytische Messtechnik GmbH
##OWNER= pz
$$ XWIN-NMR		Version 3.5
$$ Fri Jul 18 14:26:21 2025 Russian Standard Time (UT+4h)  Yarkov@DPX200
##.OBSERVE FREQUENCY= 200.1313
##.OBSERVE NUCLEUS= ^1H
##.ACQUISITION MODE= SIMULTANEOUS
##.ACQUISITION SCHEME= undefined
##.AVERAGES= 8
##.DIGITISER RES= 18
##SPECTROMETER/DATA SYSTEM= spect
##.PULSE SEQUENCE= zg30
##.SOLVENT NAME= CDCl3
##.SHIFT REFERENCE= (INTERNAL, CDCl3, 0, 15.499)
##AUDIT TRAIL= $$ (NUMBER, WHEN, WHO, WHERE, WHAT)
$$ ##TITLE= Audit trail, XWIN-NMR		Version 3.5
$$ ##JCAMPDX= 5.01
$$ ##ORIGIN= Bruker BioSpin GmbH
$$ ##OWNER= Yarkov
$$ C:/Bruker/XWIN-NMR/data/yarkov2/nmr/H-C/1/pdata/1/auditp.txt
$$ ##AUDIT TRAIL=  $$ (NUMBER, WHEN, WHO, WHERE, WHAT)
(   1,<2025-07-18 14:25:09.46 +0400>,<Yarkov>,<DPX200>,
      <created by zg, POWCHK disabled, PULCHK disabled
       configuration hash MD5:
       00 E9 B6 7A A2 85 ED C7 34 08 36 98 17 FE 4E 26
       data hash MD5: 16K
       31 76 EA 4B CF FC 97 71 B6 BA A4 98 56 C3 32 D9>)
(   2,<2025-07-18 14:25:26.18 +0400>,<Yarkov>,<DPX200>,
      <Start of raw data processing
       efp BC_mod = 2 LB = 0.25 FT_mod = 6 PKNL = 1 PHC0 = -1351.98 PHC1 = 8.99091 SI = 16K 
       data hash MD5: 16K
       5A 8D 05 FD 9E 18 E6 CB 8F 5F F1 92 F6 E5 B9 E7>)
(   3,<2025-07-18 14:25:33.07 +0400>,<Yarkov>,<DPX200>,
      <abs ABSG = 5 
       data hash MD5: 16K
       72 66 40 DF 45 B0 89 B1 EB F7 5A 04 EC 9C EC A3>)
(   4,<2025-07-18 14:25:49.28 +0400>,<Yarkov>,<DPX200>,
      <pk PHC0 = -1.163049 PHC1 = -1.8 
       data hash MD5: 16K
       44 2B F1 26 B8 30 98 BD 6F 71 1D F2 56 90 3B B9>)
$$ ##END=
$$ 
$$ hash MD5
$$ 56 B1 E3 E9 7B 85 C1 0C FB 0B D1 62 CE 63 43 73
##$RELAX= 
##$RELAX= 
##$RELAX= 
##$RELAX= 
##$RELAX= 
##$RELAX= 
$$ Bruker specific parameters
$$ --------------------------
##$DU= <C:/Bruker/XWIN-NMR>
##$EXPNO= 1
##$NAME= <H-C>
##$PROCNO= 1
##$TYPE= <nmr>
##$USER= <yarkov2>
##$AMP= (0..31)
100 100 100 100 100 100 100 100 100 100 100 100 100 100 100 100 100 100 
100 100 100 100 100 100 100 100 100 100 100 100 100 100 
##$AQSEQ= 0
##$AQ_mod= 1
##$AUNM= <au_zg>
##$AUTOPOS= <>
##$BF1= 200.13
##$BF2= 200.13
##$BF3= 200.13
##$BF4= 200.13
##$BF5= 200.13
##$BF6= 200.13
##$BF7= 200.13
##$BF8= 200.13
##$BYTORDA= 1
##$CFDGTYP= 0
##$CFRGTYP= 5
##$CHEMSTR= <none>
##$CNST= (0..31)
1 1 145 1 1 1 1 1 1 1 1 1 1 1 1 1 1 1 1 1 1 1 1 1 1 1 1 1 1 1 1 1 
##$CPDPRG= <>
##$CPDPRG1= <>
##$CPDPRG2= <>
##$CPDPRG3= <>
##$CPDPRG4= <mlev>
##$CPDPRG5= <mlev>
##$CPDPRG6= <mlev>
##$CPDPRG7= <mlev>
##$CPDPRG8= <mlev>
##$CPDPRGB= <>
##$CPDPRGT= <>
##$D= (0..31)
0 0.7 0 0 0 0 0 0 0 0 0 0.03 0 0 0 0 0 0 0 0 0 0 0 0 0 0 0 0 0 0 0 0 
##$DATE= 1752834308
##$DBL= (0..7)
120 120 120 120 120 120 120 120 
##$DBP= (0..7)
150 150 150 150 150 150 150 150 
##$DBP07= 0
##$DBPNAM0= <>
##$DBPNAM1= <>
##$DBPNAM2= <>
$$ [...]
##$SUBNAM3= <"">
##$SUBNAM4= <"">
##$SUBNAM5= <"">
##$SUBNAM6= <"">
##$SUBNAM7= <"">
##$SUBNAM8= <"">
##$SUBNAM9= <"">
##$SW= 18.0517328524113
##$SWIBOX= (0..15)
0 0 2 0 0 0 0 0 0 0 0 0 0 0 0 0 
##$SW_h= 3612.71676300578
##$TD= 16384
##$TD0= 1
##$TE= 0
##$TE2= 300
##$TE3= 300
##$TEG= 300
##$TL= (0..7)
0 120 120 120 120 120 120 120 
##$TP= (0..7)
150 150 150 150 150 150 150 150 
##$TP07= 0
##$TPNAME0= <>
##$TPNAME1= <>
##$TPNAME2= <>
##$TPNAME3= <>
##$TPNAME4= <>
##$TPNAME5= <>
##$TPNAME6= <>
##$TPNAME7= <>
##$TPOAL= (0..7)
0.5 0.5 0.5 0.5 0.5 0.5 0.5 0.5 
##$TPOFFS= (0..7)
0 0 0 0 0 0 0 0 
##$TUNHIN= 0
##$TUNHOUT= 0
##$TUNXOUT= 0
##$USERA1= <user>
##$USERA2= <user>
##$USERA3= <user>
##$USERA4= <user>
##$USERA5= <user>
##$V9= 5
##$VALIST= <valist>
##$VCLIST= <CCCCCCCCCCCCCCC>
##$VD= 0
##$VDLIST= <DDDDDDDDDDDDDDD>
##$VPLIST= <PPPPPPPPPPPPPPP>
##$VTLIST= <TTTTTTTTTTTTTTT>
##$WBST= 1024
##$WBSW= 4
##$XGAIN= (0..3)
0 0 0 0 
##$XL= 0
##$YL= 0
##$YMAX_a= 204608
##$YMIN_a= -176742
##$ZGOPTNS= <>
##$ZL1= 120
##$ZL2= 120
##$ZL3= 120
##$ZL4= 120
##$ABSF1= 15.48135
##$ABSF2= -2.570499
##$ABSG= 5
##$ABSL= 3
##$ALPHA= 0
##$AQORDER= 0
##$ASSFAC= 0
##$ASSFACI= 0
##$ASSFACX= 0
##$ASSWID= 0
##$AUNMP= <proc_1d>
##$AZFE= 0.1
##$AZFW= 0.1
##$BCFW= 0
##$BC_mod= 2
##$BYTORDP= 0
##$COROFFS= 0
##$CY= -3
##$DATMOD= 1
##$DC= 0
##$DFILT= <>
##$DTYPP= 0
##$F1P= 0
##$F2P= 0
##$FCOR= 1
##$FTSIZE= 16384
##$FT_mod= 6
##$GAMMA= 0
##$GB= 0
##$INTBC= 1
##$INTSCL= 3.241238e-09
##$ISEN= 128
##$LB= 0.25
##$LEV0= 0
##$LPBIN= 0
##$MAXI= 10000
##$MC2= 0
##$MEAN= 0
##$ME_mod= 0
##$MI= 1.114404
##$NCOEF= 0
##$NC_proc= -7
##$NLEV= 6
##$NOISF1= 3.799351
##$NOISF2= 2.8
##$NSP= 0
##$NTH_PI= 0
##$NZP= 0
##$OFFSET= 15.49899
##$PC= 1
##$PHC0= -1353.143
##$PHC1= 7.190909
##$PH_mod= 1
##$PKNL= yes
##$PPARMOD= 0
##$PSCAL= 0
##$PSIGN= 0
##$REVERSE= no
##$SF= 200.130004545502
##$SI= 16384
##$SIGF1= 3
##$SIGF2= 2
##$SINO= 0.751879
##$SIOLD= 32768
##$SREGLST= <19F.Aceton>
##$SSB= 0
##$STSI= 16384
##$STSR= 0
##$SW_p= 3612.71676300578
##$SYMM= 0
##$S_DEV= 0
##$TDeff= 16384
##$TDoff= 0
##$TI= <>
##$TILT= no
##$TM1= 0
##$TM2= 0
##$TOPLEV= 0
##$USERP1= <user>
##$USERP2= <user>
##$USERP3= <user>
##$USERP4= <user>
##$USERP5= <user>
##$WDW= 1
##$XDIM= 16384
##$YMAX_p= 383963697
##$YMIN_p= -652360
$$ End of Bruker specific parameters
$$ ---------------------------------
##NTUPLES= NMR SPECTRUM
##VAR_NAME=  FREQUENCY,     SPECTRUM/REAL,   SPECTRUM/IMAG
##SYMBOL=    X,             R,               I
##VAR_TYPE=  INDEPENDENT,   DEPENDENT,       DEPENDENT
##VAR_FORM=  AFFN,          ASDF,            ASDF
##VAR_DIM=   16384,         16384,           16384
##UNITS=     HZ,            ARBITRARY UNITS, ARBITRARY UNITS
##FACTOR=    0.220516191357247, 1,           1
##FIRST=     3101.81295093813, 0,            0
##LAST=      -510.903812067648, 0,           0
##MIN=       -510.903812067648, -652360,     0
##MAX=       3101.81295093813, 383963697,    0
$$ Real data points
##PAGE= N=1
##DATA TABLE= (X++(R..R)), XYDATA
$$ [...]
10629 166777 191224 252589 274459 280434 223721 248867 204369 104381 69334 -8294 63481 137583
10617 137583 -3178 48035 221882 317228 211669 254034 214546 318101 255023 153108
10607 153108 62444 -68449 50083 176860 202903 142298 71209 -56659 51938 132807
10597 132807 172635 219464 239786 233073 220012 118148 176477 153347 168344 250413 254465 161130
10585 161130 221598 91185 75499 234578 185925 175708 171397 224775 179839 167842 218773
10574 218773 263812 263928 143624 97456 112936 206873 50428 6143 44618 63244 206105
10563 206105 239313 170291 144803 220561 162556 152206 132832 39496 58523 191458 213905
10552 213905 250411 225065 134906 186189 181179 209631 283859 233579 181870 117068 17115 2090
10540 2090 160643 109633 94423 127629 99808 127051 153420 -1772 57924 -32957 -14815
10529 -14815 73079 42609 89747 283676 375295 353746 159064 476 79850 142595 95125
10518 95125 -43684 60169 134782 189306 132205 112857 134450 122867 115883 175734 66362
10507 66362 163530 95887 228603 259000 210913 191384 115884 31559 81583 98949 103686 39657
10495 39657 24270 98665 26417 117081 113676 128845 35443 133421 98845 138746 141992 184917
10483 184917 103730 25255 158061 262451 218547 189094 215828 166064 99868 227063 218976
10472 218976 215704 245050 320119 319828 173663 84973 49052 39873 32595 -10388 7650 -10921
10460 -10921 71289 153462 66448 72934 127729 188451 253017 208992 291783 135629 30867
10449 30867 66210 1088 -71463 -177 43581 98561 72718 -7362 96457 205276 175446
10438 175446 87148 254808 291320 239361 124863 38298 8970 92054 40242 29026 30088
10427 30088 23838 55003 123356 62953 15704 71978 120092 -19508 94384 324075 191986
10416 191986 30949 119064 18465 65045 35082 51175 181838 220131 265956 122428 8223
10405 8223 31423 131839 41898 -85069 -40711 86159 80113 -35640 -107545 67669 91310
10394 91310 22105 99906 36750 15404 114953 171296 96363 138308 11408 21427 181179
10383 181179 174610 123093 50695 35814 207867 257690 20460 123967 192422 34591 16064
10372 16064 182185 226535 190278 142306 169086 38265 -8162 98627 155687 116953 119439
10361 119439 11094 -5586 165408 21186 -79169 119815 123632 125675 216939 156622 125481
10350 125481 283920 370137 279400 296278 139245 191717 187668 276780 257508 133279 174631
10339 174631 168275 22098 -54645 6891 22950 108492 345274 277272 240294 176324 181710
10328 181710 261950 202449 189244 127043 127489 205094 356667 -10100 -70343 55063 -10716
10317 -10716 83933 79309 42742 -37589 -73595 -118926 -74351 -94812 4422 94975 313717 262584
10305 262584 85167 269384 287252 176758 38270 169803 242147 225791 211884 208665 168989
10294 168989 116308 111939 213141 221038 151403 223960 285107 278164 164738 212158 274494 98408
10282 98408 148691 151234 -68915 -2455 21141 -32892 86556 213129 274342 177145 173593
10271 173593 138712 95501 44365 64431 85236 14838 95878 56455 167857 224893 37151
10260 37151 51592 67843 188751 130554 56582 -8749 72473 163738 254252 150893 175627
10249 175627 264906 69291 81104 189980 33133 115424 110636 116111 137910 -25127 -155730
10238 -155730 -27707 39302 130547 204518 156723 205361 202908 146634 62574 63816 -141 81723
10226 81723 193587 41569 125113 224302 241597 343104 210922 208080 299176 167748 161820
10215 161820 108121 87165 196719 100104 163826 202775 309405 207364 177726 135969 209627
10204 209627 313385 266973 242693 229558 164545 138083 104633 209503 156286 176760 172617
10193 172617 115415 91256 244168 306046 294068 312177 237519 269387 302998 248430 296205
10182 296205 190014 121168 46892 -40712 120648 64793 88868 127238 137422 108020 127795
10171 127795 26158 111632 308739 256607 194426 140029 47893 -130385 -36644 -15961 88547
10160 88547 168411 224517 324550 324613 175091 123920 134424 156355 224276 303470 243577 174298
10148 174298 96074 144997 234599 118369 151763 192183 99448 84788 23179 104558 260324
10137 260324 151186 132180 110763 237769 238511 227070 225655 226084 105478 177933 260634 230309
10125 230309 201771 121409 97314 322977 160990 110322 242792 180908 200325 116563 224095
10114 224095 88907 37403 168863 112119 64783 102876 120898 45468 58718 -56326 45020
10103 45020 39468 115777 -16923 50951 170337 186402 262962 87830 82663 136210 182969
10092 182969 135907 92264 -53266 71775 153627 32289 34451 213109 240101 232653 207815
10081 207815 318551 247500 164209 -37306 -63699 150372 212072 277811 116086 38653 14974
10070 14974 69709 183101 223833 208694 203519 241789 172442 265653 193735 228961 231250 212491
10058 212491 176926 92204 137257 311179 254711 276544 204235 -69924 66860 125408 116472
10047 116472 275274 257192 90293 108960 -63035 -12509 -25154 97401 65376 -209 64288
10036 64288 88788 118084 174110 141787 161724 146547 212872 89013 3829 170552 182963
10025 182963 167582 180410 88133 152990 99483 181827 257553 181927 147071 143621 126307 143191
10013 143191 179340 46824 4431 36980 112321 74518 90745 237215 261084 168314 149991
10002 149991 16980 133504 155068 49178 -114625 -180252 50458 222877 222728 43036
9992 43036 80744 178488 101395 96862 203100 292938 170326 130763 125079 186246 247485 205708
9980 205708 251577 256583 133616 73533 149044 162040 234865 209861 219487 309772 303451 258757
9968 258757 62988 82539 204303 200156 21858 116656 23474 162689 228706 235329 112726
9957 112726 121178 98711 9290 63959 51418 222206 284854 259055 161403 130983 100089 -597
9945 -597 -2724 123203 172663 154938 140439 245879 267251 124100 -92014 -44288 268450
9934 268450 204891 75323 155812 104450 170687 74356 94929 187420 231878 166629 45540
9923 45540 206435 264017 164460 13470 27904 133410 137107 125663 202867 248856 158052
9912 158052 -8325 79802 199753 224426 263908 212498 343961 232532 103587 117678 133074
9901 133074 121326 48378 122170 253405 249556 200389 241231 302916 238634 221730 135510 122765
9889 122765 253378 339470 179462 125439 213667 154187 55101 6578 146621 175063 84866
9878 84866 100108 138134 178827 199912 69589 39155 11898 42136 -23100 -25145 23032 -19963
9866 -19963 115887 192573 227349 286052 457570 473097 369030 211006 202372 104420 76490
9855 76490 94482 173734 147759 44857 202845 365868 234520 129412 46978 146348 199933
9844 199933 184893 194027 183824 174776 122685 98855 78631 235367 288517 215570 304835 257962
9832 257962 177974 285363 172616 120452 108187 166159 196391 247176 219251 181620 200391
9821 200391 229614 223184 151490 222562 229819 140189 166909 120905 73381 79853 79141 160852 254373
9808 254373 234840 308729 246115 118160 151297 200404 169326 246316 224539 352220 444422
9797 444422 226363 123072 77435 180866 98597 229296 294289 191567 196820 122216 150913
9786 150913 98787 125987 123251 117618 -46557 -9975 80098 106425 49197 115720 242820 86375
9774 86375 150696 239505 181618 227454 263288 248368 205136 319193 373890 249361 93995
9763 93995 95865 17554 79830 163415 136911 118427 237919 356773 257626 272482 187641 255642
9751 255642 280965 143237 81939 223125 347550 310798 307334 216953 188704 59866 8666
9740 8666 44426 210574 197199 31619 81258 143500 115424 161624 227662 177439 162476 176391
9728 176391 221014 176023 118109 196319 268010 212421 140001 164893 247738 205586 210547 173353
9716 173353 236126 231460 337801 221433 154155 85281 242248 213604 193754 188636 126817
9705 126817 164830 305317 268886 161136 165929 106850 75088 -36431 150308 272711 113015
9694 113015 121578 313564 256746 266593 310801 105223 104066 234429 305498 154076 66564
9683 66564 66777 26647 107673 136320 49381 12266 126179 83978 256713 141070 103716 199666
9671 199666 219747 392721 459791 316086 350337 261834 52238 15164 18773 114789 143048
9660 143048 74653 72879 48651 60410 110546 134177 223995 204040 182134 160066 100992 51286
9648 51286 38377 1619 102572 229543 245907 138620 198225 180345 202544 264089 189840
9637 189840 258757 116239 135226 277628 206965 153769 86902 120869 180689 199914 234042
9626 234042 371866 300685 170830 -11540 35649 146469 170785 212315 243371 190079 117609
9615 117609 138304 141911 222958 274672 159093 105833 228279 259523 283543 263428 303538
9604 303538 275807 318007 347608 269066 140561 154051 243051 151622 88078 280003 231858
9593 231858 284767 239708 182598 197484 266526 267867 234376 139690 157685 174883 224498 349004
9581 349004 269020 304765 252369 228815 225106 206274 253944 360614 235147 210446 381545
9570 381545 262072 205056 248530 300906 67149 -39406 2320 66204 158734 317705 361527
9559 361527 264421 179861 214970 198828 215966 157697 175827 202697 250112 285390 240829 209089
9547 209089 176160 350047 217371 194075 240653 165318 70678 166309 211321 161682 222817
9536 222817 238340 232026 273255 161503 135723 172426 180182 299350 162118 139873 211031
9525 211031 159323 291654 216399 155463 104835 135766 173334 204071 298881 298973 85556 106077
9513 106077 255212 155299 206550 191973 188450 154132 91649 143675 97595 191642 179903 124300
9501 124300 190543 212440 67582 200442 175102 342739 331521 206788 261902 200612 179320
9490 179320 156045 162683 255982 86575 3116 136846 197307 242658 294099 382795 406396
9479 406396 371443 360316 242364 237663 304623 173750 76314 131960 126675 52242 88691 135202
9467 135202 242374 275901 113281 68436 207590 271018 161519 109037 116381 155619 165617
9456 165617 190609 54096 -33026 152060 213494 235594 240368 270045 84318 -33536 122934
9445 122934 180559 181121 90614 57809 116042 103754 98109 31242 132078 89850 41328 174109
9433 174109 238682 177749 109025 25272 132098 58666 56753 220857 246185 138976 125176
9422 125176 301491 274956 138169 80038 205244 239853 211920 362789 214031 244772 70960
9411 70960 -29089 -45323 126495 192089 285191 247547 225897 115256 116451 280040 235667
9400 235667 180365 257987 247220 66112 188715 213215 172163 220899 296103 276267 247142
9389 247142 210707 291718 258667 264929 349790 321289 271646 211099 150415 235712 187462 186110
9377 186110 200964 221268 159395 194295 177280 151865 195926 176504 303646 233715 113045
9366 113045 141081 209837 224256 241770 125684 108368 89999 159778 237150 242464 120978
9355 120978 96606 315417 307810 277240 281484 261937 158953 148156 135137 34311 140347
9344 140347 193724 240894 242351 17310 74647 110515 109232 198841 202685 292802 336008 172253
9332 172253 251290 340115 197259 166418 204773 265517 194262 63269 50072 100167 99988 98161
9320 98161 94409 75545 174704 135340 172099 191777 195516 135047 241626 262488 259073 313731
9308 313731 342469 248234 190194 102510 79660 26505 15422 54892 123224 160103 248276 231324
9296 231324 121687 97707 50735 -15589 132820 218362 233124 294038 265111 350453 342959
9285 342959 199926 154323 169514 246051 322607 169576 158288 174758 305869 210767 224383
9274 224383 186835 168358 230265 304045 222622 224141 298973 212240 118898 170329 309964 332683
9262 332683 285602 267581 299135 178417 124617 112069 166947 166553 142371 189719 314897 215526
9250 215526 209276 124018 171269 130262 163958 267520 173062 129575 108167 82715 184488
9239 184488 242915 286082 269840 151466 97347 40779 183186 274600 191973 129505 41185
9228 41185 67869 109870 100738 215215 157712 233786 231213 213855 187744 195492 46237 2282
9216 2282 62460 96445 192764 219533 177086 221099 187203 85283 97931 269186 304520 281737
9204 281737 274555 189014 189010 161390 103706 197704 188908 156873 271822 232276 246403 292101 251755
9191 251755 263794 225218 214801 152816 167773 168573 235210 180162 137198 70413 74813 132105
9179 132105 373650 376664 410545 376176 220972 98962 181137 112698 164781 186215 210938
9168 210938 310440 143208 100370 27994 133746 125236 81345 123997 207137 257756 204770
9157 204770 68336 165822 145322 36406 93167 234651 205448 164960 107628 133840 244996
9146 244996 137310 5152 145943 212119 167187 83346 178702 214883 210072 181427 292283
9135 292283 224135 230161 134399 249945 277068 139523 266817 291487 187775 198834 274907
9124 274907 351085 320848 137800 102013 161027 183812 264470 363226 327936 400403 335930
9113 335930 304912 293244 269021 351798 258528 204009 219424 116053 45397 142394 221317
9102 221317 207431 90216 206890 284596 171836 202261 185724 269789 381274 256877 201704
9091 201704 185112 182274 209626 214527 218861 179286 203301 216805 123414 176894 162064 178083
9079 178083 313895 269691 292253 339648 303579 330086 183874 247414 374519 306058 317425
9068 317425 370050 408236 274920 334953 335847 295995 283343 197688 293280 431663 301172
9057 301172 226667 123773 122771 186266 229548 119007 236922 267153 257214 290969 379715
9046 379715 378286 294047 220442 206690 153551 166394 279329 308832 260754 209844 319239
9035 319239 333291 395625 348660 369214 392606 356742 184849 379927 404281 303550 281801
9024 281801 254672 356601 373201 391441 342620 276767 243155 239185 417173 417462 359562 324461
9012 324461 309663 366835 203730 162204 215018 363741 376202 279925 280304 298050 390527 339375
9000 339375 256092 361319 340581 403772 497443 397004 428658 447595 385137 293464 265198
8989 265198 411632 439179 471009 485974 576113 451099 302204 454585 511604 578773 589683
8978 589683 542805 627296 514144 489246 553590 543255 585666 477440 579460 727724 783801
8967 783801 806118 859785 856382 844182 865209 804800 837704 924665 1043454 1035879 1055611 1140936
8955 1140936 1240247 1282392 1316896 1367800 1503146 1626789 1592450 1868065 1978030 1947742 2234702
8944 2234702 2379449 2471275 2777628 2960369 3041413 3293449 3411520 3418557 3482425 3567715 3779060
8933 3779060 3991999 4320743 4689524 5261191 5819459 6305742 5984433 5177831 4672971 4196787
8923 4196787 3869963 3598141 3448352 3220851 3181070 3133366 3028857 2942927 3055270 2982248
8913 2982248 2787006 2677174 2537672 2566354 2553226 2459053 2418229 2367356 2314513 2329399 2426215
8902 2426215 2364756 2386865 2480682 2293599 2248776 2251132 2042864 2147183 2175736 2148426 2075282
8891 2075282 2134003 2145895 2070168 2005997 2062894 2101230 1981081 2061663 1965820 1967551 2047902
8880 2047902 2162841 2225002 2302057 2386644 2263575 2095797 1943084 1945980 1807524 1732621 1790932
8869 1790932 1685665 1606340 1565235 1653216 1587188 1422859 1336339 1388363 1258131 1254755 1181701
8858 1181701 1106501 952182 947298 1000021 1057466 914899 919036 909053 901863 974000 916430 754747
8846 754747 558770 733250 700959 688204 729199 660875 586202 543047 573635 696339 694627
8835 694627 600436 576880 546804 571997 654569 431006 311753 346813 501151 493895 522949
8824 522949 474372 433246 493592 402447 447332 362162 499873 407414 325791 292431 481938
8813 481938 545204 381280 229535 259388 279342 365626 393956 374619 369368 382566 406422
8802 406422 254431 326342 366552 461193 460622 383434 217873 246293 195667 205894 398398
8791 398398 250092 277776 253712 321901 306817 410846 388772 337276 321055 266721 391857
8780 391857 388435 514049 413266 441199 388509 353910 316823 281881 338254 412140 345007
8769 345007 181830 167839 295381 327555 366881 188080 271567 301980 340484 372662 379938
8758 379938 380045 292629 259976 249193 182481 311680 414546 178588 188093 206807 188158 195969
8746 195969 187827 366525 349833 271617 313110 333068 244527 308276 383741 336538 334519 231824
8734 231824 169469 253695 211501 181959 123285 91310 151435 140381 161428 85734 201132
8723 201132 341160 350040 316270 261364 242885 209178 339527 158411 120083 193352 121382
8712 121382 243705 262021 233919 156641 180414 146865 272729 343714 319920 182842 259757
8701 259757 273447 243847 267716 166476 154218 167266 232449 231911 185677 210085 255984 212919
8689 212919 160493 157538 192328 168785 151034 171746 278196 338420 256346 147015 227733
8678 227733 278112 216695 20435 181721 198955 230725 207788 101764 178284 120998 156070
8667 156070 85939 242190 239800 161119 274983 320258 150099 161262 189366 254199 110025
8656 110025 255246 355161 229200 235815 224769 175859 255095 184632 217245 284267 129271
8645 129271 124677 170288 290783 291822 137379 61444 78061 127734 156248 146900 30637 160520
8633 160520 304361 327065 218505 186350 275951 218584 157910 249823 277275 230044 215664
8622 215664 207218 233847 193699 277266 304596 237761 306065 211277 143489 130033 239703 283266
8610 283266 330970 271928 143971 237375 252515 212985 268372 212098 77384 232262 220764
8599 220764 213900 393516 469083 215168 196042 143356 200217 235366 352904 262563 161342
8588 161342 205396 310185 387353 649721 377931 35325 60367 -112428 -3198 25571
8578 25571 129319 137260 10596 5482 54823 50224 225646 268946 215085 120544 29135 75475
8566 75475 40488 35489 12635 149089 88902 69893 65400 132348 254830 288366 205504 196748
8554 196748 247545 79610 45928 142053 176951 206036 135231 290100 497181 272968 134027
8543 134027 313206 274987 283770 403096 288073 210482 204221 231269 191749 244111 195756
8532 195756 296643 323840 232819 143236 141151 247348 255070 300172 240391 150049 209560 225523
8520 225523 256332 170822 152580 236189 364207 376008 145983 165339 188706 69200 74890
8509 74890 183511 242177 213932 263607 186421 223332 317304 250375 219192 323426 411319
8498 411319 289128 211088 204066 135824 237474 299991 294338 200132 164352 237341 264628 333004
8486 333004 275602 200044 236603 339635 230648 21221 -158300 4480 96054 118528 130430
8475 130430 113592 155805 207426 151317 141384 221659 216207 277437 288629 298155 98994 28446
8463 28446 -7021 61030 191573 229677 244669 202185 226346 88734 153545 351628 326487
8452 326487 305688 142034 171194 282650 219370 211260 148174 196744 193112 162734 317168
8441 317168 478158 389042 243689 138046 191394 223337 278828 220582 249156 154288 173601
8430 173601 289531 279953 462771 379861 380446 234181 235247 230796 259946 313171 256253 179773
8418 179773 258975 98972 69968 136168 129317 229229 249365 343182 334446 360629 181925 115574
8406 115574 322162 290918 266144 243343 171286 283598 276888 213925 127544 122881 222501 248841
8394 248841 173862 132480 72363 28031 87320 98720 8817 41849 167913 274912 295394
8383 295394 283760 274103 189718 254333 244763 190972 237124 133566 24684 60640 208968
8372 208968 287140 98772 108045 156543 132519 170954 284898 255556 254730 310325 359065 383599
8360 383599 413356 382321 177849 165011 99344 220341 300723 220758 224723 336997 288279
8349 288279 210741 322769 319824 331508 252862 100005 62687 151241 253443 271534 299706
8338 299706 200064 173063 173389 244260 316303 235500 149544 221687 262825 160506 141800 119816
8326 119816 159023 229744 140885 242623 292057 272917 291195 230868 119154 147442 248519
8315 248519 247272 127582 101688 14719 60758 157398 172571 202308 189718 125716 45710 19224
8303 19224 110770 317343 281229 163023 112318 198620 215796 227548 79579 132005 146695
8292 146695 152993 155948 48105 134393 64345 94758 181457 186427 192698 166887 192996 195600
8280 195600 245120 240056 166499 236312 235619 311544 229699 249620 220876 179545 198040 151849
8268 151849 94485 -35673 64751 173857 149392 46428 126098 110962 114628 97072 145143
8257 145143 96993 143482 144121 127548 201943 137658 291024 266461 101196 243425 358390
8246 358390 301875 176251 205432 175580 114893 115725 218942 162031 187086 201524 276058 195746
8234 195746 118507 176704 70476 153370 284150 306835 159158 243331 337731 299925 139636
8223 139636 257244 221405 201870 313097 286931 174826 186340 66832 96804 200566 121457
8212 121457 102920 159491 265564 346433 316915 317839 331553 256505 107754 271633 382172
8201 382172 250946 378267 323939 297416 407434 427724 553440 566703 360803 -565796
8191 -565796 -652360 -223930 -136417 68701 6751 94055 -12002 52006 84627 110853 124374
8180 124374 126743 108619 233440 211519 147550 88120 -30194 127691 74702 -12551 139037
8169 139037 163710 128563 93707 177101 175690 279960 323147 222105 87516 111713 80345
8158 80345 36249 49067 140257 142968 179524 153772 47620 -60478 -38422 195842 313022
8147 313022 159783 136686 146150 195552 360439 291179 203131 117909 223023 280335 261244
8136 261244 274633 418776 403955 374694 339586 237581 102855 63714 158179 173235 126114
8125 126114 157630 238815 274078 267727 238179 281841 299957 233983 235803 140385 231524 220926
8113 220926 245484 217012 190417 136466 71181 18964 112595 160765 139382 139312 175105 168875
8101 168875 137364 137176 245171 193278 190235 158314 130189 256019 189150 79991 193486
8090 193486 291044 144001 157735 257779 225057 204174 250439 312015 279991 114171 255118
8079 255118 292373 185987 132023 124480 113177 111220 58270 137590 162706 195258 190269 288099
8067 288099 147504 169325 272481 29273 -151264 78882 305945 275679 113024 44013
8057 44013 138169 188037 257453 229207 242401 229478 181920 108140 74131 197415 294143 161876
8045 161876 110062 294506 387924 278576 202061 191681 152307 101355 104471 114605 135064
8034 135064 175359 222179 295293 255999 149676 122862 256877 189787 134726 210242 268232
8023 268232 205547 188572 302943 223292 293994 179452 306985 101182 104653 333858 357509
8012 357509 426304 348797 309328 252815 246349 164997 111939 187972 301601 453918 355579
8001 355579 331427 389539 395089 260317 99364 154961 142900 236938 288818 196677 57992
7990 57992 134723 83561 91599 231221 231800 226712 264475 108404 160050 236978 266952 286992
7978 286992 265431 181703 296642 321882 278497 264502 184126 262807 260773 195515 233249 240629
7966 240629 257538 116784 194179 344570 149912 258212 233156 124109 259862 329125
7956 329125 189811 125933 197955 231144 160338 168371 153437 151295 211983 229932 174988 247153
7944 247153 310516 279413 235229 263245 138582 120777 162548 129260 227218 227632 73147 24294
7932 24294 211962 284717 117582 44734 121637 158645 88566 241006 281159 157388 159090
7921 159090 57364 15727 87837 310945 332063 345547 301418 303873 254386 274150 272349 234738
7909 234738 176855 207771 296420 283589 144300 228938 299476 289990 334068 272088 144382
7898 144382 188850 138159 160840 290294 243962 344034 285087 279241 131701 148457 157907
7887 157907 185486 163514 220001 265502 287698 202294 241290 418126 414713 358682 352272 283886
7875 283886 206457 198574 212929 206283 228974 195280 190812 185286 260977 315961 321839 187587
7863 187587 176979 117706 59855 119952 315277 296302 170672 222389 213722 234809 129311
7852 129311 187488 76913 239376 291087 245046 158690 152688 222020 264986 292156 281316
7841 281316 201351 105911 154258 174768 148829 181036 330845 334232 282655 200976 170478 84590
7829 84590 152640 269724 238393 116075 108752 236239 291077 161382 96671 145506 153332
7818 153332 141311 37225 243815 270280 136491 167244 276894 325482 410775 238229 291607
7807 291607 223491 198844 86736 87873 39489 159379 -153444 -139551 438182 234355 207816
7796 207816 202902 189957 182341 234349 274853 305446 157076 53195 107941 243451 213536
7785 213536 232620 114914 87646 211948 229101 228357 174936 130149 183721 140588 135890 219494
7773 219494 279069 202379 152600 153497 219615 233701 180260 64689 123002 126922 107108 108666
7761 108666 146448 76724 -12586 70171 177957 250269 198080 179796 131456 109141 183722
7750 183722 168556 100434 20958 63425 84797 77609 152465 227139 176100 172901 177348 142202
7738 142202 233863 196846 222894 266226 221131 147609 90408 69834 21864 104433 149734 103315
7726 103315 274712 266522 305645 241944 159261 204088 246808 186460 238239 263831 294741 330306
7714 330306 171354 121885 86174 45645 119293 212634 227387 157619 114094 298281 469515
7703 469515 327540 309074 179857 268066 146625 169080 337077 195317 125634 101440 155532
7692 155532 217800 190374 288660 376409 343161 382836 242476 281262 363927 300797 299815 177685
7680 177685 159100 292527 269764 200482 211158 115845 92115 218329 140450 165274 307055
7669 307055 295387 177772 263257 280131 146395 183618 284341 194683 270927 287558 310443
7658 310443 256781 367661 337393 195580 163787 121079 218917 321549 297199 313770 226513
7647 226513 182846 204761 130667 140777 14231 139612 267419 275703 224465 160201 184891
7636 184891 308849 269336 101952 165552 140470 254467 279334 349973 237196 251975 259697
7625 259697 225699 237926 178461 188351 214927 302867 342991 334095 393625 278010 176474 134971
7613 134971 91149 139810 96571 168160 150376 279626 363388 189775 178257 291370 191921
7602 191921 290175 171071 136653 198976 128708 74611 187262 133512 215443 191000 121644
7591 121644 107257 83282 268037 345561 279833 281462 262492 305323 281415 308670 240395 103488
7579 103488 48413 119394 177451 286425 376575 247936 357344 375550 292858 251738 322024
7568 322024 215655 181316 274798 384765 268604 146631 93431 165938 208421 197260 134054
7557 134054 93883 129331 121259 50762 112643 259879 204193 120239 300576 288698 322269
7546 322269 254726 111616 140830 306583 183774 -32402 153232 125799 60171 84308 164717
7535 164717 180032 156581 86923 190179 123974 127834 111689 281948 252164 225825 235667 282782
7523 282782 329024 272589 99917 185466 47007 -588 197315 110071 109551 140209 262999
7512 262999 314549 251326 195597 200242 173513 147455 253402 349858 227893 236403 265936 333114
7500 333114 186923 179921 166534 188028 244203 245802 157559 170155 148476 220855 193624 246749
7488 246749 320512 261585 127663 79941 -34070 97253 212461 205278 41830 129495 314194
7477 314194 220443 363989 347873 211123 168886 256550 243369 168193 266052 286314 226878
7466 226878 313753 238143 95098 141633 230918 158817 173626 178666 269812 165283 129240
7455 129240 340090 371895 414811 377920 332416 295344 200323 212824 143520 95856 12168
7444 12168 71365 38332 17101 126461 238731 235058 261024 268050 190309 309238 206104
7433 206104 173286 191274 147998 182670 293853 390955 328006 239176 182039 190831 216513 308976
7421 308976 395529 208213 189433 167467 183086 252364 342330 323702 416650 373063 202686
7410 202686 309197 317188 286382 268079 276727 274219 294576 215317 226862 241537 339320 181473
7398 181473 155432 214527 181475 102137 168555 197847 241647 267999 160588 149947 210204
7387 210204 167376 176035 149501 123860 155883 151402 143634 106079 132556 236620 273205 379084
7375 379084 211209 89469 211481 371197 323617 282593 215658 97180 186388 269467 329130
7364 329130 230097 262297 357282 349181 224069 242756 298383 342177 264329 313411 327792 143609
7352 143609 44631 188989 237044 270047 302497 329970 426353 279268 107948 214368 283437
7341 283437 149242 48630 195843 277030 315429 397343 265676 185460 229681 250839 238331
7330 238331 247339 246144 210875 231061 147686 -89 67403 247094 150903 209606 227630 139893
7318 139893 115672 39831 161137 331345 254962 343822 297449 346850 304895 310050 295500
7307 295500 410268 519159 317469 312939 318490 249684 73749 51542 163060 239474 259571
7296 259571 257511 220900 268714 284467 368197 356564 320898 349680 296493 340936 314689 138119
7284 138119 190131 124914 306567 387992 334721 278247 184498 241641 222800 233425 181297
7273 181297 297001 372183 272713 201290 175754 170924 223927 258292 264793 223276 220979 237867
7261 237867 351563 354670 354443 182222 185801 275074 214337 166353 196589 259925 43080 69966
7249 69966 297045 384155 318378 354423 366568 374538 248870 264642 354887 487264 525544
7238 525544 417567 332466 292288 171057 128182 111965 242011 238384 213775 292798 281622
7227 281622 302742 369464 342501 317948 422539 334606 296816 301853 331210 190004 131498
7216 131498 183292 203254 282580 219561 283983 337567 286115 172089 280432 185818 241078
7205 241078 373679 326477 418519 292495 317048 274021 173869 286781 216524 194028 295512
7194 295512 540734 413155 269384 338203 112014 192370 335859 386615 402848 383945 312268
7183 312268 279432 276417 340574 402070 466906 362765 400769 343076 309316 248810 205407 326856
7171 326856 401981 345212 296772 193830 202698 105108 168647 348571 315106 417296 398916
7160 398916 230150 223747 348769 506713 456549 421501 369045 437874 529559 393351 360387
7149 360387 368366 338556 436099 541474 490978 426296 189961 309837 270790 290001 389674
7138 389674 420919 276195 232064 319576 303495 371732 407531 535316 592341 501822 553752
7127 553752 545270 565498 556471 608967 622663 591708 620159 594417 471665 361479 420934 291716
7115 291716 293352 365158 455897 513848 637525 581527 513879 549059 546942 451325 363960 463633
7103 463633 414988 395932 505895 534396 577957 493591 545067 592045 636746 561827 599220
7092 599220 723485 600971 606647 677370 551748 545178 566235 435275 556136 557076 637783
7081 637783 604870 465293 505292 524098 563642 554817 474939 407161 449664 559666 527842
7070 527842 532905 456938 414115 477105 514371 524651 482287 402337 577827 506928 337017
7059 337017 456399 628298 576323 661745 621754 601448 553479 524828 628355 629917 546274
7048 546274 542342 648875 651689 669401 710742 538957 573142 551817 581495 596375 522554 503749
7036 503749 467737 492629 569262 682434 620117 672041 686609 734336 501556 534184 602995
7025 602995 556596 470042 580975 697421 799856 735396 595981 670349 614310 590565 644266
7014 644266 638102 586875 655343 817748 771988 634785 526336 604072 619077 603414 674026
7003 674026 785764 717823 659946 646364 597195 586679 557265 656924 763494 788277 756711
6992 756711 795208 738212 623857 666762 672208 790695 725346 650442 622260 599569 607893 683826
6980 683826 587064 643419 676407 699388 755299 783112 734370 750234 789337 826257 764018 712264
6968 712264 792568 864233 972967 973092 922682 875231 977211 971172 794681 764140 833725 795830
6956 795830 803996 734872 701694 796320 917105 826059 823688 870106 911990 779688 744392 682314
6944 682314 763795 938562 1035801 833792 963881 1054393 979244 1089426 1058834 981242 883167
6933 883167 929974 974441 863548 829063 831169 1106821 1198761 1065640 1081751 1118852 1031146
6922 1031146 1072696 895563 910249 1002068 1015641 1230791 1179527 1146757 1129891 1199856 1146540
6911 1146540 1163260 1224249 1178415 1211833 1145498 1175763 1257952 1294269 1316480 1282294 1198079
6900 1198079 1270864 1363427 1278837 1196369 1225075 1341812 1444722 1494547 1483392 1538915 1511056
6889 1511056 1520863 1481906 1457446 1452803 1628795 1742932 1677997 1684132 1650681 1764551 1739794
6878 1739794 1791711 1841811 1795455 1899357 1993281 1913038 1855713 1857000 1889482 2002935 2074246
6867 2074246 2225296 2281458 2271484 2316542 2323009 2489022 2412718 2414248 2714686 2661873 2609473
6856 2609473 2676240 2663154 2820751 3041061 3080505 3000582 3066239 3082523 3111410 3278410 3495989
6845 3495989 3630027 3710566 3867726 4169653 4302919 4451581 4652871 4764231 5020421 5065411
6835 5065411 5272269 5643740 5949981 5994244 6237714 6601849 6950841 7340115 7635424 7897567
6825 7897567 8243480 8606516 9126631 9516485 9979960 10648240 11135194 11398090 11824274 12171731
6815 12171731 12436116 12560015 12816343 13230328 13682567 14115988 14718032 15526845 16183001
6806 16183001 16493123 16560161 16799217 16994529 17249006 17718573 18206041 18671309 19182651 19876948
6796 19876948 20489077 21329897 22163385 23120757 24051570 25008104 26073990 27240972 28287864
6787 28287864 29249243 29864183 30273041 30918310 31657957 32388076 33036007 33135976 32925589 33007623
6777 33007623 33163126 33285019 33022085 32401423 31696419 31421934 31445749 31468044 31616512 31872528
6767 31872528 32094701 32409641 32767849 33253356 33872115 34508058 35293441 36388938 37432647
6758 37432647 38422129 39413653 40072607 40297191 40313723 40261713 40405185 40212042 39727936 38940011
6748 38940011 38247303 37688147 37383025 36934136 36212202 35307019 34573825 34028573 33597021
6739 33597021 33222338 32802899 32595574 32465236 32300405 32302832 32424616 32519044 32840964 33185104
6729 33185104 33246091 33437057 33468183 33633075 33352608 32807008 32371059 31961700 31548132 31166751
6719 31166751 30986828 30919014 30815715 30660826 30514654 30185661 29882009 29232100 28683624 28384606
6709 28384606 28168631 27999396 27962102 28011279 28088200 28107359 28298402 28377296 28465632 28410981 28446662
6698 28446662 28755568 28755058 28682941 28849216 29159025 29427344 29657033 30046089 30369487 30742244
6688 30742244 30989412 30712329 30450989 30134718 29904406 29831909 30027504 30245724 30411666 30839532
6678 30839532 31299815 31586529 32048727 32481753 32831894 33309011 33982046 34655884 35352059
6669 35352059 35872228 36091834 36090236 35927081 35934052 36330031 36630827 37266661 37758146 37577593
6659 37577593 37352873 36733839 36179752 35962318 35714325 35771518 36047298 36418851 36860706 37348436
6649 37348436 37867455 38230938 38082092 37589003 37040961 36819607 36860918 36884827 37044226 36928670
6639 36928670 36614457 35981818 35179165 34556943 34050571 33624574 33283036 32963966 32657866
6630 32657866 32192443 31779295 31381007 31147558 30995092 30961087 30922941 31121060 31246774 31288747
6620 31288747 31251843 30817012 30183192 29460518 28520864 27781483 27235109 26767946 26446313 26160513
6610 26160513 25663959 25208114 24552774 24070699 23546859 23048509 22604984 22409439 22155437
6601 22155437 21696015 21446858 21204767 21036794 20958174 20637091 20295145 20046753 19758123 19361621
6591 19361621 18939107 18478759 18151791 17575189 16859399 16317131 15824171 15404864 15136359
6582 15136359 14869734 14500166 13971824 13608824 13267047 12818592 12245558 11931491 11719586
6573 11719586 11637673 11399071 11177027 10966873 10780484 10518469 10134298 9800601 9531700 9285733
6563 9285733 8802922 8657905 8402413 8213044 7855079 7510045 7265744 7168110 6911085 6790145
6553 6790145 6619203 6406691 6129561 6041159 5832914 5626732 5378079 5309524 5255521 5149920
6543 5149920 4869534 4751475 4621152 4678719 4638431 4422741 4257487 4123568 3927920 3780207
6533 3780207 3694855 3681198 3569988 3532749 3491876 3463679 3284815 3233756 3214457 3248282 3241566
6522 3241566 3057003 2978246 2909696 2790153 2748002 2744099 2923783 2774375 2487134 2568751 2490873
6511 2490873 2397429 2331986 2322272 2302216 2171325 2061969 2099366 2128537 2161869 2112464 2145013
6500 2145013 2136413 2013943 1990089 1893923 1885360 1887156 1843829 1912046 1716794 1746565 1639722
6489 1639722 1755060 1862462 1712322 1579030 1568568 1545619 1516343 1585997 1627555 1625516 1618537
6478 1618537 1604263 1562407 1581177 1559894 1602430 1585026 1553184 1659801 1520850 1497260 1554572
6467 1554572 1650930 1614266 1602721 1511227 1411797 1344149 1383611 1419998 1530653 1534258 1539000 1468998
6455 1468998 1507497 1659799 1544845 1545560 1459892 1381752 1416052 1497323 1390393 1345965 1343209
6444 1343209 1420564 1447037 1389241 1295633 1181965 1234816 1294605 1253924 1305025 1287319 1323217
6433 1323217 1389239 1381988 1294685 1171323 1164875 1169204 1225038 1152973 1097270 1113785 1248657 1211846
6421 1211846 1314640 1259178 1234763 1203607 1189069 1139714 1090118 1184402 1241160 1342206 1138926
6410 1138926 1106023 1164917 1158505 1222401 1198778 1000724 985554 950203 982605 1000266 1115837
6399 1115837 1118732 1059102 1011889 964502 1014243 1038712 1065351 1056788 985113 916483 955041 921712
6387 921712 883716 911801 874346 903395 941922 956406 1070989 1075653 1005034 886106 705907
6376 705907 753424 839385 884823 996171 883669 902260 954929 973368 846009 856037 857845
6365 857845 941618 838592 888741 857070 797529 734227 693505 771120 714821 675518 850131
6354 850131 945821 828282 814125 774315 800919 813595 793828 696714 757889 708468 782223
6343 782223 729560 765193 736506 748290 749502 709001 672081 682047 630826 617314 595041 728499
6331 728499 722732 654200 746234 764083 738129 734712 714593 771065 779571 774362 743662 633458
6319 633458 730593 704162 820708 809736 841693 888534 872148 824142 796464 824664 779193
6308 779193 608118 562124 599890 640653 617097 680951 630421 711234 766998 626373 595098
6297 595098 586399 502247 595225 729760 608375 676418 821927 849375 658413 646690 755070
6286 755070 777782 660180 649347 752347 689272 621731 606919 715587 703996 650144 695764
6275 695764 667685 689753 562284 601064 511511 481112 582455 537175 540190 584166 618020
6264 618020 567837 707731 615997 517072 443230 477811 654260 578409 615875 447263 488047
6253 488047 498032 578303 559572 640637 675882 624042 510156 544931 664887 618293 633414
6242 633414 737137 712029 670544 649441 683946 734328 686310 614988 615552 580468 595061 567759
6230 567759 477998 504722 449113 580706 490008 565775 517198 335763 285514 438090 571346
6219 571346 526678 497107 569607 475905 515240 544463 589665 609552 596057 514692 451295 445636
6207 445636 445684 455677 210058 196650 300928 439794 567165 552439 404097 484304 507012
6196 507012 525788 487013 387945 422219 469979 563086 515536 418526 465045 455631 345556 341338
6184 341338 467466 499091 511942 534765 519775 556450 367437 522168 451696 315391 347945
6173 347945 347572 175340 330412 408162 412435 510191 520702 460721 459001 471817 479889 477009
6161 477009 413740 307939 359041 375021 363674 363109 443718 552385 468758 376700 365241 515298
6149 515298 405768 405824 488839 428406 450097 396836 356390 427851 482611 370152 365405 454179
6137 454179 480109 485807 509018 395156 218128 149359 261684 341107 275078 336767 282995
6126 282995 263623 459484 379036 286049 365131 281035 319777 291068 368203 415459 408706 389515
6114 389515 240359 205538 315024 332782 364102 432580 406730 331549 448792 473959 392660
6103 392660 181314 190843 269123 351329 439189 365032 378002 363373 476387 209179 172959
6092 172959 283694 306690 384822 314033 314890 325236 301322 157971 286564 404892 402290
6081 402290 242627 286011 461492 366243 332107 419207 419295 401472 391570 399548 248272 274797
6069 274797 243274 204672 281807 405971 540723 558640 458125 474461 401599 325631 397876
6058 397876 399754 370051 370844 387274 453612 418965 475744 420399 374235 293998 293209 278742 212156
6045 212156 207299 314140 275471 132572 177729 253029 189148 203687 328143 386616 363332
6034 363332 229898 208479 213975 251498 288529 446451 467549 463010 475725 205887 39878
6023 39878 112215 168336 282873 344730 335589 414780 296053 250163 348903 348193 359829 399910
6011 399910 446516 415497 356955 274827 243864 269549 344475 280678 195722 139472 335407
6000 335407 330969 280815 316580 253245 281659 250440 355089 448642 417940 355113 193782
5989 193782 282241 334659 339991 212498 214899 333907 366199 406909 511545 333813 281676
5978 281676 231624 334190 327688 490391 516653 501529 481209 459237 457071 291529 473139
5967 473139 453002 384641 467431 359038 346726 489337 540612 484742 289126 381463 549371
5956 549371 553239 427576 468525 534172 506493 451136 161776 273087 451973 497329 538801
5945 538801 524983 457094 601924 563087 285303 342430 423701 391191 348300 450629 438699
5934 438699 402761 426307 337729 329025 388751 460186 585603 489119 328254 262640 363612
5923 363612 465942 513308 537550 585774 533164 418365 377636 314860 330224 525215 596543
5912 596543 500997 357348 273747 351775 405044 290081 307268 290764 322137 462160 531023
5901 531023 474062 320159 216426 356778 403842 455094 377488 439095 395220 397219 518260
5890 518260 471446 528044 465050 412863 536318 363139 352488 330738 329977 507514 504620 393725
5878 393725 463192 440054 441783 501924 360920 408163 472526 525393 480643 546819 562478 672435
5866 672435 640574 483734 496850 478085 452415 426279 328263 441292 425179 399571 331745
5855 331745 445867 401964 288595 259439 275556 319700 413360 481346 392939 324787 277965
5844 277965 291584 290966 324616 288056 226165 162813 237208 279158 429033 426382 357774 467928
5832 467928 620239 507650 444546 320318 316695 292270 253697 214245 223715 458320 436225
5821 436225 370753 517733 459602 426106 416325 380385 417899 470867 490150 537032 440759 412764
5809 412764 439973 419521 428479 368052 325759 265060 272804 311943 423706 377607 293763 234771
5797 234771 427906 342295 416781 483684 388262 424316 381020 317751 383176 326709 310520
5786 310520 481447 376833 255406 261663 305373 335638 449306 406311 433166 341176 325848
5775 325848 339179 466742 514474 476259 434007 487622 454982 381793 420130 473678 512497
5764 512497 498887 430225 401381 533645 427918 414867 258830 195293 355070 477010 379056
5753 379056 463207 377297 428330 438992 463254 379733 285284 267032 321818 417164 393363 369856
5741 369856 337306 390106 403291 306100 167567 355421 511742 371658 489387 412681 425464
5730 425464 564919 375523 380606 379883 338297 274059 364884 303997 352551 275513 234956 361656
5718 361656 329943 349692 434659 485274 469752 477099 519605 538348 456539 430224 327692 413108
5706 413108 456077 470386 506676 427942 362827 353075 407224 460274 591877 542115 510429 525212
5694 525212 463982 516018 541246 396858 448231 455264 444832 499052 491947 507314 545560 549941
5682 549941 532857 472154 394130 409649 457576 447401 393474 458670 493351 477841 473133 556510
5670 556510 587492 556604 463529 532871 439885 332793 419089 494840 507571 552943 538676
5659 538676 548418 615689 584977 415171 509141 618390 487963 482163 559787 546272 576233
5648 576233 643264 581925 551965 615062 524782 440199 429501 629615 630654 574991 693138
5637 693138 562878 591279 528860 553011 489793 541927 621437 714964 549917 511137 506884
5626 506884 285879 348755 409690 540756 660096 607976 674576 548304 509058 379470 468140
5615 468140 541202 516358 669188 542538 494578 609416 601526 575257 627497 664607 690678
5604 690678 683601 615675 612282 516281 483410 556223 646464 635205 615809 615931 630451 529471
5592 529471 625328 740131 655660 496179 457269 579696 610630 662012 701118 671977 723951
5581 723951 631826 472971 581980 841018 768165 721033 782533 774162 805464 787411 724413
5570 724413 679415 690980 603799 640354 718834 679360 635625 704223 753375 755434 692335 729399
5558 729399 749676 745677 718829 789849 731483 681804 783601 843211 714137 770724 774961 671058
5546 671058 653591 652774 682173 807037 765255 723588 660094 625055 567812 580839 678958 736857
5534 736857 734743 822174 849004 720745 728467 723552 662639 697721 689477 715614 799829 905532
5522 905532 758038 751092 859253 830158 816595 828252 866139 889525 730679 797099 949661
5511 949661 881946 874663 799092 826439 924881 865826 889112 980033 965856 984805 930300 930197
5499 930197 957842 943144 968062 880038 946440 1014356 1028022 1000785 1041321 1174333 1163595
5488 1163595 1102409 964457 994930 1017910 953927 1006118 1070136 1239993 1346858 1308783 1263717
5477 1263717 1221325 1149627 1106795 1237934 1213270 1116863 1194000 1133255 1116813 1231977 1185014
5466 1185014 1292816 1239726 1342439 1429179 1337114 1339141 1379044 1545454 1636907 1575710 1638149
5455 1638149 1589037 1738391 1807388 1709671 1866623 1993334 2131588 2333357 2258966 2381161
5445 2381161 2348632 2441522 2566174 2575576 2698290 2954831 3065160 3019536 3157837 3013661
5435 3013661 2972029 3060190 2978825 2893150 3057594 3002733 2971646 2932360 2836954 2776539 2582540
5424 2582540 2424107 2313476 2134817 2238028 2381361 2372113 2294726 2303781 2263259 2099426 2214545
5413 2214545 2144166 2179150 2106918 2089236 2141029 2032384 2138599 2046357 2013573 2026600 2206628
5402 2206628 2181616 2147999 2145555 1921963 1935828 1983685 2043020 2139803 2106561 2136174 2123932
5391 2123932 2048597 1993089 2180980 2224929 2193631 2316515 2087987 2238578 2367712 2369542 2340772
5380 2340772 2269211 2286024 2280382 2224712 2124397 2147685 2171758 2173877 2171750 2348321 2335311 2316393
5368 2316393 2389299 2425220 2310221 2182086 2241631 2226322 2208012 2248650 2337466 2204152 2168307
5357 2168307 2212571 2029687 2203278 2359113 2316987 2201254 1946462 2048665 2049152 2168396
5347 2168396 2259334 2211956 2131015 2065095 1999997 2016696 2041817 2052192 2007657 2001680 1954820 2018945
5335 2018945 1990793 1893906 2038275 2099430 2052562 2001774 2070075 2066165 2102207 1986584 1975591
5324 1975591 2015444 2042136 2037897 1999340 2064056 2090664 2089092 2018341 2058435 2121269 2117240 2161035
5312 2161035 2373735 2408677 2424097 2437953 2422766 2445864 2409969 2435996 2561174 2617567 2660792
5301 2660792 2606725 2545723 2672413 2554913 2643286 2757165 2736011 2899570 2934118 2943425 2971355
5290 2971355 2879305 3021580 3056463 3113737 2970331 2965631 3214137 3309238 3266110 3304700 3223284
5279 3223284 3225338 3312372 3309452 3415269 3560361 3539009 3591496 3739082 3659333 3648599 3710765
5268 3710765 3799219 3973190 4079306 4195785 4281208 4165422 4215392 4359387 4378907 4590814
5258 4590814 4607279 4592160 4754530 4969515 5119654 5090588 5150653 5273098 5391114 5338296
5248 5338296 5453499 5480314 5443148 5555533 5685067 5832030 5916862 6046386 6165536 6211215
5238 6211215 6242382 6271453 6508217 6634504 6690670 6684401 6837324 7182833 7240813 7292334 7357976
5227 7357976 7609939 7736128 7754743 7852662 8014881 8036752 8369848 8603831 8680599 8913218
5217 8913218 9146097 9259632 9484083 9737926 10001311 10322830 10462050 10723317 11029231 11341486
5207 11341486 11559027 11759466 12056305 12352625 12697154 12906700 13208245 13527602 13892577
5198 13892577 14145973 14372423 14728232 15058623 15508066 15851659 16291295 16364077 16777655 17343829
5188 17343829 17669526 18129492 18570143 19035678 19462467 20057927 20791249 21532512 22278053
5179 22278053 22840166 23517457 24410307 25245319 26245880 27162294 28229638 29213195 30288259
5170 30288259 31358512 32392344 33712832 35056908 36479411 37957268 39490836 41295937
5162 41295937 43162172 44994806 47086072 49143764 51168952 53312334 55841882 58633881
5154 58633881 61869831 65152411 68779929 72886398 77241494 81651267 86473569 92028275
5146 92028275 98217583 105092549 112433497 120160143 128360400 137255970 147043422 157831033
5138 157831033 169724628 181434861 192245150 203136197 213649880 222871648 233475832
5131 233475832 247419017 264726980 283804521 303132673 324527606 348629828 371307122
5124 371307122 383963697 373999941 354399252 342523272 338380307 338981839 344111501 353358999
5116 353358999 361471650 352038460 324924131 299392130 280367901 266077404 253211856
5109 253211856 240956146 230417424 222317270 216578502 211970587 207655895 204479910 202322692
5101 202322692 199225629 193937019 189279397 186535193 185263245 183379024 180908269 178112307
5093 178112307 175863007 174337648 173349660 172706622 172308479 170952678 168497728 165360625
5085 165360625 162778150 161489839 161051550 160280895 159160714 158221694 157572582 157783976 158899820
5076 158899820 160872520 163497929 165596382 164189846 158797515 153620983 150507694 149189848
5068 149189848 149409724 150627117 151910593 150522964 144405245 136435316 129730195 124533949
5060 124533949 120143229 116199118 112696859 109404509 105813596 101356235 96760894 92772486
5052 92772486 89144363 85529651 81972710 78297933 74693217 71234689 67647841 64192889
5044 64192889 61127274 58276640 55626314 52978453 50411638 47988638 45757456 43503462
5036 43503462 41329835 39348778 37555858 35861921 34196051 32784114 31440295 30224930
5028 30224930 29202185 28187702 27112645 26119667 25279634 24538193 23786964 23089509 22391645
5019 22391645 21750830 21169648 20613241 19953330 19414417 19114491 18510443 17974793 17702112
5010 17702112 17254313 16641950 16239345 15938313 15570350 15367674 15123830 14739301 14406308
5001 14406308 13909997 13570995 13242205 12990389 12685924 12405834 12111777 11870184 11681433
4992 11681433 11482623 11234126 11017692 10843231 10671345 10449913 10219044 10023573 9996459 9855719
4982 9855719 9805549 9627038 9577604 9443874 9377906 9276938 9106117 8838190 8793254 8622039
4972 8622039 8575339 8509349 8431700 8236301 8196044 8106169 7912804 7780659 7772455 7784798 7544360
4961 7544360 7312763 7199612 7094816 6918529 6921246 6896429 6886220 6780085 6702150 6725082 6654946
4950 6654946 6452939 6271685 6224736 6218047 6195380 6153944 6036287 5952130 6052137 6016453 5945100
4939 5945100 5958869 5747937 5625297 5695771 5593788 5409491 5481576 5505551 5580003 5686000
4929 5686000 5661277 5383749 5327100 5178710 5122339 5176606 5175830 5076460 5078249 5091044 4902566
4918 4902566 4859812 4795025 4706951 4720343 4653470 4582146 4567952 4510727 4451398 4356508 4291317
4907 4291317 4295099 4319442 4238466 4169307 4184704 4145502 4157910 3978260 3946026 3909073 3813832
4896 3813832 3710406 3675799 3670006 3699463 3636134 3608829 3497889 3407205 3359369 3284920 3335316
4885 3335316 3375809 3252742 3224853 3233228 3277783 3099164 2993093 3030169 3071140 2994877 3099162
4874 3099162 3210748 3121823 2906872 2847979 2879057 2724385 2710480 2694529 2661469 2744324 2819277
4863 2819277 2822627 2846340 2692010 2761795 2724971 2581121 2546330 2570249 2643853 2576666 2459999
4852 2459999 2405835 2581232 2512443 2626357 2640452 2580508 2540460 2507815 2550847 2537976 2530291
4841 2530291 2462631 2513848 2539222 2569494 2454100 2362720 2359530 2514279 2479409 2519139 2553741
4830 2553741 2513107 2593002 2568674 2509384 2507644 2466671 2439660 2551039 2572420 2595142 2469929
4819 2469929 2570478 2718239 2711151 2889966 2959128 3002879 3072758 3170653 3291112 3350906 3444913
4808 3444913 3388639 3503135 3562438 3572553 3470087 3370080 3444390 3368393 3385103 3312879 3367089
4797 3367089 3316785 3112875 2889567 2867464 2815749 2837124 2683138 2657975 2665920 2608866 2469922
4786 2469922 2479018 2484601 2548735 2501547 2350756 2353003 2294455 2300997 2297980 2225890 2206487 2310001
4774 2310001 2314038 2227248 2152194 2117155 2076705 2078732 2076737 2102785 2082899 1914814 2111177 1987700
4762 1987700 2083024 2208938 2018010 2063393 1990445 1881623 1901196 1890011 1895142 1829946 1822132
4751 1822132 1858542 1788000 1754560 1754018 1585815 1557799 1640409 1600716 1585310 1528236 1570786 1554206
4739 1554206 1563327 1647920 1655590 1575961 1558501 1593586 1493200 1579117 1570524 1343426 1264546 1299776
4727 1299776 1384749 1352834 1353248 1338283 1260732 1208604 1285152 1340917 1297354 1060568 1112793 1017197
4715 1017197 1072985 1102129 983425 1116302 1121413 886547 992866 958521 969020 1073778 1022748
4704 1022748 1110674 973324 780701 811884 911480 848298 765661 835958 802441 780498 845144
4693 845144 855693 753551 721629 714488 723912 845113 726257 717774 810695 811089 869742 786791
4681 786791 761187 847745 921455 917605 852899 798294 796017 783933 874262 786253 689359 774562
4669 774562 806236 789216 744749 708399 699502 750915 733940 708313 688120 660470 667476 703033
4657 703033 626631 708001 702708 614001 635447 755017 683862 554603 515366 419644 447569
4646 447569 572377 534890 682146 764850 677451 676608 706499 659850 631419 682395 580858
4635 580858 619485 510091 436775 607402 657655 643056 605263 517652 589678 519948 486783
4624 486783 617899 457885 373014 461561 509644 485775 441536 499068 609451 678528 577393
4613 577393 569552 504105 491585 459302 385487 465811 536679 537511 570194 613719 664675 490043
4601 490043 396543 554530 544228 443280 540748 499835 461197 503853 549433 614968 637259
4590 637259 552903 552591 446345 381089 432735 452079 440304 333523 446380 376351 385151 334289
4578 334289 444602 457182 479990 521575 484828 499146 518233 489817 560365 628331 603822
4567 603822 542003 438747 389878 477806 542953 489542 431315 539602 597789 536811 504029
4556 504029 506392 495400 422034 453216 486072 413183 545310 649966 609378 635740 535696
4545 535696 444212 411733 456328 322331 358313 464356 416258 431238 310492 351869 438237
4534 438237 481079 420800 441592 502470 438377 339804 311971 282797 304238 333911 375640 240214
4522 240214 320921 408998 328423 389928 493652 552338 608387 629321 583187 458013 512974
4511 512974 564447 442001 390691 384097 252804 247552 365481 387774 317224 417913 428257
4500 428257 122846 205538 282262 307575 361312 527427 462720 404054 445688 615471 557032
4489 557032 440974 511428 458295 465267 471688 468007 502057 514774 472672 410340 481743 437433
4477 437433 344832 313747 278817 376450 286606 189966 395902 446891 471699 487298 501224
4466 501224 285476 205197 289749 406629 460707 510995 366719 347085 276667 241632 321819
4455 321819 386871 459156 522170 458307 454379 372759 233818 325851 337841 236862 252453
4444 252453 366996 392468 341996 400342 445799 386712 384682 318097 272075 285743 424317
4433 424317 356415 309067 257991 252185 355962 347573 276114 314132 322473 447770 418771 414200
4421 414200 308171 257963 173766 202241 262033 289490 291351 355138 331558 311636 279040 373644
4409 373644 350423 387108 373371 325821 294639 291691 366431 284277 338339 339670 279046 314953
4397 314953 312960 226215 354941 345344 402013 539415 441210 336592 287028 299207 451907
4386 451907 389802 436374 352099 334664 355294 273441 239173 259696 336517 352789 412955 343769
4374 343769 365374 473002 465334 411589 292846 272107 256908 258942 225976 328402 303972
4363 303972 231242 245386 230454 196414 140111 200781 197701 160103 333031 315308 388136 317979
4351 317979 244487 308124 302489 448744 288044 200731 294404 356720 227414 141535 311730
4340 311730 210414 202673 253638 255782 364826 417086 409138 368390 410464 315390 283196 303289
4328 303289 240546 231635 258638 263847 314741 385815 476633 376443 443724 362974 461005 352358
4316 352358 300098 301411 270798 317073 315255 420416 387755 420214 384612 353096 185955 173387
4304 173387 303359 394581 337498 299532 349614 227938 359169 362778 389589 436252 391082
4293 391082 362497 386069 385609 417792 359781 229430 333867 461788 455539 371502 368093 410424
4281 410424 416541 385769 372192 358039 423792 333868 405292 449983 453026 531104 357499 386117
4269 386117 364947 326521 372610 346905 418894 314419 458498 478826 365117 322776 464993
4258 464993 606503 472726 354262 361938 304796 461387 445896 428637 422012 401959 497981
4247 497981 404432 300509 347933 350237 368990 304658 409935 540079 515086 399142 480084
4236 480084 510511 385452 405706 419253 415606 357872 384709 278646 259062 484744 543188
4225 543188 451773 515939 531535 566612 333633 486742 576765 535729 573592 560805 564315
4214 564315 431470 417848 438932 345352 204158 299573 322269 497100 439144 332228 411238
4203 411238 399067 475219 623089 493115 412074 388311 411737 405931 338351 293660 301701 359708
4191 359708 308120 424290 532413 483110 521346 473980 516639 672124 541547 525820 437651
4180 437651 363544 446941 449655 207315 330326 192839 173233 236559 334257 482327 416492
4169 416492 434888 446241 454019 623827 608488 664814 643353 638068 594256 429640 437654 445062
4157 445062 345432 403769 550317 496035 545031 467724 457565 351110 362769 261081 245197
4146 245197 267437 368988 404855 397076 419394 496366 461935 455959 517386 539653 420841 465998
4134 465998 518582 544527 405183 326556 343400 322860 373370 360059 401609 523703 639592
4123 639592 590107 477560 334420 474784 383926 487549 620943 578537 371700 377724 430212
4112 430212 519549 478275 450357 468940 544836 554027 576315 605098 606167 456048 552967 579330
4100 579330 384846 448714 485858 585247 518928 435332 425659 549180 476615 483474 601362
4089 601362 654511 623499 539935 415620 469721 451433 400458 553042 520571 492756 503046
4078 503046 470606 544673 518691 587750 551592 565738 644857 537920 509866 457116 519761
4067 519761 631604 521893 507371 539550 608773 557518 565168 506776 417289 506265 650503
4056 650503 623522 643731 596184 567903 584889 569241 727683 701580 726707 606593 595034
4045 595034 518620 392425 475585 589863 745827 671899 452444 346884 599442 696657
4035 696657 641276 601179 514156 507767 828681 846530 707172 736234 684128 730742 703857
4024 703857 623322 669891 678853 724507 744578 749679 889157 842361 737648 759727 713954 566517
4012 566517 672485 788141 646746 822673 845085 756520 792085 760287 819877 926111 1001871
4001 1001871 1053842 955861 873040 964460 929686 1089854 1083918 1067077 1042407 1069272 1039043
3990 1039043 975039 890647 835314 864716 1039489 1067040 1035355 1102658 1086740 1149808 1351300
3979 1351300 1347677 1386461 1361386 1402293 1424132 1308269 1256063 1238782 1252315 1146058 1163206
3968 1163206 1265928 1363582 1341786 1445438 1443288 1453992 1544726 1613760 1715718 1848387 1888317
3957 1888317 1841117 1903786 2023148 1980123 1960314 2016942 2013725 1937455 1905418 1929126 2045503
3946 2045503 2175892 2286914 2304707 2280781 2308455 2259130 2374397 2380897 2391491 2435003 2467787
3935 2467787 2464127 2556894 2679794 2719258 2887790 2965818 3014463 3026537 3054417 3159364 3243912
3924 3243912 3223318 3213588 3219660 3101902 3125252 3179688 3392838 3424606 3460851 3514126 3505528 3572414
3912 3572414 3531553 3714764 3747618 3748163 3771730 3782712 3828791 4000368 4177292 4208704 4325556
3901 4325556 4551942 4712133 4888323 5157351 5272257 5448795 5542655 5676648 5775059 5926823
3891 5926823 6256848 6638504 6918372 7035328 7349097 7772362 8296811 8721305 9189729 9630109
3881 9630109 10074037 10431285 10716462 10991382 11395425 11826466 12450649 13211141 13988877 14775262
3871 14775262 15868012 17051731 17420968 16413194 14664644 13353232 12412193 11691587 11130377
3862 11130377 10732030 10390363 10021126 9782597 9579166 9544063 9331106 9324206 9178523 8770062
3852 8770062 8548520 8351535 8266234 8082732 8091806 8150967 8021441 8011761 8033708 7961730 8030395
3841 8030395 8014752 7921446 7750800 7560472 7560814 7605672 7649226 7696254 7591059 7439440 7290794
3830 7290794 7274208 7261590 7330619 7341872 7412187 7399780 7361739 7426475 7698284 7868791 8101955
3819 8101955 8231026 8215840 7826464 7431645 7322672 7228285 7086873 7010816 7029698 6787110
3809 6787110 6662055 6567983 6501400 6477362 6323079 6167802 6066834 5916092 5850483 5707752
3799 5707752 5599721 5572326 5511163 5544996 5567496 5571784 5437876 5298696 5443418 5401103 5368444
3788 5368444 5227142 5215235 5296980 5329772 5238619 5236182 5280799 5220127 5212192 5277397 5388946
3777 5388946 5339051 5461310 5597913 5520780 5564610 5679321 5654194 5733767 5815312 5830498 5885743
3766 5885743 6024248 6061874 6195088 6301417 6333427 6431045 6507971 6613154 6726555 6880547
3756 6880547 6897392 6971203 7214551 7342666 7442619 7490199 7592069 7781505 7746171 8031129
3746 8031129 8351850 8496744 8461903 8693690 8911580 9085101 9267165 9449012 9474811 9684428
3736 9684428 9911012 10140845 10208596 10321777 10588594 10874373 11142833 11310875 11709929 12044008
3726 12044008 12425271 12712866 12961209 13276341 13646387 14008626 14422405 14757634 15081976
3717 15081976 15549025 16083829 16364749 16922881 17423227 17859899 18371775 19000955 19448517
3708 19448517 19926262 20414263 21170699 21953155 22920440 23794133 24573298 25425757 26234698
3699 26234698 27204015 28325366 29596410 30667663 31876238 33116125 34467504 35924782
3691 35924782 37363672 39190860 41084967 43108137 45283479 47639853 50005992 52774907
3683 52774907 55779122 58570365 61405536 64074073 67097932 70398604 73919667 77710239
3675 77710239 81341359 85283086 89239253 92877785 96732572 101182047 106134338 111831786
3667 111831786 118328910 125265899 132969279 141068798 148324048 152120963 152616044 152510540
3659 152510540 153098925 154699002 157091648 160244003 163754593 166775550 169524735 172715005
3651 172715005 176504407 180680256 185631588 190940713 196212588 201467978 207077671 213135542
3643 213135542 219547456 225784613 232143693 238928034 246159713 253533370 258689900 259405362
3635 259405362 257216511 254008181 248157559 238872356 229059402 221025615 215179892 210902641
3627 210902641 207818141 205677000 204420280 204026364 204200888 204578341 204893231 205439422 206432836
3618 206432836 207544429 208894976 210848360 213478497 216944890 220734946 224175802 226450801
3610 226450801 227985404 229593245 230594351 229138213 223230225 214569270 206363546 199318670
3602 199318670 193189575 187664128 182817102 178149904 173982128 170292962 166960937 163882894
3594 163882894 161057285 158560823 156159964 153867872 151681020 150003639 148851398 147812956
3586 147812956 146144487 143812155 141142695 138068306 134576227 130806703 127513543 124498946
3578 124498946 121367651 118288009 115434038 112501743 109797704 106926637 103798317 100967731
3570 100967731 98400588 95802292 93238533 91014487 89073800 87052787 85185299 83542473
3562 83542473 81990851 80617009 79222349 78009865 76632107 75048167 72860002 69946434
3554 69946434 66953628 64293519 61961104 59876807 58125796 56206179 54286352 52342538
3546 52342538 50388407 48487606 46749476 45044077 43362647 41899180 40472054 38933179
3538 38933179 37376879 36014910 34589303 33193625 31964356 30852993 29721917 28682386
3530 28682386 27477139 26349437 25377348 24534730 23620053 22752855 21895691 21054448 20508244
3521 20508244 19925579 19274639 18684819 18010785 17459642 16980523 16527312 16110847 15746383
3512 15746383 15344801 14975277 14536884 14143307 13838809 13700638 13423267 12866066 12442342
3503 12442342 12311172 12088157 11878557 11713075 11535649 11369998 11044726 10944569 10804769
3494 10804769 10668191 10503445 10235795 9979061 9847869 9691541 9540369 9421645 9267214
3485 9267214 9087834 8847689 8691961 8569491 8382470 8274992 8193495 8092208 7962353 7803828
3475 7803828 7836957 7700654 7654083 7581325 7507038 7481580 7371039 7244422 7054286 7062376 7068071
3464 7068071 6914999 6801075 6764082 6553301 6507866 6525932 6574933 6578799 6403645 6399081 6270463
3453 6270463 6100414 6199915 6015466 6031756 5917579 5856893 5850334 5723521 5644590 5843220 5860667
3442 5860667 5754799 5618850 5491277 5409810 5359778 5340158 5377075 5290793 5213677 5312084 5212379
3431 5212379 5286445 5170979 5071691 4987443 4859413 4847901 4786538 4894745 4862336 4638472 4633651
3420 4633651 4550506 4568322 4555463 4368290 4290716 4242071 4248797 4143982 4111117 4227398 4244911
3409 4244911 4197319 4188521 4251742 4258377 4084525 3990974 3906034 3832224 3945357 3991381 3919588
3398 3919588 3867540 3865780 3927281 3894376 3786588 3777624 3826207 3826641 3657319 3483975 3413774 3336676
3386 3336676 3382937 3380325 3385217 3486698 3366193 3448838 3369351 3358749 3360331 3414226 3244550
3375 3244550 3253099 3261864 3338866 3221074 3138118 3238488 3214402 3310902 3322714 3288312 3233453
3364 3233453 3129982 3081137 3077231 3035395 3056741 3149149 3088496 3042969 3103391 3114847 3067634
3353 3067634 3002335 3206059 3350002 3312561 3236355 3172892 3114708 3103706 3314025 3430233 3280184
3342 3280184 3113923 3185972 3071857 3004681 3109774 3078358 3071122 3011367 2906563 2705884 2644585
3331 2644585 2677283 2749090 2680785 2711175 2677469 2696426 2818697 2775780 2615306 2530568 2571172
3320 2571172 2625089 2563410 2569494 2639559 2654019 2766293 2760521 2750294 2652001 2540751 2564095
3309 2564095 2576199 2481630 2264878 2272377 2238597 2278005 2222508 2079126 2038785 2049371 1904313
3298 1904313 1971329 1946788 1922852 1847391 1821486 1871677 1965417 1866214 1819004 1784719 1718438
3287 1718438 1713125 1734279 1735256 1742534 1656895 1574860 1747448 1786441 1773593 1665061 1697591 1599220
3275 1599220 1443652 1500341 1468800 1419156 1394497 1304869 1204746 1171438 1256601 1254120 1307408
3264 1307408 1364631 1399204 1369686 1337315 1274005 1159471 1062745 1082320 1060300 1226400 1184754
3253 1184754 1051681 1090587 1113722 1061377 1049164 1046316 1015330 967831 959106 915241 965043 802955
3241 802955 765892 796175 678883 776386 851916 780597 691679 686981 806915 872926 848985
3230 848985 670018 609907 770751 747294 641733 737546 785826 634657 649962 658628 730920
3219 730920 694866 604472 493247 544841 454538 354516 477180 582341 595315 557618 639650
3208 639650 511090 515472 523849 631816 659381 520448 563642 590963 581432 509011 520752 435283
3196 435283 512628 525664 441532 430909 463205 570783 485760 540557 622416 551970 624083
3185 624083 516326 415356 506621 562705 442087 474138 440127 556751 652712 592055 581735
3174 581735 589862 610116 597123 633578 539086 392716 376500 425560 420351 548920 483383 314055
3162 314055 308212 349355 385727 419414 302996 269634 378874 350736 344425 444696 264415
3151 264415 402351 375744 255035 250468 304019 304877 251299 329129 307077 306992 274012 196491
3139 196491 283213 330787 288858 268850 310910 311331 305730 387195 404858 369306 354655 261962
3127 261962 117642 201116 143646 102342 210857 342477 472179 440113 308608 278487 244644
3116 244644 260379 327054 349145 246436 342349 388777 493715 295288 238620 234943 200782
3105 200782 205275 286470 235951 248830 220605 272606 362739 327587 302568 247942 232602 277237
3093 277237 311137 254191 144781 87947 39796 43849 249963 175785 340127 308804 245410
3082 245410 204446 172848 299094 333671 266500 286514 231499 261318 277567 310233 266184
3071 266184 293354 158305 129557 162301 57508 74585 162289 178694 298320 312812 233482
3060 233482 282748 166943 38745 77134 163723 218317 258442 199394 226255 228127 143477
3049 143477 296818 332081 118607 107134 163790 43626 -59498 74167 192866 152776
3039 152776 41236 98000 225852 231523 73930 48464 119160 33958 107244 160190 72997
3028 72997 54263 77526 84189 135659 -66796 -88320 76740 186311 141939 -83030 -62445
3017 -62445 42958 60469 39399 -32268 -55431 111857 111319 125900 40606 92432 106374 67527
3005 67527 129261 127308 145212 58987 38254 2199 -22778 119076 158187 151783 44307 169846
2993 169846 180904 44421 184337 208409 47928 53839 33637 -72942 96049 84359 212869
2982 212869 248031 160390 60594 69021 -170 -39905 5115 -86873 -110427 -90160 42747 34104
2970 34104 -157690 -112386 92992 149191 175809 -24337 -83154 -40953 88491 69794 87417
2959 87417 -16375 -26820 -57218 -33458 -60777 -143661 -147649 -78716 -90278 -54554 -141510 7059
2947 7059 78035 22719 46487 -70501 -150679 -190924 -212328 -147850 -33600 -119770 -15849
2936 -15849 110369 103053 -61402 -43382 -178740 -49255 27143 -92238 -149708 -156465 -192138
2925 -192138 -123895 34859 -5185 -13495 -35382 -57158 -14294 -59992 -48249 -141725 -108486 20019
2913 20019 31964 -139648 -221369 -232061 -140316 -122449 -59333 69512 -5295 -81676 -114986
2902 -114986 -45312 -109148 -142812 -65874 -110473 -129845 -55642 -78938 -127244 -98190 -85681 48919
2890 48919 116297 193851 159461 58181 -50507 -73444 -100098 -136131 -97541 -53788 -1160
2879 -1160 45593 -69474 -173208 -40664 -19035 92285 139627 49809 -57708 -9976 -128158
2868 -128158 -188395 -88385 -59956 -199628 -143741 -27865 -127903 -153196 -79158 -72057 6796
2857 6796 -5658 -121465 -130357 -114368 -122408 -151264 -177895 -261186 -170387 -14109 -57926 -76212
2845 -76212 -161946 -272189 -89881 -12373 -11103 -31229 -75120 -80135 -83522 -6678 40854 -57598
2833 -57598 -147196 -118344 -154753 -107883 64812 -129157 -272769 -177665 46869 -26530 -147202
2822 -147202 -137462 -45776 28150 -30149 -105143 -120463 -147362 -33337 43727 -118766 -87438
2811 -87438 -49760 -149801 -238136 -227099 -270344 -273724 -256879 -214229 -317283 -438177 -408080
2800 -408080 -282869 -320417 -231222 -91342 -161111 -87253 -147961 -234050 -294163 -268165 -247076
2789 -247076 -161189 -181945 -208255 -175577 -229015 -152208 -123685 -49102 -54932 -67622 9237 -11821
2777 -11821 -166578 -179812 -94658 -186114 -71182 4934 96618 57865 -107556 -194207 -28878
2766 -28878 43801 67130 180761 101432 111805 97297 131795 -48984 2883 -69032 -126912
2755 -126912 -128416 -158165 -186095 -191881 -46598 -15935 -122211 -210362 -240749 -163269 -131000 -44646
2743 -44646 -99551 32160 68721 -18744 -45442 60486 -104458 -214345 -152970 -37200 -56658
2732 -56658 -201364 -210533 -194989 -145737 -146294 -219652 -140412 -76326 -92292 -109432 -216936 -262345
2720 -262345 -339818 -235217 -122506 -130796 -162950 -87585 -93116 -52099 -7097 -121789 -150809
2709 -150809 -87861 -224393 -169115 -77613 28483 -115860 -181160 -227125 -151879 -33968 -30522
2698 -30522 25858 -46939 -87296 -185772 -182824 -217089 -245240 -157478 -16434 -65954 -70567 -127963
2686 -127963 -161976 -187193 -167332 -153151 -110225 -53917 -49272 -162657 -139090 -97820 -82682 -152124
2674 -152124 -214674 -151798 -221547 -165815 -149067 -141949 -227783 -272093 -215082 -140302 -180173 -130339
2662 -130339 -101107 -96600 -170156 -164737 -339630 -338465 -306207 -210233 -140801 -212111 -149158 -177823
2650 -177823 -212889 -201276 -176847 -172754 -177945 -86178 -321659 -358246 -232424 -147596 -73624 -16949
2638 -16949 -23558 -127892 -93940 -28288 -17428 -68506 -76154 12250 -100204 -147004 -56037 -1853
2626 -1853 -171034 -120677 -164312 -118024 25870 121114 -88658 -94115 -18357 25447 -48163 -42619
2614 -42619 -63805 -27085 -25488 -70035 -86210 -149987 -115712 -66053 -76720 -171346 -216575 -202035
2602 -202035 6440 -24677 18621 53835 55528 85457 51485 -68176 -143478 -184425 -77
2591 -77 -169483 -234006 -134625 -57001 -54584 -70583 -145538 -1512 21302 20214 67834 90878
2579 90878 -77081 -49215 39585 46752 -52315 -88354 -49384 1259 13837 73764 28266 -56414
2567 -56414 -203042 -170815 -64777 -10202 -6864 -93370 -127021 -112160 -66413 -135985 -226440 -204044
2555 -204044 -236655 -153158 -153356 -170863 -156344 -62922 -130530 -53010 -54449 -68916 -188613 -284803
2543 -284803 -103530 12343 -97950 -183485 -158044 449 -77737 -164923 -210323 -243652 -164790
2532 -164790 -235883 -221354 -155891 -139488 -191062 -185760 -129863 -155066 -222097 -173578 -244950 -168779
2520 -168779 -199456 -188463 -134174 -59236 -146229 -250841 -91215 -12237 -91608 -90118 -76727
2509 -76727 -166477 -212961 -245843 -283358 -210955 -125092 -193090 -90358 -59757 -109646 -38553 -72086
2497 -72086 26860 -110224 -181362 -142100 -87693 6361 -124731 -132717 43323 -4919 -110437
2486 -110437 -146543 62389 97766 72806 -30125 -52038 -55913 -38424 -14948 -51912 -176278
2475 -176278 -240114 -137876 -20354 -122138 -163457 -220632 -195353 -105605 -76940 -116512 -96632
2464 -96632 -61378 -26565 -128451 -124764 -157820 -142930 -26654 52896 28662 14002 -75016 -19941
2452 -19941 138531 57937 36027 -10239 -218666 -138845 -46019 -116194 -144610 43072 102861
2441 102861 119709 28206 -10600 60909 83353 26858 -6536 121584 60203 6459 9522 26038
2429 26038 80692 49662 14260 51669 59452 100453 160231 51463 -55719 -61607 -25776 -89678
2417 -89678 -83345 14671 45043 187994 180452 150361 166447 236346 129313 74550 122217 378344
2405 378344 340324 233619 85045 -10741 146558 276635 335297 299228 328263 365868 330824
2394 330824 350896 293078 294359 399903 444637 354663 307763 284451 259417 258039 484801 460120
2382 460120 448257 526822 645553 644612 536149 565954 639438 727067 701916 749547 713267 627608
2370 627608 782674 820675 903590 1000778 917766 948760 919236 897282 885909 1026022 1227526
2359 1227526 1232493 1341533 1442283 1526535 1524180 1496325 1514079 1746158 1776950 1941864 1953938
2348 1953938 2065090 2214864 2259513 2427216 2586552 2843502 3108657 3304754 3495601 3799399
2338 3799399 4127485 4498433 4818540 5274982 5555646 5889554 6492558 6977727 7434235 7847827
2328 7847827 8211145 8592357 8933195 9154755 9384177 9842969 10629296 11305847 12316827
2319 12316827 13416980 14503485 15984046 16931808 15797401 13638648 12082428 10973727
2311 10973727 10151092 9453074 8959094 8662619 8433996 8212113 8058053 7894085 7858283 7714610
2301 7714610 7539008 7294750 7009130 6664911 6553629 6323571 6145428 6198967 6187371 5896510
2291 5896510 5890644 6025924 6031601 6129956 6108998 5922004 5781511 5666152 5836303 5724125 5588572
2280 5588572 5331893 5237176 5294316 5182491 5114148 5154355 5140615 5081164 5241072 5218643 5242935
2269 5242935 5387187 5752767 5878981 5843480 5924956 5605747 5223241 4976828 4653126 4377168
2259 4377168 4434859 4372744 4074784 3947906 3826605 3684830 3630596 3608611 3377507 3042374
2249 3042374 2877554 2771366 2722389 2720091 2503658 2297114 2234780 2173871 2060184 1915618
2239 1915618 1701958 1519417 1615074 1615308 1515302 1406206 1261583 1259448 1099836 1045030 1016907
2228 1016907 971385 829648 794692 710273 716260 797924 731318 696128 486080 466821 527525
2217 527525 526625 513457 533893 402589 393821 519831 557494 328763 226346 209816 354849
2206 354849 336555 371417 414153 440871 511221 426621 337661 325873 295108 186703 226433
2195 226433 382832 315537 219669 261737 253968 190967 128573 223126 271628 259926 176417 149372
2183 149372 122949 150032 52745 84196 18699 -68901 -49066 43612 74916 -60595 -126754
2172 -126754 -102873 39165 109265 17246 42534 73925 639 -43839 -51903 6544 -16935 -3853
2160 -3853 -66506 -157430 -149391 -90497 6435 15792 -22173 -37502 -39163 63364 100669 76370
2148 76370 62882 -28924 57546 67315 -60382 -88631 -13870 2677 18398 -154134 -104646 -31397
2136 -31397 121550 88408 -60458 -71930 -133755 -177454 3500 10698 -98427 -81907 -48730
2125 -48730 -27626 15017 -133239 -116290 58524 -24235 -47975 14649 -137629 -118580 -199216
2114 -199216 -189140 -237574 -180408 -22292 -57496 -21275 -35639 -80991 -186432 -86609 -28732
2103 -28732 39843 -77920 -205406 -145486 -251774 -177007 -85218 -109951 -43782 -4757 16043
2092 16043 -182650 -233390 -157754 -42403 -116621 -82506 -134071 -114181 -83477 -95225 -84583
2081 -84583 -22245 58676 -28233 -115175 -175248 -169062 -232002 -48787 -169958 -205291 -108446 -159889
2069 -159889 -102911 26196 58641 -146847 -298564 -128310 -77639 -34002 -96787 -55728 100829
2058 100829 -43327 -57741 -42433 -78196 -36559 10149 -49802 -156540 -252407 -127129 -112890
2047 -112890 -178939 -145400 -29641 -48389 16442 -123162 -139418 -134629 -296285 -234899 -233141
2036 -233141 -135936 -126906 -73933 -20643 -81653 -79696 -81558 -219227 -343326 -145039 -190716 -88979
2024 -88979 -19107 -1053 -42133 -51507 -178131 -187171 -146515 -125602 -172343 -218077 -192612 -314752
2012 -314752 -351859 -226053 -161837 -203998 -222266 -287498 -177748 -215805 -201630 -139725 -193003
2001 -193003 -153102 -195937 -133897 -196891 -156383 -140262 -181753 -130957 -86541 -175871 -309959
1990 -309959 -357401 -267160 -223563 -144496 -63984 -78385 -141007 -212832 -228728 -158207 -160559 -284056
1978 -284056 -272799 -195850 -210930 -244143 -70457 -175402 -206510 -111829 -104707 -138872 -155708
1967 -155708 -68684 -128427 -115511 -213128 -105408 -23639 -72562 -83182 -93735 -206425 -232553
1956 -232553 -270681 -394695 -303121 -322674 -145808 -174986 -162586 -353893 -355000 -497055 -442586
1945 -442586 -274331 -266901 -252843 -248208 -260312 -192162 -204695 -316651 -268405 -311118 -293054 -315675
1933 -315675 -315139 -229444 -368331 -499852 -412712 -378011 -306796 -356269 -374192 -342322 -408072 -401217
1921 -401217 -266396 -221480 -222719 -141476 -340520 -333059 -290644 -266034 -175731 -164468 -288946
1910 -288946 -264540 -255663 -233918 -252410 -330484 -208818 -63525 -69031 -219545 -215171 -236269 -385376
1898 -385376 -329558 -273334 -189782 -213865 -338072 -365267 -268154 -258887 -257548 -316595 -352880 -281237
1886 -281237 -274988 -241559 -292101 -167119 -85049 -262952 -210160 -288740 -336353 -198593 -311438
1875 -311438 -317801 -209215 -329962 -374700 -295214 -359552 -310154 -372432 -348862 -191621 -159777
1864 -159777 -258035 -296805 -291026 -292341 -308062 -309493 -296623 -303010 -302409 -258076 -222683 -222576 -264547
1851 -264547 -273261 -340592 -390762 -353256 -407057 -432568 -411274 -296906 -237610 -355468 -360177 -286450
1839 -286450 -297644 -281749 -131964 -224991 -324503 -289037 -243787 -138367 -279823 -378131 -370560
1828 -370560 -361379 -350741 -268514 -315917 -339326 -283965 -317721 -251093 -372322 -481158 -400917
1817 -400917 -107676 -190144 -235837 -360231 -368413 -351396 -379662 -247752 -155227 -161975 -123877
1806 -123877 -157853 -99396 -236429 -329697 -374657 -321624 -416030 -227248 -133051 -101578 -64087
1795 -64087 -427644 -426799 -502105 -554077 -483510 -390267 -466710 -449475 -440431 -317521 -289659 -322955
1783 -322955 -214567 -143528 -158188 -343348 -226784 -190345 -272623 -355784 -423757 -183252 -174143
1772 -174143 -101393 -126704 -205326 -234962 -308372 -257622 -304234 -179657 -251227 -293510 -235082
1761 -235082 -256318 -139367 -184711 -328239 -409780 -506285 -488546 -343642 -195650 -220309 -254430
1750 -254430 -185398 -370767 -380140 -205396 -220911 -284265 -244757 -250993 -298097 -249717 -254415 -390306
1738 -390306 -396680 -267925 -134182 -271451 -277462 -244787 -414920 -359813 -278662 -248276 -219835
1727 -219835 -312363 -243215 -249011 -246731 -402151 -517513 -346038 -252784 -309776 -220549 -171952
1716 -171952 -282073 -284048 -278560 -328468 -272739 -269822 -173835 -186798 -368940 -322758 -396748 -336046
1704 -336046 -337493 -311680 -325701 -334138 -191504 -267651 -393720 -380651 -341551 -321869 -268956 -329900
1692 -329900 -328008 -287533 -335781 -423873 -353516 -323388 -298128 -501872 -606905 -386290 -287868
1681 -287868 -291143 -204081 -316562 -451103 -442633 -315266 -294900 -359998 -211951 -272005 -397591
1670 -397591 -393424 -313128 -376379 -360002 -305515 -220144 -132543 -207030 -295051 -208511 -88403 -80866
1658 -80866 -129560 -231598 -291599 -325974 -270366 -416252 -368430 -265662 -179752 -212698 -228807
1647 -228807 -183195 -254835 -337907 -246146 -273316 -340025 -346140 -359235 -397203 -361511 -265710 -230429
1635 -230429 -312686 -333572 -131793 -182804 -266653 -280066 -259962 -48532 -197448 -255428 -234656
1624 -234656 -250875 -171389 -338114 -406093 -334820 -178338 -113131 -333200 -371963 -366566 -389283
1613 -389283 -324452 -243830 -155228 -339621 -297535 -435211 -367024 -330981 -359395 -299031 -376642
1602 -376642 -309025 -228655 -187314 -213359 -257371 -292110 -407761 -361567 -371499 -387938 -375469 -430849
1590 -430849 -362962 -263263 -295008 -229513 -327564 -254250 -282181 -359897 -336084 -279952 -390704
1579 -390704 -422698 -441830 -367808 -340913 -275072 -239318 -165643 -82966 -321655 -286387 -112858
1568 -112858 -184608 -66410 -158061 -235568 -189980 -226225 -281309 -228624 -234154 -236564 -332489 -415733
1556 -415733 -158905 -266523 -267124 -280015 -322980 -387749 -462745 -380881 -294989 -249642 -299294 -277225
1544 -277225 -247464 -306346 -322515 -228734 -92053 -273197 -325245 -367229 -336172 -326285 -274382
1533 -274382 -314946 -163055 -81502 -315842 -279722 -310059 -294657 -221823 -220426 -384890 -442656
1522 -442656 -370856 -285557 -147729 -86679 -97703 -141218 -170206 -246254 -359240 -310899 -341704
1511 -341704 -362755 -357668 -337897 -296989 -349289 -331990 -357308 -353162 -324234 -249940 -241872 -174350
1499 -174350 -275276 -411165 -387667 -322544 -321381 -276354 -413496 -253338 -250079 -354530 -336037
1488 -336037 -271128 -282651 -257007 -240595 -428313 -308746 -266700 -416378 -348752 -382107 -422633
1477 -422633 -317156 -334785 -351865 -363296 -232765 -261013 -218977 -244925 -171357 -301192 -383902
1466 -383902 -299138 -281757 -282772 -255707 -149545 -278167 -344050 -236537 -245584 -365470 -252222
1455 -252222 -233925 -297483 -316672 -211254 -162799 -129777 -286422 -332630 -333330 -396490 -396166 -321788
1443 -321788 -371994 -445140 -412941 -336874 -440260 -328419 -307329 -402559 -311398 -341739 -294989
1432 -294989 -255313 -322239 -327294 -348782 -319335 -197362 -185383 -214652 -200668 -207577 -258401 -249590
1420 -249590 -425750 -315334 -275300 -271016 -241361 -249408 -186212 -320659 -238021 -238708 -365620 -425760
1408 -425760 -288472 -284374 -302401 -292008 -238771 -175592 -245989 -299950 -412826 -344179 -326493
1397 -326493 -364231 -455926 -373281 -410976 -434836 -288451 -278418 -248326 -356927 -364458 -262292
1386 -262292 -198512 -235852 -323269 -235026 -262608 -293566 -257741 -353391 -457547 -219318 -276332
1375 -276332 -260669 -193284 -179900 -298825 -425583 -390810 -262030 -145363 -144750 -323850 -314603
1364 -314603 -266864 -301526 -331133 -235471 -224352 -411297 -496071 -475425 -307007 -209706 -333781
1353 -333781 -240447 -298724 -331279 -210007 -212860 -251111 -249720 -264375 -397995 -395921 -400054 -347120
1341 -347120 -332003 -289234 -308011 -359094 -276146 -359162 -398231 -333719 -314521 -295025 -320616 -329856
1329 -329856 -208536 -215959 -248865 -253598 -322868 -340191 -324544 -210059 -273082 -335336 -240595 -324042
1317 -324042 -364836 -318923 -270367 -285555 -304524 -199064 -383281 -401357 -317126 -332197 -387755
1306 -387755 -343529 -310791 -309739 -324570 -396215 -502262 -446581 -343733 -364105 -361398 -323655 -411379
1294 -411379 -404195 -424271 -369227 -203800 -216874 -309672 -209105 -333774 -362391 -306415 -211275
1283 -211275 -113755 -176142 -226651 -431054 -360329 -347991 -247264 -178205 -257934 -351255 -286772
1272 -286772 -322032 -366521 -217555 -194156 -259785 -159142 -202775 -272029 -339362 -358245 -432850
1261 -432850 -385249 -308370 -252225 -185714 -312034 -428632 -368126 -143964 -247184 -400546 -411340
1250 -411340 -403312 -243703 -159319 -412442 -424326 -392949 -392245 -410267 -254798 -258594 -167580 -172451
1238 -172451 -238849 -234805 -205709 -173946 -213048 -274617 -374608 -488320 -407163 -436440 -463725 -409627
1226 -409627 -360704 -377101 -380660 -433011 -285280 -267432 -276662 -378703 -416057 -345161 -381488 -339202
1214 -339202 -326932 -276415 -300833 -302039 -245159 -210244 -348344 -335585 -257605 -306691 -321876 -302960
1202 -302960 -415728 -344439 -204424 -244031 -248036 -257195 -223397 -240924 -178231 -283664 -367047
1191 -367047 -378069 -259734 -220084 -204866 -287624 -596075 -567502 -438542 -350078 -377386 -322005
1180 -322005 -377365 -311565 -255097 -260994 -473066 -264347 -332895 -348953 -362662 -215717 -155707
1169 -155707 -215906 -172234 -319738 -308086 -280554 -439686 -394560 -463097 -400835 -313661 -273482
1158 -273482 -315723 -349281 -358233 -234606 -267911 -290820 -276027 -222165 -201220 -251920 -196961 -205346
1146 -205346 -242808 -340322 -233655 -240025 -192853 -241796 -254664 -265219 -188713 -219658 -261743 -373900
1134 -373900 -282757 -243524 -279149 -345261 -267330 -321115 -350421 -266737 -274909 -200543 -273019 -325369
1122 -325369 -216797 -225255 -326583 -213957 -107779 -150576 -264169 -414175 -466440 -345829
1112 -345829 -290669 -322427 -284588 -266759 -384737 -457069 -409000 -405534 -425262 -387030 -384823 -348471
1100 -348471 -285019 -300587 -353086 -173128 -227064 -239940 -221308 -363340 -338129 -345955 -446226
1089 -446226 -362159 -371509 -436183 -345018 -410026 -359539 -415341 -534067 -436648 -299998 -456260
1078 -456260 -446114 -436351 -405309 -398981 -408197 -389234 -391113 -356853 -358132 -357242 -247496 -210415 -317251
1065 -317251 -361118 -274090 -310076 -239680 -281407 -383920 -369132 -504683 -334346 -309930 -307707
1054 -307707 -317821 -308271 -345124 -361225 -233027 -219539 -383551 -419721 -341218 -262973 -227273
1043 -227273 -272666 -386777 -373461 -312906 -244648 -234974 -205501 -145847 -311389 -335028 -302020
1032 -302020 -185024 -135776 -217009 -400616 -404372 -374223 -348399 -449456 -465454 -491394 -477405
1021 -477405 -386389 -316790 -249445 -188205 -242986 -391783 -241998 -271045 -316099 -299380 -443658
1010 -443658 -282295 -348585 -371411 -352664 -366185 -360201 -411722 -402974 -459949 -377304 -268898 -340821
998 -340821 -359786 -292566 -302531 -301400 -326264 -309054 -340709 -357744 -371930 -325276 -201275 -257943
986 -257943 -253129 -225924 -343718 -348330 -396066 -417094 -314655 -273966 -192557 -194235 -436490 -295472
974 -295472 -362920 -345275 -280066 -285777 -183730 -260199 -321391 -312310 -400301 -307791 -268908 -320793
962 -320793 -344052 -497915 -400460 -386501 -444135 -315942 -260164 -423078 -526694 -371332 -351612
951 -351612 -354787 -284928 -333732 -362605 -371669 -351299 -314566 -374147 -289166 -347563 -409312 -263442
939 -263442 -280468 -553142 -623159 -418678 -504651 -423816 -380473 -257096 -147549 -284562 -372720
928 -372720 -382984 -404500 -309922 -285652 -443150 -413147 -104195 -72689 -242164 -389791 -396127
917 -396127 -398131 -503395 -381038 -296719 -371965 -389090 -211445 -226815 -256061 -443249 -388770
906 -388770 -362509 -331534 -289270 -356005 -327047 -225835 -218794 -226848 -109069 -170620 -333590 -419819
894 -419819 -390119 -419359 -384115 -374396 -403427 -301333 -315797 -311189 -174923 -221755 -241506 -317339
882 -317339 -374324 -476784 -332384 -387190 -320049 -304278 -400118 -402319 -407887 -334703 -241387 -145788
870 -145788 -274669 -330457 -420724 -286913 -227860 -129452 -179268 -229846 -298244 -293973 -199486 -297371
858 -297371 -316212 -369198 -462232 -312060 -284540 -485395 -389990 -285201 -289427 -216049 -182759
847 -182759 -182394 -254969 -231903 -372577 -338869 -232390 -219963 -119833 -229852 -240886 -328484
836 -328484 -427767 -412517 -360302 -340388 -329614 -420950 -349859 -224590 -240756 -211251 -153136 -107332
824 -107332 -92159 24455 -155135 -213857 -119932 -247668 -241744 -232446 -179268 -234825 -320711 -282094
812 -282094 -267580 -279288 -266053 -186922 -153891 -234357 -259609 -432163 -334964 -279887 -314489 -330806
800 -330806 -375182 -301073 -355891 -286753 -141324 -181844 -233858 -195691 -351126 -452306 -350085
789 -350085 -355099 -309241 -373305 -404267 -290427 -238876 -329169 -323620 -217220 -231005 -284820 -255190
777 -255190 -259570 -385967 -390622 -425569 -369631 -256904 -348219 -418057 -449415 -345703 -201325
766 -201325 -250791 -333227 -215452 -248637 -351048 -343396 -266767 -266722 -401810 -361105 -302005 -409682
754 -409682 -396778 -299183 -249817 -342127 -351997 -302632 -254205 -291006 -431510 -421981 -334430 -319186
742 -319186 -332323 -263940 -277379 -253079 -274163 -187858 -248159 -378427 -279048 -242549 -276581 -362093
730 -362093 -423893 -399285 -506228 -366157 -310251 -325302 -295576 -361311 -404014 -425228 -436310
719 -436310 -371324 -238677 -321921 -365869 -241160 -361000 -244899 -269831 -431637 -354367 -303564
708 -303564 -443223 -373517 -343224 -326249 -363412 -364918 -449961 -490098 -418393 -451677 -490029 -396988
696 -396988 -333566 -256160 -234857 -207676 -158161 -219457 -227179 -257581 -188866 -190314 -160545 -150276
684 -150276 -97462 -300939 -299644 -314087 -287930 -308952 -384247 -294767 -245523 -306341 -289498 -411380
672 -411380 -432166 -287294 -282576 -246282 -241068 -403735 -421686 -238531 -97257 -206572 -205872 -209217
660 -209217 -341381 -285035 -296853 -265006 -439665 -486445 -279954 -300812 -347088 -391410 -305081
649 -305081 -204380 -237798 -224015 -255370 -374054 -228778 -285291 -240831 -253366 -289387 -212483
638 -212483 -426505 -609494 -471993 -397270 -285211 -356883 -370348 -133048 -293657 -292227 -367218
627 -367218 -377853 -349435 -323259 -415518 -430073 -379721 -275516 -246886 -199115 -280646 -432675
616 -432675 -276833 -316709 -313335 -269864 -296073 -314206 -440472 -266132 -146212 -225831 -192556
605 -192556 -145633 -260374 -321200 -281353 -251952 -337608 -403702 -321294 -258689 -290520 -220059 -216866
593 -216866 -279379 -177079 -220910 -229026 -227165 -238854 -272475 -291509 -283332 -207276 -276022 -422325
581 -422325 -285199 -301250 -433742 -326394 -305830 -282553 -336110 -373838 -439537 -421010 -330707
570 -330707 -380883 -349782 -393388 -386496 -318509 -248865 -385362 -400229 -272490 -300587 -385349 -406098
558 -406098 -434462 -403248 -387063 -390671 -510274 -470749 -519490 -432655 -307566 -223695 -253066 -417618
546 -417618 -421591 -491619 -364118 -258272 -355598 -348562 -356360 -369208 -261046 -190926 -150202 -248441
534 -248441 -309718 -359010 -267291 -128358 -212325 -269870 -325544 -349150 -292325 -361773 -377521 -443845
522 -443845 -466506 -396796 -334892 -366769 -382777 -181468 -117449 -127304 -176381 -193356 -232842 -333322
510 -333322 -246903 -363490 -428326 -353857 -322917 -245054 -19967 -106122 -123854 -236850 -312773
499 -312773 -388986 -291634 -278885 -180455 -145966 -248681 -289687 -203560 -292329 -258006 -292805 -178130
487 -178130 -163634 -359327 -374289 -260517 -119140 -288374 -249708 -274304 -325655 -232051 -324642
476 -324642 -344592 -239265 -278241 -295700 -310889 -110755 -348420 -284640 -166635 -172947 -198434
465 -198434 -171938 -156495 -84806 -383553 -396290 -364358 -368758 -358671 -281801 -252045 -179222 -336963
453 -336963 -565820 -471568 -370897 -254834 -222643 -208663 -297918 -313536 -301424 -298478 -429769
442 -429769 -199563 -252805 -367039 -398583 -376973 -405555 -359549 -253823 -287757 -228735 -245120
431 -245120 -189959 -278871 -368343 -299451 -243996 -251892 -296786 -187303 -248308 -179844 -66282 -175307
419 -175307 -243557 -246377 -403960 -303606 -233544 -287923 -203222 -242312 -377517 -371987 -310871 -294913
407 -294913 -175709 -179237 -127360 -134584 -191075 -254297 -403381 -372646 -215922 -120786 -158244 -199957
395 -199957 -60665 -176155 -123962 -92609 -103335 -139344 -120158 -166892 -260802 -316953 -327588
384 -327588 -196191 -361473 -462886 -444858 -415873 -253963 -286821 -181012 -76552 -144196 -100044
373 -100044 -179436 -253464 -176929 -227865 -210437 -123536 -221181 -231536 -211175 -300615 -216965 -250266
361 -250266 -251451 -185682 -181879 -76334 -100166 -224676 -267969 -183959 -154683 -189662 -283426 -279554
349 -279554 -135421 -108220 -225530 -223329 -212176 -180986 -242100 -229233 -162520 -170779 -245479 -191771
337 -191771 -146725 -134930 -204019 -298962 -425086 -479681 -512061 -432872 -222107 -172752 -235117
326 -235117 -220474 -239591 -306136 -226579 -310385 -294552 -328912 -245095 -279125 -239797 -107278 -216724
314 -216724 -266930 -213389 -275503 -397577 -303789 -277623 -144354 -200755 -219422 -248936 -147854
303 -147854 -103455 -206351 -254339 -338531 -359668 -162362 -307971 -342846 -143006 -161626 -109790
292 -109790 -77544 -108928 -249795 -323641 -334514 -234348 -95749 -170181 -225083 -221516 -156178
281 -156178 -269177 -242813 -129664 -136447 -12859 -191359 -127654 -107770 -206964 -99516 -182484
270 -182484 -139899 -108751 1130 -120118 -194903 -109497 -147052 -103668 -170471 -157169 -111634
259 -111634 -22722 -201472 -288270 -287780 -210972 -167280 -179764 -135741 -34124 -81904 -282791 -165028
247 -165028 -77489 -217349 -194391 -98357 -153696 -240238 -223188 -141084 -167049 -188833 -256836 -164848
235 -164848 -268167 -352223 -256352 -218690 -207723 -136748 -128563 -153934 -110818 -100289 -222209 -252949
223 -252949 -326979 -270378 -52384 -248022 -222960 -209744 -172582 -181103 -155002 -122858 -75110 -203853
211 -203853 -240101 -208671 -250681 -358682 -328593 -343967 -281190 -197816 -245100 -219681 -118150
200 -118150 -191953 -60248 -49937 -149251 -9017 -93747 -136644 -194298 -132707 -263768 -277892
189 -277892 -162024 -178268 -191472 -224961 -250198 -257091 -263424 -219354 -90327 -102937 -170779 -188658
177 -188658 -125942 -110283 -168367 -271218 -283703 -204040 -230306 -214108 -164375 -104423 -140144 -169605
165 -169605 -239457 -201138 -129560 -246059 -207961 -276054 -290393 -192245 -279763 -284649 -145665 -139520
153 -139520 -235887 -176097 -204921 -254786 -324459 -266381 -208842 -190459 -299591 -322107 -220379
142 -220379 -252699 -283560 -217173 -42458 -20130 -101600 -64343 -85421 -153520 -175522 -233004 -94776
130 -94776 -174582 -169429 -154224 -313484 -162892 -12382 58934 -103355 -75779 -102104 -245022
119 -245022 -257198 -144605 -152597 -214119 -152087 -205716 -140765 -149659 -157403 -35374 53988 2969
107 2969 -20549 1665 -61543 -45585 -144161 -150621 -198090 -189898 -150631 -115625 -145227 -130142 -122475
94 -122475 -105139 -68072 -40949 -56566 -58717 -23950 -57010 -149890 -95287 -105872 -166471 -107104
82 -107104 -128404 -118310 -93241 -52278 -143697 -107007 -24208 -110873 -189295 -139346 -95365 -132238
70 -132238 -110253 -80284 -115262 -90519 -189643 -158336 -114853 -91601 -120497 -85800 -109357 -113337
58 -113337 -65450 -72935 -210343 -182427 -63367 -153994 -127409 -120742 -86619 -65261 -147719 -167791
46 -167791 -83965 -30681 -49826 -51395 -21425 -67821 -110113 -48855 -31658 14578 9197 -80242
34 -80242 -36941 -19909 -54143 -89839 -100287 52416 67864 58469 42089 -65338 -141056 -86230
22 -86230 -82693 -25947 -31199 -66911 -75844 -70564 -5389 -71038 -63298 -52242 -27682 -133844 -161367
9 -161367 -118334 -101121 -193940 -147052 2467 11176 42200 -58677 -68138
0 -68138
$$ Imaginary data points
##PAGE= N=2
##DATA TABLE= (X++(I..I)), XYDATA
16383 -1305631 -1396998 -1433481 -1298198 -1198388 -1143836 -1138399 -1129846 -1158555 -1049203 -1008115 -968864
16372 -968864 -985851 -1028954 -975275 -911892 -853083 -834202 -834108 -843084 -845047 -874024 -878695 -851498 -877922
16359 -877922 -897189 -784527 -827822 -768593 -720527 -681881 -655987 -687854 -657815 -651426 -668066
16348 -668066 -688748 -651975 -570184 -512066 -516386 -510769 -514287 -443035 -376471 -393758 -295938 -263771
16336 -263771 -261706 -317674 -331583 -327204 -337933 -319974 -210984 -212184 -194038 -231398 -247675 -258217
16324 -258217 -210624 -81177 -119906 -112278 -104883 -141272 -187936 -123933 -90230 72069 102306
16313 102306 116610 101664 24721 -54985 -61975 65678 145938 175742 108199 160821 153858 148971
16301 148971 258430 300489 230121 339744 326304 310205 237384 214443 273092 325468 221920
16290 221920 256432 457986 476473 540945 535616 430578 438263 457253 430046 461183 536463
16279 536463 546365 518654 663823 506566 608890 598555 665244 684143 705924 740262 792510
16268 792510 658818 659778 679344 601388 524889 594813 588268 654926 803318 708430 750479 704549
16256 704549 792624 853187 815872 867953 909206 840660 909037 983250 1052329 960411 843680
16245 843680 930233 1026440 1034732 1134871 1122273 1123934 1031871 1094880 1144658 1094936 1067285 1111071
16233 1111071 1125074 1086142 1193523 1203634 1196441 1151454 1094225 1176805 1158587 1114858 1119852
16222 1119852 1223385 1188909 1318998 1328475 1230649 1233876 1227178 1265092 1350134 1279554 1163678
16211 1163678 1204939 1179640 1244252 1256552 1396149 1370298 1308437 1314173 1391441 1459643 1509501
16200 1509501 1417122 1382205 1452524 1545346 1509379 1394353 1418851 1484779 1463629 1472016 1411535
16189 1411535 1388716 1382749 1420340 1528294 1435691 1495544 1581371 1486742 1464361 1376545 1333039
16178 1333039 1478041 1386547 1440892 1573251 1482613 1537398 1505510 1538527 1509940 1469761 1491856
16167 1491856 1483130 1558902 1510492 1599577 1675978 1650899 1715281 1726964 1747686 1655990 1529868
16156 1529868 1660561 1559534 1512195 1638541 1551824 1461808 1465683 1534550 1617666 1543220 1499161
16145 1499161 1530878 1489499 1484742 1537146 1528278 1586688 1559805 1599056 1528001 1594082 1719447
16134 1719447 1701258 1675707 1736390 1701316 1640444 1703777 1794718 1809293 1733912 1651384 1745804
16123 1745804 1711993 1622897 1676978 1769860 1723041 1729305 1772287 1772636 1633500 1601491 1629850 1645023
16111 1645023 1692292 1671347 1783697 1750824 1604228 1514496 1661733 1796022 1761634 1626049
16101 1626049 1533751 1594620 1706885 1670204 1808765 1769411 1668323 1682713 1661987 1731947 1591334
16090 1591334 1618218 1793199 1780701 1677938 1721370 1736033 1787889 1842644 1711096 1727971 1615183
16079 1615183 1765404 1777199 1784804 1749626 1691716 1591122 1586906 1627838 1708320 1715074 1594838
$$ [...]
##END NTUPLES=NMR SPECTRUM
##END=
