##TITLE=1H_DE-80H_X3
 200.13MHz, d2o
 8 sc
 
 19ns.26.2.2025
##JCAMPDX= 6.0         $$ Bruker NMR JCAMP-DX V2.0
##DATA TYPE= NMR SPECTRUM
##DATA CLASS= NTUPLES
##ORIGIN= UXNMR, Bruker Analytische Messtechnik GmbH
##OWNER= pz
$$ XWIN-NMR		Version 3.5
$$ Wed Mar  4 11:46:52 2026 Russian Standard Time (UT+4h)  Yarkov@DPX200
##.OBSERVE FREQUENCY= 200.1313
##.OBSERVE NUCLEUS= ^1H
##.ACQUISITION MODE= SIMULTANEOUS
##.ACQUISITION SCHEME= undefined
##.AVERAGES= 8
##.DIGITISER RES= 18
##SPECTROMETER/DATA SYSTEM= spect
##.PULSE SEQUENCE= zg30
##.SOLVENT NAME= CDCl3
##.SHIFT REFERENCE= (INTERNAL, CDCl3, 0, 15.3513)
##AUDIT TRAIL= $$ (NUMBER, WHEN, WHO, WHERE, WHAT)
$$ ##TITLE= Audit trail, XWIN-NMR		Version 3.5
$$ ##JCAMPDX= 5.01
$$ ##ORIGIN= Bruker BioSpin GmbH
$$ ##OWNER= Yarkov
$$ C:/Bruker/XWIN-NMR/data/yarkov2/nmr/H-C/1/pdata/1/auditp.txt
$$ ##AUDIT TRAIL=  $$ (NUMBER, WHEN, WHO, WHERE, WHAT)
(   1,<2026-03-04 11:46:08.12 +0400>,<Yarkov>,<DPX200>,
      <created by zg, POWCHK disabled, PULCHK disabled
       configuration hash MD5:
       00 E9 B6 7A A2 85 ED C7 34 08 36 98 17 FE 4E 26
       data hash MD5: 16K
       05 50 B1 2C E3 23 20 C8 4E 13 0F 0B 47 AE 08 D0>)
(   2,<2026-03-04 11:46:14.81 +0400>,<Yarkov>,<DPX200>,
      <Start of raw data processing
       efp BC_mod = 2 LB = 0.25 FT_mod = 6 PKNL = 1 PHC0 = -5299.748 PHC1 = 6.821927 SI = 16K 
       data hash MD5: 16K
       2C 32 B1 36 6C 0B 7A 38 DA C5 1F 9D 38 8F EA E1>)
$$ ##END=
$$ 
$$ hash MD5
$$ BE 5C 32 55 FD CE 4B 2B 0D 29 1B 29 5F CA 25 D7
##$RELAX= 
##$RELAX= 
##$RELAX= 
##$RELAX= 
##$RELAX= 
##$RELAX= 
$$ Bruker specific parameters
$$ --------------------------
##$DU= <C:/Bruker/XWIN-NMR>
##$EXPNO= 1
##$NAME= <H-C>
##$PROCNO= 1
##$TYPE= <nmr>
##$USER= <yarkov2>
##$AMP= (0..31)
100 100 100 100 100 100 100 100 100 100 100 100 100 100 100 100 100 100 
100 100 100 100 100 100 100 100 100 100 100 100 100 100 
##$AQSEQ= 0
##$AQ_mod= 1
##$AUNM= <au_zg>
##$AUTOPOS= <>
##$BF1= 200.13
##$BF2= 200.13
##$BF3= 200.13
##$BF4= 200.13
##$BF5= 200.13
##$BF6= 200.13
##$BF7= 200.13
##$BF8= 200.13
##$BYTORDA= 1
##$CFDGTYP= 0
##$CFRGTYP= 5
##$CHEMSTR= <none>
##$CNST= (0..31)
1 1 145 1 1 1 1 1 1 1 1 1 1 1 1 1 1 1 1 1 1 1 1 1 1 1 1 1 1 1 1 1 
##$CPDPRG= <>
##$CPDPRG1= <>
##$CPDPRG2= <>
##$CPDPRG3= <>
##$CPDPRG4= <mlev>
##$CPDPRG5= <mlev>
##$CPDPRG6= <mlev>
##$CPDPRG7= <mlev>
##$CPDPRG8= <mlev>
##$CPDPRGB= <>
##$CPDPRGT= <>
##$D= (0..31)
0 0.7 0 0 0 0 0 0 0 0 0 0.03 0 0 0 0 0 0 0 0 0 0 0 0 0 0 0 0 0 0 0 0 
##$DATE= 1772610367
##$DBL= (0..7)
120 120 120 120 120 120 120 120 
##$DBP= (0..7)
150 150 150 150 150 150 150 150 
##$DBP07= 0
##$DBPNAM0= <>
##$DBPNAM1= <>
##$DBPNAM2= <>
##$DBPNAM3= <>
##$DBPNAM4= <>
##$DBPNAM5= <>
##$DBPNAM6= <>
##$DBPNAM7= <>
##$DBPOAL= (0..7)
0.5 0.5 0.5 0.5 0.5 0.5 0.5 0.5 
##$DBPOFFS= (0..7)
0 0 0 0 0 0 0 0 
##$DE= 6
##$DECBNUC= <off>
##$DECIM= 32
##$DECNUC= <off>
##$DECSTAT= 4
##$DIGMOD= 1
##$DIGTYP= 9
##$DL= (0..7)
0 120 120 120 120 120 120 120 
##$DP= (0..7)
$$ [...]
##$SUBNAM2= <"">
##$SUBNAM3= <"">
##$SUBNAM4= <"">
##$SUBNAM5= <"">
##$SUBNAM6= <"">
##$SUBNAM7= <"">
##$SUBNAM8= <"">
##$SUBNAM9= <"">
##$SW= 18.0517328524113
##$SWIBOX= (0..15)
0 0 2 0 0 0 0 0 0 0 0 0 0 0 0 0 
##$SW_h= 3612.71676300578
##$TD= 16384
##$TD0= 1
##$TE= 0
##$TE2= 300
##$TE3= 300
##$TEG= 300
##$TL= (0..7)
0 120 120 120 120 120 120 120 
##$TP= (0..7)
150 150 150 150 150 150 150 150 
##$TP07= 0
##$TPNAME0= <>
##$TPNAME1= <>
##$TPNAME2= <>
##$TPNAME3= <>
##$TPNAME4= <>
##$TPNAME5= <>
##$TPNAME6= <>
##$TPNAME7= <>
##$TPOAL= (0..7)
0.5 0.5 0.5 0.5 0.5 0.5 0.5 0.5 
##$TPOFFS= (0..7)
0 0 0 0 0 0 0 0 
##$TUNHIN= 0
##$TUNHOUT= 0
##$TUNXOUT= 0
##$USERA1= <user>
##$USERA2= <user>
##$USERA3= <user>
##$USERA4= <user>
##$USERA5= <user>
##$V9= 5
##$VALIST= <valist>
##$VCLIST= <CCCCCCCCCCCCCCC>
##$VD= 0
##$VDLIST= <DDDDDDDDDDDDDDD>
##$VPLIST= <PPPPPPPPPPPPPPP>
##$VTLIST= <TTTTTTTTTTTTTTT>
##$WBST= 1024
##$WBSW= 4
##$XGAIN= (0..3)
0 0 0 0 
##$XL= 0
##$YL= 0
##$YMAX_a= 733228
##$YMIN_a= -636670
##$ZGOPTNS= <>
##$ZL1= 120
##$ZL2= 120
##$ZL3= 120
##$ZL4= 120
##$ABSF1= 0
##$ABSF2= 0
##$ABSG= 0
##$ABSL= 0
##$ALPHA= 0
##$AQORDER= 0
##$ASSFAC= 0
##$ASSFACI= 0
##$ASSFACX= 0
##$ASSWID= 0
##$AUNMP= <proc_1d>
##$AZFE= 0.1
##$AZFW= 0.1
##$BCFW= 0
##$BC_mod= 2
##$BYTORDP= 0
##$COROFFS= 0
##$CY= -3
##$DATMOD= 1
##$DC= 0
##$DFILT= <>
##$DTYPP= 0
##$F1P= 0
##$F2P= 0
##$FCOR= 1
##$FTSIZE= 16384
##$FT_mod= 6
##$GAMMA= 0
##$GB= 0
##$INTBC= 1
##$INTSCL= 3.241238e-09
##$ISEN= 128
##$LB= 0.25
##$LEV0= 0
##$LPBIN= 0
##$MAXI= 10000
##$MC2= 0
##$MEAN= 0
##$ME_mod= 0
##$MI= 1.114404
##$NCOEF= 0
##$NC_proc= -6
##$NLEV= 6
##$NOISF1= 3.799351
##$NOISF2= 2.8
##$NSP= 0
##$NTH_PI= 0
##$NZP= 0
##$OFFSET= 15.35134
##$PC= 1
##$PHC0= -5299.748
##$PHC1= 6.821927
##$PH_mod= 1
##$PKNL= yes
##$PPARMOD= 0
##$PSCAL= 0
##$PSIGN= 0
##$REVERSE= no
##$SF= 200.130034093644
##$SI= 16384
##$SIGF1= 3
##$SIGF2= 2
##$SINO= 0.751879
##$SIOLD= 32768
##$SREGLST= <19F.Aceton>
##$SSB= 0
##$STSI= 16384
##$STSR= 0
##$SW_p= 3612.71676300578
##$SYMM= 0
##$S_DEV= 0
##$TDeff= 16384
##$TDoff= 0
##$TI= <>
##$TILT= no
##$TM1= 0
##$TM2= 0
##$TOPLEV= 0
##$USERP1= <user>
##$USERP2= <user>
##$USERP3= <user>
##$USERP4= <user>
##$USERP5= <user>
##$WDW= 1
##$XDIM= 16384
##$YMAX_p= 507838819
##$YMIN_p= -1549021
$$ End of Bruker specific parameters
$$ ---------------------------------
##NTUPLES= NMR SPECTRUM
##VAR_NAME=  FREQUENCY,     SPECTRUM/REAL,   SPECTRUM/IMAG
##SYMBOL=    X,             R,               I
##VAR_TYPE=  INDEPENDENT,   DEPENDENT,       DEPENDENT
##VAR_FORM=  AFFN,          ASDF,            ASDF
##VAR_DIM=   16384,         16384,           16384
##UNITS=     HZ,            ARBITRARY UNITS, ARBITRARY UNITS
##FACTOR=    0.220516191357247, 1,           1
##FIRST=     3072.26425639819, 0,            0
##LAST=      -540.452506607588, 0,           0
##MIN=       -540.452506607588, -1549021,    0
##MAX=       3072.26425639819, 507838819,    0
$$ Real data points
##PAGE= N=1
##DATA TABLE= (X++(R..R)), XYDATA
$$ [...]
9872 -406623 -367935 -352541 -447838 -399465 -350050 -384249 -398341 -419234 -358965 -339221 -379754 -359534
9860 -359534 -344553 -360670 -349069 -332924 -353071 -357216 -413322 -406437 -318724 -396556 -415972 -330563
9848 -330563 -315102 -292661 -285878 -245044 -291996 -256029 -295565 -369946 -444587 -412572 -338291 -390359
9836 -390359 -365654 -315221 -310391 -333888 -263926 -273136 -306430 -386216 -397994 -332477 -381397 -352667
9824 -352667 -336767 -300905 -286576 -323818 -322203 -309039 -297238 -315365 -347106 -348427 -283450 -321409
9812 -321409 -297013 -259411 -283901 -174501 -223684 -302593 -346909 -319248 -308019 -335696 -355021
9801 -355021 -307980 -317841 -365593 -357735 -354788 -300063 -281779 -286936 -282831 -272922 -327622 -336101 -381114
9788 -381114 -345191 -342320 -298744 -277412 -292416 -325162 -351216 -260244 -259830 -334733 -361713 -256860
9776 -256860 -226055 -322180 -321738 -296146 -295635 -345750 -277422 -297364 -340325 -342738 -284632 -246170 -231507
9763 -231507 -244773 -247869 -257179 -219513 -218239 -316937 -322432 -323648 -289031 -325658 -268761 -295200 -299444
9750 -299444 -263113 -313076 -311521 -276000 -275594 -277013 -303427 -337741 -276278 -287383 -292163 -189473
9738 -189473 -198538 -238476 -260765 -291510 -242615 -215498 -258913 -306856 -307661 -287821 -266185 -221000
9726 -221000 -250369 -269653 -260199 -287489 -360481 -302445 -262406 -231869 -291369 -324356 -260013 -247542
9714 -247542 -300532 -302100 -256932 -309463 -327551 -274897 -181441 -222805 -256205 -229229 -208975 -250657
9702 -250657 -281307 -260368 -190399 -185019 -146534 -159640 -218724 -185254 -229691 -229518 -198866 -218022
9690 -218022 -240087 -219816 -186215 -222139 -238325 -216920 -153715 -144739 -177211 -115298 -129348 -137381
9678 -137381 -158260 -154085 -135916 -201309 -206508 -214003 -234195 -299792 -246060 -172560 -144395 -190570
9666 -190570 -189504 -166616 -210762 -221285 -182207 -170875 -139862 -167104 -177544 -131591 -189954 -160915
9654 -160915 -154735 -167425 -185464 -201798 -222681 -263686 -273308 -192552 -181602 -221322 -206255 -235109
9642 -235109 -206046 -183699 -187796 -238253 -191928 -92649 -127129 -145374 -174794 -171534 -198662 -152282
9630 -152282 -166182 -214533 -265278 -215187 -208769 -186470 -160277 -163774 -115243 -112827 -93706 -63846
9618 -63846 -110551 -30936 256 -43121 -114704 -145149 -104121 -142869 -102044 -119384 -148733 -119350
9606 -119350 -146341 -131606 -101642 -127151 -120379 -90538 -67791 -69254 -98981 -119289 -102432 -38916
9594 -38916 -25668 -107179 -86365 -74937 -74610 -58338 -108061 -114877 -41693 -35784 -12712 -14263 24288
9581 24288 -21008 -56572 -5764 25051 -36450 -10907 -17694 -33707 -124717 -133916 -129982 -167182
9569 -167182 -92674 -85474 -28478 74457 34028 -16164 -29963 -9823 -13081 46365 67565 85051
9557 85051 162419 198642 189800 102617 63038 108602 180732 154343 168460 84616 93658 154235
9545 154235 111377 38573 75767 105412 103785 68303 124583 105483 104176 120983 139784 167753
9533 167753 98216 134436 111834 84749 89741 129110 149057 174512 177828 166773 246510 182436
9521 182436 124774 160393 163593 178457 249156 243994 176387 198342 302847 301207 224689 209406
9509 209406 200261 166262 244300 291831 252987 263227 312706 317789 232369 266233 282656 233899
9497 233899 212567 271567 278018 195189 278847 315676 318112 304432 299766 278967 316272 395655
9485 395655 365494 384337 403271 412754 406167 433086 406536 453960 486465 498858 455946 511020
9473 511020 498703 491531 503203 543518 543160 547834 560893 572971 568874 577156 574219 628066 610357
9460 610357 688095 726593 735796 717328 792148 799139 770941 827388 798627 865621 900643 905627
9448 905627 935464 897653 864733 995029 988437 1049233 1111577 1189816 1143882 1129494 1154131 1215914
9436 1215914 1189435 1183105 1155937 1254515 1265943 1284003 1242980 1313806 1408691 1447072 1518174 1549180
9424 1549180 1602614 1615598 1638128 1726865 1657207 1640907 1721753 1782704 1820685 1866395 1899857
9413 1899857 1993557 2077926 2143590 2094795 2104616 2233127 2300453 2356163 2378157 2485948 2488157
9402 2488157 2581311 2757755 2845011 3017463 3124299 3184085 3310422 3392336 3452605 3496285 3605833
9391 3605833 3673534 3742855 3872558 4014239 4148243 4251741 4335616 4512097 4678179 4805990
9381 4805990 4922629 5096461 5315372 5531374 5780372 5974823 6162832 6358236 6617532 6859986
9371 6859986 7119587 7446096 7673095 8004498 8349189 8753851 9060670 9514672 9944307 10355058
9361 10355058 10821256 11292029 11769530 12310871 12923351 13549413 14099690 14754117 15325743
9352 15325743 15897395 16570794 17222855 17819014 18418530 19049786 19703752 20234140 20625460
9343 20625460 21100425 21520903 21850444 22102767 22191494 22234495 22208378 22055027 21829038 21494380
9333 21494380 21083009 20664124 20235397 19630845 18993132 18434482 17825324 17178356 16608399
9324 16608399 15952269 15316961 14740195 14128356 13509738 13006269 12367037 11868217 11412369
9315 11412369 10913447 10529419 10105118 9686576 9322936 8996778 8714707 8420330 8112390
9306 8112390 7934096 7786909 7568248 7372910 7170308 6899711 6628160 6358966 6082923 5843897
9296 5843897 5600190 5462188 5351233 5167985 4986958 4789983 4708959 4633650 4598311 4549928
9286 4549928 4548235 4524404 4470852 4353709 4252462 4068533 3896853 3727079 3575515 3476044
9276 3476044 3385499 3309523 3222605 3210747 3109516 3089164 3130070 3084499 2982236 3023108 3066780
9265 3066780 3177352 3267833 3269359 3223895 3160347 3086659 2896997 2851754 2928166 2995100 2970419
9254 2970419 2987949 2961404 2803636 2668308 2627080 2587705 2669123 2777269 2931963 3023015 3048571
9243 3048571 3093042 2954559 2815271 2661035 2485415 2304446 2161326 2025461 1991206 1987561
9233 1987561 2019922 2042197 2072109 1994892 1927660 1927569 1835466 1804356 1831367 1720005 1696998 1704928
9221 1704928 1841872 1786530 1772873 1880142 1899166 1988178 2047744 2058945 2054628 2120240 2150290
9210 2150290 2110420 2045354 1898973 1945301 2047399 1967980 1875868 1938996 2053094 2117010 2079118
9199 2079118 2069767 1974180 1851922 1782337 1757520 1746895 1666766 1640617 1653764 1681975 1717287
9188 1717287 1787309 1752417 1718287 1671567 1696494 1705466 1678477 1710120 1754079 1718491 1750736 1850055
9176 1850055 1889215 1961502 2046705 2151802 2349875 2543412 2695700 2808069 2802851 2658570
9166 2658570 2528879 2257147 2170132 2045659 1836012 1820671 1801353 1730030 1712603 1769411 1804193
9155 1804193 1929487 1976545 2069371 2278228 2520341 2787331 2860485 2845313 2774106 2625020
9145 2625020 2488974 2375598 2234335 2095401 2064563 2041064 2047889 2192720 2390715 2593652
9135 2593652 2836164 3141170 3398289 3508164 3498188 3450688 3308967 3035599 2804492 2586305
9125 2586305 2407633 2425060 2306599 2247852 2236757 2285595 2275745 2239012 2386366 2536486 2670922
9114 2670922 2943250 3246512 3423743 3488624 3449724 3343631 3127452 2935530 2741009 2587446
9104 2587446 2468526 2335556 2268696 2238266 2261512 2258343 2241667 2309003 2342628 2327169 2367833
9093 2367833 2298479 2268507 2175452 2131997 2115245 2029870 1994451 1914175 1918502 1956793 1943132 1873433
9081 1873433 1968110 2028810 1992934 2144868 2233014 2283645 2393970 2375477 2385542 2458530 2429722
9070 2429722 2400304 2407589 2414544 2361299 2328847 2368679 2377676 2423544 2536877 2611230 2637031 2605890
9058 2605890 2652508 2686805 2669889 2671843 2655571 2661120 2686546 2655395 2675886 2695749 2666450 2655879
9046 2655879 2624724 2702990 2629418 2681943 2743425 2712106 2759500 2761242 2847036 2922704 2944429 3036853
9034 3036853 3186196 3230523 3285550 3414127 3493000 3577894 3654213 3677674 3660338 3774259 3828258
9023 3828258 3846058 3899134 4114721 4196888 4317421 4410043 4388349 4332272 4296949 4272967 4150462
9012 4150462 4199363 4206114 4206461 4331704 4431966 4504050 4635994 4684906 4730078 4766055 4859003
9001 4859003 4949752 5039298 5151127 5177096 5253310 5244190 5340468 5505118 5704986 5804010 6008049
8990 6008049 6202677 6361224 6556213 6689997 6807695 6974521 7134661 7312735 7521944 7807083
8980 7807083 8083158 8307081 8538408 8704490 8815407 8905842 9035480 9246353 9411744 9675229
8970 9675229 10041090 10424977 10858391 11275483 11761806 12398955 12972289 13577286 14220226 15020646
8960 15020646 15888392 16803601 17797257 18772109 19820300 21019040 22348307 23899981 25855943
8951 25855943 28439052 32024028 37216292 44857778 55971351 71148722 88907845 104970841
8943 104970841 113730181 114314094 106410435 92212235 77567990 65705900 57198515 51213769
8935 51213769 47276417 44735848 43636699 44044644 45954227 49649396 56211137 66836037
8927 66836037 82850281 104232905 128084197 145938339 148875325 139927692 123424116
8920 123424116 104464037 88098807 75533912 66718061 60661962 56560303 54097191 53145088
8912 53145088 53510023 55513996 59529029 66300760 76769326 92260636 113064847 137517813
8904 137517813 159903981 173218269 175885644 166303481 148062955 130225257 117699033
8897 117699033 112110284 113042441 120664413 134095450 150555284 163837913 170498827 170733287
8889 170733287 165939290 162534804 167013407 181447929 203727781 226564856 244427342
8882 244427342 255446634 254289707 238919442 214798282 186502305 156646971 129831709
8875 129831709 108380240 92738660 81808284 74568408 70334720 68394024 67880752 68000444
8867 68000444 68410897 68274370 67116969 65475198 63757986 62253686 61623444 62221155 64114848
8858 64114848 67038366 70437815 74050590 78054587 82196334 87838136 96550177 108991186
8850 108991186 124108039 137930170 144673675 143205195 133341369 118178645 104076122
8843 104076122 94641610 91354454 94342924 103695696 118328014 134709846 145633859 146703048
8835 146703048 138862569 123603422 106442640 92414084 83247792 78620354 76666118 74957476
8827 74957476 73079595 71054189 68071126 65050524 62634875 60031302 56718992 53371163
8819 53371163 50083987 47173160 45309394 44972220 46161363 48509677 51406143 54602520
8811 54602520 57755085 60254041 61887207 60889536 57055244 51763879 45269653 39021527
8803 39021527 34120813 30559202 27899178 25939171 24531924 23727938 23314445 23435585 24196709
8794 24196709 25640865 28147166 32078899 37381248 43432463 47926570 48990985 47403661
8786 47403661 42895794 36687189 31369277 27410350 24658710 22636980 21170314 20087413
8778 20087413 19304652 18910345 18892476 19252500 20220249 22161397 25504482 30384131 36369061
8769 36369061 41559938 43298837 42033143 38225253 32619999 27160928 22900156 19868771
8761 19868771 17584714 15885660 14630092 13626357 12836393 12165961 11636774 11324840 11172444
8752 11172444 11167646 11300782 11353123 11303703 11114182 10843608 10630973 10366809 10204597 10061684
8742 10061684 10057985 10149468 10208789 10277651 10393828 10333646 10103975 9904865 9746134 9650193 9665428
8731 9665428 9767169 9761381 9933537 10215773 10379711 10555359 10695734 10864574 11057343 11266009
8721 11266009 11439096 11728773 11978334 12211126 12584009 13210541 13876129 14673968 15681565
8712 15681565 16711185 17861300 19185013 20529456 21995025 23985760 26877352 31169114
8704 31169114 37714759 47134007 59762018 74045434 85787524 88995239 82302867 70974592
8696 70974592 60250677 52584061 48320284 47282187 49754856 56024320 65397694 75348971
8688 75348971 81540531 79243225 69663459 58138021 48229128 40931087 35680008 31917172
8680 31917172 29266843 27545482 26278605 25438161 24840228 24584357 24823126 25367818 26275090
8671 26275090 27592967 29144523 31005890 33195460 35818663 39211345 43919251 50968736
8663 50968736 61302022 75593022 93225432 111744094 126290926 134028879 133880067 124396821
8655 124396821 109554448 95572231 86163427 82849182 85711645 94114211 106754321 120087621
8647 120087621 129629223 133585298 129985756 117941280 100760599 83113898 68509603
8640 68509603 57683045 50040925 44862723 41724244 40351877 40457184 41526207 42400541
8632 42400541 41627918 38923669 35735390 33095401 31385578 30375186 29872483 29942958 30720125
8623 30720125 32485340 35699640 40886278 48554891 58274281 67767673 72973537 70513603
8615 70513603 62879454 54437198 48057803 44228980 42906815 44446728 49111367 57047855
8607 57047855 67126681 76550680 80921288 78412129 71988620 65018126 58015775 50558275
8599 50558275 43306240 37487241 33931266 32409303 32468527 33563022 34988560 35842149 36007584
8590 36007584 35100908 32339629 28284160 24040398 20612118 18096383 16062449 14517628
8582 14517628 13272895 12292781 11244474 10634848 10374399 10057149 9913091 9769046 9686283
8573 9686283 9579556 9453482 9352246 9263413 9328877 9465880 9864333 10769189 12289498 14375180
8563 14375180 16602489 18293538 18239534 16551084 14342238 12517016 11390090 10847095 10846943
8554 10846943 11488327 12727022 14373719 15887383 16246221 14869022 12699298 10531030
8546 10531030 8760440 7427241 6435272 5714461 5203997 4781147 4522210 4285669 4015564
8537 4015564 3878971 3782786 3712114 3688343 3525187 3411632 3289275 3226286 3159260 3120294 3070843
8526 3070843 3046742 3028201 2952051 2896926 2775896 2692407 2589412 2421527 2398854 2491756 2556322
8515 2556322 2689464 2676368 2607668 2559708 2420206 2188051 2008728 1942460 1873331 1788831 1661472
8504 1661472 1621527 1601838 1509173 1445064 1491966 1514465 1437037 1304142 1273546 1282832 1193455
8493 1193455 1177956 1103655 1108363 1018486 1038441 1120129 1108842 1152943 1179198 1282969 1268167
8482 1268167 1277124 1379334 1370669 1284524 1161054 1069862 1008068 1008546 985883 990653 1059084 1107158
8470 1107158 1141928 1104429 1084180 984286 900141 836927 831760 827817 832523 773463 775623 729238
8458 729238 754334 839159 758590 662121 587339 556064 501692 531481 484445 516699 520031 533546
8446 533546 504482 528471 550076 488313 422114 388206 492261 508381 453094 298842 310484
8435 310484 296275 242602 191047 201841 163944 66131 53485 36147 46125 83183 58654 62789
8423 62789 43811 29045 47549 107926 154574 99861 30411 25056 76647 -5059 -94491 -69344
8411 -69344 -17677 -39226 5865 -78063 -69102 -26629 -45559 -45750 -94601 -106130 -98122 -74048 -106661
8398 -106661 -90658 -37899 -50065 -84711 -155329 -167880 -138612 -140176 -203002 -126400 -222881 -256018
8386 -256018 -228144 -172447 -177475 -201340 -227512 -178094 -131893 -167723 -207619 -217867 -208069 -228105
8374 -228105 -245875 -241618 -177223 -159442 -76639 -95023 -177046 -181076 -283338 -311720 -298591 -238814
8362 -238814 -174073 -247477 -234802 -214023 -254877 -268989 -311241 -303016 -214583 -198047 -127190 -87493
8350 -87493 -128114 -228755 -305964 -262895 -250957 -212940 -190700 -216286 -178217 -170228 -145026 -99071
8338 -99071 -74905 -72894 -61476 -9775 106130 133674 151271 136982 63561 22846 19883 -88446
8326 -88446 -57823 -32808 38058 34298 60414 112987 118307 74987 -22814 -46259 -45913 -50033 -162023
8313 -162023 -124502 -168753 -190528 -94093 -45964 -100961 -121296 -141556 -138228 -125744 -152969 -109222
8301 -109222 -85654 -109888 -151678 -112114 -3577 9666 -9254 181958 304312 385513 427640
8290 427640 465092 402714 420356 417876 294177 300378 271148 207826 222652 312484 364993 378620
8278 378620 363383 367482 366739 234579 108021 66456 42683 -21958 -19144 -62207 -136441 -91551
8266 -91551 -110165 -92706 -9493 -57301 -142354 -161933 -192283 -245856 -259213 -229061 -192080 -157452
8254 -157452 -176675 -130558 -79928 -47631 -23392 44459 53555 83167 26706 -23666 -8836 17781
8242 17781 46138 126513 166078 189114 182486 181541 205321 168445 66124 -48044 -72013 -112656
8230 -112656 -90941 -120312 -133018 -165294 -129860 -126226 -181734 -215377 -126062 -119925 -38579 -118355
8218 -118355 -256072 -233189 -332412 -281603 -254206 -265298 -241913 -168161 -223745 -217353 -229408 -246717
8206 -246717 -317710 -355806 -328796 -319328 -337713 -356405 -284521 -228175 -254440 -236033 -257420 -258413
8194 -258413 -213202 -154772 164866 11937 -109794 -135389 -202101 -307000 -330268 -265925 -262145
8183 -262145 -201854 -225148 -242367 -295001 -258240 -270367 -303575 -330007 -329952 -300734 -283695 -326602
8171 -326602 -312116 -286902 -319584 -283865 -306542 -333084 -359894 -353531 -270726 -321750 -349243 -378984
8159 -378984 -337546 -327611 -368275 -419273 -390538 -367034 -428767 -410184 -395924 -385685 -382785 -362513
8147 -362513 -369251 -360728 -313325 -281202 -373322 -438482 -341021 -318303 -314115 -314370 -360876 -359080 -355389
8134 -355389 -392734 -370739 -513743 -503053 -472205 -442845 -396204 -385004 -340091 -319883 -389808
8123 -389808 -412854 -379772 -346726 -324689 -331542 -355310 -401357 -381044 -405012 -421540 -367672 -411365
8111 -411365 -431988 -319032 -318295 -332370 -353948 -359939 -411350 -379320 -418803 -432090 -422903 -369493
8099 -369493 -419443 -383835 -308696 -400955 -433276 -426485 -485939 -461841 -387112 -354517 -340278 -367899
8087 -367899 -395813 -420296 -403214 -330299 -393845 -418035 -412768 -378794 -333668 -405310 -444644 -418893
8075 -418893 -402905 -457478 -426846 -384731 -422683 -446983 -411484 -364034 -329746 -372484 -404182 -424858
8063 -424858 -397030 -389571 -456401 -496324 -493127 -391450 -417626 -415827 -377631 -413011 -379589 -422731
8051 -422731 -380818 -425911 -405751 -389091 -381321 -478016 -506879 -468581 -394769 -356005 -415297 -378189
8039 -378189 -349503 -308444 -394271 -396641 -401421 -388167 -370272 -310653 -346467 -378177 -394551 -368844
8027 -368844 -277162 -302304 -389714 -327705 -320067 -353526 -373327 -430942 -402199 -362547 -372821 -413060
8015 -413060 -386053 -401269 -452295 -464698 -461575 -378841 -408561 -381560 -393434 -378498 -332362 -329233
8003 -329233 -296914 -354179 -371845 -407310 -397071 -398372 -390919 -340393 -435382 -467671 -435251 -380182
7991 -380182 -338458 -365982 -365838 -482490 -503436 -448078 -392751 -386276 -379061 -419648 -393210 -406068
7979 -406068 -400606 -415869 -423381 -452805 -436279 -478189 -501931 -489946 -465931 -389317 -403679 -458264
7967 -458264 -439608 -423656 -409144 -399159 -382463 -408568 -420196 -418037 -447483 -381163 -383389 -394661
7955 -394661 -365657 -382168 -438378 -415520 -446008 -474392 -398889 -416457 -398727 -434209 -438860 -409133
7943 -409133 -329362 -304774 -371543 -382936 -448382 -503818 -507248 -445590 -438759 -357691 -387610 -342090
7931 -342090 -332082 -386716 -389103 -366788 -392441 -365825 -372920 -460747 -390637 -327519 -384827 -386611
7919 -386611 -406904 -388432 -401027 -393818 -369916 -360196 -348834 -332380 -324038 -341026 -331766 -294108
7907 -294108 -287542 -377539 -383138 -350351 -297551 -336748 -385013 -406664 -330379 -348109 -434005 -366316
7895 -366316 -350571 -312558 -261305 -213294 -303332 -352140 -267067 -277419 -282690 -281599 -357131 -335928
7883 -335928 -260104 -327298 -365188 -369707 -323115 -372624 -368578 -380619 -430472 -457770 -446580 -396956
7871 -396956 -396962 -408267 -333482 -308214 -378461 -352413 -378147 -333495 -321071 -359535 -379439 -400784
7859 -400784 -463340 -434720 -401742 -375000 -322570 -304608 -329882 -357780 -309783 -272832 -304532 -358626
7847 -358626 -359097 -272249 -295143 -266923 -315790 -312104 -289189 -336012 -338139 -354555 -284661 -291694 -319872
7834 -319872 -334017 -331232 -338860 -310733 -318786 -324169 -366762 -309672 -297786 -251652 -286979 -306449
7822 -306449 -261711 -251879 -309896 -359874 -336929 -304076 -314024 -304050 -269490 -258022 -320052 -361908
7810 -361908 -287460 -204036 -254429 -251283 -216852 -147488 -313428 -480978 -326997 -341046 -337988
7799 -337988 -315046 -303933 -261054 -269607 -287376 -259537 -301014 -390803 -431197 -387846 -416553 -406453
7787 -406453 -379276 -365556 -368977 -403193 -433238 -360927 -333943 -318675 -336577 -412109 -402723 -325868
7775 -325868 -326550 -365753 -379092 -380489 -336785 -339589 -388349 -386191 -374429 -395883 -361047 -330931 -337686
7762 -337686 -332855 -361595 -343028 -302647 -307666 -317941 -298324 -299079 -290593 -255665 -267335 -317591 -375595
7749 -375595 -385501 -306168 -322761 -301870 -309057 -348647 -340487 -351907 -328899 -346060 -373559 -347898
7737 -347898 -371765 -348415 -335876 -398460 -428261 -400740 -333503 -364423 -374899 -398129 -375883 -328282
7725 -328282 -319272 -340119 -382977 -388932 -349381 -374534 -344264 -389031 -383773 -335047 -264457 -256705
7713 -256705 -250226 -302657 -309893 -253233 -278003 -248167 -255772 -231455 -222233 -200696 -235938 -198814
7701 -198814 -209159 -229691 -291769 -338245 -337181 -298094 -299250 -314829 -282760 -353868 -398101 -317923
7689 -317923 -363663 -410828 -348830 -352905 -295908 -348932 -252092 -236732 -276670 -249430 -324376 -372382
7677 -372382 -291658 -272679 -321552 -370177 -366026 -307594 -359110 -374375 -310208 -317351 -340126 -345397
7665 -345397 -363748 -312309 -292523 -289243 -338245 -358123 -384827 -371945 -323488 -236824 -292210 -279647
7653 -279647 -291092 -355397 -356548 -388049 -377164 -385875 -409402 -428361 -397075 -328511 -284877 -331306
7641 -331306 -388721 -316724 -292980 -338604 -344347 -359170 -311255 -309360 -320943 -294479 -281112 -252762
7629 -252762 -325168 -375308 -266839 -250863 -291780 -237868 -245082 -311714 -307413 -332286 -301038 -260764
7617 -260764 -272820 -352552 -399637 -398936 -392259 -355770 -303090 -335364 -329389 -304766 -325843 -312571
7605 -312571 -285279 -332666 -353545 -351388 -381144 -333252 -321129 -345006 -305637 -348408 -383053 -358444
7593 -358444 -400474 -414067 -374597 -376683 -354531 -392100 -376334 -285614 -288809 -263828 -322928 -309188
7581 -309188 -293849 -369750 -392181 -352771 -328957 -330211 -323880 -338152 -331142 -297711 -312450 -309985
7569 -309985 -310479 -312530 -330117 -338099 -359071 -381758 -332061 -341212 -345956 -380674 -402658 -420291 -419789
7556 -419789 -354155 -333030 -314223 -298045 -308105 -279467 -220855 -221169 -270645 -307882 -355924 -241117
7544 -241117 -179717 -307435 -273353 -300999 -282722 -296694 -293357 -353867 -424516 -335876 -265586 -288447
7532 -288447 -307242 -324796 -329961 -299520 -300898 -312463 -360611 -291384 -333278 -378416 -356417 -370632
7520 -370632 -401395 -407612 -410746 -396074 -446372 -421092 -431568 -399449 -373164 -328695 -334033 -341062
7508 -341062 -330476 -343996 -340398 -316818 -288836 -257298 -253883 -314758 -324366 -258801 -312955 -314282
7496 -314282 -268289 -283224 -294192 -344763 -359076 -399723 -343262 -317612 -359793 -342330 -332590 -360369
7484 -360369 -243541 -294951 -313804 -297090 -263241 -271443 -276853 -281509 -332999 -350110 -322313 -316915
7472 -316915 -282031 -266149 -352710 -428260 -352408 -339771 -339669 -348016 -305182 -292887 -290983 -296189 -346325
7459 -346325 -330552 -295965 -305399 -278554 -282791 -278300 -245433 -242103 -341509 -382922 -373090 -349128 -329829
7446 -329829 -295370 -252795 -304577 -311468 -299911 -336484 -369450 -329488 -274895 -259078 -264296 -257982
7434 -257982 -282534 -271334 -271363 -234928 -153401 -241645 -261407 -295012 -359482 -250674 -301239 -260669
7422 -260669 -230521 -255350 -296210 -351746 -294933 -268272 -302059 -231573 -220869 -332351 -347655
7411 -347655 -364107 -318942 -254236 -285022 -308527 -331023 -282958 -310683 -378994 -361286 -255308
7400 -255308 -251772 -254999 -313046 -283164 -267478 -281189 -212668 -220802 -232204 -186370 -368158 -342201
7388 -342201 -319453 -259002 -321721 -368064 -346323 -383193 -334615 -322544 -387284 -318865 -217662
7377 -217662 -137971 -207395 -303665 -233847 -224073 -261287 -290696 -326942 -308031 -279667 -304028 -290613
7365 -290613 -332160 -342639 -312360 -298295 -322065 -287843 -231188 -206067 -219175 -253843 -302144 -291588
7353 -291588 -290001 -297054 -283554 -244356 -216275 -228444 -234453 -263029 -254579 -212005 -224458 -199293
7341 -199293 -276252 -336656 -328892 -306923 -306290 -313892 -277358 -237328 -287741 -222091 -260301 -248840
7329 -248840 -201623 -222646 -236174 -299966 -301115 -284447 -269213 -308542 -310965 -252574 -294931 -224748
7317 -224748 -176726 -255970 -273330 -308580 -298214 -295423 -322438 -316297 -288150 -230096 -238643 -257096
7305 -257096 -311121 -280960 -233606 -225257 -263140 -260985 -282948 -202954 -264056 -251240 -299209 -248739
7293 -248739 -251072 -278909 -294049 -248073 -212755 -280255 -343422 -374256 -285027 -225352 -215489 -259462
7281 -259462 -169404 -244609 -318726 -237574 -211310 -216927 -190461 -200238 -210663 -241671 -229498 -235388
7269 -235388 -220021 -196819 -152691 -168308 -284704 -294111 -282994 -374946 -374590 -336717 -252748 -180220
7257 -180220 -287648 -358100 -361295 -358807 -362989 -323414 -272478 -242777 -266093 -293326 -260298 -285466
7245 -285466 -280992 -301288 -318761 -263177 -194075 -220971 -244206 -247585 -245258 -227783 -177808 -175099
7233 -175099 -199862 -156083 -227601 -272722 -221706 -213948 -243930 -243662 -181039 -195761 -155774 -107403
7221 -107403 -145812 -136989 -108537 -107588 -155056 -159089 -84873 -119086 -68231 -23130 -61031 -35539
7209 -35539 -1511 -56515 -52856 -17659 85896 179905 152392 133948 81889 48108 92754 29143
7197 29143 -144 -40166 705 1142 -10457 -70961 -42440 -30728 -51815 -40537 -78196 -39693
7185 -39693 -102967 -148507 -61804 -84325 -111163 -44892 -17252 -67960 -104530 -174201 -141793 -163930
7173 -163930 -193741 -163885 -164770 -156956 -146497 -142465 -118160 -184265 -238755 -218157 -199142 -208909 -203815
7160 -203815 -184431 -173499 -176284 -212827 -228421 -184452 -171770 -203143 -213498 -206077 -145008 -180433
7148 -180433 -207411 -158863 -160937 -187605 -178978 -209022 -213997 -231150 -200806 -165304 -139931 -150126
7136 -150126 -154301 -203109 -142717 -152023 -214736 -281387 -226831 -132153 -139041 -78222 -180592 -213431
7124 -213431 -91903 -123780 -76593 -80023 -55232 -81389 -69530 -68445 -98599 -36609 -28945 -72111
7112 -72111 -21998 -47893 -82392 -55705 14970 197 -38969 -38834 -43107 -65942 6264 -27468
7100 -27468 -80231 -23831 -41960 -51947 -61528 -41544 -12772 -19574 -89155 -140935 -98974 -78891
7088 -78891 -87086 -129378 -84924 -64868 -156246 -148000 -110968 -141182 -138691 -184749 -188076 -124976 -135241
7075 -135241 -178830 -171118 -142215 -154961 -119187 -70433 -99062 -191938 -292972 -308868 -155026
7064 -155026 -120673 -151367 -162518 -168952 -136703 -138707 -156386 -222206 -182371 -182690 -182625 -160831 -114463
7051 -114463 -88983 -128915 -147273 -207957 -290083 -303404 -172118 -127627 -154436 -141110 -168650
7040 -168650 -147855 -168090 -241609 -176047 -110135 -160793 -187581 -177235 -206533 -156035 -148426 -246305
7028 -246305 -187644 -119061 -99766 -7633 -29530 -87916 -141636 -160325 -167041 -142799 -190710 -119771
7016 -119771 -110628 -113582 -38774 -110891 -135049 -135226 -106685 -67942 -71938 -54583 -2624 -22531 -97063
7003 -97063 -87297 -150173 -70786 -66218 -81885 -84525 -2762 -55051 -97441 -126734 -112937 -115295 -168330
6990 -168330 -156783 -165497 -217190 -132858 -119486 -151293 -149232 -122505 -107575 -76235 -99774 -152201
6978 -152201 -114839 -122018 -126032 -168613 -99052 -124966 -168448 -148285 -144642 -147936 -121470 -113112 -146197
6965 -146197 -112754 -81582 -87505 -171618 -184992 -145145 -219578 -225958 -211960 -205914 -198222 -85534
6953 -85534 -66611 -186934 -186388 -181921 -209592 -165752 -151731 -161014 -174315 -170314 -214404 -202984 -151028
6940 -151028 -59302 -38499 -118981 -116035 -152458 -150796 -127831 -155271 -176865 -173491 -150112 -199729
6928 -199729 -187531 -119760 -142133 -146696 -142381 -151528 -117751 -106699 -156621 -155417 -91344 -31396
6916 -31396 -116609 -154380 -86496 -101858 -134880 -163805 -79369 -105358 -68361 -119984 -146858 -153823
6904 -153823 -161836 -186086 -149459 -128197 -138977 -121593 -110182 -107090 -165201 -179611 -230261 -204563
6892 -204563 -167122 -194917 -170818 -133371 -47280 -46960 -123686 -90119 -125389 -150852 -101838 -154127
6880 -154127 -163599 -175313 -139021 -136805 -141159 -80126 -145658 -154587 -111221 -131028 -98715 -141333
6868 -141333 -117895 -178091 -162785 -112812 -133762 -174625 -157482 -160154 -162336 -193746 -154995 -190886
6856 -190886 -186058 -182225 -202576 -101623 -76066 -112582 -105692 -26784 -65221 -123517 -110802 -43821
6844 -43821 -34926 -96504 -122560 -164921 -175769 -103200 -82969 -93920 -142542 -141851 -141621 -104340 -94858
6831 -94858 -115253 -162131 -84752 -129316 -84219 -109573 -120543 -175753 -200102 -244809 -235695 -163714
6819 -163714 -135112 -72285 -68051 -72252 -90197 -94413 -83916 -85245 -53978 -27650 -37039 -108771 -125530
6806 -125530 -89154 -86483 -67124 -83557 -111278 -73512 -14844 -55239 -127041 -113918 -137230 -122666
6794 -122666 -122545 -105302 -171132 -168068 -111381 -133191 -164457 -92770 -91245 -83772 -70510 -83595 -57861
6781 -57861 -83199 -98922 -174303 -71171 -34324 -80124 -73068 -34520 -47266 -113417 -114392 -91521
6769 -91521 -102613 -124639 -108234 -73251 -43997 -89739 -98913 -149148 -160446 -68720 -74468 -38443
6757 -38443 -82320 -57962 -23564 -59738 -36452 -37328 -126297 -61764 -113329 -125388 -93336 -115010
6745 -115010 -137927 -105761 -100955 -155206 -65828 -26967 -52871 -98061 -98423 -62350 -28938 -37005
6733 -37005 -8709 -41397 -51487 -27154 -25832 -71328 -48464 -25885 3089 -32610 -10539 22478
6721 22478 8928 -32456 -46671 -58031 -48782 17476 6843 -53174 -67005 5520 -10791 15617
6709 15617 31218 38302 14137 17172 87059 82383 -52 -62703 -33962 24294 89462 36564
6697 36564 -35119 -24691 -2696 -23236 -12843 -17715 -57369 9566 -3352 22226 9645 -16426
6685 -16426 -68756 16916 78756 -10780 -122692 -78653 -33414 -14989 52887 36705 884 18341
6673 18341 -4322 52524 37308 -60144 12574 6786 -40348 -23307 8437 95006 76107 12471
6661 12471 26444 65712 97153 65876 70418 115592 156818 157928 99097 135302 49186 3698
6649 3698 41536 70738 112452 73984 144837 151488 115328 150582 118547 51833 113097 160917
6637 160917 152797 193414 225037 183780 239033 337695 348976 354968 386027 431405 477832 483838
6625 483838 459402 485714 387260 362212 380852 354886 316164 357329 370192 432474 489827 533113
6613 533113 552596 554462 520021 460903 427161 376481 391667 358484 388211 322796 300944 312693
6601 312693 347423 313716 239733 221971 251728 234762 284320 313962 325123 322498 264939 157315
6589 157315 166823 184083 240741 214379 208113 223916 277946 252041 265443 340086 327659 333519
6577 333519 347991 366184 345248 379780 414576 419198 388583 453290 408541 408705 460966 506415
6565 506415 544189 564588 599461 657290 683844 785871 902961 902658 955552 946405 1063368 1000549
6553 1000549 980397 919664 858463 860235 808476 808039 822164 879700 954658 962291 983129 1058372
6541 1058372 1087482 948208 884148 879006 780078 702689 686774 719261 703966 724448 695927
6530 695927 703181 597876 619358 640776 620834 576200 606017 584793 588438 543814 487880 484193
6518 484193 540879 579204 580409 598244 602383 580357 546605 545297 635604 622720 614473 626357
6506 626357 552465 520754 503516 592153 587565 608193 595093 660953 692763 708977 666358 620775
6494 620775 598984 683267 680292 677932 641629 614869 675148 662971 707911 725783 696979 710125
6482 710125 747979 775829 792310 782621 770386 755847 779781 727691 754518 774892 742143 751960
6470 751960 744576 731493 728336 777242 853989 809999 856813 774510 774898 831410 857782 887449
6458 887449 873845 816950 847688 764479 800511 800973 841623 890177 873637 928720 919856 921759
6446 921759 916422 910086 903921 903481 984998 1052585 1061584 1059421 1095172 1178587 1109747 1191856 1229751
6433 1229751 1160159 1087843 1123982 1140172 1158781 1209324 1205550 1272070 1295377 1351945 1360556 1312961
6421 1312961 1277253 1334168 1325812 1394614 1446677 1428997 1480130 1506557 1476141 1509850 1538728 1553504
6409 1553504 1619002 1526317 1555635 1590041 1619007 1606686 1644692 1681529 1702722 1711150 1787210 1801252
6397 1801252 1830052 1871016 1925958 1958968 2044730 2110701 2148981 2186926 2190014 2259963 2329674 2415342
6385 2415342 2478612 2600848 2734677 2867204 3010275 3174918 3348231 3447474 3484526 3509815
6375 3509815 3490320 3412940 3436722 3445357 3377575 3438164 3576060 3676568 3749903 3792698 3914299
6364 3914299 3990821 4152463 4228541 4252912 4409323 4566979 4713082 4986093 5272573 5468606
6354 5468606 5569697 5665044 5723387 5792759 5887113 5970760 6112478 6282338 6599383 6881502
6344 6881502 7131386 7393404 7698253 8077135 8512660 9070346 9580235 10151146 10862514 11689713
6334 11689713 12617385 13706982 14867593 16132423 17659701 19446030 21580019 24137853
6326 24137853 27535999 32171126 38591111 47601112 59496748 72887506 84985471 92230030
6318 92230030 92026965 85268021 75051687 64922179 57090145 51912628 49354036 49477669
6310 49477669 52567293 58972743 68782638 80591813 91114868 96182385 93565027 83980022
6302 83980022 71031025 58355179 47993428 40023361 33937670 29271180 25718183 22823042
6294 22823042 20503620 18691300 17218365 16188788 15350011 14811389 14410094 14058938 13871220
6285 13871220 13794661 13690214 13558691 13484180 13355941 13227274 13125091 12979664 13020117 13112753
6275 13112753 13218205 13464439 13788587 14038774 14344231 14880197 15477061 16107919 16947096
6266 16947096 18000850 19126946 20443219 21934379 23601752 25393910 27480535 29866757
6258 29866757 32592445 35915341 40016788 45232634 52425556 62535634 76913534 96112796
6250 96112796 119011565 141694366 157805634 162116338 153942738 137640680 119396245
6243 119396245 103793742 92689352 86229235 84177186 87069212 95509837 109554184 127800422
6235 127800422 145894735 157509509 157622830 145690689 126129313 104718962 85800907
6228 85800907 70656109 58892333 49633294 42274482 36359669 31552785 27711324 24613151
6220 24613151 22134771 20252020 18721839 17517790 16477418 15518867 14726550 13976949 13232449
6211 13232449 12568132 11960481 11397794 10863245 10314612 9938877 9587921 9229103 8868746
6202 8868746 8417575 8050728 7690492 7369947 7200507 7008440 6794578 6674722 6534073 6454799
6192 6454799 6262107 6108714 5994008 5884885 5741460 5576123 5465659 5342978 5268307 5208694
6182 5208694 5155999 5131143 5096954 5032383 4973005 4841616 4655209 4544057 4375938 4288143 4190926
6171 4190926 4138893 4134231 4114095 4096198 4056302 4073322 4008189 4007945 4070802 4073646 4034924 4012143
6159 4012143 4009829 3982452 3979899 3990963 3900016 3860662 3864778 3909245 3930593 3950556 3997201 3987081
6147 3987081 3971970 3967559 4014594 4051748 4072443 4092417 4120446 4147884 4089871 4111321 4138816 4180148
6135 4180148 4213017 4270595 4203107 4198938 4244414 4300964 4244952 4287001 4344417 4431331 4540336
6124 4540336 4554911 4609848 4673056 4748044 4890379 4894569 5041602 5112867 5141892 5316340 5496804
6113 5496804 5704608 5857223 6008448 6229487 6413272 6598662 6826238 7055371 7263289 7444943
6103 7444943 7652031 7724299 7927222 8085594 8237228 8451917 8767369 9122884 9467730 9843170
6093 9843170 10233486 10702894 11167232 11778043 12516954 13306714 14271559 15360939 16671508
6084 16671508 18111727 19754615 21523572 23406860 25507856 27876114 30698689 34114935
6076 34114935 38357105 44116388 51970581 63076912 78775967 99027031 121707631 141441601
6068 141441601 151419934 147493557 131996968 111809217 92949081 77944793 66697934
6061 66697934 58508941 52616662 48548531 45908794 44389630 43975743 44725072 46688617
6053 46688617 49977818 55252885 63634890 76225799 94049495 116364021 139521818 156538944
6045 156538944 160368693 149322691 128588070 105698926 85813489 70167658 58137809
6038 58137809 48889605 41705140 36036687 31372100 27652863 24750737 22508917 20808487
6030 20808487 19568697 18703764 17991401 17485497 17132785 16763929 16382315 16024301 15656748
6021 15656748 15428645 15265532 15093948 15008321 15119872 15352170 15599373 15955624 16312061 16666177
6011 16666177 17256515 17993355 18835399 19846940 21075217 22624863 24584018 27104969 30603385
6002 30603385 35877744 43679683 54507123 67748691 81009882 89895451 90630364 83276499
5994 83276499 71496476 59601298 50007071 42663906 37212339 33423716 30703392 28816016
5986 28816016 27563562 26961603 27084625 27809293 29214695 31628543 35560077 41679236 50744359
5977 50744359 63039417 77137376 89326239 94879687 91161241 80154666 66514974
5970 66514974 53997446 43891449 36079685 30157389 25586833 21923231 18949274 16536222
5962 16536222 14608823 13117704 12081537 11265173 10641327 10070986 9629875 9289128 8926859
5953 8926859 8544936 8187775 7836261 7410223 7172698 6942007 6707346 6475920 6213933 6015125
5943 6015125 5817665 5642259 5491331 5373491 5145216 5033782 4930134 4895487 4788919 4578703
5933 4578703 4405779 4261016 4133608 4026109 3868887 3752149 3742952 3707383 3581854 3610978
5923 3610978 3721258 3667370 3636493 3597205 3389561 3185071 3040315 2889531 2748555 2548306
5913 2548306 2470722 2423473 2376569 2344429 2194145 2063387 1980069 1910751 1924059 1919547 1858385
5902 1858385 1809208 1785551 1690677 1709318 1697754 1676941 1666238 1718906 1733019 1688235 1671935
5891 1671935 1744691 1795695 1778922 1751200 1706996 1690731 1643888 1526841 1460938 1497685 1479161
5880 1479161 1382020 1323193 1210524 1153739 1160202 1104494 1031468 1055026 1002876 1011923 934938 876970
5868 876970 843117 861571 902929 883716 863455 907543 912986 900054 897164 803890 769607 838229
5856 838229 840769 840773 880010 792881 714781 737433 756731 732560 754450 699205 766296 783293 752913
5843 752913 723213 742993 668549 669473 661032 586126 627202 649264 696040 703124 691835 725084
5831 725084 614734 624611 659924 635366 644626 663221 722917 746102 763764 705254 630514 557609
5819 557609 613603 554571 472230 404443 447663 454500 497839 518650 445300 415121 403833 432300
5807 432300 437593 491382 456221 415297 405435 444642 444545 449137 434926 416809 410466 372286 320047
5794 320047 293733 352755 391251 371251 372916 307346 262379 249819 289488 337445 407118 369266
5782 369266 370341 400242 446473 422150 320998 302943 241131 235470 325847 330614 321240 283901
5770 283901 299329 292797 258317 319000 385991 354882 440892 430871 444358 493284 603245 750555
5758 750555 816066 878067 857931 896501 878712 859442 772455 691650 643414 651196 655868 562949
5746 562949 469301 466905 479356 518522 518597 546014 569708 599043 608233 744672 855921 888064
5734 888064 882370 835204 903984 864230 812472 768869 708315 680889 559340 560479 538289 481461
5722 481461 455961 447343 419097 433958 395389 407116 419092 401120 346695 357044 333996 311036
5710 311036 382800 415686 365730 331115 322510 316912 345086 427004 416290 380431 381118 310395
5698 310395 452496 494274 470952 411026 480724 547925 543322 554664 668674 685376 680679 782785
5686 782785 894331 928454 972775 959375 952760 993673 964001 978315 917380 909427 981714 965948
5674 965948 907987 943736 921548 888318 948738 993752 1011076 1074071 1055837 1140353 1219379 1235312
5662 1235312 1292099 1386060 1395173 1392664 1367911 1247498 1160678 1110006 1010465 926419 903303 937054
5650 937054 879328 837882 899964 832277 835082 836266 819758 791266 807371 809656 834193 838093
5638 838093 817368 811892 781521 674672 609466 608788 560212 536376 495876 470984 459308 547293
5626 547293 575697 517403 538416 543850 525650 489979 536462 558648 519456 463574 377896 402826
5614 402826 415375 408338 370752 359346 379042 394107 377040 369764 379502 420065 400178 400101 484438
5601 484438 450118 402458 389877 428656 457758 472063 421656 430451 460484 443230 513278 504893
5589 504893 453034 445656 396237 346300 404785 436382 399884 404882 374927 495569 529759 503023
5577 503023 557683 547261 489788 512521 495722 483189 501841 461667 452247 444488 466478 444346
5565 444346 490294 544923 563241 560665 615640 645771 535101 524277 618590 604389 540103 580968
5553 580968 616561 630468 700575 679431 566411 631654 625123 633047 636411 585093 556096 590537
5541 590537 602783 639141 630036 599428 651470 645486 642144 612429 646040 681026 693795 654080
5529 654080 658037 624504 622976 643235 690200 689470 726032 738999 680023 644497 723154 733505
5517 733505 766237 702848 674591 698723 693552 748485 673593 742423 779429 756177 770854 713092
5505 713092 739381 761187 758434 784808 812868 775183 783425 794418 796017 835677 817040 791102
5493 791102 780376 796467 812061 793888 789221 816338 826027 888972 889529 875050 929884 902127
5481 902127 881483 790616 824763 880564 832348 872280 830056 830875 831375 849162 835375 851803
5469 851803 833883 767677 826735 860822 920630 971741 965301 930880 903569 960898 961553 932079
5457 932079 931516 922237 915425 971326 963630 907967 986012 1039783 1077918 1100554 1120552 1085111 1053279
5444 1053279 1078878 1126053 1172238 1142264 1239325 1208129 1263003 1243591 1240081 1298214 1224260 1195288
5432 1195288 1275356 1310857 1329598 1303836 1282674 1275604 1346148 1397375 1402880 1383535 1319040 1418517
5420 1418517 1498666 1467111 1505228 1554605 1597746 1637407 1650277 1613469 1644146 1673194 1634588
5409 1634588 1588083 1638259 1723938 1741605 1806783 1745592 1755629 1739578 1773443 1865091 1900852
5398 1900852 1957292 1957352 1909886 1985248 2012532 2083135 2043623 1994273 2089076 2087803 2109441 2170927
5386 2170927 2224226 2283619 2259457 2286060 2319385 2334124 2360643 2343780 2300063 2352855 2473070
5375 2473070 2468584 2485783 2565088 2604033 2583183 2556330 2585601 2599319 2579138 2617572 2685153 2780653
5363 2780653 2858770 2896741 2917635 2948291 3003841 3030341 3053497 3084674 3165317 3166153 3180896 3238358
5351 3238358 3325097 3419753 3452981 3474997 3477440 3610995 3712332 3823250 3934988 3976358 4065883
5340 4065883 4132072 4205142 4315520 4391136 4486315 4607152 4724560 4893935 5022088 5160948
5330 5160948 5309057 5415327 5498299 5561823 5639490 5805316 6034648 6289583 6553016 6701379
5320 6701379 6860430 7056263 7313260 7614817 7905916 8165553 8472737 8896801 9314506 9749461
5310 9749461 10279708 10794199 11316630 11906086 12532433 13253143 14095471 15186284 16356215
5301 16356215 17899691 19919488 22653324 26333998 31204539 36895723 42317262 45462189
5293 45462189 45143951 42619640 40062723 38518830 38305128 39437562 42171965 47042063
5285 47042063 54193497 63594366 73878548 82669267 87881530 89659877 89270657 89039572
5277 89039572 89848074 90284628 89444410 88945237 90822636 94621097 97986172 99950098 102089873
5268 102089873 103636897 104281266 106380398 111095792 116833019 121531672 123927852 123913672
5260 123913672 122703209 119275917 113906025 108612022 104907983 104043139 105055289 104675240
5252 104675240 101986605 98988983 95202299 90370185 86645197 85361259 85699527 85898520
5244 85898520 86208255 87986794 90310117 89562907 84406438 75655201 65223700 55519432
5236 55519432 47931769 42476210 38832094 36884196 36640274 38115127 40814454 43712316
5228 43712316 44974719 42616083 37426648 31942995 27233034 23492016 20569019 18338971
5220 18338971 16448871 14922115 13739663 12812174 11963945 11199268 10576325 10148583 9758697
5211 9758697 9388802 9102866 8832910 8523398 8190800 7933230 7661160 7404098 7203161 7002423
5201 7002423 6863140 6671828 6491598 6313492 6228841 6101669 5865469 5684283 5559374 5490832
5191 5490832 5349779 5188911 5116729 5049555 4879099 4844943 4783554 4657597 4579434 4584714 4527624
5180 4527624 4439341 4409291 4362850 4377531 4268332 4301379 4263155 4156875 4117342 4125507 4136200
5169 4136200 4120708 4068554 4090229 4085972 4044598 4042890 4127222 4124223 4067166 4104172 4120116 4156720
5157 4156720 4264359 4324661 4255567 4310834 4327466 4328123 4235209 4247750 4222462 4161747 4226424 4323109
5145 4323109 4370142 4437474 4473676 4536805 4637590 4653643 4723805 4743819 4818699 4876015 4920241
5134 4920241 4917106 4982901 5067131 5145506 5200269 5252133 5379798 5353414 5349445 5385669 5380639 5331834
5122 5331834 5244454 5081053 4943951 4917742 4821532 4805421 4780749 4771247 4810388 4826298 4860364
5111 4860364 4933942 4997637 5084055 5182266 5202328 5313224 5357593 5467494 5578052 5602400 5610158
5100 5610158 5560346 5502913 5503978 5433327 5372322 5324295 5246588 5232606 5261645 5340900 5385760 5480046
5088 5480046 5493695 5396154 5397728 5365981 5347546 5279710 5232208 5229939 5228648 5287324 5290763 5349463
5076 5349463 5472194 5580998 5628644 5698424 5728523 5645943 5520672 5370129 5169554 5084463
5066 5084463 4997089 4934441 4810287 4692010 4723132 4712999 4644077 4619741 4661648 4765028 4740694
5055 4740694 4723348 4757204 4772444 4856093 4885387 4840480 4828519 4852079 4815794 4814652 4863764 4890927
5043 4890927 4903457 4918464 4844955 4869677 4899475 4959685 4947674 4951567 5013949 5078080 5103617 5172200
5031 5172200 5253988 5322156 5390301 5353062 5413819 5530355 5606531 5666766 5756640 5855484 5939190
5020 5939190 6058293 6190291 6226336 6239416 6323825 6498659 6651152 6767045 6850427 6959657
5010 6959657 6993086 7061038 7004435 6994708 7049515 7154894 7359930 7429743 7477797 7599676 7713876
4999 7713876 7903054 8063341 8246100 8470278 8674031 8760087 8837131 8949121 9047257 9139545
4989 9139545 9138083 9208531 9231239 9359899 9398333 9510486 9617416 9814338 9999089 10245814
4979 10245814 10519770 10784525 11118934 11395995 11584444 11692527 11705943 11717947 11759817 11791828
4969 11791828 11843946 12006695 12146992 12249849 12479060 12718445 13005763 13273208 13482596 13650826
4959 13650826 13795644 13998289 14229762 14478543 14773619 14997427 15244928 15556232 15928592
4950 15928592 16198495 16394950 16649846 16873395 17035385 17275362 17557272 17903035 18239667
4941 18239667 18617119 18939818 19372138 19872284 20408854 20967924 21388932 21752228 22114149
4932 22114149 22488932 22701267 22926966 23198345 23552726 24013773 24619095 25238397 25871579
4923 25871579 26483585 27220459 28040863 28893183 29795152 30860449 32039972 33351510 34817023
4914 34817023 36355274 38056378 39950729 41835834 43726347 45697127 47830084 50129309
4906 50129309 52869088 56439774 61172542 67888993 77568856 91927863 112053651 136965389
4898 136965389 161598353 176100505 171659133 153253383 132938508 117433071 107156614
4891 107156614 100504393 96742503 95504798 96587893 99569493 104859357 113091053 125374643
4883 125374643 143206052 168119965 199645280 234309916 264684844 285134083 298843777
4876 298843777 308583037 307712617 290835951 265984019 244419964 230526745 223069217 219452475
4868 219452475 218215933 218404887 219708029 222124730 226368765 233200612 243676669 259228293
4860 259228293 280631117 305512865 326976639 333811460 321861597 301533801 284168543
4853 284168543 274151619 270898859 273304814 280577727 292315195 308500793 329207618
4846 329207618 354454612 382965094 412065286 437443086 454731376 461261211 456870662
4839 456870662 444097489 426776731 408137145 389810089 372034162 354814471 338325803
4832 338325803 323110424 310237994 300637783 294974426 293738242 296822465 304118791 315379984
4824 315379984 330039926 347130489 365667729 385175949 405931926 428518296 452656354
4817 452656354 476394937 496231248 507838819 507740523 494818830 471582700 442999984
4810 442999984 413730616 386654074 363228912 343970708 328464312 315863077 305652938
4803 305652938 297511756 291426530 287352729 285035694 284111673 284400192 285921562 288173023
4795 288173023 290338466 291845209 292935161 294339523 295629877 295301802 291317278 282750804
4787 282750804 270140377 255328931 240074209 225677857 212780594 201281056 190923681
4780 190923681 181638410 173639995 166898880 160886153 155120515 149228874 143201248 137013955
4772 137013955 130543490 123698457 116983743 110734865 105093006 99901402 95116910 90974756
4764 90974756 87600495 84964343 82775022 80784293 78785013 76716815 74347942 71649761
4756 71649761 68835926 65910287 63045137 60375531 57817021 55586733 53471419 51400841
4748 51400841 49219832 47000611 44696890 42492503 40325473 38404143 36736951 35109042
4740 35109042 33664855 32306203 31103427 29947031 28790110 27794624 26903846 26020574 25213018
4731 25213018 24395001 23642445 22938168 22219193 21607714 20941490 20372936 19765886 19231896
4722 19231896 18799226 18363336 17933080 17465852 17090194 16828659 16483073 16078067 15743923
4713 15743923 15445950 15121306 14857404 14531308 14255967 14035688 13780529 13510770 13300515
4704 13300515 13121421 12952758 12809765 12651485 12448858 12275196 12041273 11818503 11573910
4695 11573910 11429749 11271159 11020230 10939213 10839278 10682697 10566734 10432052 10279697 10202216
4685 10202216 10093737 9882592 9710495 9514229 9320230 9162108 9036302 9022763 8884799 8806675
4675 8806675 8773455 8691122 8647243 8536024 8400387 8291048 8323877 8203000 8145144 8167476 8182246
4664 8182246 8148345 8181658 8199136 8314704 8392450 8383557 8465126 8456453 8471133 8531346 8484987 8507063
4652 8507063 8656191 8722481 8793818 8949200 9101758 9179271 9377615 9649979 9772142 9752744
4642 9752744 9947881 10031448 10206780 10468436 10816039 11246869 11630780 11939376 12252601 12418150
4632 12418150 12518205 12543575 12574126 12729541 13041424 13384825 13795464 14218867 14678258 15190889
4622 15190889 15664845 16164999 16772727 17456812 18297264 19508652 20780109 22182522 23668514
4613 23668514 25382253 27277263 29193978 31353644 33871199 37114621 41550648 47955933
4605 47955933 57036377 70221643 88836011 113037285 139309942 159706243 164851325
4598 164851325 153176866 133290161 114630724 101793993 95157799 94536831 100582979 113839981
4590 113839981 133309296 154727755 170000911 170423905 155990822 136142511 119703243
4583 119703243 110816382 110387208 118038947 132639061 149362464 159835023 156278033 140071366
4575 140071366 119814987 102470435 90693288 84278328 83341718 88302029 99595693 115727999
4567 115727999 131815589 139907869 133750381 115789177 94618059 76369216 62397966
4560 62397966 51740754 43649853 37488573 32726379 28936705 25865896 23505053 21664106
4552 21664106 20192331 19120238 18274566 17559563 16937821 16383085 15816175 15171649 14410735
4543 14410735 13704558 13058713 12507396 11959263 11457328 11026542 10710327 10474437 10313345
4534 10313345 10091009 9805704 9488779 9292973 9034432 8854750 8731756 8612782 8563883 8496243
4524 8496243 8391772 8237983 7992621 7749552 7520395 7355559 7211498 7086408 6878892 6760369
4514 6760369 6675572 6483485 6382186 6270441 6114910 6012259 5815250 5673506 5650695 5635228
4504 5635228 5630972 5541391 5474029 5414177 5447530 5447151 5499278 5552513 5489358 5442351 5254956 5071437
4492 5071437 4929203 4817895 4698349 4537448 4374416 4283379 4258811 4259266 4208260 4128832 4197161
4481 4197161 4338581 4466559 4662974 4836026 4939206 4969613 4925321 4897324 4940677 4901292
4471 4901292 4924779 4960348 5135248 5585522 6054196 6429913 6455548 6062634 5360157 4873511
4461 4873511 4510166 4373020 4306643 4208398 4139029 4084471 4001178 3999684 3872767 3723744 3628898
4450 3628898 3557389 3480767 3407035 3396256 3420364 3456074 3425787 3392616 3336438 3239631 3220377
4439 3220377 3183674 3148689 3160170 3178621 3161419 3197584 3204473 3223444 3176772 3247147 3257358 3304825
4427 3304825 3415450 3483927 3495079 3502157 3522818 3608493 3654796 3667615 3697087 3665774 3634816
4416 3634816 3639112 3715036 3764276 3720227 3752998 3735189 3708445 3704665 3766286 3802991 3782753 3787045
4404 3787045 3757958 3780961 3960321 4140806 4165823 4202134 4247203 4266094 4208751 4226608 4145753
4393 4145753 4170210 4135470 4050589 4020285 4076140 4137413 4124022 4114823 4152723 4187774 4208179 4296085
4381 4296085 4281488 4223519 4241214 4227005 4319290 4363018 4424262 4473622 4444741 4465172 4469087 4438065
4369 4438065 4464690 4455846 4424826 4273024 4262435 4327765 4281729 4256525 4256763 4309542 4398796 4440508
4357 4440508 4457876 4488343 4573882 4625113 4662953 4645899 4654960 4727081 4824202 4886200 4948922 4987094
4345 4987094 5036471 5145931 5265260 5379364 5460210 5415733 5328227 5214460 5198067 5113631 4991731
4334 4991731 4987304 5082179 5157550 5173423 5336111 5415315 5493470 5425138 5320725 5284479 5203875
4323 5203875 5201344 5199971 5299447 5294587 5453568 5533616 5482875 5429390 5403464 5319312 5318377 5332718
4311 5332718 5296416 5234580 5285753 5388966 5409296 5461946 5537716 5524906 5401188 5365880 5322322
4300 5322322 5289256 5292526 5381916 5386766 5397443 5388218 5501466 5520538 5579471 5636134 5722102 5739659
4288 5739659 5832016 5899057 5962521 6016186 6130352 6121287 6212047 6291672 6394245 6576907 6658618
4277 6658618 6749138 6837918 6937281 6993090 7143612 7370368 7420458 7458807 7545140 7686470 7830587
4266 7830587 7907313 8059549 8196818 8310784 8424665 8587352 8759304 8885192 8975881 9174996
4256 9174996 9329349 9412170 9629665 9895160 10063801 10224287 10472391 10733986 10950234 11155017
4246 11155017 11316296 11526528 11806510 11988565 12216888 12572780 12891703 13158508 13515537
4237 13515537 13977566 14430483 14835716 15317572 15836469 16416703 17010231 17748459 18461080
4228 18461080 19317252 20214304 21172774 22278693 23458054 24832995 26311187 27898726 29625501
4219 29625501 31509573 33341529 34984146 36377033 37726810 39000154 40396808 42023456
4211 42023456 43623811 45184483 46568327 47794439 48925893 50114554 51545040 53313238
4203 53313238 55727757 58711415 62210427 65821633 69203876 71915607 73840367 75122694
4195 75122694 76111960 77109291 78410970 80102062 82171655 84264638 86266652 87985554
4187 87985554 89628350 91441622 93606622 96070212 98666350 101152814 103205387 104783671
4179 104783671 106290748 108199519 111031598 115422429 121595922 129338236 137509789 144477819
4171 144477819 148894233 150436540 150214407 149700638 149886188 151052926 153057874 155491007
4163 155491007 157801726 159986123 162093296 164038432 165714998 166919275 167381011 166861229
4155 166861229 165780841 164659621 163632749 163180049 163455883 164679003 167280921 171818209
4147 171818209 178914574 188287692 198912012 209326205 218203487 225121304 230948335 237066358
4139 237066358 244401267 252337526 259251794 264301082 267832758 271091980 274793775 278468134
4131 278468134 280740757 280848295 279477866 277496261 275637831 274388788 274458471 276184171
4123 276184171 278807360 281601062 283915389 285778907 287415021 288820160 290198981 291566510
4115 291566510 293026185 295473765 299702159 306225259 314520467 323263441 330332101 333822907
4107 333822907 333565246 331144416 328673608 327685062 328663476 330496366 331168441 329003785 324344350
4098 324344350 318964843 314348053 310262637 304705314 296386981 285905059 275077248 265201998
4090 265201998 256561365 249005394 242866646 238520348 236079343 235197751 235401991 236064367
4082 236064367 236768305 236596160 234380572 230145873 224595527 218692764 212653255 206443682
4074 206443682 200273217 194510218 189610217 185949366 183788498 182807864 182251587 180455086
4066 180455086 176324306 169746646 161688839 153376095 145669188 139097702 133562948 128722388
4058 128722388 124338575 120404950 116729370 113155624 109618927 105989296 102411391 98976380
4050 98976380 95725146 92757753 89895378 87390623 85204002 83177087 81401187 79974201
4042 79974201 78665203 77073511 75040028 72527898 69417622 66184154 63031395 60078635
4034 60078635 57540798 55349583 53361979 51684508 49982915 48276862 46523956 44749627
4026 44749627 42940628 41239731 39626759 38129273 36858299 35520418 34152219 32669801
4018 32669801 31115179 29598082 27949749 26338768 24853409 23460362 22285203 21290207
4010 21290207 20337134 19430721 18601866 17894521 17279501 16675777 16042471 15415015 14928691
4001 14928691 14563604 14173237 13836590 13552656 13281034 13012255 12773775 12637478 12513166
3992 12513166 12395128 12262400 12173063 12116318 12169599 12171392 12242639 12401260 12655503 12910064
3982 12910064 13225972 13642264 14283902 14974688 15757504 16498118 17094907 17358464 17306059 16931436
3972 16931436 16104794 15169199 13993230 12918658 11908102 10961539 10176204 9422420 8841782
3963 8841782 8360642 7908705 7505407 7221368 6971395 6690106 6483112 6277446 6108731 5915448
3953 5915448 5732287 5644562 5519007 5276765 5190420 5001985 4801780 4729731 4583423 4505033
3943 4505033 4459154 4335752 4154721 4086613 3988652 4001366 3906521 3783830 3738961 3658581 3631474
3932 3631474 3592233 3511852 3501164 3524717 3456664 3378951 3334521 3361257 3415603 3419707 3356953 3358005
3920 3358005 3362707 3346712 3398093 3373828 3334699 3348562 3348661 3383016 3367951 3363406 3372913 3339582 3295752
3907 3295752 3319090 3332301 3280586 3305081 3334789 3294988 3305111 3271548 3246226 3283066 3329620
3896 3329620 3319729 3255961 3296826 3359648 3415226 3435185 3496265 3452483 3408457 3542448 3433034
3885 3433034 3359609 3319689 3303737 3290195 3199709 3100300 3033670 3011334 2985705 2940555 2915569
3874 2915569 2887633 2829010 2721473 2666902 2676093 2589380 2467998 2494146 2570065 2545847 2601340
3863 2601340 2611948 2636216 2629689 2645440 2591851 2536494 2514747 2504881 2461107 2425269 2424560 2348559
3851 2348559 2421465 2522681 2571961 2552699 2533237 2574276 2658584 2667194 2595728 2569485 2530230
3840 2530230 2525723 2595010 2585256 2637070 2649225 2658398 2633206 2608942 2689392 2602712 2528626 2489489
3828 2489489 2475867 2445858 2453924 2397925 2404435 2491128 2472043 2539358 2568905 2570175 2587453 2563938
3816 2563938 2536866 2492559 2450612 2370762 2339780 2242780 2188417 2213712 2198320 2180435 2149988
3805 2149988 2166362 2152951 2161842 2126549 2107661 2066493 2016552 2057453 2070943 2139275 2168179 2310088
3793 2310088 2398095 2434849 2418199 2404098 2368459 2206557 2147891 2191637 2064784 1979403 1955720
3782 1955720 1895950 1911184 1942662 1963587 1957149 1924042 1885474 1986890 2034452 2030514 1981816 1997288
3770 1997288 1970611 1895044 1938031 1940496 1929794 1901079 1886744 1826924 1835458 1830114 1730680 1692635
3758 1692635 1668531 1664057 1691393 1678669 1655393 1616710 1589203 1602570 1543086 1512320 1501717 1546174
3746 1546174 1539450 1515278 1573954 1554834 1595838 1694088 1745384 1831047 1892372 1966900 2004894 2022528
3734 2022528 2067728 2094203 2033648 2017616 1981257 1903467 1854535 1867950 1842996 1859291 1879020
3723 1879020 1897973 1934596 2014246 2131192 2192542 2219620 2244044 2265239 2278751 2234914 2247611
3712 2247611 2266547 2227058 2244568 2166327 2079818 2047089 2013635 2023617 2012544 1957472 2003106 2033791
3700 2033791 2050710 2106581 2128688 2241206 2337911 2390000 2456849 2480469 2487621 2498195 2502443 2495368
3688 2495368 2515878 2600238 2636685 2630356 2699425 2753918 2778964 2832601 2942140 3014513 3139811
3677 3139811 3296674 3333789 3387519 3418098 3527559 3646571 3693549 3764115 3881257 4001898
3667 4001898 4064593 4174348 4324763 4455933 4539429 4643866 4743697 4869140 4950374 5012481
3657 5012481 5075071 5163725 5193052 5188511 5166750 5169330 5318672 5395092 5444906 5567553 5726136
3646 5726136 5961128 6087957 6249421 6490180 6776258 7172208 7531390 7821991 8142504 8328878
3636 8328878 8382672 8621963 8818422 9037600 9276677 9482399 9698178 9979665 10273536 10566301
3626 10566301 10710873 10770140 10844111 10937793 11051170 11152943 11372922 11638775 11923712 12264042
3616 12264042 12689140 13170753 13736741 14353395 14885854 15534087 16206741 16790421 17464360
3607 17464360 18102023 18701150 19234813 19877221 20570931 21489553 22674222 24051126 25765130
3598 25765130 27764686 29915485 32381060 34932314 37471970 39957483 42359604 44530960
3590 44530960 46131229 47022156 47016177 46250267 44767560 42527035 39823677 36982926 34353268
3581 34353268 32015185 30044854 28359619 26925678 25534033 24215060 23031486 21911371
3573 21911371 20802857 19739954 18716663 17737318 16770456 15851806 15108438 14394058 13709749
3564 13709749 13023358 12328986 11677306 11046676 10443358 9892902 9278044 8725360 8264594
3555 8264594 7820980 7435068 7194760 6965657 6698590 6537965 6396318 6281694 6197496 6060387
3545 6060387 5936191 5761838 5645795 5503981 5399868 5202802 4957853 4730656 4487953 4265959
3535 4265959 3965840 3789079 3704872 3516752 3350642 3234291 3135404 3021093 2973674 2877879
3525 2877879 2771407 2662471 2587192 2544425 2436394 2306757 2226390 2191636 2180411 2084516 1939742
3514 1939742 1880195 1848664 1843358 1787420 1780878 1786541 1695427 1708249 1696417 1793468 1793013 1789447 1819060
3501 1819060 1859208 1869737 1901583 1922189 1898740 1799983 1702531 1661648 1459068 1416464 1295312
3490 1295312 1250541 1299888 1260246 1297786 1298192 1328740 1373848 1398119 1428417 1451745 1527156 1527680
3478 1527680 1548904 1555707 1453345 1344923 1286665 1235407 1135637 962311 957804 886159 867416
3467 867416 922634 915834 861126 863640 918762 913965 878356 874654 833294 788959 852942 849090 796480
3454 796480 721365 651985 726952 645236 602495 611346 573175 560664 543338 583992 602822 580621
3442 580621 499464 485933 465190 472968 463315 474202 429404 463948 528970 503209 476217 434340
3430 434340 422498 449879 446751 482021 503069 516071 606960 557038 519652 554195 584675 610846
3418 610846 586096 529829 514493 587659 622215 583058 656725 667895 646689 694496 692369 659605
3406 659605 606064 646097 706067 706507 744587 802840 795052 862895 905725 976687 865304 945627
3394 945627 974729 954898 1054538 1131321 1159728 1172217 1320928 1390539 1448965 1535109 1707116
3383 1707116 1802038 1980855 2162245 2445677 2626319 2834925 3065530 3247131 3401636 3472645
3373 3472645 3430154 3324448 3291065 3126979 3017482 2880136 2800173 2729269 2744689 2854205
3363 2854205 2886878 2896197 2923639 3052211 3207855 3289315 3311945 3378673 3444921 3507316 3598030
3352 3598030 3639724 3705794 3758161 3829124 4019558 4152759 4453047 4845571 5253897 5743190
3342 5743190 6388100 7035506 7563607 7951574 8196402 8180081 7834899 7194828 6595769 6088814
3332 6088814 5565868 5215152 5077307 5001358 4986302 5050838 5284997 5496623 5597060 5635276
3322 5635276 5655647 5671022 5596850 5554715 5476393 5499149 5542663 5452522 5225960 5027146 4897608
3311 4897608 4885389 5049621 5203460 5454482 5688982 6056394 6366475 6647517 6856878 6837445
3301 6837445 6712953 6523863 6370441 6175102 5965553 5805134 5733420 5800517 6010762 6172075
3291 6172075 6408164 6710017 7075084 7373076 7655735 8033662 8411035 8792281 9399800 10068933
3281 10068933 10712897 11280855 11908439 12646023 13294300 13793818 14137821 14207628 13955381 13678827
3271 13678827 13460852 13248876 13135678 13034737 12957874 12911969 12905882 12948009 13063180 13108654
3261 13108654 13263650 13453679 13631307 13831155 14106641 14383246 14712182 15200013 16027974
3252 16027974 17318477 19107903 21560063 24908879 28686401 31972531 32754615 30570027
3244 30570027 27194484 23708003 20731866 18267074 16240799 14650478 13536031 12723086
3236 12723086 11993280 11405902 10856286 10468792 10184359 9993502 9829274 9778285 9734972 9767405
3226 9767405 9929212 9999032 10109678 10293935 10553579 10916861 11398067 11842461 12362989 12707609
3216 12707609 12869006 12566185 11960597 11001299 9981406 9075056 8224384 7481906 6785437
3207 6785437 6218179 5720040 5279449 4940165 4692606 4478555 4203852 3900553 3647724 3422972
3197 3422972 3238516 3044782 2835724 2709491 2606996 2423685 2254401 2048277 1940781 1819037
3187 1819037 1680446 1532621 1397092 1278548 1178132 1170444 1182241 1069101 1001479 980184
3177 980184 891886 817511 746188 741587 657075 617449 566406 597197 531982 447825 430059 452066
3165 452066 389283 352184 303105 267415 268806 318444 316565 203458 185522 167487 130035 134765
3153 134765 76440 49929 -46473 -101470 -91543 -12490 27 2501 33172 -6741 22342 38659
3141 38659 -10434 -117360 -150630 -159131 -136058 -141975 -157794 -118530 -149501 -205438 -188469 -185991
3129 -185991 -172349 -190920 -242894 -288343 -278369 -279627 -241465 -271528 -306639 -312085 -270462 -308980
3117 -308980 -307702 -335263 -401546 -420966 -379710 -310758 -366539 -417030 -417370 -372908 -330724 -356064
3105 -356064 -386453 -435073 -513310 -451416 -375599 -439564 -459646 -434885 -472527 -481869 -491016 -488896
3093 -488896 -493453 -497722 -535504 -557933 -555498 -635657 -641092 -520801 -506714 -552843 -557579 -586972
3081 -586972 -588757 -523314 -535901 -564013 -571082 -561043 -566217 -544508 -480418 -455551 -499265 -556094
3069 -556094 -523467 -528239 -527712 -492387 -377642 -366142 -431228 -455010 -427766 -541315 -510194 -531633
3057 -531633 -441536 -396402 -483635 -475754 -447474 -456562 -436331 -492396 -492659 -441166 -463906 -409007
3045 -409007 -398184 -382286 -355228 -349630 -302751 -324849 -347671 -290586 -256613 -273907 -290993 -224444
3033 -224444 -233509 -212579 -201664 -175213 -155817 -177496 -174571 -170145 -106715 -16201 43647 11544
3021 11544 13563 67629 36442 147963 172798 172195 261594 276595 341052 436000 482605 496078
3009 496078 594354 687996 720037 808421 896570 937657 950395 989178 1056161 1102109 1188882 1253509
2997 1253509 1310647 1336647 1241919 1221661 1198429 1131178 1102623 1102949 1050025 990643 969467 958740
2985 958740 888675 916303 979203 983736 1058000 1131130 1197942 1261334 1394284 1556575 1738279
2974 1738279 1986205 2193843 2326507 2354767 2363118 2413217 2557575 2630907 2774123 2891418
2964 2891418 3020065 3051322 3008267 2943267 2822965 2660376 2564715 2429218 2215861 1971963
2954 1971963 1756204 1616241 1424260 1289629 1169650 1120509 1065961 1046106 1046841 975257 1118387
2943 1118387 1203073 1327371 1393046 1475435 1645601 1856605 2022491 2101100 2205148 2122668
2933 2122668 2063469 2102182 2216635 2291758 2333206 2316871 2292359 2216052 2168119 2067174 1894077
2922 1894077 1676758 1537947 1414925 1256021 1059331 876735 685877 536923 434866 378337
2912 378337 273605 211765 244588 211544 235484 214526 163341 234402 292909 361060 408630
2901 408630 538756 509317 409480 364829 383127 377297 348487 321304 317387 219429 145730 261449
2889 261449 186764 59512 30303 78011 11696 -107872 -178363 -281365 -309590 -312385 -357588
2878 -357588 -423151 -503386 -529230 -532060 -471829 -518147 -569148 -534314 -516278 -506800 -451784 -463376
2866 -463376 -518369 -534169 -559723 -583534 -572528 -584508 -646978 -687331 -668766 -752106 -670071 -673404
2854 -673404 -660943 -624286 -718717 -737570 -745856 -686602 -685999 -702141 -748731 -813016 -767679 -785576
2842 -785576 -749158 -726461 -736232 -701181 -701952 -704803 -711945 -706395 -695034 -741750 -792397 -794512 -734734
2829 -734734 -752073 -853437 -814052 -814515 -822691 -800474 -737199 -710434 -751149 -787871 -729411 -735277
2817 -735277 -733482 -740570 -826688 -894706 -850356 -868033 -849343 -822548 -822355 -902045 -848705 -778634
2805 -778634 -732538 -717532 -746582 -779060 -740867 -735682 -786327 -757267 -799953 -798139 -853925 -837046
2793 -837046 -834380 -783772 -767136 -820229 -832505 -797603 -753557 -763584 -825669 -782943 -801759 -769564
2781 -769564 -818336 -804908 -716121 -760646 -734331 -703542 -759387 -832644 -796079 -814366 -833675 -818429
2769 -818429 -729494 -747564 -718463 -710517 -743232 -788011 -761034 -758827 -775616 -800244 -817480 -870172
2757 -870172 -838300 -782793 -825831 -844487 -810831 -817594 -856616 -793872 -747203 -783861 -784975 -796455
2745 -796455 -838372 -771969 -751352 -786950 -831396 -821094 -788161 -748748 -755701 -763529 -816479 -818389
2733 -818389 -739176 -760312 -785882 -742140 -734739 -755147 -773931 -832382 -825107 -818250 -720476 -651268
2721 -651268 -727982 -685097 -607524 -569026 -605639 -647503 -707950 -726652 -802974 -764292 -754157 -742151
2709 -742151 -754225 -750027 -738643 -737385 -745562 -720276 -748002 -710119 -740134 -757046 -693546 -695681
2697 -695681 -792636 -795217 -750443 -842526 -871219 -770124 -611825 -652567 -665506 -700883 -775993
2686 -775993 -736239 -752385 -772438 -751039 -794067 -785102 -820978 -837976 -814458 -819808 -843762 -845248
2674 -845248 -864088 -840069 -779672 -799562 -767465 -736619 -722217 -803904 -838794 -777685 -771926 -774768
2662 -774768 -687243 -711464 -686431 -645344 -709866 -735665 -716091 -745351 -698924 -722177 -756931 -717855
2650 -717855 -812681 -777572 -793795 -865209 -795397 -725737 -702592 -677805 -718920 -728782 -694004 -735125
2638 -735125 -729776 -716020 -740204 -739841 -741967 -698322 -693486 -722681 -683695 -680825 -661376 -668673 -704020
2625 -704020 -712820 -715896 -719907 -723670 -754780 -785981 -713877 -719028 -694920 -691762 -635600 -656684 -663844
2612 -663844 -702448 -692413 -653127 -760520 -813833 -805700 -709735 -723535 -755726 -739486 -702034 -707990
2600 -707990 -694852 -709079 -683470 -680313 -715947 -707627 -710671 -687821 -706009 -698183 -754090 -751271 -824854
2587 -824854 -736196 -672639 -675807 -700918 -685560 -769986 -748797 -767586 -687946 -688191 -723955 -686712
2575 -686712 -717922 -699525 -664286 -680195 -698174 -738191 -749897 -712147 -709990 -711678 -759714 -749384
2563 -749384 -713597 -668625 -617412 -624852 -642705 -759488 -696713 -662545 -671564 -659020 -653745 -641902
2551 -641902 -589246 -593661 -547131 -522930 -559871 -530984 -582890 -551411 -561787 -592134 -622783 -649938
2539 -649938 -651688 -624559 -573502 -597797 -620124 -642545 -674497 -627139 -654311 -567376 -527704 -547868
2527 -547868 -540196 -544784 -562319 -472588 -469746 -403310 -419337 -503657 -539776 -444354 -373549 -370951
2515 -370951 -359021 -447070 -473099 -399026 -416039 -383458 -453065 -403604 -353347 -349024 -448277 -474003
2503 -474003 -392336 -314462 -297312 -326959 -236748 -195757 -266509 -289830 -232763 -182292 -146682 -117437
2491 -117437 -88946 37250 57944 16741 -9712 39315 126915 155563 76188 52445 121369
2480 121369 214540 258110 303205 401754 493705 568940 668786 817221 1001967 1209184 1404135
2469 1404135 1672724 2185568 2650430 3013030 3133402 3311825 3451966 3682148 4026538 4591788
2459 4591788 5217771 6361035 7974719 10604427 14607825 21050642 28789816 37266279
2451 37266279 38755461 31512220 23717727 17035924 12820943 9797182 7405300 5503548
2443 5503548 4379432 3512931 2867017 2401512 2262827 2204858 2264672 2144790 1857503 1561422
2433 1561422 1377993 1264389 1160137 961755 837485 700754 590749 534189 466276 394973
2423 394973 312481 200438 114355 49354 16793 -6147 -51467 -89835 -79543 -196184 -224010
2412 -224010 -281680 -245149 -210345 -222239 -250140 -221397 -333062 -329027 -322095 -353249 -335379 -253326
2400 -253326 -319930 -305217 -311549 -404932 -432440 -350152 -401578 -447854 -439406 -491629 -533106 -561401
2388 -561401 -509926 -522182 -454968 -513465 -543281 -543780 -538703 -529700 -597152 -577969 -587928 -566763 -493746
2375 -493746 -490927 -536553 -650990 -635235 -556188 -571061 -586130 -559386 -610389 -584044 -541500 -513334
2363 -513334 -593515 -602450 -682398 -680532 -674554 -681166 -716271 -689364 -687852 -707458 -725691 -732342 -709109
2350 -709109 -690805 -673649 -690104 -707835 -670784 -705915 -675106 -640627 -620959 -674664 -647242 -649795
2338 -649795 -700735 -715751 -675578 -731114 -715131 -666055 -630541 -710008 -744201 -734649 -784452 -819216
2326 -819216 -814729 -789679 -787391 -769399 -757511 -752143 -732906 -724890 -666176 -713110 -713237 -669921 -678109
2313 -678109 -735257 -747143 -763860 -781665 -815383 -764893 -729256 -735401 -777695 -742993 -724506 -764786
2301 -764786 -746978 -749980 -755007 -767740 -752062 -723216 -719451 -755432 -780944 -796132 -750541 -742067
2289 -742067 -762617 -778525 -766279 -720216 -711023 -738234 -768316 -799802 -768928 -781769 -793169 -786123
2277 -786123 -754964 -730070 -710269 -732873 -769853 -759501 -769158 -816064 -761774 -734035 -689772 -652161
2265 -652161 -658704 -669083 -654924 -592731 -693765 -744492 -799983 -742374 -709396 -751442 -713348 -733632
2253 -733632 -708420 -708031 -637368 -780412 -771457 -761120 -740602 -772689 -848374 -796346 -740056 -738395
2241 -738395 -685861 -699721 -738061 -687184 -750182 -682172 -659483 -743919 -770636 -773065 -851341 -866532
2229 -866532 -833871 -780397 -697270 -732031 -736464 -698292 -688985 -757609 -762656 -710288 -733386 -775631
2217 -775631 -774269 -760234 -762311 -699611 -695098 -791277 -800479 -752547 -668119 -743303 -740826 -737881 -750436
2204 -750436 -724753 -715233 -780786 -851000 -868303 -876123 -807253 -786984 -760653 -754444 -818830 -725593
2192 -725593 -720709 -731372 -726034 -744404 -761388 -774495 -734023 -729107 -670464 -600711 -593948 -560294
2180 -560294 -625472 -708585 -747535 -712508 -731786 -777807 -687944 -714869 -689368 -689306 -695104 -760767
2168 -760767 -847978 -801362 -746926 -692594 -736162 -845237 -870387 -792790 -780830 -759231 -789761
2157 -789761 -792835 -787899 -710964 -679296 -734577 -756209 -796949 -863355 -878911 -872486 -868287 -803208
2145 -803208 -823242 -832437 -765551 -747637 -740361 -730391 -747920 -666413 -708679 -742424 -786347 -738409
2133 -738409 -741189 -665274 -669740 -725776 -731546 -765891 -825594 -755190 -686580 -740911 -769838 -774413
2121 -774413 -780269 -726305 -759034 -676102 -652253 -683989 -742012 -741715 -721545 -765038 -740160 -727514
2109 -727514 -721305 -720116 -727300 -731074 -750439 -742412 -749686 -769059 -787080 -797176 -772257 -744465 -755591
2096 -755591 -757709 -724071 -759135 -806355 -786341 -779912 -794272 -752871 -779109 -765458 -739360 -708136
2084 -708136 -748234 -815991 -795454 -802835 -765765 -730088 -828212 -776698 -729997 -736225 -693585 -741670
2072 -741670 -812604 -755385 -780898 -828724 -822844 -803175 -773700 -751598 -744649 -726250 -715878 -715792 -775731
2059 -775731 -844783 -838623 -845766 -812857 -784798 -774279 -776316 -788480 -786088 -781375 -793133 -778838 -773651
2046 -773651 -783552 -810408 -768121 -718913 -707572 -756310 -808899 -730974 -712699 -759538 -762978 -733469
2034 -733469 -783693 -727926 -724268 -715197 -695699 -690678 -699488 -706751 -699230 -774073 -794193 -808908 -818645
2021 -818645 -767974 -709156 -732142 -744417 -786085 -717037 -646213 -723389 -717792 -718813 -806666 -813690
2009 -813690 -748920 -730134 -708412 -762510 -726387 -715803 -682522 -677561 -656308 -696031 -758308 -729068
1997 -729068 -684956 -723415 -760457 -767560 -730733 -716439 -744168 -703971 -674415 -717776 -747228 -677427
1985 -677427 -649923 -685759 -766882 -746273 -706390 -690997 -786221 -768899 -707459 -664384 -715582 -724109
1973 -724109 -712373 -712295 -772894 -781037 -766742 -746437 -758953 -686925 -685661 -774073 -800985 -764332 -647777
1960 -647777 -689663 -732417 -745328 -824138 -790499 -782078 -789991 -759913 -723833 -687101 -721060 -732495
1948 -732495 -749512 -798616 -823334 -754875 -735546 -759799 -759008 -779583 -798011 -727551 -761355 -798922
1936 -798922 -756906 -677425 -610507 -679858 -746626 -722167 -746257 -730632 -739889 -708360 -715345 -728260
1924 -728260 -684241 -737948 -754060 -735630 -687431 -659546 -743678 -783580 -797243 -699680 -679166 -706187
1912 -706187 -695932 -714640 -682852 -678453 -659483 -679551 -799613 -727148 -742907 -795758 -806564 -812605
1900 -812605 -856424 -838664 -715608 -690961 -653107 -700087 -731064 -701436 -690477 -756580 -715005
1889 -715005 -635855 -667882 -639700 -692337 -670012 -648773 -704219 -697183 -581153 -706839 -714558 -684129
1877 -684129 -680536 -644657 -726954 -646926 -619877 -747670 -784431 -704716 -674377 -644637 -662181 -744433
1865 -744433 -834426 -829342 -704860 -631431 -631748 -699492 -745595 -776312 -820282 -735859 -739640 -788352
1853 -788352 -816704 -808057 -822980 -792590 -752348 -707529 -780478 -719445 -675900 -686559 -727334 -740127
1841 -740127 -762088 -708268 -697608 -702900 -683153 -712002 -783908 -752573 -773324 -743800 -713748 -785774
1829 -785774 -778339 -728265 -722810 -706604 -734787 -744629 -769962 -767230 -681851 -752512 -763205 -723145
1817 -723145 -705177 -677494 -694753 -655707 -686561 -685878 -675081 -681443 -666876 -681582 -679183 -666755
1805 -666755 -654257 -605528 -641847 -686326 -695142 -658687 -652127 -717691 -762087 -677198 -644109 -713207
1793 -713207 -705993 -689323 -724698 -703165 -640212 -719121 -801305 -848949 -791080 -784376 -756166 -713894
1781 -713894 -764102 -723535 -691220 -749206 -699490 -645085 -726747 -805394 -733472 -709268 -790813 -852255
1769 -852255 -827666 -806204 -725823 -733662 -715736 -708598 -761463 -785426 -744984 -783350 -828604 -777687
1757 -777687 -682774 -743787 -797645 -776153 -717865 -758420 -754147 -749720 -753162 -685773 -647420 -649082
1745 -649082 -692851 -687160 -693160 -732478 -720469 -763454 -719656 -768241 -755071 -731858 -765205 -817448
1733 -817448 -767515 -693892 -628500 -671695 -752517 -715355 -689382 -678699 -717357 -725076 -684128 -668928
1721 -668928 -698535 -707713 -752758 -813811 -774623 -758041 -724911 -702440 -737327 -753493 -761804 -741428
1709 -741428 -724073 -612795 -628073 -717326 -724829 -667207 -725089 -772396 -756941 -766802 -815494 -770689
1697 -770689 -632289 -660963 -752177 -739981 -694388 -679882 -660575 -724543 -717799 -713338 -756274 -744334
1685 -744334 -760674 -723194 -726678 -707910 -723721 -729315 -675171 -624240 -745063 -759445 -790438 -787878
1673 -787878 -648695 -637448 -752577 -707827 -689550 -694118 -682508 -772863 -786255 -711686 -753222
1662 -753222 -754491 -798135 -728137 -699535 -683269 -653514 -701104 -728664 -781381 -741198 -700417 -697521
1650 -697521 -755668 -747990 -726376 -685790 -707704 -785788 -710243 -656381 -690708 -674246 -736259 -745528
1638 -745528 -684872 -745083 -771659 -701695 -641243 -704508 -727436 -680828 -651153 -756781 -765798 -679492
1626 -679492 -702357 -693933 -707628 -661422 -696631 -719008 -792230 -765252 -737364 -701951 -731243 -680843
1614 -680843 -666547 -643427 -669921 -760991 -688013 -807646 -820901 -760269 -711553 -694433 -755723
1603 -755723 -725218 -697360 -774941 -765706 -768060 -682911 -703720 -685676 -694135 -711136 -788668 -764339
1591 -764339 -722305 -686522 -645256 -685965 -711688 -743866 -727355 -784074 -722915 -694265 -742086 -718499
1579 -718499 -739846 -746070 -743119 -828908 -778035 -674373 -681809 -715815 -726749 -751866 -727759 -710993
1567 -710993 -666142 -630040 -746750 -731389 -700324 -725312 -747096 -677587 -671580 -706698 -746169 -755481
1555 -755481 -709225 -718055 -654869 -632835 -637774 -674522 -730684 -675418 -634002 -685816 -686512 -705374
1543 -705374 -605871 -663257 -679775 -661703 -627328 -746374 -774420 -690258 -705282 -721837 -654118
1532 -654118 -618318 -670251 -696720 -634026 -672273 -712491 -676452 -675107 -690927 -692760 -681196 -697374
1520 -697374 -728105 -707734 -688776 -728196 -691874 -660064 -754819 -811096 -778540 -739724 -727727 -752121
1508 -752121 -721435 -667491 -605921 -627283 -662206 -671375 -692279 -719119 -727030 -687796 -734285 -733075
1496 -733075 -671621 -650013 -699697 -665248 -678750 -616033 -631922 -675809 -724069 -694306 -686235 -713058
1484 -713058 -691210 -719421 -757058 -769125 -743308 -696253 -709310 -749860 -705317 -776404 -706628 -775782
1472 -775782 -829510 -835188 -795284 -754233 -766175 -696740 -699968 -727792 -655497 -678221 -637182 -635442
1460 -635442 -682281 -716238 -639620 -611178 -653491 -672137 -716713 -772217 -722538 -686420 -719989 -676754
1448 -676754 -655949 -619615 -658082 -681242 -660675 -661987 -721407 -752515 -766324 -801630 -767082 -725682
1436 -725682 -762499 -728915 -717475 -741279 -701538 -764688 -785572 -691399 -635464 -743363 -791285
1425 -791285 -765941 -734390 -717038 -742379 -795550 -781412 -725134 -711207 -683404 -671070 -695492 -744228
1413 -744228 -754224 -745649 -762910 -799841 -759570 -718856 -759258 -726886 -755601 -742210 -743656 -751565
1401 -751565 -748535 -740736 -711505 -729017 -724150 -709722 -747080 -696225 -668919 -609692 -702714 -699736
1389 -699736 -691506 -723282 -730753 -709543 -738903 -736983 -717860 -709149 -742162 -774861 -783233 -722565 -655355
1376 -655355 -669146 -675117 -658717 -657999 -669360 -687149 -712082 -709639 -711875 -712908 -751121 -708134 -719627
1363 -719627 -729249 -713575 -631754 -667452 -643457 -731451 -730831 -741136 -743276 -794588 -715335 -651198
1351 -651198 -633986 -626483 -658481 -668519 -687362 -701402 -730165 -678337 -694229 -659766 -713184 -742154
1339 -742154 -688397 -710914 -715323 -762379 -749458 -738668 -696548 -640699 -662310 -637816 -728406 -812871
1327 -812871 -732048 -683573 -670427 -659052 -644582 -640223 -608182 -593546 -635083 -686014 -682537 -700028
1315 -700028 -700675 -714038 -751564 -801040 -854300 -793009 -701300 -694144 -741251 -730080 -703919 -685591
1303 -685591 -646775 -650954 -628816 -649594 -651828 -703722 -686667 -675427 -706931 -726556 -698188 -655517
1291 -655517 -656745 -679105 -729577 -713226 -710743 -751003 -739407 -782276 -756505 -706387 -696463 -688145
1279 -688145 -684578 -743625 -763968 -720692 -634897 -702752 -734045 -741869 -730688 -723776 -699709 -680828
1267 -680828 -700323 -758302 -750522 -731601 -740783 -666443 -689397 -727296 -770118 -672421 -639962 -672462
1255 -672462 -704181 -682435 -686554 -672552 -672326 -704158 -762487 -726239 -744280 -726437 -708007 -668264
1243 -668264 -671518 -675675 -651215 -666491 -740534 -694502 -638442 -636359 -720550 -726515 -769725 -743095
1231 -743095 -699702 -718211 -658019 -669650 -689900 -704184 -783518 -707730 -658153 -753395 -740102 -709889
1219 -709889 -639968 -622133 -642983 -636490 -668556 -747233 -722412 -671108 -720015 -755083 -712006 -695997
1207 -695997 -750282 -755993 -717578 -701423 -757699 -763528 -771423 -732516 -604282 -593171 -679292 -683030
1195 -683030 -631229 -649745 -697941 -723509 -695564 -622843 -672350 -650591 -667554 -666500 -700457 -670919
1183 -670919 -642752 -644087 -672513 -674698 -663253 -679841 -700259 -717230 -694163 -688915 -764416 -742869
1171 -742869 -683463 -681585 -641995 -602422 -597891 -659616 -686139 -729259 -694392 -685595 -680230 -739611
1159 -739611 -696621 -680633 -757122 -687285 -694510 -714367 -747991 -754102 -701254 -756682 -680764 -671120
1147 -671120 -730359 -699350 -659739 -657996 -652788 -596269 -603155 -672418 -639747 -688018 -660151 -752177
1135 -752177 -738470 -743606 -761481 -711549 -684611 -636497 -603341 -556567 -587639 -588979 -609019 -635951
1123 -635951 -649484 -692264 -670785 -669193 -638013 -700192 -727726 -715626 -706621 -707152 -624895 -646875
1111 -646875 -682513 -679526 -692076 -756913 -737214 -720134 -702253 -690165 -687796 -622400 -634800 -664397
1099 -664397 -710878 -745154 -689805 -676832 -702042 -683360 -678831 -746800 -737251 -712905 -706873 -664184
1087 -664184 -720173 -673459 -614130 -600259 -570851 -562634 -609947 -641129 -643244 -640106 -664511 -713590
1075 -713590 -682574 -657203 -691060 -595448 -692310 -701063 -666393 -657145 -712673 -697685 -667947 -743237
1063 -743237 -719348 -766947 -738740 -681134 -674672 -656309 -714534 -696498 -666960 -660246 -665453 -642841
1051 -642841 -627129 -653997 -645203 -643386 -741059 -762017 -733754 -685649 -649854 -683185 -710716 -637025
1039 -637025 -650853 -748594 -739358 -741133 -754424 -766775 -775001 -758884 -705002 -667123 -679422 -689798
1027 -689798 -658818 -661120 -635387 -688957 -735115 -727774 -751658 -735470 -724214 -694812 -707962 -702183
1015 -702183 -745218 -723752 -718305 -718134 -725686 -771740 -692896 -665478 -699914 -676086 -684829 -670062 -681429
1002 -681429 -616986 -649715 -693178 -728217 -702635 -650243 -647036 -608146 -637156 -708018 -732369 -679026
990 -679026 -674278 -641768 -658132 -640283 -660047 -695496 -706726 -688890 -724274 -701629 -632628 -701937
978 -701937 -771852 -754597 -703023 -702375 -690635 -648865 -659295 -640428 -631085 -680484 -720507 -705977
966 -705977 -705452 -679283 -685356 -652802 -695009 -721983 -681043 -694150 -621338 -679875 -733382 -650214
954 -650214 -635880 -605049 -588240 -644365 -691607 -711382 -651435 -668326 -750438 -694981 -658445 -727979
942 -727979 -778024 -765861 -689027 -648009 -698324 -730023 -645866 -671967 -637735 -667865 -688522 -683811
930 -683811 -685471 -635025 -685262 -665216 -690927 -700031 -699120 -724198 -745086 -767468 -775426 -751350 -669110
917 -669110 -682580 -660912 -625016 -668479 -671759 -660733 -698287 -735529 -643384 -581690 -657966 -631838
905 -631838 -638521 -664027 -637566 -685753 -706928 -672072 -568282 -651440 -703896 -701267 -699650 -748260
893 -748260 -737575 -692583 -653074 -647619 -663245 -682313 -705041 -642278 -647596 -668591 -686048 -657290
881 -657290 -665848 -672924 -666984 -741988 -711456 -668617 -679440 -686153 -661086 -616784 -651450 -722703 -665402
868 -665402 -643866 -582021 -628136 -652908 -607493 -574873 -653029 -682600 -636563 -722614 -804773 -836445
856 -836445 -794665 -746118 -675655 -682617 -742965 -694242 -691839 -728184 -713595 -736005 -801947 -839788
844 -839788 -776867 -643254 -573685 -610251 -685186 -732971 -711379 -668136 -619833 -660845 -648568 -587052
832 -587052 -637969 -667422 -691320 -731846 -699760 -727525 -743131 -671338 -643592 -711941 -712977 -666125
820 -666125 -676362 -724182 -734191 -719175 -696861 -640912 -648251 -669132 -664272 -666830 -683507 -709882
808 -709882 -697688 -690664 -680938 -677156 -697165 -683813 -730195 -762969 -682997 -623698 -641343 -702044
796 -702044 -647649 -687069 -697755 -701399 -719718 -713226 -628045 -643130 -682351 -682711 -650654 -606000 -619305
783 -619305 -718313 -764137 -769088 -756928 -740520 -662640 -623495 -625487 -620019 -650401 -603409 -605471 -606108
770 -606108 -629618 -645648 -675814 -693649 -690944 -721556 -698741 -709253 -709527 -716222 -702423 -666327 -678329
757 -678329 -704289 -718753 -679502 -643475 -617030 -599155 -605318 -593830 -619061 -606015 -632908 -641246
745 -641246 -623424 -611015 -661058 -644069 -678700 -757248 -709750 -703644 -675084 -690431 -645956 -603138
733 -603138 -684152 -700472 -703475 -707207 -693713 -699985 -755172 -704762 -665694 -721544 -727703 -723506 -746421
720 -746421 -727363 -666794 -668433 -677684 -623257 -654020 -637930 -604142 -645703 -662331 -665374 -653220
708 -653220 -652225 -596472 -660752 -580624 -654122 -754595 -709755 -669849 -630737 -584358 -683141 -655572
696 -655572 -707594 -675529 -657200 -682700 -703501 -648865 -609115 -602794 -577848 -575232 -610511 -642552
684 -642552 -596188 -636166 -665111 -673543 -659064 -666355 -692620 -648500 -628772 -642539 -689060 -629728
672 -629728 -583210 -675145 -663729 -656679 -678254 -675602 -721959 -666882 -675774 -639331 -659370 -667634 -588187
659 -588187 -577829 -646308 -666490 -708682 -768504 -700957 -635455 -635985 -646263 -626820 -709148 -751328
647 -751328 -734081 -723122 -661498 -696223 -682891 -612725 -616358 -644044 -712978 -685404 -686393 -667722
635 -667722 -665155 -608368 -678301 -678958 -718246 -704183 -670194 -661624 -661489 -680171 -722754 -701910 -705638
622 -705638 -662640 -592418 -656606 -729509 -675214 -637919 -636244 -695208 -670163 -665197 -726358 -729910
610 -729910 -694995 -700521 -676592 -623932 -658007 -655771 -633347 -634765 -570926 -593165 -663127 -684745
598 -684745 -621587 -598585 -669998 -713582 -701217 -697251 -687495 -679401 -664973 -615810 -605059 -655095
586 -655095 -731649 -731799 -702837 -658774 -653092 -651602 -754641 -764228 -681123 -639393 -672711 -644334 -629449
573 -629449 -708554 -680229 -633068 -683356 -701198 -704066 -744391 -686889 -709603 -681062 -642437 -688858
561 -688858 -660072 -565181 -631281 -728452 -698702 -677288 -642767 -629207 -723024 -735064 -707539 -663039
549 -663039 -684333 -683991 -669836 -652231 -616735 -614539 -594112 -621758 -580639 -648212 -737577 -723638
537 -723638 -658887 -647155 -602266 -647921 -662066 -705006 -641420 -567124 -649587 -656981 -652414 -648308
525 -648308 -661710 -633874 -619980 -616613 -644335 -664507 -708898 -723861 -661029 -687385 -649021 -611659
513 -611659 -575798 -676374 -674045 -697601 -676885 -744711 -689183 -698540 -692524 -627283 -593073 -609260
501 -609260 -656602 -598453 -671235 -726626 -641012 -676270 -730542 -678159 -697184 -692626 -688512 -673701
489 -673701 -719412 -731607 -721386 -680273 -667730 -704072 -695225 -686269 -635285 -605456 -616853 -601503
477 -601503 -610245 -656262 -652091 -663591 -622815 -584548 -621367 -612224 -639696 -629025 -603816 -590092
465 -590092 -692495 -741286 -717611 -634549 -698350 -652172 -619074 -570034 -566427 -608655 -588585 -598961
453 -598961 -599429 -645327 -698508 -661391 -678342 -669563 -609225 -610158 -624736 -614312 -672115 -641423 -657451
440 -657451 -597812 -577089 -582930 -632592 -663514 -667234 -766066 -705077 -637038 -626693 -719899 -685185
428 -685185 -632130 -589202 -571852 -631498 -670706 -675758 -602610 -577514 -641686 -591318 -559944 -621808
416 -621808 -641404 -651015 -710884 -707449 -689134 -695712 -656092 -615176 -561053 -548539 -547677 -634122 -644123
403 -644123 -648537 -622476 -622492 -647384 -618506 -660307 -669072 -724613 -713044 -670817 -693001 -722819 -661355
390 -661355 -709430 -766300 -712673 -606837 -613915 -606635 -649290 -645493 -674471 -635955 -629485 -597870
378 -597870 -626224 -671124 -627445 -527043 -541515 -586336 -655736 -652146 -609247 -611911 -622248 -626429
366 -626429 -585377 -579037 -626601 -673211 -647064 -546940 -556650 -619346 -588615 -587891 -573312 -602959
354 -602959 -672904 -713707 -694121 -690103 -638869 -675487 -624867 -674917 -718647 -693718 -653673 -648526
342 -648526 -634564 -677618 -657870 -621047 -692660 -679715 -619846 -661859 -676720 -653148 -643394 -641740
330 -641740 -655651 -649990 -587146 -615431 -617529 -588459 -659263 -634392 -598636 -636802 -648014 -681214
318 -681214 -638797 -601632 -643474 -651341 -696621 -697746 -607858 -695878 -668737 -655971 -637853 -578723
306 -578723 -597470 -597753 -636941 -655576 -619508 -641314 -629423 -608725 -617610 -638883 -622181 -662483
294 -662483 -597905 -557103 -656334 -709201 -658875 -609505 -656147 -674447 -647558 -669172 -708174 -728177
282 -728177 -731188 -690511 -674735 -660215 -696570 -694483 -654032 -620588 -699175 -696056 -728107 -680926
270 -680926 -704342 -719178 -708335 -678984 -669510 -647096 -669555 -750722 -689439 -620921 -645905 -638666
258 -638666 -726273 -760391 -732342 -675186 -672138 -660068 -633727 -659416 -714622 -696126 -695649 -666445
246 -666445 -662134 -681257 -652521 -669156 -694344 -648934 -602992 -594952 -652896 -696358 -650856 -706606
234 -706606 -716165 -689740 -682313 -703264 -733095 -697076 -693669 -625405 -637639 -623733 -548446 -629314
222 -629314 -655612 -603073 -631752 -724662 -717486 -711034 -722596 -787363 -797682 -737242 -647412 -667655
210 -667655 -590057 -596974 -665875 -663212 -651535 -682231 -669846 -668058 -692452 -688500 -665442 -626811 -644679
197 -644679 -668104 -692152 -685547 -666946 -646339 -680886 -711072 -686532 -692031 -693044 -741096 -687291
185 -687291 -707011 -691527 -724791 -718287 -705844 -697811 -740142 -781517 -713860 -726501 -716483 -733971
173 -733971 -732093 -673806 -672609 -744110 -687456 -692796 -735193 -729716 -668895 -714001 -713503 -687343 -652855
160 -652855 -670738 -717719 -762938 -721862 -747338 -752809 -748777 -741345 -685913 -657470 -681796 -767755
148 -767755 -788591 -754122 -728358 -668184 -651313 -621965 -651598 -750178 -782537 -816211 -764887 -772340
136 -772340 -795720 -759858 -714407 -740197 -733138 -770061 -780953 -753516 -756757 -763044 -722777 -684570
124 -684570 -721203 -770872 -749984 -731062 -714660 -740541 -767898 -806386 -807193 -808605 -795947 -781474
112 -781474 -710165 -733628 -752325 -720606 -745789 -756009 -744573 -750371 -772207 -736630 -746031 -802088
100 -802088 -815737 -841591 -818954 -762535 -766894 -789790 -845141 -802310 -761262 -728314 -746206 -785372
88 -785372 -780662 -790360 -844638 -882192 -859537 -825204 -807935 -820593 -825578 -832057 -906554 -853117 -843954
75 -843954 -783903 -756306 -819824 -848818 -818836 -822079 -824247 -784722 -810920 -805116 -824100 -807814 -826930
62 -826930 -872921 -898193 -916520 -881079 -814966 -842728 -874711 -890124 -888578 -881751 -859976 -888216
50 -888216 -860844 -813226 -857847 -908976 -909654 -861740 -897590 -932261 -902387 -916979 -948094 -930771
38 -930771 -891160 -897600 -910265 -941790 -962985 -993331 -1011265 -971065 -933902 -958864 -960969 -962234 -946681
25 -946681 -898206 -924246 -903812 -947932 -924778 -965775 -990090 -924013 -970938 -972383 -982583 -987142
13 -987142 -1002990 -998001 -1011703 -981018 -981854 -1044742 -1039431 -1017550 -1027822 -1044993 -1032969 -1044882 -1061907
0 -1061907
$$ Imaginary data points
##PAGE= N=2
##DATA TABLE= (X++(I..I)), XYDATA
16383 -2058009 -2029384 -2013164 -1990327 -1919961 -1875856 -1864970 -1838537 -1809857 -1732876 -1681839 -1640636
16372 -1640636 -1615687 -1589915 -1576305 -1486734 -1469266 -1402747 -1367271 -1330290 -1314507 -1267119 -1226787
16361 -1226787 -1228691 -1158533 -1063568 -1047997 -996703 -980263 -1011520 -973928 -931149 -842457 -824988
16350 -824988 -791462 -694826 -670351 -613180 -551403 -526075 -461161 -436821 -448553 -431977 -382833
16339 -382833 -280309 -238757 -262444 -265665 -213578 -152004 -75220 -58403 -34048 9140 40646
16328 40646 42968 75942 118000 153278 253283 275503 290429 429688 449078 441200 461310 499265
16316 499265 514145 580140 598788 596965 615949 650343 689341 712689 743507 794367 836344 848986
16304 848986 855397 928035 1008511 1041637 1117380 1094158 1128287 1245056 1253405 1255322 1328854 1367593
16292 1367593 1386789 1414137 1449881 1432475 1472036 1476502 1462527 1520158 1528967 1578800 1621330 1639691
16280 1639691 1710693 1750495 1784006 1760178 1751133 1729075 1791130 1809459 1853576 1870827 1976417
16269 1976417 2010834 2022223 2000270 2004839 2091118 2143475 2174849 2156146 2176465 2254424 2304916
16258 2304916 2291752 2292285 2309110 2372187 2360264 2430198 2462217 2453838 2510199 2510552 2500992 2550654
16246 2550654 2578067 2559010 2596507 2650973 2644336 2644801 2731015 2789773 2778943 2783680 2802822 2830628
16234 2830628 2838965 2901777 2950779 2952575 2937632 2931127 2945993 2932436 2989052 2970507 2996678 3050875
16222 3050875 3088496 3101709 3069527 3105848 3131210 3139805 3128197 3126706 3137395 3192887 3248249 3266573
16210 3266573 3365274 3369920 3335287 3328784 3298599 3335059 3307018 3300490 3357414 3482387 3550543 3496170
16198 3496170 3473991 3522113 3514010 3507909 3550239 3592782 3605648 3624246 3634836 3636039 3655049 3642764
16186 3642764 3658347 3630451 3596476 3625789 3648640 3637880 3669462 3695169 3654206 3645166 3744304
16175 3744304 3788241 3834037 3784466 3828010 3861142 3800354 3819272 3786273 3898622 3892291 3941856
16164 3941856 3919435 3941069 3954394 3900711 3888023 3906321 3903095 3907220 3915361 3853596 3936217 3909476
16152 3909476 3949015 4016634 4058602 4099134 4078813 4030183 4023076 4059319 4062149 4037276 4038317 4091175
16140 4091175 4094418 4072542 4056308 4040875 4107432 4090599 4098758 4081522 4112813 4205739 4195174 4172347
16128 4172347 4184755 4144784 4061618 4037139 4110711 4183760 4125768 4175508 4097474 4149935 4157227
16117 4157227 4190687 4146118 4145381 4213529 4243798 4257476 4235102 4275664 4206715 4171621 4196786 4223343
16105 4223343 4179889 4189731 4227961 4243988 4249063 4252176 4175261 4208297 4285072 4243681 4235895 4262689
16093 4262689 4244592 4265183 4291182 4270397 4293329 4250943 4241929 4277927 4289412 4278400 4274442 4322991
$$ [...]
##END NTUPLES=NMR SPECTRUM
##END=
