##TITLE=1H_DE-80H_X3
 200.13MHz, d2o
 8 sc
 
 19ns.26.2.2025
##JCAMPDX= 6.0         $$ Bruker NMR JCAMP-DX V2.0
##DATA TYPE= NMR SPECTRUM
##DATA CLASS= NTUPLES
##ORIGIN= UXNMR, Bruker Analytische Messtechnik GmbH
##OWNER= pz
$$ XWIN-NMR		Version 3.5
$$ Mon Mar 16 11:03:23 2026 Russian Standard Time (UT+4h)  Yarkov@DPX200
##.OBSERVE FREQUENCY= 200.1313
##.OBSERVE NUCLEUS= ^1H
##.ACQUISITION MODE= SIMULTANEOUS
##.ACQUISITION SCHEME= undefined
##.AVERAGES= 8
##.DIGITISER RES= 18
##SPECTROMETER/DATA SYSTEM= spect
##.PULSE SEQUENCE= zg30
##.SOLVENT NAME= CDCl3
##.SHIFT REFERENCE= (INTERNAL, CDCl3, 0, 15.4814)
##AUDIT TRAIL= $$ (NUMBER, WHEN, WHO, WHERE, WHAT)
$$ ##TITLE= Audit trail, XWIN-NMR		Version 3.5
$$ ##JCAMPDX= 5.01
$$ ##ORIGIN= Bruker BioSpin GmbH
$$ ##OWNER= Yarkov
$$ C:/Bruker/XWIN-NMR/data/yarkov2/nmr/H-C/1/pdata/1/auditp.txt
$$ ##AUDIT TRAIL=  $$ (NUMBER, WHEN, WHO, WHERE, WHAT)
(   1,<2026-03-16 11:02:34.25 +0400>,<Yarkov>,<DPX200>,
      <created by zg, POWCHK disabled, PULCHK disabled
       configuration hash MD5:
       00 E9 B6 7A A2 85 ED C7 34 08 36 98 17 FE 4E 26
       data hash MD5: 16K
       C9 99 7B FD 36 3A B2 21 EB 59 7E BD EA 81 DB F6>)
(   2,<2026-03-16 11:02:41.01 +0400>,<Yarkov>,<DPX200>,
      <Start of raw data processing
       efp BC_mod = 2 LB = 0.25 FT_mod = 6 PKNL = 1 PHC0 = -5299.148 PHC1 = 6.821927 SI = 16K 
       data hash MD5: 16K
       C3 49 30 C1 AD 50 D8 51 A1 BE D8 80 B3 47 67 74>)
$$ ##END=
$$ 
$$ hash MD5
$$ C5 6E 4F E4 F2 51 B6 F2 07 AE E1 BC 34 1E E0 AA
##$RELAX= 
##$RELAX= 
##$RELAX= 
##$RELAX= 
##$RELAX= 
##$RELAX= 
$$ Bruker specific parameters
$$ --------------------------
##$DU= <C:/Bruker/XWIN-NMR>
##$EXPNO= 1
##$NAME= <H-C>
##$PROCNO= 1
##$TYPE= <nmr>
##$USER= <yarkov2>
##$AMP= (0..31)
100 100 100 100 100 100 100 100 100 100 100 100 100 100 100 100 100 100 
100 100 100 100 100 100 100 100 100 100 100 100 100 100 
##$AQSEQ= 0
##$AQ_mod= 1
##$AUNM= <au_zg>
##$AUTOPOS= <>
##$BF1= 200.13
##$BF2= 200.13
##$BF3= 200.13
##$BF4= 200.13
##$BF5= 200.13
##$BF6= 200.13
##$BF7= 200.13
##$BF8= 200.13
##$BYTORDA= 1
##$CFDGTYP= 0
##$CFRGTYP= 5
##$CHEMSTR= <none>
##$CNST= (0..31)
1 1 145 1 1 1 1 1 1 1 1 1 1 1 1 1 1 1 1 1 1 1 1 1 1 1 1 1 1 1 1 1 
##$CPDPRG= <>
##$CPDPRG1= <>
##$CPDPRG2= <>
##$CPDPRG3= <>
##$CPDPRG4= <mlev>
##$CPDPRG5= <mlev>
##$CPDPRG6= <mlev>
##$CPDPRG7= <mlev>
##$CPDPRG8= <mlev>
##$CPDPRGB= <>
##$CPDPRGT= <>
##$D= (0..31)
0 0.7 0 0 0 0 0 0 0 0 0 0.03 0 0 0 0 0 0 0 0 0 0 0 0 0 0 0 0 0 0 0 0 
##$DATE= 1773644553
##$DBL= (0..7)
120 120 120 120 120 120 120 120 
##$DBP= (0..7)
150 150 150 150 150 150 150 150 
##$DBP07= 0
##$DBPNAM0= <>
##$DBPNAM1= <>
##$DBPNAM2= <>
##$DBPNAM3= <>
##$DBPNAM4= <>
##$DBPNAM5= <>
##$DBPNAM6= <>
##$DBPNAM7= <>
##$DBPOAL= (0..7)
0.5 0.5 0.5 0.5 0.5 0.5 0.5 0.5 
##$DBPOFFS= (0..7)
0 0 0 0 0 0 0 0 
##$DE= 6
##$DECBNUC= <off>
##$DECIM= 32
##$DECNUC= <off>
##$DECSTAT= 4
##$DIGMOD= 1
##$DIGTYP= 9
##$DL= (0..7)
0 120 120 120 120 120 120 120 
##$DP= (0..7)
$$ [...]
##$SUBNAM2= <"">
##$SUBNAM3= <"">
##$SUBNAM4= <"">
##$SUBNAM5= <"">
##$SUBNAM6= <"">
##$SUBNAM7= <"">
##$SUBNAM8= <"">
##$SUBNAM9= <"">
##$SW= 18.0517328524113
##$SWIBOX= (0..15)
0 0 2 0 0 0 0 0 0 0 0 0 0 0 0 0 
##$SW_h= 3612.71676300578
##$TD= 16384
##$TD0= 1
##$TE= 0
##$TE2= 300
##$TE3= 300
##$TEG= 300
##$TL= (0..7)
0 120 120 120 120 120 120 120 
##$TP= (0..7)
150 150 150 150 150 150 150 150 
##$TP07= 0
##$TPNAME0= <>
##$TPNAME1= <>
##$TPNAME2= <>
##$TPNAME3= <>
##$TPNAME4= <>
##$TPNAME5= <>
##$TPNAME6= <>
##$TPNAME7= <>
##$TPOAL= (0..7)
0.5 0.5 0.5 0.5 0.5 0.5 0.5 0.5 
##$TPOFFS= (0..7)
0 0 0 0 0 0 0 0 
##$TUNHIN= 0
##$TUNHOUT= 0
##$TUNXOUT= 0
##$USERA1= <user>
##$USERA2= <user>
##$USERA3= <user>
##$USERA4= <user>
##$USERA5= <user>
##$V9= 5
##$VALIST= <valist>
##$VCLIST= <CCCCCCCCCCCCCCC>
##$VD= 0
##$VDLIST= <DDDDDDDDDDDDDDD>
##$VPLIST= <PPPPPPPPPPPPPPP>
##$VTLIST= <TTTTTTTTTTTTTTT>
##$WBST= 1024
##$WBSW= 4
##$XGAIN= (0..3)
0 0 0 0 
##$XL= 0
##$YL= 0
##$YMAX_a= 75933
##$YMIN_a= -66455
##$ZGOPTNS= <>
##$ZL1= 120
##$ZL2= 120
##$ZL3= 120
##$ZL4= 120
##$ABSF1= 0
##$ABSF2= 0
##$ABSG= 0
##$ABSL= 0
##$ALPHA= 0
##$AQORDER= 0
##$ASSFAC= 0
##$ASSFACI= 0
##$ASSFACX= 0
##$ASSWID= 0
##$AUNMP= <proc_1d>
##$AZFE= 0.1
##$AZFW= 0.1
##$BCFW= 0
##$BC_mod= 2
##$BYTORDP= 0
##$COROFFS= 0
##$CY= -3
##$DATMOD= 1
##$DC= 0
##$DFILT= <>
##$DTYPP= 0
##$F1P= 0
##$F2P= 0
##$FCOR= 1
##$FTSIZE= 16384
##$FT_mod= 6
##$GAMMA= 0
##$GB= 0
##$INTBC= 1
##$INTSCL= 3.241238e-09
##$ISEN= 128
##$LB= 0.25
##$LEV0= 0
##$LPBIN= 0
##$MAXI= 10000
##$MC2= 0
##$MEAN= 0
##$ME_mod= 0
##$MI= 1.114404
##$NCOEF= 0
##$NC_proc= -9
##$NLEV= 6
##$NOISF1= 3.799351
##$NOISF2= 2.8
##$NSP= 0
##$NTH_PI= 0
##$NZP= 0
##$OFFSET= 15.48136
##$PC= 1
##$PHC0= -5299.148
##$PHC1= 6.821927
##$PH_mod= 1
##$PKNL= yes
##$PPARMOD= 0
##$PSCAL= 0
##$PSIGN= 0
##$REVERSE= no
##$SF= 200.13000807381
##$SI= 16384
##$SIGF1= 3
##$SIGF2= 2
##$SINO= 0.751879
##$SIOLD= 32768
##$SREGLST= <19F.Aceton>
##$SSB= 0
##$STSI= 16384
##$STSR= 0
##$SW_p= 3612.71676300578
##$SYMM= 0
##$S_DEV= 0
##$TDeff= 16384
##$TDoff= 0
##$TI= <>
##$TILT= no
##$TM1= 0
##$TM2= 0
##$TOPLEV= 0
##$USERP1= <user>
##$USERP2= <user>
##$USERP3= <user>
##$USERP4= <user>
##$USERP5= <user>
##$WDW= 1
##$XDIM= 16384
##$YMAX_p= 486701110
##$YMIN_p= -2640953
$$ End of Bruker specific parameters
$$ ---------------------------------
##NTUPLES= NMR SPECTRUM
##VAR_NAME=  FREQUENCY,     SPECTRUM/REAL,   SPECTRUM/IMAG
##SYMBOL=    X,             R,               I
##VAR_TYPE=  INDEPENDENT,   DEPENDENT,       DEPENDENT
##VAR_FORM=  AFFN,          ASDF,            ASDF
##VAR_DIM=   16384,         16384,           16384
##UNITS=     HZ,            ARBITRARY UNITS, ARBITRARY UNITS
##FACTOR=    0.220516191357247, 1,           1
##FIRST=     3098.28478894734, 0,            0
##LAST=      -514.431974058436, 0,           0
##MIN=       -514.431974058436, -2640953,    0
##MAX=       3098.28478894734, 486701110,    0
$$ Real data points
##PAGE= N=1
##DATA TABLE= (X++(R..R)), XYDATA
$$ [...]
7683H23861K00056L33639j7683J38400m58079J97903J77490m10216q53250P41881
7673H74002q1798p15295Q06172r713j70783N44504n88682k32193N10810M273K7166
7662I68463o40690J02626M57958n725j25228J8697k29401J77755K70861j45062
7652H50254K17676p15762K6746O20441j13468K44635j28959m97141k80132N21626
7642G45916K5059l2899O9676k97099L71679j61838k84026M12542L84252m60526
7632G72736o43228O29654o7598m15853K45761Q88848p10894l44694K72093L73046
7622I99871N0429j77733p7933l82921l5810l75074j10028N28277r5399J62860
7612D86539K52603R0200P5046k16829k71016j01314k6904M55665j07030k00329
$$ y = [823861, 1023917, 1357556, 1339873, 1478273, 1020194, 1218097, 1395587, 985371, 132121, 874002, 792204, 76909, 883081, 873368, 702585, 1247089, 658407, 426214, 937024, 941297, 968463, 327773, 430399, 888357, 882632, 757404, 776101, 546700, 724455, 995316, 850254, 1067930, 352168, 378914, 999355, 885887, 1130522, 1001563, 504422, 224290, 745916, 770975, 738076, 807752, 510653, 882332, 720494, 436468, 849010, 1233262, 772736, 129508, 759162, 691564, 275711, 521472, 1410320, 699426, 354732, 626825, 999871, 1050300, 872567, 794634, 411713, 375903, 829, -109199, 419078, 323679, 486539, 739142, 829342, 904388, 687559, 416543, 315229, 288325, 743990, 636960, 436631]
7602D36631K56878O36236Q3616j66340K99778l66646n28749j30927L19748k4477
7592H15748P8156m10283k0684K73812k9812O6212J2010l71140K25585M74818J57249
7581A271671J06576j71628k81701M99252m8953P7841L2169l46935L30215o36100
7571H32407l50744L29368L2137L92277J32739n15775k42081k35615o65018J95009
7561i5296L66876K08253M33228P4226m34795P00869l98323n45064l65660K73628
7551B17942K03343j09204P24763N17719n34965l26452K61126j08981K6006n13045
7541C58252k48483R92500K79289m75039J8654J8920k342n1582L6491j3688m51432
7530D61540n4553N22267k54102k06668j2915J63193j5036J36128n7352J08795
$$ y = [436631, 693509, 1329745, 1413361, 1247021, 1546799, 1180153, 651404, 520477, 840225, 815748, 893904, 483621, 462937, 736749, 706937, 773149, 785159, 414019, 639604, 1114422, 1271671, 1378247, 1206619, 924918, 1424170, 1375217, 1453058, 1485227, 1138292, 1468507, 832407, 481663, 811031, 843168, 1235445, 1368184, 852409, 610328, 374713, -290305, -95296, 271580, 479833, 913061, 987287, 552492, 1253361, 855038, 309974, -55686, 217942, 421285, 312081, 1036844, 1554563, 1019598, 693146, 954272, 845291, 871297, 358252, 109769, 1102269, 1381558, 906519, 925173, 944093, 941751, 890169, 926660, 912972, 461540, 406987, 929254, 675152, 468484, 455569, 618762, 603726, 739854, 682502, 791297]
7520G91297m29407K91483N47350n18715l76032L61969K18009J62307l15829N63199
7510A295631o15122m63830L75974k30808J41300L51052j90003n96300N92798j84080
7500D76612M85289M6962m28188j9807P9638O0056M39920N7908j07967k71937L6002
7489H54488M8121J81831k89816p6351J22665j08482M5621O64287L85939k53569
7479A574734l80861l11096J34841j56931j11262L24422M91878j53104j45047J11974
7469A379548j27083M6377J73388K63587k71727J29253j35862l06764K54163k72971
7459A131909q2696J05167J3449M42422J17635j01501J1645K33171L24270j28207
7449B067264n86906q573K74588l36839L68843P6342k26120k88750j6799n87814
$$ y = [791297, 361890, 653373, 1200723, 682008, 305976, 667945, 885954, 1048261, 732432, 1295631, 680509, 216679, 592653, 361845, 503145, 854197, 664194, 67894, 660692, 476612, 961901, 1008863, 580675, 560868, 640506, 700562, 1140482, 1198390, 1090423, 818486, 854488, 902609, 1084440, 794624, 718273, 840938, 732456, 778077, 1442364, 1828303, 1574734, 1193873, 882777, 1017618, 860687, 749425, 1073847, 1565725, 1412621, 1267574, 1379548, 1252465, 1298842, 1472230, 1735817, 1464090, 1593343, 1457481, 1150717, 1404880, 1131909, 1049213, 1154380, 1167829, 1610251, 1727886, 1626385, 1638030, 1871201, 2195471, 2067264, 1480358, 1471785, 1746373, 1409534, 1778377, 1854719, 1628599, 1339849, 1323050, 735236]
7439G35236O36158m1730o44358l8075J34552L05872o09855k31301K79718L19979
7429H46196K48918o64498n6209O8814N41225l9325O91947o8815m21671k23769
7419I22813J35329J85585k09592j05206j4068J95582K22424j99715L81354O873
7409A521379j65926N5377j50803j5413m85542N25905l5884P7689L52039l23758
7399A355063K66200L25132m14008k1898l96226O1336L75954j54279L52552L42650
7389B092476m5843L30686o07516k48599K09175j98524L5597m03587j00532l76382
7379F86951j55722p0889K28836M70992j34882k13582k20909L54658P5400l77038
7369F43815M36886j77022n43067O75552P3907L85639l41352j84670l19581M9593
$$ y = [735236, 1371394, 1329664, 685306, 647231, 781783, 1087655, 477800, 246499, 526217, 846196, 1095114, 430616, 374407, 443221, 984446, 945121, 1637068, 1568253, 1146582, 922813, 1058142, 1243727, 1034135, 928929, 914861, 1110443, 1332867, 1133152, 1514506, 1521379, 1355453, 1410830, 1260027, 1244614, 759072, 1284977, 1249093, 1326782, 1678821, 1355063, 1621263, 1946395, 1532387, 1510489, 1114263, 1175599, 1551553, 1397274, 1749826, 2092476, 2046633, 2377319, 1769803, 1521204, 1730379, 1531855, 1567452, 1163865, 1063333, 686951, 531229, 460340, 689176, 1160168, 1025286, 811704, 590795, 945453, 1020853, 643815, 1080701, 903679, 360612, 1036164, 1110071, 1495710, 1154358, 969688, 650107, 699700]
7359F99700M70344k5312k97453O33063m82615k4773j70565l79637J43345K96695
7349H62792l02767K69756j36079J86846J22999R3379j22552q3542O0081o92390
7339B58523N90615k27154k2545J21782j81533k68513M58437R2311L9835K06577
7329A068335Q6738P2988k23451m7750J26395l3310q8475o18983J26612M37908
7319I07007L9391o61540J37077M29659K07670l88991l04M13810j55767m06007
7309E22005P31808l30301n16011R0658m61431K16964O12002k08057r1484Q24971
7299A391124k97453j85328J85904K62791m66681J58707l74207k59083j35077L42677
7289F23374L69319l90127J2233k33235R8370Q43447M41067n22469m13792j05558
$$ y = [699700, 1170044, 1144732, 847279, 1480342, 997727, 972954, 802389, 422752, 566097, 862792, 560025, 829781, 693702, 880548, 1003547, 1096926, 974374, 890832, 950913, 258523, 849138, 621984, 599439, 721221, 539688, 271175, 729612, 821923, 861758, 1068335, 1155073, 1228061, 1004610, 956860, 1083255, 1049945, 961470, 342487, 469099, 907007, 946398, 284858, 421935, 851594, 1059264, 670273, 669969, 1083779, 928012, 522005, 1253813, 923512, 407501, 498159, 36728, 253692, 865694, 657637, 566153, 1391124, 1093671, 908343, 1094247, 1357038, 890357, 1049064, 674857, 415774, 280697, 623374, 992693, 602566, 614799, 381564, 479934, 1323381, 1764448, 1241979, 828187, 722629]
7279G22629o39833K02474M8428N43981K83701p43787k45108K28402O5008K63828
7269G29723L95238J68805j48799J52551Q9066k59196j62574n27769O69986l92087
7259G14944j19833k4583K76608J59330K82974m91822R62929J06048m69495k20877
7249A176223l60342L63850j46610R4434l70184J32088O06146K70004k85026j15726
7239A364857j49253l71165m41144L16452k0566N3622N09234k91054l1400J42236
7229A081819m4995L47479K9295m23113k20685K4047o5708L14671l80806n86190
7219G5814P97948P04731l91602k40105m18345k65682L46879P04873j625k56294
7209A056592J66382K91899k07953k05202J70234J7461M95924K18195k48478j87514
$$ y = [722629, 82796, 285270, 333698, 877679, 1161380, 417593, 172485, 400887, 465895, 729723, 1124961, 1293766, 1144967, 1297518, 1386584, 1127388, 964814, 437045, 1107031, 714944, 595111, 570528, 847136, 1006466, 1289440, 797618, 1760547, 1866595, 1397100, 1176223, 815881, 1179731, 1033121, 1127555, 757371, 889459, 1495605, 1765609, 1480583, 1364857, 1215604, 844439, 403295, 719747, 699181, 752803, 1262037, 970983, 939583, 1081819, 1036824, 1384303, 1413598, 990485, 769800, 793847, 728139, 1042810, 662004, 75814, 873762, 1578493, 1186891, 946786, 528441, 262759, 609638, 1314511, 1312886, 1056592, 1222974, 1514873, 1306920, 1101718, 1271952, 1289413, 1785337, 2003532, 1755054, 1567540]
7199A567540K58094k02236N43964J9682j83575J99228L45021L16557M99301K07425
7189C571001O4292P06915q7862k77130n60148j009046o5410K20172p88441j51278
7179A623065n5815J17700k51143N46348L36232k94632m56329l38029R48942j50393
7169B025946J09716N1300J4863J97723o2425q1399K42436j45952q88303l79165
7159A084740L71846K96380r9887M12917m18885J91932m97298J89447N80938N5667
7149B167797J59396o02403L80682j48248L9394J77675J05249J59973j55923J72743
7139B456335J77012R5119o66354l32685K18545J35405j60603L77209l9166l03621
7129A957196K62775J74078N0602q8756p4678P32172K91423N38342p2268K3029
$$ y = [1567540, 1825634, 1623398, 2167362, 2187044, 2003469, 2202697, 2547718, 2864275, 3363576, 3571001, 3635293, 4342208, 4254346, 3977216, 3417068, 2408022, 2342612, 2562784, 1774343, 1623065, 1567250, 1684950, 1433807, 1980155, 2316387, 2021755, 1565426, 1227397, 2176339, 2025946, 2135662, 2186962, 2201825, 2399548, 2337123, 2255724, 2498160, 2352208, 1463905, 1084740, 1456586, 1752966, 1653079, 2065996, 1647111, 1839043, 1341745, 1531192, 2112130, 2167797, 2327193, 1724790, 2105472, 1957224, 1996618, 2174293, 2279542, 2439515, 2283592, 2456335, 2633347, 2728466, 2062112, 1729427, 1947972, 2083377, 1922774, 2299983, 2260817, 1957196, 2219971, 2394049, 2444651, 2355895, 2281217, 3013389, 3304812, 3843154, 3770886, 3793915]
7119C793915L55467M59660P37562J88554P58775J457565J205606R75883J809077
7110A1742064J397027P80703J240576K68200K55268j57774j549456j337380j462047
7101A1177181k273725j399636o14199j047268p31435o71039j48112q91887j81642
7092C218238j43017l04632l85567k17121R6233L47440j30712K41428o5532l65052
7082B291706m33059J1413L1511k33983N9392j00901N21426J75947n37960k20410
7072A565082O00823m34620o10047j83477M40156l00701j42438L60445J27633L40994
7062A763850r6420J30745j64413k94367m31853q1549O03611r8764k4754j54241
7052A151845J13962j74650L5100R4546l6501q952N3044r9796j50991J44157L9794
$$ y = [3793915, 4149382, 4609042, 5346604, 5535158, 6293933, 7751498, 8957104, 9932987, 11742064, 13139091, 13919794, 15160370, 15428570, 15683838, 15526064, 13976608, 12639228, 11177181, 8903456, 7503820, 6889621, 5842353, 5110918, 4439879, 4291767, 3399880, 3218238, 3075221, 2770589, 2385022, 2167901, 2264134, 2611574, 2480862, 2722290, 2656758, 2291706, 1858647, 1870060, 1901571, 1667588, 1726980, 1626079, 2147505, 2323452, 1785492, 1565082, 2165905, 1731285, 1121238, 937761, 1377917, 1077216, 934778, 1295223, 1422856, 1763850, 1667430, 1798175, 1633762, 1339395, 907542, 825993, 1429604, 1330840, 1306086, 1151845, 1265807, 1091157, 1126257, 1220803, 1184302, 1175350, 1228394, 1128598, 977607, 1121764, 1161558]
7041A161558J56147o7564o7000j78355M64703l29036n55791k360K99375k01294
7031F80383J43422J46578J56810k3519j04452K32172J61499M44295J33271o20460
7021A349999K24260J93301k8686J74601k57818k07203q0186j99667L08046j09338
7011A367309J32092J8854k956j97618L9473l77195j82491N1524j59580M28743
7001A118155R0480K29804k74575L5038p5958k97310K90286J27238p96507L38946
6991G85597Q3344L42258K03798p0973j28403l60109j40608N06011K08939K72827
6981A702681k64167n64566k38717l36547L65551K03581M77526L64670p39635l20287
6971F50090N01017R7466m14800j39384j83114O58771M22308J79297k88891m26709
$$ y = [1161558, 1317705, 1250141, 1183141, 1004786, 1469489, 1140453, 584662, 582302, 881677, 680383, 823805, 970383, 1127193, 1103674, 999222, 1231394, 1392893, 1837188, 1970459, 1349999, 1574259, 1767560, 1738874, 1913475, 1655657, 1448454, 1368268, 1168601, 1476647, 1367309, 1499401, 1518255, 1515299, 1317681, 1357154, 979959, 797468, 848992, 689412, 1118155, 1208635, 1438439, 1163864, 1198902, 1122944, 825634, 1115920, 1243158, 446651, 785597, 868941, 1211199, 1414997, 1344024, 1215621, 855512, 714904, 1220915, 1429854, 1702681, 1438514, 873948, 635231, 298684, 664235, 867816, 1345342, 1710012, 970377, 650090, 1151107, 1248573, 833773, 694389, 511275, 1170046, 1592354, 1771651, 1482760, 1056051]
6961A056051J25377N3085L89077r5070K89956L8043r29341K33059j49406l05358
6951G05473M92644j09537J87859j32005L74417m55559j19205P42547j21854n15532
6941A049248K14601l89380J78547r3329K68593O56020m12633l35249l7517k47594
6931H51307J64901O40623l60324o68887J68555N59958j27274k60355Q1938R94065
6921B044507o3492q09923l01674L12176l53501j5551K54034L54695k06799N72550
6911A787022l20091J33987k08606o57022n0003J49602L49052M17374k65755k52851
6901A082709J16775m5085J79143j75952K91158q4945j86354Q8649O9585m9625
6891A286058L35520l44119m9635K4157M45302l50480k1172L04714K38725J95779
$$ y = [1056051, 1181428, 1234513, 1623590, 1528520, 1818476, 1856519, 927178, 1160237, 1010831, 705473, 1198117, 1088580, 1276439, 1144434, 1518851, 1063292, 944087, 1686634, 1564780, 1049248, 1263849, 874469, 1053016, 959687, 1228280, 1884300, 1471667, 1136418, 1098901, 851307, 1016208, 1656831, 1296507, 627620, 796175, 1356133, 1228859, 968504, 1050442, 2044507, 1981015, 1171092, 869418, 1181594, 828093, 812542, 1066576, 1421271, 1214472, 1787022, 1466931, 1600918, 1392312, 735290, 685287, 834889, 1183941, 1601315, 1335560, 1082709, 1199484, 1154399, 1333542, 1157590, 1448748, 1363803, 1177449, 1266098, 1335683, 1286058, 1621578, 1277459, 1227824, 1251981, 1697283, 1346803, 1325631, 1630345, 1869070, 2064849]
6881B064849m52692k27341O1781l27924K59870L90366j01510Q7275J22500n82760
6871A294414j14924K3154k29777K19067j89441r1842k8141N70005r3788k09381
6861A149346N9918m36165o5328N92840m30759J84260Q934K68506N58110m08808
6851A480854J17952m97889o0085m28424L78396j50368J83720L76603K0775n3774
6841A367760j89841l26761n549K21021l35628M6571O40985L95311k41269n15897
6831A056703N26864p0046m12171r0629K23133k7276J82068K18069k0947r7682
6821A488086P9023K23874r5148j74622n5876j4565M67207k17729j67492K57793
6811A790551k16658p3581q09888K99805J07335l96035m2227J17508L11768j95028
$$ y = [2064849, 1612157, 1384816, 1446597, 1118673, 1378543, 1768909, 1667399, 1754674, 1877174, 1294414, 1179490, 1202644, 972867, 1191934, 1002493, 910651, 882510, 1452515, 1358727, 1149346, 1209264, 773099, 707771, 1300611, 869852, 1054112, 1063046, 1331552, 1889662, 1480854, 1598806, 1100917, 1040832, 612408, 990804, 840436, 1024156, 1400759, 1421534, 1367760, 1177919, 851158, 845609, 1066630, 731002, 777573, 1418558, 1813869, 1572600, 1056703, 1583567, 1513521, 1101350, 1010721, 1233854, 1206578, 1388646, 1606715, 1585768, 1488086, 1567109, 1790983, 1695835, 1521213, 1465337, 1450772, 1917979, 1700250, 1532758, 1790551, 1573893, 1500312, 690424, 990229, 1097564, 701529, 659302, 776810, 1088578, 893550]
6801H93550j29117J44710j22406L9574L09140p5389l42808L1909L75205L48356
6791A472724j6767n9600J11545L99382l46499R2504m14915m21068M89409K37342
6781A544057K78232M2454m59084K9716R4838L11141n11649l44999j82068N82223
6771A384861k79368K6073O39923p7692O6532K02454m87584K60740k24768j10339
6761A400832k72988R4549r4908k00161K99261K91238q3151M2858M89371l79008
6751A587893p15636L57319O82335K09186k21965m43141O0067L2325J93425j87658
6741A554150J91729k16495l65969r3496k10756k84576J84888R26109m52385j41317
6731A091882J85598j09190p5955r3466K16615K31550n54638j22596O40202k63331
$$ y = [893550, 764433, 909143, 786737, 826311, 1135451, 1060062, 717254, 749163, 1124368, 1472724, 1455957, 1396357, 1507902, 1907284, 1560785, 1653289, 1238374, 817306, 1306715, 1544057, 1822289, 1864743, 1405659, 1435375, 1530213, 1841354, 1329705, 984706, 802638, 1384861, 1105493, 1131566, 1771489, 1693797, 1760329, 1962783, 1475199, 1735939, 1511171, 1400832, 1127844, 1222393, 1127485, 927324, 1226585, 1517823, 1434672, 1477530, 1966901, 1587893, 872257, 1229576, 1911911, 2121097, 1899132, 1455991, 1516058, 1548383, 1741808, 1554150, 1745879, 1529384, 1163415, 1069919, 859163, 574587, 759475, 1685584, 1233199, 1091882, 1277480, 1168290, 1092335, 998869, 1215484, 1447034, 892396, 769800, 1410002, 1146671]
6721A146671k53746n7766Q56302o1012j53248L73916p2724M09497n82529p77357
6711H28004Q43271N4415J11223j61145K05864j45529j06844j36843L4598j05659
6701A421355O75040l37993m12917k5323m8577l33890N13945K16971k05257K86567
6691A749921J11345j32886J60681n46825m01363M73080M76984K57623j60693k35176
6681A752691j82244l7573k62652O8048P33097p06208L07890K72409L45769K06382
6671B497609k46465l79810l9816K73556r81773K7447M60123L59235K05916P7007
6661B253029l15783K27102k43607l61093N9705L92702J04722k50458N64355q4426
6651B346248l62389N81196o89027k88327L0490J42384k03688k76961J43431O18759
$$ y = [1146671, 892925, 835159, 1691461, 1630449, 1477201, 1851117, 1778393, 2187890, 1605361, 828004, 1671275, 1725690, 1836913, 1675768, 1881632, 1736103, 1629259, 1492416, 1527014, 1421355, 2096395, 1758402, 1345485, 1320162, 1271585, 937695, 1451640, 1668611, 1463354, 1749921, 1861266, 1728380, 1889061, 1342236, 940873, 1413953, 1890937, 2148560, 1987867, 1752691, 1570447, 1532874, 1270222, 1338270, 2071367, 1365159, 1673049, 1945458, 2291227, 2497609, 2251144, 1871334, 1831518, 2105074, 1123301, 1150748, 1610871, 1970106, 2176022, 2253029, 1937246, 2164348, 1920741, 1559648, 1619353, 2012055, 2116777, 1866319, 2430674, 2346248, 1983859, 2565055, 1876028, 1587701, 1618191, 1760575, 1556887, 1279926, 1423357, 2042116]
6641B042116K20833j85903l08286k2616L07172o3303o91439L21408M07011K00468
6631B227461l35206l36915P0429K48970J46403j06169K30390m42976m00865o559
6621A294963o4756J0675O12610J33986r8316O69738j05274l28556m0614O06061
6611B690517m1748p40448K06856R10446l43489j97645m51151l16583J7572M37254
6601B171581N54012Q5846m39953P7013J30840m51287K2734l17619J36553N01986
6591B471706O5726L24985K7896O00354j88724j53594J215221K67921K11781O03757
6581E447029N29082k43956n87213L25480m46036n98803K91199j01285J34813K7818
6571D778128j38399n7331K86736J37159n02475R0325L34857N05609N18424R4545
$$ y = [2042116, 2262949, 2077046, 1768760, 1746144, 2053316, 1990013, 1298574, 1619982, 2026993, 2227461, 1892255, 1555340, 1625769, 1874739, 2021142, 1914973, 2145363, 1702387, 1301522, 1294963, 1230207, 1240882, 1853492, 1987478, 1889162, 2558900, 2453626, 2125070, 2084456, 2690517, 2648769, 1908321, 2115177, 3025623, 2682134, 2484489, 2033338, 1716755, 1734327, 2171581, 2725593, 2811439, 2371486, 2448499, 2579339, 2128052, 2150786, 1833167, 1969720, 2471706, 2537432, 2862417, 2890313, 3490667, 3301943, 3148349, 4363570, 4631491, 4843272, 5447029, 5976111, 5732155, 5144942, 5470422, 5024386, 4425583, 4716782, 4615497, 4750310, 4778128, 4639729, 4582398, 4869134, 5006293, 4503818, 4594143, 4929000, 5434609, 5953033, 6047578]
6561F047578J05950L15215l08958l89943N34265N0619k73143l03663O7450k63917
6551E581453J94052K41920J118320N37573N59663J311112J767084K337075J927219
6542A5575471J758780J261972j20758r58989j633931j961251j903368j449391
6534A0568535k004369j224334l12878n52722q78641j96447j11849n44341O9287
6525D812241n66039l86674K13883K04015K72083l80967M2083j1378j91098j36256
6515C871893k15193j65686j47798l24949k15839K58636K45714J7566L27109J0677
6505C662130j51802k2746l90772K18105j38686o1323N59649q622k10873k17807
6495C237253j27840m21300m3178j42373m223O27683J53505m8535J00364K25033
$$ y = [6047578, 6153528, 6468743, 6159785, 5769842, 6304107, 6354726, 6081583, 5777920, 5845370, 5581453, 5775505, 6017425, 7135745, 7673318, 8232981, 9544093, 11311177, 13648252, 15575471, 17334251, 18596223, 18475465, 17516476, 15882545, 13921294, 12017926, 10568535, 8564166, 7339832, 7026954, 6474232, 5595591, 5399144, 5287295, 4742954, 4812241, 4246202, 3859528, 4073411, 4277426, 4549509, 4168542, 4210625, 4199247, 4008149, 3871893, 3656700, 3491014, 3343216, 3018267, 2802428, 3061064, 3306778, 3324344, 3651453, 3662130, 3510328, 3487582, 3096810, 3314915, 3176229, 3114906, 3674555, 3665933, 3455060, 3237253, 3109413, 2688113, 2644935, 2502562, 2498339, 3126022, 3279527, 3230992, 3331356, 3556389]
6485C556389m24251j72128K87220M43457K04818n99072p55476P8134j92070j45195
6475B281826L74094Q7347j9625o7607K70727N04859K40830m7347j24696p34994
6465B765414j29374M8368j8770J53229J27534R2210Q31129R434m78334n63365
6455B837475k73956L92325n3151L29167J26354j09631n08226J54414k27566J70714
6445B837919j12082k30900l81181O20608M19792n816J15521k07396P240J6246
6435C079951k35592M80442l35487K29784l43363M66463M29278q7571M83326j94494
6425C972737J34687K61936K27327k35893J051461O17799N22941N63416R71248
6416H087659J347566K268963J553483R99086P98269m36197o52045j682010j681814
$$ y = [3556389, 3132138, 2960010, 3247230, 3690687, 3895505, 3296433, 2540957, 2619091, 2427021, 2281826, 2655920, 2743267, 2723642, 2656035, 2926762, 3431621, 3672451, 3625104, 3500408, 2765414, 2636040, 2684408, 2665638, 2818867, 2946401, 3038611, 3869740, 3879174, 3400840, 2837475, 2563519, 2955844, 2902693, 3231860, 3358214, 3248583, 2740357, 2894771, 2667205, 2837919, 2725837, 2494937, 2113756, 2734364, 3154156, 3148340, 3263861, 3056465, 3063705, 3079951, 2844359, 3324801, 2989314, 3219098, 2875735, 3342198, 3771476, 3683905, 4167231, 3972737, 4107424, 4369360, 4596687, 4360794, 5412255, 6030054, 6552995, 7116411, 8087659, 9435225, 11704188, 13257671, 14256757, 15055026, 14618829, 13966784, 12284774, 10602960]
6407A0602960j454157r76546o92368j85935n00650p47008o44562j06882P11524
6398F006376k590q4577O2586j48502J50380Q6765L2370j01936J39048n87622K20626
6387E772924N60432J78465M23250P90743J052767J185579J101305M64686O00216
6378A2130367Q0055m08282j181408k45524j039721j087914q73928l83702n72350
6369F417593k16375K2622n29966P4572j03886j94014n0571m64707k73334n16956
6359D164978n45833o7628O17732l06750J44296J98637p75272L2556J4528N0443
6349C527687L3525l80885M41836K58464j12983J13487l58129m55963j64679J09366
6339C011726O5845L63331k39395k74385J34919K11816J63242K37971q27974k27230
$$ y = [10602960, 9148803, 8172257, 7479889, 7293954, 6793304, 6046296, 5401734, 5294852, 6006376, 6003786, 5919209, 5981795, 5833293, 5983673, 6070438, 6102808, 6000872, 6139920, 5552298, 5772924, 6333356, 6511821, 6935071, 7725814, 8778581, 9964160, 11065465, 11530151, 12130367, 12210422, 11802140, 10620732, 10375208, 9335487, 8247573, 7373645, 6989943, 6417593, 6201218, 6223840, 5693874, 5768446, 5664560, 5470546, 5419975, 4955268, 4681934, 4164978, 3619145, 3551517, 4169249, 3862499, 4006795, 4205432, 3430160, 3462716, 3477244, 3527687, 3561212, 3180327, 3622163, 3880627, 3767644, 3881131, 3523002, 3067039, 2902360, 3011726, 3077571, 3440902, 3201507, 2927122, 3062041, 3273857, 3437099, 3675070, 2847096, 2619866]
6329B619866K74542k511N7105Q51678k10943o70369O1296J78475M3036J59668
6319C361843J00054o03996L99768j66057l45710p5665L5835j79808j96573K67830
6309B597521R9962l2312N92190K47860K52604n1990r55095l13180N2387r6211
6299B393736N23907J26486O9970l0607k92379m41181K14789q8614J55357L09409
6289B940873k61617K24621r3241J66847P5396K97094J12715m56112J68836J29263
6279C304675j007969j58299L12658K2218O59650J76130k26141j64231l78474M37887
6269B978104J27998L16887o0205j70984j67154K4359K14675P6629K4992k53368
6259C111933L65080k17367k22730J0943K20099L59598k38081o58746N37201L23505
$$ y = [2619866, 2894408, 2891897, 2949002, 3800680, 3589737, 2919368, 2980664, 3159139, 3202175, 3361843, 3461897, 2857901, 3257669, 3091612, 2745902, 2670237, 2706072, 2526264, 2329691, 2597521, 2697483, 2665171, 3257361, 3505221, 3757825, 3705835, 2750740, 2437560, 2489947, 2393736, 2917643, 3044129, 3114099, 3083492, 2791113, 2349932, 2564721, 2476107, 2631464, 2940873, 2679256, 2903877, 2810636, 2977483, 3052879, 3349973, 3462688, 3006576, 3175412, 3304675, 2296706, 2138407, 2451065, 2473283, 3132933, 3309063, 3082922, 2918691, 2540217, 2978104, 3106102, 3422989, 3362784, 3191800, 3024646, 3049005, 3263680, 3340309, 3365301, 3111933, 3477013, 3259646, 3036916, 3047859, 3267958, 3627556, 3389475, 2730729, 3267930, 3591435]
6249C591435k79440k4146p3830M42798m13831l46355k1930K45590P8892L27111
6239C526294r6720K37885R8945k68350K21539k5078J08009L02034l02079j67724
6229C634755j39924J14351k11298J71253j88750j35038q9466O00854N21508o15031
6219C663214P47414j06057n14715k98679j44658M71881N50458l35381O0014J81730
6209D275221L80925J97119l23935l52093P9355R44069K25761q78814l42436l14171
6199C891001N94734J31081J44664n58712n33905J28808n15980k82770O31657O28221
6189D258799j90198R951K65564M5103M81530j36962L15845k2278j20024j91134
6179D716196m57341M12863N25548J23289r8544j6145o71064m22544L9322O40752
$$ y = [3591435, 3311995, 3287849, 3214019, 3656817, 3242986, 2896631, 2874701, 3120291, 3199183, 3526294, 3429574, 3667459, 3766404, 3498054, 3719593, 3694515, 3802524, 4104558, 3802479, 3634755, 3494831, 3609182, 3397884, 3569137, 3380387, 3245349, 3155883, 3756737, 4278245, 3663214, 4410628, 4304571, 3789856, 3491177, 3346519, 3818400, 4368858, 4033477, 4093491, 4275221, 4656146, 4853265, 4529330, 4177237, 4256592, 5200661, 5426422, 4547608, 4205172, 3891001, 4485735, 4616816, 4761480, 4202768, 3668863, 3797671, 3281691, 2998921, 3630578, 4258799, 4068601, 4078552, 4344116, 4389219, 4870749, 4733787, 5049632, 5027354, 4907330, 4716196, 4258855, 4671718, 5197266, 5320555, 5222011, 5205866, 4534802, 4112258, 4151580, 4792332]
6169D792332m80776L43006k08031j20160K95614L41371K47854n9886K44384K63491
6159E659199P63088R70177N10185P147n06531j94925p45812j49176l79653m06743
6149E526956J90335l35017m78701n65439L07140n7389K05028j93314k27601K32164
6139D604162j51802O2409J54375n7489k00164j5896K4833M7372K17832j1045l42933
6128D331654m57396k5847M60907K27783m35300L45614J33014k52234j78887Q7405
6118D236713o09063n69922O09669N86953N76182l04999K24344M96793N9484m16277
6108D889877L44308J43992K49429J11163n76819N17016m00889n83452l1057K37899
6098D901467M89369N12709l40667k74459o1702J09548J75805N52070k4024J07990
$$ y = [4792332, 4311556, 4654562, 4446531, 4326371, 4621985, 4963356, 5211210, 5151324, 5395708, 5659199, 6422287, 7392464, 7902649, 7909796, 7403265, 7208340, 6462528, 6313352, 5933699, 5526956, 5717291, 5382274, 4903573, 4338134, 4645274, 4587885, 4792913, 4599599, 4371998, 4604162, 4452360, 4514769, 4669144, 4611655, 4411491, 4395595, 4420428, 4467800, 4685632, 4674587, 4331654, 3874258, 3848411, 4309318, 4537101, 4101801, 4447415, 4580429, 4328195, 4149308, 4236713, 3627650, 3057728, 3667397, 4254350, 4830532, 4525533, 4749877, 5246670, 5306154, 4889877, 5234185, 5378177, 5627606, 5738769, 5161950, 5678966, 5278077, 4694625, 4663568, 4901467, 5390836, 5903545, 5562878, 5288419, 5226717, 5336265, 5512070, 6064140, 6040116, 6148106]
6088F148106J38998k26064o1089J27294N82836o7338n4807L59973J085077p66584
6078G266402M065J190245N15798j94279n35817M71375O50958K71440K60269K7635
6068I928091l47658l66860k87542k56367N72088M80672o99855n1168J51019j43091
6058H979329n81236L4124m16978k3481n09399n8981J71967J03641L4701R4130
6048G827817O61458l6793J72338k36598j88611n37244q939L21374J05887o3300
6038H017389j14387p7079j29598M86101K70710j91062k01360m55314J51990P00349
6028H457739L24478L84478Q7687o2338J57179L3384K35827j27234J2702m63900
6018I040002k42325K19246k1013k02125O82145O10504l97373L28698R4208l62332
$$ y = [6148106, 6287104, 6061040, 5999951, 6127245, 6710081, 6642743, 6587936, 6947909, 8032986, 7266402, 7270467, 8460712, 8976510, 8782231, 8246414, 8717789, 9368747, 9640187, 9900456, 9928091, 9580433, 9213573, 8926031, 8669664, 9241752, 9722424, 9022569, 8971401, 9122420, 8979329, 8398093, 8432217, 8015239, 7991758, 7482359, 7423378, 7595345, 7698986, 7733687, 7827817, 8489275, 8452482, 8624820, 8388222, 8199611, 7662367, 7653428, 7974802, 8080689, 8017389, 7903002, 7825923, 7696325, 8182426, 8453136, 8262074, 8060714, 7605400, 7757390, 8457739, 8782217, 9166695, 9254382, 9192044, 9349223, 9382607, 9618434, 9491200, 9503902, 9040002, 8797677, 9016923, 8995910, 8793785, 9475930, 10086434, 9689061, 10017759, 10111967, 9749635]
6008I749635J93680k11240L1890M69336K19093n36119l868N25400j87281O11838
5998A0862364N01008R9172K76462k41706k54398k49977j93687K82970N28169L35879
5988A1946256k13969M45304j24321o00757o0413O61895J04516r9368N39952j05993
5978A2493102l59517N48069J171553Q96539P78983Q95232P24107J070622Q20428
5969A9039118J307632J662484J707219K420035K554060L417910M198935M098235
5961D0405628L699898L224315K786782K012862J007159L25473r87772j801558
5953E0672787k204154k359542k785759k417777k489948l015590j843178j211716
5945C2345123j325606J13477M33650J241782J374655J659417L130869L938473
$$ y = [9749635, 9943315, 9732075, 9763965, 10233301, 10452394, 9916275, 9912407, 10437807, 10250526, 10862364, 11363372, 11462544, 11739006, 11497300, 11242902, 10992925, 10799238, 11082208, 11610377, 11946256, 11732287, 12177591, 12053270, 11452513, 11392100, 12053995, 12158511, 12059143, 12599095, 12493102, 12133585, 12681654, 13853207, 14749746, 15528729, 16423961, 17148068, 18218690, 19039118, 20346750, 22009234, 23716453, 26136488, 28690548, 32108458, 36307393, 40405628, 44105526, 47329841, 50116623, 52129485, 53136644, 53462117, 52474345, 50672787, 48468633, 46109091, 43323332, 40905555, 38415607, 35400017, 33556839, 32345123, 31019517, 31132994, 31566644, 32808426, 34183081, 35842498, 38973367, 42911840]
5937D2911840L696347L214719K855151J583893J549721N91749l55576L10013Q2307
5928E6440164L69075o2861j639136k478555l591527m262074l967639l751167m050003
5919C3006277l398227k551328k656390k189773j715483q97732p83400j362032
5911A7451912j492060o90285n65963n74810l86784n47980k38116J99092j41820
5902A3013186m47615J66626K62173k08923l94454m28021o25536M5758L24918n8270
5892A1649842p08329l87860l63242J19617J09080k55178l74055N458M39341l0724
5882A0203950m52830k47122J76177r5139j24353J20324k95498J66024Q982R7455
5872I557970Q7925j19015J93802k22786m05523K5308N94483J056154L59824M21377
$$ y = [42911840, 46608187, 49822906, 52678057, 54261950, 55811671, 56403420, 56047844, 56357857, 56440164, 56809239, 56746378, 55107242, 52628687, 49037160, 44775086, 40807447, 37056280, 33006277, 29608050, 27056722, 24400332, 22210559, 20495076, 19597344, 18813944, 17451912, 15959852, 15269567, 14703604, 14128794, 13742010, 13194030, 12955914, 13155006, 13013186, 12565571, 12732197, 12994370, 12785447, 12390993, 11962972, 11337436, 11383194, 11708112, 11649842, 10941513, 10553653, 10190411, 10310028, 10419108, 10163930, 9789875, 9795333, 10234674, 10203950, 9751120, 9503998, 9680175, 9585036, 9460683, 9581007, 9285509, 9451533, 9460515, 9557970, 9645895, 9526880, 9720682, 9497896, 9092373, 9117681, 9712164, 10768318, 11128142, 11549519]
5862A1549519M81650K12663K08925l06364K97022j32096o24483l77189k51914
5853A1057733n41918m75701n14611l58293j45208l55504K73991J21168l66615
5844H695042l29327J84154K37889l10177M77238L12119n18216J10418J2067L1679
5834H902886J71035L04103L52884K83251Q04562M79401N84561K18775L14967M33942
5824A2850367O20065j79305k31257O751l17739K9469l17190K55127L68739k5607
5814A3059420L75557j90816N62871N04481K39548M11133N72755M12363l99113
5805A5548199L99527k25162J10607j71025M42086M09247J018140K23928r7273
5796A7658274M10801M88824M8372j1510R8858K8462o1305M43928J501555j3254
$$ y = [11549519, 12031169, 12243832, 12452757, 12146393, 12443415, 12311319, 11686836, 11309647, 11057733, 10515815, 10040114, 9525503, 9167210, 9022002, 8666498, 8940489, 9061657, 8695042, 8365715, 8549869, 8787758, 8477581, 8954819, 9266938, 8748722, 8859140, 8871207, 8902886, 9073921, 9378024, 9730908, 10014159, 10818721, 11298122, 11882683, 12101458, 12416425, 12850367, 13470432, 13291127, 13059870, 13066621, 12748882, 12778351, 12461161, 12716288, 13085027, 13059420, 13434977, 13244161, 13807032, 14311513, 14551061, 14962194, 15534949, 15947312, 15548199, 15947726, 15722564, 15833171, 15662146, 16104232, 16513479, 17531619, 17755547, 17658274, 18069075, 18557899, 18606271, 18594761, 18693619, 18722081, 18660776, 19104704, 20606259, 20593005]
5786B0593005j33731M81140j57854K27025P57680K1681J18605N4429o68527o25710
5776B0667743L36103r6807j7149o92574q8502M58234J21996K17159l04355m00031
5766B0201817k3226k65780l23745N33036O92569N47207m1111K95K55655l19973
5756B1256744k24304j169985j83287j19667q84255m84287m73306k772J18516M13189
5746A8246586p3607K64386m93858k13624K52593n2338j0218n08760l54905o39945
5736A6416310J14248p54513l56268O29571q49456m06831J27419p36779q11202
5727A3372499r39043L86816J94612n13871n21333m5799j49029J54361K9927j03325
5717A1865815K25815k94646O47313L4278j30387J8910p39116p5757J123N57953
$$ y = [20593005, 20459274, 20940414, 20782560, 21009585, 21767265, 21788946, 21907551, 21961980, 21293453, 20667743, 21003846, 20907039, 20889890, 20197316, 20108814, 20567048, 20689044, 20906203, 20601848, 20201817, 20178591, 19912811, 19589066, 20122102, 20814671, 21361878, 21320767, 21321062, 21576717, 21256744, 21032440, 19862455, 19679168, 19559501, 18675246, 18190959, 17717653, 17714881, 17833397, 18246586, 18172979, 18437365, 17943507, 17729883, 17982476, 17930138, 17919920, 17411160, 17056255, 16416310, 16530558, 15776045, 15419777, 16049348, 15199892, 14793061, 14920480, 14183701, 13372499, 12433456, 12820272, 13014884, 12501013, 11979680, 11933881, 11784852, 11939213, 11969140, 11865815, 12091630, 11796984, 12444297, 12478575, 12348188, 12367098, 11627982, 11552225, 11553348, 12111301]
5707A2111301K26382O101K81075K38718m69327m09330j88782J88252o14178J67535
5697A1537747P99173o26891l84670j55421q7651K30522K52736m1217j42464o3810
5687A1318054L11228j51075N84404K405N7272L51844L50180J00446L2239K39555
5677A3196552J78689Q1718Q50371L91045N42421N17973j87875o44268m51457k80741
5667A4194428l16676L9025j84106K62619N86172l06171O15798K04261k43646q4575
5657A4767129J74711K9920J37075K91656M57865J91849j18043k9925J002344J99624
5647A7104205N49823J070232J87750N21883R32081Q07724J211410N04154N32087
5638B3421349J094421N09973J160380J265099R50267N28521J660501J037500J222272
$$ y = [12111301, 12337683, 12343784, 12624859, 12863577, 12394250, 11984920, 11796138, 11984390, 11370212, 11537747, 12336920, 11710029, 11325359, 11169938, 11082287, 11312809, 11565545, 11524328, 11381864, 11318054, 11629282, 11478207, 12062611, 12065016, 12122288, 12474132, 12824312, 12924758, 12956997, 13196552, 13375241, 13456959, 14307330, 14698375, 15240796, 15758769, 15570894, 14926626, 14475169, 14194428, 13877752, 13916777, 13732671, 13995290, 14581462, 14275291, 14891089, 15095350, 14851704, 14767129, 14941840, 14971760, 15108835, 15400491, 15858356, 16050205, 15932162, 15902237, 16904581, 17104205, 17654028, 18724260, 18912010, 19433893, 20365974, 21173698, 22385108, 22889262, 23421349, 24515770, 25025743, 26186123, 27451222, 28401489, 28930010, 30590511, 31628011, 32850283]
5629C2850283J490198J456089M42355Q63302M17555J112731N19292j78533J088282
5620D0061554J142772P30028O77769J517962J548935K203013K091034K051655
5612E2024722J994860K447954L150780L022409M983960N208212O464638P143036
5604H6440571Q200371Q817291Q914998R817435J1025564J2670590J0246671P395173
5596A63528664K524625j670382m182754m585825n330330m263330k900320k317640
5588A40802708j828008n35678j07166l39121M94691o0709j196494k219533k986027
5579A32024663m402223l965053n508968n064148n846647o913551n978723o103926
5571H8241424n735805o601263n841322n099023m426355m381322l674603l290976
$$ y = [32850283, 34340481, 35796570, 36238925, 37102227, 37519782, 38632513, 39151805, 38973272, 40061554, 41204326, 41934354, 42612123, 44130085, 45679020, 47882033, 49973067, 52024722, 54019582, 56467536, 59618316, 62640725, 67624685, 72832897, 79297535, 86440571, 94640942, 103458233, 112373231, 122190666, 133216230, 145886820, 156133491, 163528664, 166053289, 164382907, 160200153, 155614328, 150283998, 146020668, 143120348, 140802708, 138974700, 138439022, 138331856, 137992735, 138487426, 138426717, 137230223, 135010690, 132024663, 127622440, 123657387, 118148419, 113084271, 107237624, 100324073, 94345350, 88241424, 82505619, 75904356, 70063034, 64964011, 60537656, 56156334, 52481731, 49190755]
5563D9190755l159345k035388k717570k402838k263685j142855j893708k022529
5555C1552837j272498j604550j029589r94846r52117j325756j170211p90347r5168
5546B2317755m86028j325744o22358m46596m1073l50392k71740J71206n69490
5537A8375540j015459k36593K55214n26544n00757r59109k86638P73325j40210
5528A5738769l04821l23325j81694k58137l548k6996r8764j16500k37408O0663
5518A4248239n65356k63945j74907k86481Q5493j78137o06620k27776k42426M11325
5508A2199409M5812p10372l05188k88466l5386L26573R5982p14319m27735n70953
5498I615357m33351L77976L66220Q2435K21958l997M08907L00916L86016L13964
$$ y = [49190755, 46031410, 43996022, 41278452, 38875614, 36611929, 35469074, 33575366, 31552837, 30280339, 28675789, 27646200, 26651354, 25699237, 24373481, 23203270, 22412923, 22317755, 21831727, 20505983, 19883625, 19437029, 19395956, 19045564, 18773824, 18945030, 18375540, 17360081, 17123488, 17378702, 16852158, 16351401, 15392292, 15105654, 15878979, 15738769, 15433948, 15110623, 14928929, 14670792, 14667244, 14640248, 14541484, 14424984, 14187576, 14248239, 13682883, 13418938, 13244031, 12957550, 13043043, 12864906, 12258286, 12030510, 11788084, 12199409, 12245221, 11534849, 11229661, 10941195, 10905809, 11232382, 11328364, 10614045, 10186310, 9615357, 9182006, 9559982, 9926202, 10008637, 10230595, 10226598, 10635505, 10936421, 11322437, 11636401]
5488A1636401k09024p72859P0231l35644n26311j04916m47267M4035K05704M7702
5478I608052L90516l10198o38642j66641l54822K33123j59219k84996l84701M43566
5468H376038R2907m92929l65523L79630q8587K35097j30899j84787p86880n3072
5458F980995k6183M11672M63814l30370k07192J66967m17965k79470L76381M58852
5448G597501J15076j81675L03800k6824J0919J47078M03938k58222m71041o10157
5438G030393o9772m14799J75811K96707j82084k01167N44116l37772L86961J7097
5428G245491n60775l3601k19959l73576k7528M7814j1951L09610l5914j7953J06994
5417F428652N08846O7848L21761J54164l09668j45657L26223P7348n9023m19054
$$ y = [11636401, 11427377, 10654518, 10724749, 10389105, 9862794, 9757878, 9310611, 9354646, 9560350, 9608052, 9998568, 9688370, 9049728, 8883087, 8528265, 8761388, 8602169, 8317173, 7932472, 8376038, 8468945, 7976016, 7610493, 7990123, 7901536, 8136633, 8005734, 7820947, 7034067, 6980995, 6954812, 7366484, 7830298, 7499928, 7292736, 7459703, 7041738, 6762268, 7138649, 7597501, 7712577, 7530902, 7834702, 7807878, 7818797, 7965875, 8369813, 8111591, 7640550, 7030393, 6960621, 6545822, 6721633, 7018340, 6836256, 6635089, 7179205, 6841433, 7228394, 7245491, 6684716, 6651115, 6431156, 6057580, 6030052, 6077866, 6065915, 6375525, 6339611, 6321658, 6428652, 6937498, 7005346, 7327107, 7481271, 7171603, 7025946, 7352169, 7429517, 7370494, 6951440]
5407F951440j75074N5049n94246m72790L31987j41401p10810J13899r2210J77540
5397E443384O58903N0121n17055O68750m16915j019619M44387L77493L52211k20047
5387E821613P8627n28568L9258K07431L58509L41291n67501R6411l24758j88689
5377E333624J68905q92184J84110N79715K26861l76320M67372j83893m89111r0477
5367D928602k55103M85690K85467L20077N8835o02370j99662q49710L3781O38700
5357D844307l9014p5537j51790L66703j56374o4745m40503j51839J03843M82484
5347D717535o9664k20797l07339R84863K58432l26329p36258n4626P6039L39810
5337D661666r5916k09569K69355o2718Q0502Q7299k47932m38424R1579L50558
$$ y = [6951440, 6776366, 6831415, 6237169, 5764379, 6096366, 5954965, 5244155, 5358054, 5265844, 5443384, 6102287, 6152408, 5635353, 6304103, 5887188, 4867569, 5311956, 5689449, 6041660, 5821613, 5900240, 5371672, 5410930, 5618361, 5976870, 6318161, 5750660, 5847071, 5522313, 5333624, 5502529, 4610345, 4794455, 5374170, 5601031, 5224711, 5692083, 5508190, 5019079, 4928602, 4673499, 5159189, 5444656, 5764733, 5823568, 5221198, 5021536, 4171826, 4205607, 4844307, 4805293, 4729756, 4577966, 4944669, 4788295, 4723550, 4283047, 4131208, 4235051, 4717535, 4647871, 4427074, 4119735, 5104598, 5363030, 5036701, 4300443, 4245817, 4321856, 4661666, 4565750, 4356181, 4625536, 4562818, 4643320, 4730619, 4482687, 4044263, 4135842, 4486400]
5327D486400L30208l95637L43523j17015l21571J16278J21634j05680l36125M13448
5317D535463L77426p875n31531O6313j85978r8178R9544L39439K40507o23739
5307D211391l58737l92348K91039K59057J39463K23697P58655K16839m11892J66101
5297E103265M2623r4832K20857J72713o31354l31740l82420K94106J59882K15946
5287D769046P85669N36823m53443n49449M22802m58783l9920K2170l6352N70372
5277E568935M2950j61773l58856n0606n72929N03185k10338k01769J225943M41496
5267F226238k71003l46051L7601n33182j19744j40526O22713J16337k39376j98283
5257E154724m09126j94393O59709j16580j73918Q4417P3958J71832K7435j86679
$$ y = [4486400, 4816608, 4420971, 4764494, 4647479, 4325908, 4442186, 4563820, 4458140, 4122015, 4535463, 4912889, 4905014, 4373483, 4439796, 4253818, 4155640, 4255184, 4594623, 4835130, 4211391, 3852654, 3460306, 3751345, 4010402, 4149865, 4373562, 5132217, 5349056, 4937164, 5103265, 5145888, 5051056, 5271913, 5444626, 4813272, 4481532, 4099112, 4393218, 4553100, 4769046, 5554715, 6091538, 5638095, 5088646, 5511448, 5052665, 5012745, 5034915, 4998563, 5568935, 5611885, 5450112, 5091256, 5040650, 4467721, 4970906, 4760568, 4558799, 5784742, 6226238, 5955235, 5609184, 5646785, 5113603, 4993859, 4853333, 5476046, 5592383, 5353007, 5154724, 4745598, 4551205, 5210914, 5094334, 4920416, 5004833, 5078791, 5250623, 5278058, 5091379]
5247E091379J93157k17239k95444N42916J16467J11729O5608m24032K31868l36641
5237E079768J76568J96266N61050M59009k42782l12002P88227M15955K12018p8620
5227G255457K03784J11064J37141n59362l3088l44555k73734m2909J10451Q80608
5217G444857m10931m76328k44712j16191J16174n0220o78610K35257L04796K96117
5207F420209j79983j07096M2193L6597K58729J32044n30423K22458N34121Q5852
5197F914701k83764Q6805m7004M01757J68751o0864j93441L73313q3773N4088
5187G330569k14670n48732r5890Q54320p6773o9451j50677l74801L005k29575
5177F427325L00193L27780j44965K05653J45541m50155j03050N46607L15183k22444
$$ y = [5091379, 5284536, 5067297, 4771853, 5314769, 5431236, 5542965, 5608573, 5184541, 5416409, 5079768, 5256336, 5452602, 6013652, 6472661, 6229879, 5917877, 6706104, 7122059, 7334077, 7255457, 7459241, 7570305, 7707446, 7148084, 7114996, 6770441, 6496707, 6453798, 6564249, 7444857, 7033926, 6557598, 6312886, 6196695, 6312869, 6262649, 5584039, 5819296, 6124092, 6420209, 6240226, 6133130, 6175323, 6211920, 6470649, 6602693, 6072270, 6294728, 6828849, 6914701, 6630937, 6717742, 6670738, 7072495, 7241246, 7180382, 6986941, 7360254, 7276481, 7330569, 7115899, 6567167, 6471277, 7325597, 7248824, 7179373, 7028696, 6653895, 6656900, 6427325, 6727518, 7055298, 6910333, 7115986, 7261527, 6811372, 6708322, 7254929, 7570112, 7347668]
5167G347668J98053l51373j91820N15727n10918M52821P08945P10572l63841o67577
5157G848257K86793J965N68455O00719n38705m98234K94124O7808j1836m31266
5147H188080K1351J46968K74560n31413j12315M52927P55119n88239k338m47L3516
5136H637769N20647j8063J81531L0500R8860M6581M46620J66150N63331N21088
5126A1195014Q42356Q98280J531493R08536N92495J63490l86305j4818j498122
5117A4232419j566133j015094n88985L5795m24767l82058j66122k58561k29595
5108I636899Q4507n1760M6522l23610k55226k82428j06242M67030K40382J22501
5098I578575M54471m98718k34530N40533k88145J00604N7882L30484M51791P12413
$$ y = [7347668, 7545721, 7194348, 7002528, 7518255, 7007337, 7460158, 8169103, 8879675, 8515834, 7848257, 8135050, 8137015, 8705470, 9306189, 8767484, 8269250, 8563374, 8631182, 8619346, 8188080, 8209431, 8356399, 8630959, 8099546, 7987231, 8440158, 9195277, 8607038, 8604700, 8604253, 8637769, 9158416, 9140353, 9321884, 9352384, 9451244, 9497825, 9944445, 10110595, 10673926, 11195014, 12037370, 12935650, 14467143, 15375679, 15968174, 16131664, 15745359, 15730541, 14232419, 12666286, 11651192, 11062207, 11098002, 10673235, 10291177, 10125055, 9866494, 9636899, 9721406, 9669646, 9716168, 9392558, 9137332, 8854904, 8748662, 9215692, 9456074, 9578575, 10033046, 9534328, 9299798, 9840331, 9552186, 9652790, 9710672, 10041156, 10492947, 11205360]
5088A1205360J8572k84852r3734J8699J47842P8883N22852o05659m15821M50837
5078A1042979l68823k58175l79061J60137L3963l61966j43015R62999J14157j83033
5068A0620162N16139J125351j4165j30619P318n5414j28644J66422J72928k85179
5058A1994299m95597l87149N18211L8420l07227j47247m8129J8842P8885j76800
5048A1086508m5303K18925q9220L05775Q68966O51029l5508K03459L58684k33986
5038A3289329j11686l75129n6620M90923K7814q5535P98319o69195k68758N85512
5028A3624974l860j63458L71240k62577K07303L90077K72255M81981O94312J846375
5018A7458622J113950J967704J857963N57894N23355K81979j488677j710144j178610
$$ y = [11205360, 11223932, 10939080, 10845346, 10864045, 11011887, 11090770, 11613622, 11007963, 10592142, 11042979, 10674156, 10415981, 10036920, 10197057, 10231020, 9869054, 9726039, 10689038, 10803195, 10620162, 11136301, 12261652, 12247487, 12116868, 12124186, 12068772, 11940128, 12106550, 12279478, 11994299, 11498702, 11111553, 11629764, 11668184, 11360957, 11213710, 11165581, 11184423, 11263308, 11086508, 11041205, 11260130, 11170910, 11476685, 12345651, 12996680, 12961172, 13164631, 13523315, 13289329, 13177643, 12802514, 12745894, 13236817, 13264631, 13179096, 13977415, 13308220, 13039462, 13624974, 13621114, 13457656, 13828896, 13566319, 13773622, 14163699, 14435954, 14917935, 15612247, 17458622, 18572572, 20540276, 22398239, 22956133, 23479488, 23761467, 22272790, 20562646, 19384036]
5009A9384036j263094j135704m16632k76463J33505k80630k00708K40085R9096
5000A6283491K3426l79552N50543N2155K13486M56510j4757J22833O24734k35342
4990A7697527J93710O95372J0750M17097j22268m88083J88444J41422J64365M02075
4980A9300411J36769l08478N83682q9827M26943j73126L60703M58709l45506N82449
4970B0932729O40500R6524J044177L93021Q3905J25897Q55843O60356L86442M90754
4960B5710148J90808P37348j73565M55196P59339Q80163J528080J623952J683334
4951C3394803K399079K169109J296469n05092L88694o14191j121336q18920p45684
4942C5842931j68335j133735n14971M94938J73003r4745N81635l13332l69837
$$ y = [19384036, 18120942, 16985238, 16568606, 16292143, 16425648, 16145018, 15944310, 16184395, 16283491, 16306917, 15927365, 16477908, 16530063, 16743549, 17200059, 17185302, 17308135, 17932869, 17697527, 17891237, 18586609, 18597359, 19014456, 18892188, 18404105, 18592549, 18733971, 18898336, 19300411, 19437180, 19128702, 19712384, 19622557, 20049500, 19876374, 20237077, 20695786, 20350280, 20932729, 21573229, 21669753, 22713930, 23106951, 23190856, 23316753, 24172596, 24832952, 25219394, 25710148, 25900956, 26638304, 26464739, 26919935, 27679274, 28559437, 30087517, 31711469, 33394803, 35793882, 37962991, 39259460, 38754368, 39143062, 38528871, 37407535, 36588615, 35842931, 35674596, 34540861, 34025890, 34520828, 34693831, 34599086, 35180721, 34867389, 34497552]
4933C4497552M16970r3101K55018P01802N42170M41226R08204L49477Q05924J182430
4923D0007672L35643R14097J376712J062923M2100m3895K41553k0009K21777J52391
4913D4290964o1937K04900J45001L70807O16709Q04904J020359J07558Q11232
4904D8310497J122081J031425K13632K68453Q85878M74595Q89929R56500K13525
4895E4366515N13217K21157k26823r3192m82966K94729L21497P46501P44230K25694
4885E6630559J211367J107317J531434J602559J344759J462173J532045J078424
4877F7500637J436739R07446K223445K329274J733201K384306K541919L262372
4869H4319339L178695L755702M017265N773312P104130P712125R863922J2021137
$$ y = [34497552, 34914522, 34821421, 35076439, 35778241, 36320411, 36761637, 37669841, 38019318, 38825242, 40007672, 40343315, 41257412, 42634124, 43697047, 43739147, 43695252, 43936805, 43916796, 44138573, 44290964, 44229027, 44433927, 44578928, 44949735, 45566444, 46371348, 47391707, 47499265, 48310497, 49432578, 50464003, 50677635, 50946088, 51831966, 52306561, 53196490, 54152990, 54366515, 54879732, 55100889, 54874066, 54780874, 54297908, 54592637, 54914134, 55660635, 56404865, 56630559, 57841926, 58949243, 60480677, 62083236, 63427995, 64890168, 66422213, 67500637, 68937376, 69844822, 72068267, 74397541, 76130742, 78515048, 81056967, 84319339, 87498034, 91253736, 95271001, 101044313, 108148443, 115860568, 125724490, 137745627]
4861A37745627J5867676J9967603K3296414K6245457L0408697L1806040K9744846
4854C15082360K2010403P122525o567343j6766913k3480764k7216580k7907476
4847B42276212k6634924k4325825k1567019j7985532j5486188j2661163j1243657
4840A12371904q883467p718292o721061n024368n002825l855737k891254k953019
4832F9321881k528508k102306j630110j556826j366956j829234j322246j340618
4824E5645077j297188r94744k76650n9269n56254k20595K72018p7572O25294O90190
4814E3750307J182118R45397R93827J357086J124473P48286K62528R16165J436952
4805F2717139K069218K013474K265718J803844J914659J677368J844872Q34332
$$ y = [137745627, 153613303, 173580906, 196877320, 223122777, 253531474, 285337514, 315082360, 337092763, 344215288, 337647945, 320881032, 297400268, 270183688, 242276212, 215641288, 191315463, 169748444, 151762912, 136276724, 123615561, 112371904, 103488437, 95770145, 89049084, 84024716, 79021891, 75166154, 72274900, 69321881, 66793373, 64691067, 63060957, 61504131, 60137175, 58307941, 56985695, 55645077, 54347889, 53353145, 53076495, 53017226, 52460972, 52240377, 52512395, 52434823, 53060117, 53750307, 54932425, 55877822, 56871649, 58228735, 59353208, 60101494, 60364022, 61280187, 62717139, 64786357, 66799831, 69065549, 70869393, 72784052, 74461420, 76306292, 77140624]
4797G7140624J126153O18863O18317L33910J05604n81855o43849K82886p86248
4788G8214405o23822q92232j478701p12754q90777n69730m37405n46142k80875
4779G1781967j425147q65723r69611j116360k5905m7796j066052k43061j147674
4770F4874638j463744j483180j857012k149052k323806k106628k381793j787704
4762D9321719k042081k121995j227799j125715j293170q65184n78050k33943n4523
4753C9779259r6837j51260J44571O21957P90693Q69723J028954J146762J421065
4744D5554887O29717J412718J713656J493188J908726J839296K278176J383379
4736E8213743O13043N32250m54471j454844j970458j425157r94877k85477j111580
$$ y = [77140624, 78266777, 78885640, 79503957, 79837867, 79943471, 79361616, 78717767, 79000653, 78214405, 77590583, 76698351, 75219650, 74506896, 73616119, 73046389, 72608984, 72062842, 71781967, 70356820, 69491097, 68521486, 67405126, 67379221, 67331425, 66265373, 66022312, 64874638, 63410894, 61927714, 60070702, 57921650, 55597844, 53491216, 51109423, 49321719, 47279638, 45157643, 43929844, 42804129, 41510959, 40645775, 40067725, 39833782, 39779259, 39682422, 39531162, 39675733, 40297690, 41088383, 41958106, 42987060, 44133822, 45554887, 46184604, 47597322, 49310978, 50804166, 52712892, 54552188, 56830364, 58213743, 58826786, 59359036, 58904565, 57449721, 55479263, 54054106, 53059229, 52773752, 51662172]
4727E1662172q13681j37455N50147N62032O88025J264955J421233M01345l67079
4718E5231694r92158j772381k858319j636518j299802j745567j146148j540746
4710D2240055r94690r45901m53026K16715m21902L6626p786q48934q86523j003082
4700C6931552o12506l51273O345n88348p77683K03092J69714l67539J54644J33748
4690C4901746L20284J19883j18464m6534P69624M37539P3450n02865K51676o04359
4680C5601980q84051J34777M63350J5447J08323J78982j64563M62618O59076R07145
4670C7483084K00324M45066R55917J370411J640227J443650K178066J974763K133393
4661D9824901K078360J435679J769738J607902K210810K441609L253602M822916
$$ y = [51662172, 50848491, 50711036, 51261183, 51823215, 52511240, 53776195, 55197428, 55598773, 55231694, 54239536, 52467155, 49608836, 47972318, 46672516, 44926949, 43780801, 42240055, 41245365, 40299464, 39846438, 40063153, 39641251, 39677877, 39670091, 38821157, 37934634, 36931552, 36319046, 35967773, 35974118, 35385770, 34608087, 34811179, 34980893, 34613354, 34767998, 34901746, 35222030, 35341913, 35223449, 35176915, 35946539, 36384078, 36457528, 35954663, 36206339, 35601980, 34717929, 34852706, 35316056, 35331503, 35439826, 35618808, 35454245, 35916863, 36575939, 37483084, 37683408, 38128474, 39084391, 40454802, 42095029, 43538679, 45716745, 47691508, 49824901, 51903261, 53338940, 55108678, 56716580, 58927390, 61368999, 64622601, 69445517]
4653F9445517N400681N828465O184145M425165L545133J901541K76934M11468
4645I7419049J376846L066521O423901J0973110J7389888K6125817L7200536M7397176
4637B47372844M6559250K7910665l59842k2879884l3964288l5630257l3168130
4630A95840358k6454002j9119545j2993912r276855p175715n965628m660039m899674
4622A05294988m945668l715456m306906l373887l450185l746206l600330l417348
4614G4739002k113194j765913o21302k40886R50923K239890L588638L898336M167891
4605H4843385K786246M12626j752133k922098l223819l723880k320240j037980
4597G3062107p75805L77883J204716K652007L768673M970847O679110Q423833
$$ y = [69445517, 74846198, 80674663, 86858808, 91283973, 94829106, 96730647, 97007581, 97419049, 98795895, 101862416, 108286317, 119259427, 136649315, 162775132, 199975668, 247372844, 293932094, 321842759, 321482917, 298603033, 264638745, 229008488, 195840358, 169386356, 150266811, 137272899, 127996044, 120820329, 114854701, 110194662, 105294988, 100349320, 96633864, 92326958, 88953071, 85502886, 81756680, 78156350, 74739002, 72625808, 70859895, 70238593, 69997707, 70948630, 73188520, 76777158, 80675494, 84843385, 87629631, 88042257, 86290124, 83368026, 80144207, 76420327, 74100087, 73062107, 72286302, 72664185, 73868901, 76520908, 80289581, 85260428, 91939538, 100363371]
4589A00363371R913707J0471258J0487810J0880950J2425524J4385744J7243049
4582A86171413J9974595K0381511J3784424L673267p137345j5732600k0989508
4575B00125757k2470907k1046464j8467518j5404414j1811566r608148q031030
4568I3285710o276228n388719n094349m493208l371587l439459l098484l349438
4560E8774238l856577l318963k710136k748771k167381j731514j677352j584219
4552C8979325j174277p90732p28089p8598j056251j025895n88012k94201l88440
4543C2854830o31932k37861o72125n28912J31662m25622O04918M64977O51102
4534C2211037K79342K32727P0588K99613l11812n66279j222106p79924j680461
$$ y = [100363371, 110277078, 120748336, 131236146, 142117096, 154542620, 168928364, 186171413, 206146008, 226527519, 240311943, 243985210, 236847865, 221115265, 200125757, 177654850, 156608386, 138140868, 122736454, 110924888, 101316740, 93285710, 87009482, 81620763, 76526414, 72033206, 68661619, 65222160, 62123676, 58774238, 54917661, 51598698, 48888562, 46139791, 43972410, 42240896, 40563544, 38979325, 37805048, 37014316, 36286227, 36207629, 35151378, 34125483, 33537471, 33243270, 32854830, 32222898, 31985037, 31312912, 30784000, 30915662, 30490040, 31094958, 31559935, 32211037, 32490379, 32723106, 32793694, 33093307, 32781495, 32215216, 30993110, 30213186, 28532725]
4525B8532725j593079j305084q62801j015732q65867p35064q22072o90660n95954
4516B0046412j35302l59886J09673J8391K4749l00808o8239o64595o42048O1523
4506A8089870j25269l33748J54667k77537m72033j64613O36187j95084J27773
4497A7440213o59900n9341J618549o9692o80559L89909j46606j34324K5986p94508
4487A6929727k97095J14063l60583K78664j71332k09016j58165J7912L8235k41263
4477A5941147o89737R5845M38152o07430L02314O86383Q7756J70679n97737m38181
4467A5389191q26095o7041n36429J91645J07888J01387N1268j67466q1178R7898
4457A4261068l91056k6262J77991K14617N3412m8981o18424M14274P42368k82881
$$ y = [28532725, 26939646, 25634562, 24771761, 23756029, 22890162, 22155098, 21333026, 20642366, 20046412, 19911110, 19551224, 19660897, 19679288, 19704037, 19403229, 19334990, 18670395, 18028347, 18089870, 17964601, 17630853, 17785520, 17507983, 17035950, 16871337, 17507524, 17312440, 17440213, 16780313, 16720972, 18339521, 18269829, 17589270, 17979179, 17832573, 17698249, 17724235, 16929727, 16632632, 16746695, 16386112, 16664776, 16493444, 16284428, 16126263, 16144175, 16182410, 15941147, 15251410, 15347255, 15785407, 15177977, 15480291, 16166674, 16254430, 16425109, 15827372, 15389191, 14563096, 14496055, 13959626, 14151271, 14259159, 14360546, 14411814, 14244348, 14163170, 14261068, 13870012, 13843750, 14021741, 14236358, 14289770, 14240789, 13622365, 14036639, 14779007, 14496126]
4447A4496126m71877K05135O1202m52876m59741K41690O28268M91657j6453m77154
4437A4245977J29457m93325J76876k39392K64129m79677k19800K27784J39005
4428A3751034J74736M15552J91490j60196K89838K31131n62761K75525L83962
4419A4990311l78277p39969r122M75403j13815p00497J13052j48045q0045m39066
4409A2969930k34657j15195n3320K35150k23288o9636K59869p3289M57808L52766
4399A3506138J84253R1176j41024J65668Q262q2998K719K30334L54054J030384
4389A5348966Q89869K18609M41977j6829R378O74221O09784q2220L91097P52379
4379A9237231Q51766R59633Q36817J006857J493898J676335K733935L008492N113106
$$ y = [14496126, 14024249, 14229384, 14290586, 13837710, 13377969, 13619659, 14247927, 14739584, 14723131, 14245977, 14375434, 13882109, 14058985, 13819593, 14083722, 13604045, 13384245, 13612029, 13751034, 13925770, 14341322, 14532812, 14372616, 14662454, 14893585, 14330824, 14606349, 14990311, 14612034, 13872065, 13862943, 14338346, 14224531, 13524034, 13637086, 13489041, 13408996, 12969930, 12735273, 12620078, 12566758, 12801908, 12578620, 12508984, 12768853, 12695564, 13153372, 13506138, 13690391, 13781567, 13640543, 13806211, 13814473, 13731475, 13734194, 13964528, 14318582, 15348966, 16238835, 16457444, 16899421, 16882592, 16891970, 17566191, 18175975, 18093755, 18484852, 19237231, 20088997, 21048630, 21885447, 22892304, 24386202, 26062537, 28796472, 31804964, 36918070]
4370C6918070N760939N948164M715778J336345j152020m905265o288906n414603
4362C6918502m686975l823420l278398k303597j467025j222897q73905p56452
4354A8505833m49944l85902M53861j86930l09448r32823L11121j99231j35909
4345A6670628l53488O3950R58751n84669l55810l62222m89727l19881N39630j73416
4335A5593746k39437J33417j26018K06129l35191j30450m9178o18216k03595k68797
4325A3962410n77209J22226L76585m0675l62961l74768m6873L65449k69740j68350
4315A2986094l6005O42578L41508K4839l06163n89824N71481L98030n71023m78640
4305A2982875M30621L96525m40881j04617K02367Q9998J2933J92570k97061Q6865
$$ y = [36918070, 42679009, 48627173, 53342951, 54679296, 53527276, 48622011, 42333105, 36918502, 32231527, 28408107, 25129709, 22826112, 21359087, 20136190, 19262285, 18505833, 18055889, 17669987, 18123848, 17936918, 17627470, 16694647, 17005768, 16806537, 16670628, 16317140, 16381090, 17339841, 16755172, 16399362, 16037140, 15547413, 15227532, 15767162, 15593746, 15354309, 15487726, 15361708, 15567837, 15232646, 15102196, 15053018, 14434802, 14231207, 13962410, 13385201, 13507427, 13884012, 13843337, 13480376, 13105608, 13058735, 13424184, 13154444, 12986094, 12950089, 13592667, 13934175, 13959014, 13652851, 13063027, 13634508, 14032538, 13461515, 12982875, 13413496, 13810021, 13369140, 13264523, 13466890, 13556888, 13569821, 13762391, 13465330, 13552195]
4295A3552195j06319J06653j36956l2010P1823M90415N8334o7148J04814J73209
4285A4215010M57635J62604k09361L02550Q12829K97741K08993J40060M65078
4276A6853139R67256P85984L68825L95926L1884k03948p77528l08015k79095j56706
4266A7677722L57596L14328j01262l87844R0314M47012n25275J37931O90570k61225
4256A8439867N96992P67755L55943j04271M41197K49386K57490J167839L02213
4247B2474411Q27472P81647N63068K19833K81583J297307R41852P01574J566005
4238B9654752P2363Q43174P43911Q46218Q08418J675386J660666Q94175J100316
4229C8299379J571037J220701J138489R50031J419222J415483J506982J731735
$$ y = [13552195, 13445876, 13552529, 13415573, 13383563, 13455386, 13945801, 14004135, 13936987, 14041801, 14215010, 14672645, 14835249, 14625888, 14928438, 15741267, 16039008, 16248001, 16388061, 16853139, 17820395, 18606379, 18975204, 19371130, 19403014, 19199066, 18421538, 18113523, 17834428, 17677722, 18035318, 18349646, 18248384, 17860540, 17950854, 18397866, 17872591, 18010522, 18701092, 18439867, 19036859, 19804614, 20160557, 20056286, 20497483, 20746869, 21004359, 22172198, 22474411, 23301883, 24083530, 24646598, 24866431, 25148014, 26445321, 27387173, 28088747, 29654752, 29727115, 30570289, 31314200, 32160418, 32968836, 34644222, 36304888, 37199063, 38299379, 39870416, 41091117, 42229606, 43179637, 44598859, 46014342, 47521324, 49253059]
4221D9253059J265581K043396J617346J417623J513888J029279Q95649J428514
4213F0464335J654890J144495J341989J836339J436910Q37961J517294J971855
4205G2206068J349018J079955J043657R02831J343994J416278J719725J412077
4197H2473603R18350J450646R96462J151168J453791J370630J024240J477425
4189I2316315J181972P25465P98468J767705R61586J128739M88762Q40004Q97911
4180A01106927L06372O08710M92185J60504N17873O03437M0536j30422K58684
4171A03964806O98475L69375r91865n88589q99867j429503j350497j667649j442562
4162I6662124j468266q97806j320039j867296j956768k090061j799155j849423
$$ y = [49253059, 50518640, 52562036, 54179382, 55597005, 57110893, 58140172, 59035821, 60464335, 62119225, 63263720, 64605709, 66442048, 67878958, 68716919, 70234213, 72206068, 73555086, 74635041, 75678698, 76581529, 77925523, 79341801, 81061526, 82473603, 83391953, 84842599, 85839061, 86990229, 88444020, 89814650, 90838890, 92316315, 93498287, 94223752, 95022220, 96789925, 97751511, 98880250, 99369012, 100209016, 101106927, 101413299, 102022009, 102514194, 102674698, 103192571, 103796008, 103836544, 103706122, 103964806, 104663281, 105032656, 104040791, 103452202, 102552335, 101122832, 99772335, 98104686, 96662124, 95193858, 94296052, 92976013, 91108717, 89151949, 87061888, 85262733, 83413310]
4154H3413310j800957j839542k481705k773144k264102k341410k492755k955179
4146F4464516j995564j857019j569515k419308k271107k717292j879250j834521
4138D7920940k162389k018231j721406j150250j944498j601309k261444j660298
4130C3401115j580047j399169j408191n46800j191495j021453j377886j041023
4122B3835051M2488m45122j088918m56774j167279m67058K5237l47074n76187
4113A9354364p19673n64798O68946l04883q04474K24013j75064o34939K26551
4104A7270043K95326k98137J8487j32604K93562j09792l43975k43859l66627p7771
4094A6304653R9383N3028j25048l64118R9200l06904M506L44189L32495k66942
$$ y = [83413310, 81612353, 79772811, 77291106, 74517962, 72253860, 69912450, 67419695, 64464516, 62468952, 60611933, 59042418, 56623110, 54352003, 51634711, 49755461, 47920940, 45758551, 43740320, 42018914, 40868664, 38924166, 37322857, 35061413, 33401115, 31821068, 30421899, 29013708, 28466908, 27275413, 26253960, 24876074, 23835051, 23877539, 23432417, 22343499, 21886725, 20719446, 20252388, 20277625, 19930551, 19354364, 18634691, 18069893, 18738839, 18433956, 17629482, 17853495, 17678431, 17043492, 17270043, 17565369, 17267232, 17285719, 17153115, 17446677, 17336885, 16992910, 16749051, 16382424, 16304653, 16404036, 16457064, 16332016, 15967898, 16067098, 15760194, 15764700, 16108889, 16441384, 16174442]
4084A6174442l44252J41535P4980j29487Q6554L00671k41164J06298k81294j21040
4074A5767243k23035L75255l41124j9764L96637N5125k49022o38232k11850L51013
4064A5262246P49803k04237l92953r9693j8251k16077m29098J04611J97073P955
4054A4961379o8517n36123M34320j40972j73000n9071J98579o35069m27260L2747
4044A3587013j50850l50910p4511J45516K44367m64167n9868m19621m02247K74667
4034A2329389l87143N22909m59719q10672J73734M53880l67j07165L49116k14333
4024A1849629L76569J55331k45617N95214j54937n57821j53444K32690k08712
4015A1888902k85365J69230M08109J80217j04008K9122K14171Q2079k32353K91634
$$ y = [16174442, 15830190, 15971725, 16046705, 15917218, 16003772, 16304443, 16063279, 16169577, 15888283, 15767243, 15544208, 15919463, 15578339, 15558575, 15955212, 16010337, 15761315, 15123083, 14911233, 15262246, 16012049, 15807812, 15414859, 15315166, 15296915, 15080838, 14651740, 14756351, 14953424, 14961379, 14892862, 14356739, 14791059, 14650087, 14477087, 14418016, 14616595, 13981526, 13554266, 13587013, 13436163, 13085253, 13010742, 13156258, 13400625, 12936458, 12876590, 12456969, 12054722, 12329389, 11942246, 12465155, 12005436, 11194764, 11368498, 11822378, 11822011, 11714846, 12063962, 11849629, 12226198, 12381529, 12135912, 12731126, 12576189, 12018368, 11864924, 12097614, 11888902, 11603537, 11772767, 12180876, 12361093, 12257085, 12286207, 12500378, 12582457, 12350104, 12641738]
4005A2641738K82952n94518J07600N27047L01586P8693l96482j57820K84201L52266
3995A3427263o6719l0375J32311J0228J96721K58801m85229K05565K37328l66755
3985A3519139K79079Q6212J53718M26600l72221K5803N50182p11741k8446l1074
3975A3897251L2574q3418L42620J01867K35641K77678q4924N76123Q1178P2032
3965A5448622k11491K20685M80408j54901K46536M52689M07985M25218J95501
3956A7511252K58629J02133l24295L46328L60004M23978M54200n5118J88741M98580
3946A9764432o8492o48248L41514Q276L24146P58276j59623N70969j63190o666
3936B0721394N51850L51998P9601k61919K99847j16848O11167O44370j17875j62458
$$ y = [12641738, 12924690, 12330172, 12437772, 12964819, 13266405, 13345098, 12948616, 12790796, 13074997, 13427263, 13360544, 13330169, 13462480, 13472708, 13669429, 13928230, 13443001, 13648566, 13885894, 13519139, 13798218, 13884430, 14038148, 14464748, 14092527, 14118330, 14668512, 13956771, 13928325, 13897251, 13929825, 13846407, 14189027, 14290894, 14526535, 14804213, 14719289, 15295412, 15376590, 15448622, 15237131, 15457816, 15938224, 15783323, 16029859, 16482548, 16890533, 17315751, 17511252, 17769881, 17872014, 17547719, 17894047, 18254051, 18678029, 19132229, 19077111, 19265852, 19764432, 19695940, 19047692, 19389206, 19397482, 19721628, 20479904, 20320281, 20891250, 20728060, 20721394, 21273244, 21625242, 21704843, 21442924, 21742771, 21625923, 22237090, 22881460, 22763585, 22601127]
3926B2601127O05741J98763J86674J20584L7526L63779P19008j29483M93739K52987
3916B5450445K31955N79509L26974O88228K28610O02429J49613M67225N59406
3907B9284394R17674M28260L30123P86543L48395N30791P39416R53406O13443
3898C4932445L39255P38129J094142J086336O43087R12032R24680O83783J149183
3889D2503072J234442R57863R27655J801933Q57999J804775J628529N33346J566974
3880E3816588J347343J089766J280858J782404K327310J780307K386058J532951
3872F7343585J784420K421192J799246J740409J930194K255401J788721K318465
3864H3381633J709138J976808J625838O62746K055818J679049P66684J538106
$$ y = [22601127, 23206868, 23405631, 23592305, 23712889, 23750415, 24114194, 24833202, 24703719, 25197458, 25450445, 25682400, 26261909, 26588883, 27277111, 27505721, 28108150, 28257763, 28724988, 29284394, 30202068, 30630328, 30960451, 31746994, 32095389, 32626180, 33365596, 34319002, 34932445, 35271700, 36009829, 37103971, 38190307, 38833394, 39745426, 40670106, 41353889, 42503072, 43737514, 44695377, 45623032, 47424965, 48282964, 50087739, 51716268, 52249614, 53816588, 55163931, 56253697, 57534555, 59316959, 61644269, 63424576, 65810634, 67343585, 69128005, 71549197, 73348443, 75088852, 77019046, 79274447, 81063168, 83381633, 85090771, 87067579, 88693417, 89356163, 91411981, 93091030, 93857714, 95395820]
3856I5395820J612582J291844P76840J051947Q29174O37940L9188P69527J079879
3847A03484741L68614o5352O77050P91955L37309J94270N16136K40040O58602
3838A07203365P22487N74318M56846J370802J438290J245024J404995J614352
3830A16030479K180524J689143J749191K397945K879894K545606K516704L754501
3822A35743987L586526M232639L872841L764817M520769M328815M837031M535598
3814A69423023M142913M347632M293595M161502L940222L106225L709713K804350
3806A99929175K540678K747068K246227J697155J855300P44420K18465j97359
3798B11781129q44434j079684j018541j484920k508943k650800k704248l047437
$$ y = [95395820, 97008402, 98300246, 99077086, 100129033, 100958207, 101596147, 101635335, 102404862, 103484741, 103853355, 103788003, 104465053, 105257008, 105594317, 105788587, 106304723, 106544763, 107203365, 107925852, 108500170, 108957016, 110327818, 111766108, 113011132, 114416127, 116030479, 118211003, 119900146, 121649337, 124047282, 126927176, 129472782, 131989486, 135743987, 139330513, 143563152, 147435993, 151200810, 155721579, 160050394, 164887425, 169423023, 173565936, 177913568, 182207163, 186368665, 190308887, 193415112, 197124825, 199929175, 202469853, 205216921, 207463148, 209160303, 211015603, 211760023, 211978488, 211781129, 210936695, 209857011, 208838470, 207353550, 204844607, 202193807, 199489559, 196442122]
3790A96442122l295383l405217k765250l751453l070694k817641l076582k231624
3782A72028278k105576j689643j957406j195083j222142j315490r76213j291530
3774A60275195p82078n12030j148606o61739n24750j43451q34197l83897K42683
3765A55527130n33711J9875m2058l81870j198021j134095j035220j794081k171432
3756A47256517k090402k623145k723672k310247l273253k644716l134634l458343
3748A24998105k576945k771664k761699k242510l148192k989707k402244k738523
3740A03366621l280643k675627k841796l439682k664751j868128j576288k444468
3732H2575238k129353j846444q27232r96693j273485q05470J50760l00758k08851
$$ y = [196442122, 193146739, 189741522, 186976272, 183224819, 180154125, 177336484, 174259902, 172028278, 169922702, 168233059, 166275653, 165080570, 163858428, 162542938, 161566725, 160275195, 159493117, 158981087, 157832481, 157170742, 156645992, 156502541, 155668344, 155284447, 155527130, 154993419, 155013294, 154971236, 154589366, 153391345, 152257250, 151222030, 149427949, 147256517, 145166115, 142542970, 139819298, 137509051, 134235798, 131591082, 128456448, 124998105, 122421160, 119649496, 116887797, 114645287, 111497095, 108507388, 106105144, 103366621, 100085978, 97410351, 94568555, 91128873, 88464122, 86595994, 85019706, 82575238, 80445885, 78599441, 77772209, 76775516, 75502031, 74696561, 74847321, 74546563, 74337712]
3723G4337712j22118k35341j41073N46303k46569n7542M43924n12836J64870J04840
3713G4282170N93561J173206J29298L24540L24252P43133N56115J13611Q60207
3704G9100093O03248P69871P54287J027778J280614J415348J370486J251130K640215
3695I0213070L157419L237951L475277L651041M017327N583622O158485N990246
3687A25484438O028289O498773O998344P287135P578311O861641O915906O364606
3679A80017443N108947L878195L289900K221606K319772N48945m49795m56189
3671A96478824o95158k157546k938061k682805l829634n136886n684740o091738
3663A67262256p317184p966941p864693p776467p923792q305941p586869p633327
$$ y = [74337712, 74215594, 73980253, 73839180, 74385483, 74138914, 74081372, 74525296, 74012460, 74177330, 74282170, 74875731, 76048937, 76178235, 76502775, 76827027, 77570160, 78126275, 78239886, 79100093, 79703341, 80473212, 81227499, 82255277, 83535891, 84951239, 86321725, 87572855, 90213070, 93370489, 96608440, 100083717, 103734758, 107752085, 113335707, 119494192, 125484438, 131512727, 138011500, 145009844, 152296979, 159875290, 166736931, 173652837, 180017443, 185126390, 189004585, 192294485, 194516091, 196835863, 197384808, 196935013, 196478824, 195783666, 193626120, 190688059, 188005254, 184175620, 179038734, 173353994, 167262256, 159945072, 151978131, 144113438, 136336971, 128413179, 120107238, 112520369, 104887042]
3655A04887042p768119p193707o542127n674672n404274m644202l838628m248288
3647E9573025l546650l670896l201872k983355k231109j294704j703009j709780
3639C9231650j556785j158329j181704p46608p15504n72258k92798J84409l6074
3630C3155999M2397M2395L28430m3994n2668M43459o48892K55851N64311j37005
3620C3950283j056950n30999M76482J07964K70704j99013m84808o0948m6009k81402
3610C2145304l50173l16289l81867k78192j068370m52436q74001m21010n88754
3601B7414212p48793m62623j308232j147686o24809M18915j121259o33302p53815
3592B1032608m28050o33857o76658k52638m97789j089320m87757k17156r84172
$$ y = [104887042, 97118923, 89925216, 83383089, 77708417, 72304143, 67659941, 63821313, 59573025, 56026375, 52355479, 49153607, 46170252, 43939143, 42644439, 40941430, 39231650, 37674865, 36516536, 35334832, 34588224, 33872720, 33300462, 33007664, 33192073, 33155999, 33198396, 33240791, 33569221, 33525227, 33472559, 33916018, 33267126, 33522977, 34087288, 33950283, 32893333, 32362334, 32838816, 32946780, 33217484, 33018471, 32533663, 32472715, 32426706, 32145304, 31795131, 31478842, 31096975, 30818783, 29750413, 29297977, 28423976, 28002966, 27414212, 26665419, 26202796, 24894564, 23746878, 23122069, 23540984, 22419725, 21786423, 21032608, 20604558, 19970701, 19294043, 19041405, 18543616, 17454296, 16966539, 16749383, 15765211]
3583A5765211k68509k11873k91331m35869R226m01435m43298k74766N76707k92598
3573A3731465l96953L6656n87609R6651l43098j0273k27709l52963l77774K00737
3563A1769130J99135K15919j47711l08338J58344L73722m85962k61193l3177J76372
3553A1656241l22722m4252j249j27767l56130m71513L12640J08899p2742l5145
3543A0646260n2071l7270L26380k13655m97213j95249l04492N56788N8274Q8429
3533A0376181m4345o01492Q229j54199k31712k47887O11865j2217k52759n68671
3523H882993L05623L66273O62112K04637p77958m82036p9861N2308K86070Q33499
3513A0253660k97341j58402L89951k97880J56250j8327o5449p27152l66607r1971
$$ y = [15765211, 15496702, 15284829, 14993498, 14557629, 14566855, 14165420, 13722122, 13447356, 14024063, 13731465, 13334512, 13371168, 12783559, 12880210, 12537112, 12526839, 12299130, 11946167, 11568393, 11769130, 11968265, 12184184, 12036473, 11728135, 11886479, 12260201, 11774239, 11513046, 11479869, 11656241, 11333519, 11289267, 11288018, 11160251, 10804121, 10332608, 10645248, 10754147, 10681405, 10646260, 10594189, 10556919, 10883299, 10669644, 10172431, 9977182, 9672690, 10229478, 10287752, 10376181, 10331836, 9730344, 9738573, 9584374, 9352662, 9104775, 9716640, 9704423, 9451664, 8882993, 9188616, 9554889, 10217001, 10421638, 9643680, 9161644, 9081783, 9134091, 9420161, 10253660, 9956319, 9797917, 10187868, 9889988, 10046238, 10027911, 9962462, 9235310, 8868703, 8776732]
3503H776732N89186M36245p8949J05564m11779K41717O901J39178p5526k95824
3493I433445P2532L44159K71627o68848m15559N86797K7088M08535J552628K18426
3483A1830830m03639N90395R16685R65077N27006O60263Q78670Q92939Q18995
3474A7677221Q19309R15096N32548K10912K31712k93653k59237n98000o20627
3465A8615281j195582j784740j168192k1502q86166r57297p03754o93190k7747
3456A1177111p59592k65977o65309q97628M28447K69713j98623K91798J61337
3447I541277N48920J127025l10050p30773m13755r63266n76801p58476M354m36248
3437G032207p03193p43159j15018o2974K16473l61456q54623k24400K74251j53211
$$ y = [8776732, 9365918, 9802163, 9723214, 9828778, 9416999, 9658716, 9665617, 9804795, 9729269, 9433445, 9505977, 9850136, 10121763, 9452915, 9037356, 9624153, 9651241, 10059776, 11612404, 11830830, 11427191, 12017586, 12934271, 13899348, 14426354, 15086617, 15965287, 16858226, 17677221, 18496530, 19411626, 19944174, 20155086, 20386798, 20093145, 19833908, 19235908, 18615281, 17419699, 15634959, 14466767, 14445265, 13559099, 12601802, 11898048, 11204858, 11177111, 10417519, 10151542, 9486233, 8588605, 9017052, 9286765, 9088142, 9379940, 9541277, 10090197, 11217222, 10907172, 10176399, 9762644, 8799378, 8222577, 7464101, 7468455, 7032207, 6329014, 5585855, 5470837, 5407863, 5624336, 5262880, 4408257, 4183857, 4458108, 4304897]
3427D304897J75978J32717l12226O66915L88116o68240j81972j23354n12109m3754
3417C826968O00936P60516K70531P23751J35845j167110o00813Q3280j5511o9612
3407D548781j71351n68827j52445Q9964j44329M25097j14901J66276l36466P7847
3397C819646k63894l68517k85710O17823l28661k21488L98515j34148K02678L44040
3387C780284J1527r5879o14663m5648Q0132K46209J34824l03802l04733j92543
3377B695708j15728m9546J5632j89650Q38404r1297m19483j19154J26168j47567
3367B543487J57433m07480j08573M60992M57698k90763o50969l7544J64544k8168
3357B260657J69353k09053o46465j53471L1458j0875O85056N68746m38765l40159
$$ y = [4304897, 4480875, 4613592, 4301366, 4968281, 5356397, 4688157, 4506185, 4382831, 3870722, 3826968, 4427904, 5188420, 5458951, 6182702, 6318547, 5151437, 4550624, 4633904, 4618393, 4548781, 4377430, 3808603, 3656158, 3746122, 3601793, 4026890, 3911989, 4078265, 3741799, 3819646, 3555752, 3187235, 2901525, 3519348, 3190687, 2969199, 3367714, 3233566, 3436244, 3780284, 3791811, 3695932, 3081269, 3035621, 3115753, 3361962, 3496786, 3192984, 2888251, 2695708, 2579980, 2530434, 2546066, 2356416, 3194820, 3103523, 2684040, 2564886, 2691054, 2543487, 2700920, 2293440, 2184867, 2645859, 3103557, 2812794, 2161825, 2124281, 2288825, 2260657, 2430010, 2220957, 1574492, 1421021, 1452479, 1441604, 2126660, 2695406, 2256641, 1916482]
3347A916482k48239p4321J61313k16214j18482M95364L15588j59432J9072N09550
3337B600681j41960m52100j65561k34753M31745m51428j73782R4860P55106n7311
3327B205497j03385j32653R2545P20k07710r0797o51010J80030P42290P5423n37328
3316A573622J96985l11006L61472L11600j99294K6764l90510k22572M65714o0023
3306A752752J97279k85749K36084n7869o052L8040k41449M0515P3696j5835j45275
3295A586137m45124o992M5402L61721L70895j96632r0875j15543l53466m71727
3285F83796Q87525M86725j14256m04262K96993M28245k45279k46064k78570K17316
3275A712169J01154J13992m77749L22902j52169N17002O4115K9205n16862l48871
$$ y = [1916482, 1668243, 1593922, 1755235, 1539021, 1420539, 1915903, 2231491, 2072059, 2091131, 2600681, 2458721, 2006621, 1841060, 1606307, 2038052, 1586624, 1412842, 1507702, 2262808, 2205497, 2102112, 1969459, 2062004, 2062724, 1855014, 1764217, 1113207, 1293237, 2035527, 2110950, 1573622, 1770607, 1459601, 1821073, 2132673, 1933379, 1960143, 1569633, 1347061, 1812775, 1752752, 1950031, 1664282, 1900366, 1842497, 1836445, 1874485, 1633036, 1673551, 1747247, 1731412, 1586137, 1141013, 1134021, 1179423, 1541144, 1912039, 1715407, 1624532, 1508989, 1155523, 683796, 1571321, 2058046, 1943790, 1539528, 1836521, 2264766, 2019487, 1773423, 1494853, 1712169, 1813323, 1927315, 1449566, 1772468, 1620299, 2137301, 2201416, 2230621, 1713759, 1364888]
3265A364888N86014K7004r315L27276l64432k64461O598j52328L06404k9289k00924
3254A597435K25569K15814k88610N37442k98767n12688k01446n4243M84100j64240
3244A540366j56553o6456n7540P06713K80408J50955l09454J6261l20727l56491
3234A427482j18913K74188J2805M86K2249j32273J97196M86320J63667j46021
3224B187186l51535l57521L29117M03727l63911j89775O6797K81967O9453P60575
3214B836080k57878n42642k02834j04708L62135N8595L31597j52747j55315m23519
3204A748764j18433K20835J39662o3004j11512L90280J73470l26338k4745R184
3194B038163j43028M00536l70491j99843k87566P90365K26082k26674J51673l64957
$$ y = [1364888, 1950902, 1977906, 1968591, 2295867, 1931435, 1666974, 1673572, 1521244, 1827648, 1798359, 1597435, 1823004, 2038818, 1750208, 2287650, 1988883, 1476195, 1274749, 1220506, 1704606, 1540366, 1383813, 1317357, 1259817, 1966530, 2246938, 2397893, 2088439, 2104700, 1783973, 1427482, 1308569, 1582757, 1595562, 1596048, 1618297, 1486024, 1683220, 2169540, 2333207, 2187186, 1835651, 1478130, 1807247, 2210974, 1847063, 1657288, 1724085, 2006052, 2075505, 2836080, 2578202, 2035560, 1832726, 1728018, 2090153, 2148748, 2480345, 2327598, 2172283, 1748764, 1630331, 1851166, 1990828, 1927824, 1816312, 2206592, 2380062, 2053724, 2028979, 2038163, 1895135, 2295671, 1925180, 1725337, 1437771, 2228136, 2454218, 2227544, 2379217, 2014260]
3184B014260p52529N79628J26854l77167K61409q0407L48740j36952N6583K05862
3174B246281n22848k58363L82308k01721j61703l63357L41676M46918K00575j89173
3164A920593m48921R94188L62364m17834j60021N29577n4145j81924K53778o25294
3154B172361N2710K47971l3130J38250n3471o7606n58037j27929P79120N67862
3144C118101j2613m41627k15270j90403M15999n39484M38935L50473J86324J34574
3134C245009l46315L34495L11132N1805J53192l66411m84322m02828J56784l10472
3124B342069J2569J1196K76881q2393j57859K4569J94290j41797j99811K82516
3114B562230J10758l1892R5952l57827J54152J28238K41824J52244m83702J38035
$$ y = [2014260, 1261731, 1841359, 1968213, 1591046, 1852455, 1772048, 2120788, 1983836, 2040419, 2246281, 1723433, 1465070, 1847378, 1645657, 1483954, 1120597, 1462273, 1909191, 2109766, 1920593, 1471672, 2465860, 2828224, 2410390, 2250369, 2779946, 2725801, 2543877, 2797655, 2172361, 2225071, 2473042, 2439912, 2578162, 2524691, 2457085, 1899048, 1771119, 2550239, 3118101, 3105488, 2663861, 2448591, 2258188, 2674187, 2134703, 2573638, 2924111, 3110435, 3245009, 2898694, 3233189, 3544321, 3596126, 3749318, 3382907, 2898585, 2495757, 2652541, 2342069, 2354638, 2365834, 2642715, 2560322, 2402463, 2427032, 2621322, 2479525, 2279714, 2562230, 2672988, 2641096, 2737048, 2379221, 2533373, 2661611, 2903435, 3055679, 2571977, 2710012]
3104B710012O6747P86Q3214r1440k31608j04817L26192k95027n02808N56092J39389
3093B656732K79884O8791l52998M894r0985J4765M98066l7136J16849m46089l13179
3082B399594J01201N17627j66091k18950l25720J57065k60582p7222l61209l8058
3072A727655L44736p0585l8825N4621J2640o57578k76390L00518k08156j67420
3062A021216N38732m75091l54327P05642K92670n34524K43229k53322K43493J0612
3052A438330M47069k39096l02710M26572p2988j71854J50223m91013m5011K6954
3042A166476j6083m73497l20400L97254k10271N8020O09663O98499M2666o92082
3032A260245m21323Q6428k9935J97440Q375j87831p1687L22678k26905K1505o78060
$$ y = [2710012, 2776759, 2777545, 2860759, 2769319, 2537711, 2432894, 2759086, 2464059, 1961251, 2517343, 2656732, 2936616, 3005407, 2652409, 2657303, 2566318, 2581083, 3079149, 3042013, 3158862, 2712773, 2399594, 2500795, 3018422, 2852331, 2633381, 2307661, 2464726, 2204144, 2126922, 1765713, 1727655, 2072391, 2001806, 1962981, 2017602, 2030242, 1372664, 1096274, 1396792, 1188636, 1021216, 1559948, 1084857, 730530, 1436172, 1728842, 1194318, 1437547, 1184225, 1427718, 1438330, 1885399, 1646303, 1343593, 1770165, 1697177, 1525323, 1675546, 1184533, 1139522, 1166476, 1150393, 676896, 356496, 753750, 543479, 601499, 1211162, 1909661, 1952327, 1260245, 838922, 925350, 895415, 1092855, 1101230, 913399, 841712, 1164390, 937485, 958990, 280930]
3021B80930n11450N0499Q69151J08489K93789j31511P883r4602r2685K48205N02426
3010A531124l46650m12116R6110O8841j02243J11894Q4062K62007N8856o23977
3000G27908p766j22276M19012l99235l89481L38390j47114K13397m70696J09715
2990B71854k09729O11110K6792l03882K93010l76543m7881j02874o7137K50446
2980C45166O6216L32066L9162j87258L57955p49264l19513N15618L54837p5850
2970F79135J31631J63379p5901j46164m55957l65883K85340N5946O51819J63416
2960A086761R7659k79519q46506j20409k22748N90473M88386j65082Q6044l56141
2950C58918L0332J35816J25043K24683n43393o52197j03771L6620Q57123l01436
$$ y = [280930, -230520, -180021, 689130, 797619, 1091408, 959897, 967780, 873178, 780493, 1028698, 1531124, 1184474, 772358, 868468, 937309, 835066, 946960, 1031022, 1293029, 1351885, 727908, 720142, 597866, 1016878, 617643, 228162, 566552, 419438, 632835, 162139, 271854, 62125, 673235, 700027, 396145, 689155, 312612, 264731, 161857, 94720, 345166, 411382, 743448, 782610, 595352, 953307, 204043, -115470, 400148, 754985, 679135, 810766, 974145, 898244, 752080, 296123, -69760, 215580, 271526, 923345, 1086761, 1184420, 904901, 58395, -62014, -284762, 305711, 794097, 629015, 715059, 358918, 389250, 525066, 650109, 874792, 331399, -320798, -424569, -387949, 469174, 167738]
2940A67738k27582L79927N71750J20941q913k23902m12832m23170J23720l60640
2930b92963L46023k17861j38240M40978K12126L7413J56862j72901j13855j64888
2920I2694K11805k43285k7859J48167l83409R6966L83614N0606m75856l39248
2910d85805L07197O21845J01234J7440j93250k90795M77411M3396Q6524m61726
2900B23471l44687M25589q61141K8967K15164L40276j8979J83712j79282j63129
2890a50039p8482N44179j7746K14677m02102M46471O03279j97230m06398k12680
2880C43929O14404M5170p55543J65797m81205K57116K70588r6131j51734L29842
2870E42233k3138j66555P3613N09785K60832j005259k09946K4670K32902L69120
$$ y = [167738, -59844, 320083, 891833, 1012774, 1003861, 779959, 367127, -56043, 67677, -292963, 53060, -164801, -303041, 137937, 350063, 387476, 544338, 371437, 257582, 92694, 304499, 61214, 33355, 181522, -201887, -104921, 278693, 329299, -146557, -485805, -178608, 443237, 544471, 561911, 368661, 77866, 555277, 598673, 685197, 223471, -121216, 304373, -556768, -527801, -312637, 27639, 8660, 192372, 13090, -150039, -228521, 315658, 297912, 512589, 110487, 556958, 1160237, 963007, 556609, 343929, 958333, 1003503, 247960, 413757, -67448, 189668, 460256, 364125, 212391, 542233, 519095, 352540, 426153, 935938, 1196770, 191511, -18435, 6235, 239137, 608257]
2860F08257K33097p18351J65285L12600J52340k38095J0269o28610N85025r4486
2850C87331N7779r1852r029R8982L10467K32224k75444J11632r5631O10380l70962
2839I65877q8564o51704P3926L94327j59056k4560j85762O2109P0938j87812l73017
2828a03298j73318L68353L72065K78692K79680k10899m21246K18388k46275j90554
2818A71588J85391J32607k40655M4909N15j61038J83376l30068O1897q9809O95739
2807F54452N7677p44427j650k22306L67201N3176M8470N28204o00915J39622M31725
2796G11229l42624k90615P34107N52065o28495j40422l85627L81028J73023M029
2786G67698j58923o51146J35332k03469K63335M69271p0633m60069N23911l07866
$$ y = [608257, 841354, 123003, 288288, 600888, 753228, 515133, 525402, -103208, 481817, 387331, 445110, 353258, 344229, 443211, 753678, 985902, 710458, 822090, 726459, 1336839, 965877, 877313, 225609, 299535, 693862, 534806, 510246, 324484, 386593, 457531, 269719, -103298, -276616, 91737, 463802, 742494, 1022174, 811275, 390029, 608417, 362142, 171588, 356979, 489586, 248931, 293840, 294355, 133317, 316693, -13375, 48522, -41287, 654452, 712129, -32298, -33948, -256254, 110947, 164123, 212593, 740797, 139882, 279504, 711229, 368605, 77990, 812097, 1364162, 735667, 595245, 209618, 590646, 763669, 767698, 608775, -42371, 92961, -110508, 152827, 622098, 551465, 91396, 615307, 307441]
2776C07441J3252N25797n11194r6735k46198P43114Q3054k67929J01340Q1859
2766G33801j65638n398K20200q9832n45405P6471K05849l5808o8529N5167K74738
2755F55616j47056m36433p7071M85697k0747k47781k03268J37027j23362q1254
2745e8632L76039J50239L02241p91604p75O37446N6102k79336n9511k81958M9966
2734A00217J13552l33240L37708K26519j78436J81070j57948j63663k60454j89558
2724c24233k08271K23898M72040m17468k803J47988J25604m16423K19518l19505
2714d99655M95686J70080O7970p9295r4637R9203j69956k18278j464j26675L30234
2703b6787L18312j21007O5533k87384R0716P72800K3263j45739R2817k76632q7017
$$ y = [307441, 320693, 846490, 335296, 238561, -7637, 735477, 818531, 550602, 651942, 733801, 568163, 562765, 782965, 693133, 147728, 224199, 430048, 394240, 325711, 380878, 655616, 508560, 72127, -4944, 480753, 460006, 212225, 8957, 145984, 22622, -58632, 317407, 467646, 769887, -21717, -22492, 614954, 671056, 391720, 332209, 50251, 100217, 213769, -119471, 218237, 444756, 266320, 447390, 289442, 125779, -134675, -324233, -532504, -308606, 163434, -254034, -256837, -108849, 16755, -399668, -180150, -499655, -3969, 166111, 234081, 154786, 60149, 159352, -10604, -228882, -230346, -357021, -26787, 291525, 170518, 236051, -51333, 39383, 812183, 835446, 689707, 782524, 505892, 418875]
2692D18875K33132n94609J88560m64489L6628N60982J65109K51071J93592n99510
2682C89341k81981K71210L8944q4516J64564m3720n8086L51723m55156K61987
2672E54310j72053J00741O9470j45448q9389L8844k93288L8435j24201j16273
2662a38852r2053O08813m66045J27080N5601j13248K79629j11724J82497j27752
2652B03946l06931M05731j32671k86562R5803J46517K49616M81501m00315n73245
2642a16610k12637l3028O01189J23913k14839L01488J74579L98970k69729o99428
2632E3868j49469K62021O6802k71479N82854j08417J64978n08369m0852O28114
2622F80051q2693n03766N18214P4116P9907J07330J38954m83853K49485N56684
$$ y = [418875, 652007, 57398, 245958, -218531, -181903, 379079, 544188, 795259, 988851, 389341, 107360, 378570, 417514, 332998, 497562, 453842, 395756, 747479, 292323, 554310, 382257, 482998, 552468, 407020, 317631, 356475, 63187, 101622, -22579, -138852, -230905, 377908, -88137, 38943, 94544, -18704, 260925, 149201, 331698, 203946, -102985, 302746, 170075, -116487, -20684, 125833, 375449, 856950, 456635, -116610, -329247, -362275, 238914, 362827, 147988, 449476, 624055, 1023025, 753296, 53868, -95601, 166420, 233222, -38257, 544597, 436180, 601158, 92789, 51937, 680051, 597358, 93592, 611806, 685922, 765829, 873159, 1012113, 528260, 777745, 1334429]
2612A334429m30511l32011L16369j15142o5123k04229l2707M94250r9051K25607
2602A091881N21831M03744L78787J00380l13895j03610l46033K13822n25585m7886
2592A373436J53054m41400j51041n62656L56368J12310o16803M17759J03947n58757
2582A86217K16958N59560m71838o86131L70013L42626n00476J83141n1320J57478
2572C06228J35986o4083k30937J18790L59744k27017K46968j8405m63099K66817
2562D30992J337K29127l10024J01987L587K6749q6854P8199J50187K8133j31568
2551E21852J98748l62258j40354N88540p9694J9702o43293J85239M15547n76021
2541A28008L00963K51294o79850k8929N92328j3486l79035J9785J33189R4938
$$ y = [1334429, 903918, 571907, 888276, 773134, 708011, 503782, 471075, 965325, 866274, 1091881, 1613712, 2017456, 2396243, 2496623, 2182728, 2079118, 1733085, 1946907, 1421322, 1373436, 1526490, 1085090, 934049, 371393, 727761, 840071, 223268, 641027, 744974, 186217, 403175, 962735, 490897, -195234, 174779, 517405, 16929, 200070, 148750, 306228, 442214, 378131, 147194, 265984, 625728, 398711, 645679, 627274, 164175, 430992, 432329, 661456, 351432, 453419, 457006, 483755, 396901, 475100, 625287, 653420, 521852, 720600, 358342, 217988, 806528, 726834, 746536, 103243, 288482, 704029, 128008, 428971, 680265, 415, -28514, 563814, 550328, 171293, 191078, 324267, 419205]
2531D19205L3665p6742j33481L69516o05475j04820J72730M54147k77397k4438
2521B26910p153L94873R7315l89244j09820J62195K88449m35272J001437j56980
2511A072710l03674m34806M61848J61753q5738J11852k64672K57282j96947j86690
2501E92918p480L50445K1923J76348m71292L24080P0456q70177Q4365R3984L55349
2490G20919O32619m26582K0888O27586K20782o36937L66518m73024J20882j18422
2480A055229j70067M24550k56479K78703N78824k24311m91336j00264J16611j83088
2470A028372k98565K64961K92220R0493N3517N58717K25748m72264k09941j51437
2460A381821M8289M52872K37362J34125l35776J89617J155j38478l74765k47953
$$ y = [419205, 452870, 376128, 242647, 612163, 6688, -98132, 74598, 528745, 251348, 226910, 219757, 614630, 711945, 322701, 212881, 375076, 663525, 228253, 1229690, 1072710, 769036, 334230, 796078, 957831, 872093, 983945, 719273, 976555, 779608, 592918, 585438, 935883, 957806, 1134154, 662862, 986942, 1057398, 187221, 271586, 365570, 720919, 1353538, 926956, 947844, 1575430, 1796212, 1159275, 1525793, 1052769, 1173651, 1055229, 885162, 1309712, 1053233, 1331936, 1910760, 1686449, 1195113, 1094849, 1211460, 1028372, 729807, 994768, 1286988, 1377481, 1430998, 1989715, 2215463, 1743199, 1533258, 1381821, 1430110, 1882982, 2120344, 2254469, 1918693, 2108310, 2109465, 1970987, 1596222, 1348269]
2450A348269N93589L49097p70605r4189L22965l031L31702p9216Q2352O81278
2440B762211j43847o75900k63530q2526N07900j79893M02009P27965k97803k33212
2430B523374j33748k10631N09588j55056M74635J12370k56248J5458k28972K07325
2420B858095n444k05606O25069K97756o12228j3600L69533k18272M7121j66439
2410B975985l7447N16729J75365m9944l6698K63322k91790P74918M13396m02015
2400D301821m93639O66987m09814n09355M00305M64936L43967L79683L82454K28484
2390E755829k77806j60802j82364N36020M42809O9623m0373M6412N12932N13073
2380G215353j30868N64621O73012J35830p926K75851O00499j44653R9494M31176
$$ y = [1348269, 1941858, 2290955, 1520350, 1426161, 1749126, 1746095, 2077797, 1998581, 2080933, 2762211, 2618364, 1942464, 1678934, 1596408, 2104308, 1924415, 2326424, 3054389, 2756586, 2523374, 2389626, 2178995, 2688583, 2533527, 3008162, 3120532, 2864284, 2879742, 2650770, 2858095, 2852651, 2647045, 3272114, 3569870, 2957642, 2944042, 3313575, 3095303, 3142424, 2975985, 2938538, 3455267, 3630632, 3580688, 3543990, 3807312, 3515522, 4290440, 4703836, 4301821, 3808182, 4475169, 4065355, 3556000, 3956305, 4421241, 4765208, 5144891, 5527345, 5755829, 5478023, 5317221, 5134857, 5670877, 6113686, 6183309, 6142936, 6189348, 6702280, 7215353, 7084485, 7649106, 8322118, 8457948, 8450022, 8725873, 9326372, 9181719, 9281213, 9712389]
2370I712389K11542Q26979j72774N92922K21457R13745N97886O54346l07591M73242
2360A3724143P15160O06556P42721K89805J245548J229272J895114J710155K185241
2351B4343715L328699M893270M474272M189058L433209J979246K096779K530134
2343E1268382K651853M624447P773077J1872499J7917634K7619338M3648365P1438180
2335B38813775J04214203J01561416M2111716l1446816p3134384p1184384o8806450
2328B42129076n9820289m2013060l1543350k3991225j7961434j2166839p866039
2321D6766840m429836j214364k20248j499610k059895l268806k862876l518669
2313B7692536l257152k104057k112073j213142q15539r40459j171767r70907o96906
$$ y = [9712389, 9923931, 10750910, 10578136, 11171058, 11392515, 12306260, 12904146, 13558492, 13250901, 13724143, 14439303, 15045859, 15788580, 16078385, 17323933, 18553205, 20448319, 22158474, 24343715, 27672414, 32565684, 37039956, 41229014, 44662223, 46641469, 48738248, 51268382, 53920235, 58544682, 66317759, 78190258, 96107892, 123727230, 167375595, 238813775, 343027978, 444589394, 486701110, 455254294, 382119910, 310935526, 242129076, 182308787, 140295727, 108752377, 84761152, 66799718, 54632879, 46766840, 42337004, 41122640, 40902392, 39402782, 37342887, 34074081, 31211205, 27692536, 24435384, 22331327, 20219254, 19006112, 18190573, 17250114, 16078347, 15107440, 14410534]
2304A4410534o48888o14325l62518n69537p35475l85037l07070j49790r60339
2295I677555p22310p44649n516o2032k33070J00775m21414n01895k58987j04617
2285F723840k89947K1237J05064K46553K3863p64989j43224J11071r67717m25486
2275D640265L43576p434j65402j70692j03310m8989J58868m64468k0285p1785
2265D090344j18189K4688p7861l67577k66741j1549l36838j46501k37940J05100
2255B656936k5204K89255l58936M8150M8906n15453K52569k80844j14421L7147
2245B038105m26485p5039K17156K20144j16352m23943J0115J26331K28942o90258
2235A108716l9692J3638l57274N15262L23063Q3838l72479M5478J71196j41302
$$ y = [14410534, 13761646, 13147321, 12784803, 12215266, 11479791, 11094754, 10787684, 10637894, 9677555, 8955245, 8210596, 8205080, 8143048, 7909978, 8010753, 7589339, 7087444, 6828457, 6723840, 6433893, 6455130, 6560194, 6806747, 6830610, 6065621, 5922397, 6033468, 5065751, 4640265, 4983841, 4976407, 4811005, 4640313, 4537003, 4488014, 4646882, 4182414, 4162129, 4090344, 3972155, 3996843, 3918982, 3551405, 3284664, 3273115, 2936277, 2789776, 2551836, 2656936, 2631732, 2920987, 2562051, 2610201, 2659107, 2143654, 2396223, 2115379, 2000958, 2038105, 1611620, 1536581, 1753737, 1973881, 1857529, 1433586, 1443701, 1570032, 1798974, 1108716, 1069024, 1082662, 725388, 1240650, 1563713, 1647551, 1275072, 1320550, 1491746, 1350444]
2225A350444M90151m77399n33557P5148Q5450r4399K41285o4313J39903j71379
2215A041334Q80629l11786n39258k76465K46966J34371L82846n33152j50686M88190
2205A362989m11691J26638k6264n00198l81443K95867L51974l11925j71673K62808
2195E97082m91185J01629J12809N52882O2968J14205j053782L83538K77714l40828
2185C17032K47158J91988k67823N3032l9597l76407l81114o9719L90588j5216
2175D9922l34658J00768J95593l08168L86706M72073J41831K4694p39685k42224
2165b53148J66776J20735j08063k13303K26607n10104l5034K44937j87676j39807
2155f88080L47546m1497k29211J57487M61844K86950k87539m47000K79954J95457
$$ y = [1350444, 1840595, 1363196, 829639, 904787, 990237, 895838, 1137123, 1072810, 1212713, 1041334, 1921963, 1610177, 1070919, 794454, 1041420, 1175791, 1558637, 1025485, 874799, 1362989, 951298, 1077936, 1051672, 551474, 170031, 465898, 817872, 505947, 334274, 597082, 105897, 207526, 320335, 873217, 936185, 1050390, -3392, 380146, 657860, 317032, 564190, 756178, 488355, 541387, 501790, 125383, -255731, -325450, 65138, 49922, -284736, -183968, 11625, -296543, 90163, 562236, 704067, 728761, -10924, -253148, -86372, 34363, -73700, -287003, -60396, -570500, -605534, -360597, -548273, -688080, -340534, -382031, -611242, -453755, 8089, 295039, 7500, -439500, -159546, 35911]
2145C5911J72582L7912J26710j72707j63061l71298l1047N27036K95386p7054
2135C80370o89938J58268k51859J72437O05758j79580m23262R9304K00339K82745
2125C54582l61500k40794J77663L96712R394J24313k26254n52972q207O8837l478
$$ y = [35911, 208493, 246405, 373115, 200408, 37347, -333951, -364998, 162038, 457424, 380370, -309568, -151300, -403159, -230722, 375036, 195456, -227806, -128502, 71837, 354582, -6918, -247712, -70049, 326663, 336057, 460370, 234116, -318856, -327063, -258226, -261704]
$$ [...]
##END NTUPLES=NMR SPECTRUM
##END=
