##TITLE=1H_DE-80H_X3
 200.13MHz, d2o
 8 sc
 
 19ns.26.2.2025
##JCAMPDX= 6.0         $$ Bruker NMR JCAMP-DX V2.0
##DATA TYPE= NMR SPECTRUM
##DATA CLASS= NTUPLES
##ORIGIN= UXNMR, Bruker Analytische Messtechnik GmbH
##OWNER= pz
$$ XWIN-NMR		Version 3.5
$$ Tue Jul  8 10:35:51 2025 Russian Standard Time (UT+4h)  Yarkov@DPX200
##.OBSERVE FREQUENCY= 200.1313
##.OBSERVE NUCLEUS= ^1H
##.ACQUISITION MODE= SIMULTANEOUS
##.ACQUISITION SCHEME= undefined
##.AVERAGES= 8
##.DIGITISER RES= 18
##SPECTROMETER/DATA SYSTEM= spect
##.PULSE SEQUENCE= zg30
##.SOLVENT NAME= CDCl3
##.SHIFT REFERENCE= (INTERNAL, CDCl3, 0, 15.4946)
##AUDIT TRAIL= $$ (NUMBER, WHEN, WHO, WHERE, WHAT)
$$ ##TITLE= Audit trail, XWIN-NMR		Version 3.5
$$ ##JCAMPDX= 5.01
$$ ##ORIGIN= Bruker BioSpin GmbH
$$ ##OWNER= Yarkov
$$ C:/Bruker/XWIN-NMR/data/yarkov2/nmr/H-C/1/pdata/1/auditp.txt
$$ ##AUDIT TRAIL=  $$ (NUMBER, WHEN, WHO, WHERE, WHAT)
(   1,<2025-07-08 10:34:45.32 +0400>,<Yarkov>,<DPX200>,
      <created by zg, POWCHK disabled, PULCHK disabled
       configuration hash MD5:
       00 E9 B6 7A A2 85 ED C7 34 08 36 98 17 FE 4E 26
       data hash MD5: 16K
       71 C0 01 64 E0 51 D1 2C F8 29 FD E2 EB 1F 1F E8>)
(   2,<2025-07-08 10:34:50.60 +0400>,<Yarkov>,<DPX200>,
      <Start of raw data processing
       efp BC_mod = 2 LB = 0.25 FT_mod = 6 PKNL = 1 PHC0 = -1361.838 PHC1 = 13.64948 SI = 16K 
       data hash MD5: 16K
       12 D8 86 C3 A3 B6 23 47 80 E7 30 32 B2 29 F9 E0>)
(   3,<2025-07-08 10:34:59.73 +0400>,<Yarkov>,<DPX200>,
      <abs ABSG = 5 
       data hash MD5: 16K
       1F F1 BD FD 33 49 DA 3A FC 93 C4 6C F0 AD 1A 3F>)
(   4,<2025-07-08 10:35:17.71 +0400>,<Yarkov>,<DPX200>,
      <pk PHC0 = 9.758663 PHC1 = -12.2 
       data hash MD5: 16K
       B3 41 B7 C9 40 3D 20 48 50 33 B2 91 D3 ED 6E 91>)
(   5,<2025-07-08 10:35:20.90 +0400>,<Yarkov>,<DPX200>,
      <abs ABSG = 5 
       data hash MD5: 16K
       0E 21 DB 09 65 98 E9 D8 1E 8D 67 5A C0 4F FD 3A>)
$$ ##END=
$$ 
$$ hash MD5
$$ 09 9B BA 26 EB 36 23 26 0F B3 56 19 9F 55 78 82
##$RELAX= 
##$RELAX= 
##$RELAX= 
##$RELAX= 
##$RELAX= 
##$RELAX= 
$$ Bruker specific parameters
$$ --------------------------
##$DU= <C:/Bruker/XWIN-NMR>
##$EXPNO= 1
##$NAME= <H-C>
##$PROCNO= 1
##$TYPE= <nmr>
##$USER= <yarkov2>
##$AMP= (0..31)
100 100 100 100 100 100 100 100 100 100 100 100 100 100 100 100 100 100 
100 100 100 100 100 100 100 100 100 100 100 100 100 100 
##$AQSEQ= 0
##$AQ_mod= 1
##$AUNM= <au_zg>
##$AUTOPOS= <>
##$BF1= 200.13
##$BF2= 200.13
##$BF3= 200.13
##$BF4= 200.13
##$BF5= 200.13
##$BF6= 200.13
##$BF7= 200.13
##$BF8= 200.13
##$BYTORDA= 1
##$CFDGTYP= 0
##$CFRGTYP= 5
##$CHEMSTR= <none>
##$CNST= (0..31)
1 1 145 1 1 1 1 1 1 1 1 1 1 1 1 1 1 1 1 1 1 1 1 1 1 1 1 1 1 1 1 1 
##$CPDPRG= <>
##$CPDPRG1= <>
##$CPDPRG2= <>
##$CPDPRG3= <>
##$CPDPRG4= <mlev>
##$CPDPRG5= <mlev>
##$CPDPRG6= <mlev>
##$CPDPRG7= <mlev>
##$CPDPRG8= <mlev>
##$CPDPRGB= <>
##$CPDPRGT= <>
##$D= (0..31)
0 0.7 0 0 0 0 0 0 0 0 0 0.03 0 0 0 0 0 0 0 0 0 0 0 0 0 0 0 0 0 0 0 0 
$$ [...]
##$SUBNAM3= <"">
##$SUBNAM4= <"">
##$SUBNAM5= <"">
##$SUBNAM6= <"">
##$SUBNAM7= <"">
##$SUBNAM8= <"">
##$SUBNAM9= <"">
##$SW= 18.0517328524113
##$SWIBOX= (0..15)
0 0 2 0 0 0 0 0 0 0 0 0 0 0 0 0 
##$SW_h= 3612.71676300578
##$TD= 16384
##$TD0= 1
##$TE= 0
##$TE2= 300
##$TE3= 300
##$TEG= 300
##$TL= (0..7)
0 120 120 120 120 120 120 120 
##$TP= (0..7)
150 150 150 150 150 150 150 150 
##$TP07= 0
##$TPNAME0= <>
##$TPNAME1= <>
##$TPNAME2= <>
##$TPNAME3= <>
##$TPNAME4= <>
##$TPNAME5= <>
##$TPNAME6= <>
##$TPNAME7= <>
##$TPOAL= (0..7)
0.5 0.5 0.5 0.5 0.5 0.5 0.5 0.5 
##$TPOFFS= (0..7)
0 0 0 0 0 0 0 0 
##$TUNHIN= 0
##$TUNHOUT= 0
##$TUNXOUT= 0
##$USERA1= <user>
##$USERA2= <user>
##$USERA3= <user>
##$USERA4= <user>
##$USERA5= <user>
##$V9= 5
##$VALIST= <valist>
##$VCLIST= <CCCCCCCCCCCCCCC>
##$VD= 0
##$VDLIST= <DDDDDDDDDDDDDDD>
##$VPLIST= <PPPPPPPPPPPPPPP>
##$VTLIST= <TTTTTTTTTTTTTTT>
##$WBST= 1024
##$WBSW= 4
##$XGAIN= (0..3)
0 0 0 0 
##$XL= 0
##$YL= 0
##$YMAX_a= 1086095
##$YMIN_a= -987926
##$ZGOPTNS= <>
##$ZL1= 120
##$ZL2= 120
##$ZL3= 120
##$ZL4= 120
##$ABSF1= 15.49458
##$ABSF2= -2.557269
##$ABSG= 5
##$ABSL= 3
##$ALPHA= 0
##$AQORDER= 0
##$ASSFAC= 0
##$ASSFACI= 0
##$ASSFACX= 0
##$ASSWID= 0
##$AUNMP= <proc_1d>
##$AZFE= 0.1
##$AZFW= 0.1
##$BCFW= 0
##$BC_mod= 2
##$BYTORDP= 0
##$COROFFS= 0
##$CY= -3
##$DATMOD= 1
##$DC= 0
##$DFILT= <>
##$DTYPP= 0
##$F1P= 0
##$F2P= 0
##$FCOR= 1
##$FTSIZE= 16384
##$FT_mod= 6
##$GAMMA= 0
##$GB= 0
##$INTBC= 1
##$INTSCL= 3.241238e-09
##$ISEN= 128
##$LB= 0.25
##$LEV0= 0
##$LPBIN= 0
##$MAXI= 10000
##$MC2= 0
##$MEAN= 0
##$ME_mod= 0
##$MI= 1.114404
##$NCOEF= 0
##$NC_proc= -4
##$NLEV= 6
##$NOISF1= 3.799351
##$NOISF2= 2.8
##$NSP= 0
##$NTH_PI= 0
##$NZP= 0
##$OFFSET= 15.49458
##$PC= 1
##$PHC0= -1352.079
##$PHC1= 1.44948
##$PH_mod= 1
##$PKNL= yes
##$PPARMOD= 0
##$PSCAL= 0
##$PSIGN= 0
##$REVERSE= no
##$SF= 200.130005427742
##$SI= 16384
##$SIGF1= 3
##$SIGF2= 2
##$SINO= 0.751879
##$SIOLD= 32768
##$SREGLST= <19F.Aceton>
##$SSB= 0
##$STSI= 16384
##$STSR= 0
##$SW_p= 3612.71676300578
##$SYMM= 0
##$S_DEV= 0
##$TDeff= 16384
##$TDoff= 0
##$TI= <>
##$TILT= no
##$TM1= 0
##$TM2= 0
##$TOPLEV= 0
##$USERP1= <user>
##$USERP2= <user>
##$USERP3= <user>
##$USERP4= <user>
##$USERP5= <user>
##$WDW= 1
##$XDIM= 16384
##$YMAX_p= 285646715
##$YMIN_p= -328483
$$ End of Bruker specific parameters
$$ ---------------------------------
##NTUPLES= NMR SPECTRUM
##VAR_NAME=  FREQUENCY,     SPECTRUM/REAL,   SPECTRUM/IMAG
##SYMBOL=    X,             R,               I
##VAR_TYPE=  INDEPENDENT,   DEPENDENT,       DEPENDENT
##VAR_FORM=  AFFN,          ASDF,            ASDF
##VAR_DIM=   16384,         16384,           16384
##UNITS=     HZ,            ARBITRARY UNITS, ARBITRARY UNITS
##FACTOR=    0.220516191357247, 1,           1
##FIRST=     3100.93043330751, 0,            0
##LAST=      -511.786329698272, 0,           0
##MIN=       -511.786329698272, -328483,     0
##MAX=       3100.93043330751, 285646715,    0
$$ Real data points
##PAGE= N=1
##DATA TABLE= (X++(R..R)), XYDATA
$$ [...]
6021I24514L145j620Q394K3416q100M501m819k862J5244P943K3618J240J1613
6008A006227p384n580L428J0208l858J0296K518L303K4496L337K206l225o388
5995A039584j2666K8858L564L590J8509J1764J3562p772K5162L0331K0369K072
5983A176927J1161m325Q411P271K2197J1576m006j0784j0164K148K6520J0230
5971A247162Q39O373K6652J1000J7653K2739Q539R682K1453J5016J4806K6995
5959A428909K2637L1060L5951K2442K4413n908p471l90P685o36J1463K2524P391
5946A600070q204K0825L0448K0197M0493p047J6716M7713L6628M7144M2911O5656
5934A953550N0235O1635P6430Q5945J02031Q9962O9964l176m8388n6779o1325
$$ y = [924514, 927659, 926039, 934433, 957849, 949749, 954250, 949431, 946569, 961813, 969756, 993374, 994614, 1006227, 998843, 993263, 996691, 1006899, 1003041, 1013337, 1015855, 1019158, 1043654, 1046991, 1049197, 1045972, 1039584, 1026918, 1055776, 1059340, 1062930, 1081439, 1093203, 1106765, 1098993, 1124155, 1154486, 1174855, 1176927, 1188088, 1183763, 1192174, 1199445, 1221642, 1233218, 1229212, 1218428, 1208264, 1210412, 1236932, 1247162, 1248001, 1254374, 1281026, 1292026, 1309679, 1332418, 1340957, 1350639, 1372092, 1387108, 1401914, 1428909, 1451546, 1482606, 1518557, 1540999, 1565412, 1559504, 1552033, 1551643, 1559328, 1558692, 1570155, 1592679, 1600070, 1591866, 1612691, 1643139, 1663336, 1703829, 1696782, 1713498, 1761211, 1797839, 1844983, 1887894, 1953550, 2003785, 2065420, 2141850, 2227795, 2329826, 2419788, 2489752, 2486576, 2438188, 2381409, 2320084]
5923B320084l5440p384J460J6217r037M012K9601M4066L8562M5200L0393N2261
5911B529995N2008N7258P2302Q5510P3647R4763J25221J45731J55468J79375J70695
5900C741973N7695j00297j67287j85333j91983j38473r7169o6295m0483k9687
5890B782661k3121j1529n559K461K6168K6369L2795L7904O3704O0219Q1780J13940
5878C187792J12971J44611J70658K12098K47688J89382M5864j48638k40494k46165
5868C675767k18522j72066j24160j04207n2604l2763l4432q610p554l550J8052
5857B935351Q826J9017L8841L4779O0260O7181Q4142J17263J33738J78477K52865
5846C930740K59250K13575L5841j16603j85153j88851j53067j20650q0014q9463
$$ y = [2320084, 2284644, 2277260, 2278720, 2294937, 2285900, 2289912, 2319513, 2363579, 2402141, 2447341, 2477734, 2529995, 2582003, 2639261, 2711563, 2797073, 2870720, 2965483, 3090704, 3236435, 3391903, 3571278, 3741973, 3799668, 3699371, 3532084, 3346751, 3154768, 3016295, 2919126, 2852831, 2812348, 2782661, 2759540, 2748011, 2742452, 2744913, 2771081, 2797450, 2830245, 2868149, 2931853, 2992072, 3073852, 3187792, 3300763, 3445374, 3616032, 3828130, 4075818, 4265200, 4311064, 4162426, 3921932, 3675767, 3457245, 3285179, 3161019, 3056812, 3004208, 2971445, 2937013, 2928403, 2920849, 2917299, 2935351, 2944177, 2963194, 3002035, 3036814, 3097074, 3164255, 3248397, 3365660, 3499398, 3677875, 3930740, 4189990, 4403565, 4439406, 4322803, 4137650, 3948799, 3795732, 3675082, 3595068, 3505605]
5836C505605j00658j03337q4962p1645o4112n9439n0474k8869k9806j3784j3850
5825B884669R559J2220K9122Q2196J02326R3377J05308R1429L2418n3174p7597
5814C311853j09884q9764r8480j10194j12981j08349j03328p4932n9602p3100
5804B371239m7178m6599m5201k2618m5601j6564k0979p775j5838q404j4247j4203
5792B066032j0683m784N372k1145r730k6738k0244l4066k8813j2972J766j697
5780A902298j2424K444j2203k1434j8760M081J8258o304m211k1897J3843k418
5768A841273J1863J108j1050n302n721r984J5744L716o099k1595m790P197j2273
5755A804087K3843m032n173n764l3499J1781K7061K2314l867N889p267o185K1984
$$ y = [3505605, 3404947, 3301610, 3216648, 3145003, 3080891, 3021452, 2970978, 2942109, 2912303, 2898519, 2884669, 2894228, 2906448, 2935570, 3017766, 3120092, 3213469, 3318777, 3410206, 3442624, 3389450, 3311853, 3201969, 3112205, 3013725, 2903531, 2790550, 2682201, 2578873, 2503941, 2444339, 2371239, 2324061, 2277462, 2232261, 2209643, 2164042, 2147478, 2126499, 2118724, 2102886, 2094482, 2080235, 2066032, 2055349, 2050565, 2055937, 2034792, 2025062, 1998324, 1978080, 1944014, 1915201, 1902229, 1903995, 1902298, 1889874, 1892318, 1880115, 1858681, 1839921, 1844002, 1862260, 1855956, 1851745, 1829848, 1843691, 1841273, 1853136, 1854244, 1843194, 1837892, 1832171, 1822187, 1837931, 1841647, 1835548, 1813953, 1809163, 1816360, 1804087, 1827930, 1823898, 1818725, 1812961, 1779462, 1791243, 1818304, 1840618, 1836751, 1842640, 1835373, 1829188, 1851172]
5742A851172K5366J47o016j764m236j554j352l250J2871K765J2154k805L627J476
5728A888601q979r864q626m643j621J0214J0685j1251k234N946J7086J7763p33
5715A902344r789p121O935k55J3947J9503q837j5083J959j8178m929k2805P83
5702A858474R24m930l701P155k2045j818j0856Q047r906L964J3102l582o348m386
5688A824094m713q219r154O286P00j7273q027j1513j3223L147K3417O645j6912
5675A775255J503n209n4P295j4398j7482k378j0790o528j0707j050J9711K267
5662A737435j8437k0390j0690N825O784n401j284J871n961q512K883j3666j5550
5649A654907j1265m459n720j2342q723r395j6565l18j4299J1200k296k4406q162
$$ y = [1851172, 1876538, 1876685, 1870669, 1868905, 1864669, 1863115, 1861763, 1858513, 1871384, 1874149, 1886303, 1883498, 1887125, 1888601, 1879622, 1869758, 1861132, 1856489, 1854868, 1865082, 1875767, 1864516, 1862282, 1868228, 1885314, 1903077, 1902344, 1892555, 1885434, 1892369, 1892114, 1906061, 1925564, 1916727, 1901644, 1903603, 1885425, 1880496, 1857691, 1858474, 1859398, 1854468, 1850767, 1857922, 1835877, 1834059, 1823203, 1831250, 1821344, 1825308, 1838410, 1834828, 1828480, 1824094, 1819381, 1811162, 1802008, 1808294, 1808994, 1791721, 1783694, 1772181, 1758958, 1762105, 1785522, 1792167, 1775255, 1776758, 1771549, 1771495, 1778790, 1764392, 1746910, 1744532, 1733742, 1727214, 1716507, 1715457, 1735168, 1737435, 1718998, 1698608, 1687918, 1693743, 1700527, 1695126, 1693842, 1695713, 1689752, 1681240, 1684123, 1670457, 1654907, 1643642, 1639183, 1633463, 1621121, 1612398, 1603003, 1586438, 1586120, 1571821, 1583021, 1580725, 1556319, 1548157]
5636A548157J6640O157M405M637p615n72k939P456n168l0402L340P179M973q960
5622A547288l870l67J8825L878J6616L1715M1069M9260M9955M6771L7467O2489
5610A901096L5005k4156o5741n4476n3021l9176l3945k1692J1346k546K545j1407
5598A643832P589J7811j511L3429K8108R544L0045K3253K5137M8412N7698P5763
5586A999110N8157R2588J17866J41816J47873J72137J91736J61855K8824j42298
5576B969664k04188k01193j73094j44470j17525n9526n2551n8624l8760k9279
5566A890454j7442k2726J1966j711O651O483J7198K5123K0571N6116M6781P0771
5554B110235P7360P4667R8881J36025J37706J66315J91888J27456J427j63431
$$ y = [1548157, 1564797, 1570954, 1575359, 1579996, 1572381, 1571809, 1568870, 1576326, 1571158, 1540756, 1544096, 1551275, 1556248, 1547288, 1543418, 1543051, 1561876, 1565754, 1582370, 1614085, 1655154, 1704414, 1754369, 1801140, 1838607, 1901096, 1936101, 1911945, 1846204, 1791728, 1738707, 1699531, 1665586, 1643894, 1655240, 1652694, 1655239, 1643832, 1651421, 1669232, 1667721, 1701150, 1729258, 1738802, 1768847, 1792100, 1817237, 1865649, 1923347, 1999110, 2057267, 2149855, 2267721, 2409537, 2557410, 2729547, 2921283, 3083138, 3111962, 2969664, 2765476, 2564283, 2391189, 2246719, 2129194, 2069668, 2017117, 1958493, 1919733, 1890454, 1873012, 1850286, 1862252, 1860541, 1867192, 1873675, 1890873, 1915996, 1936567, 1992683, 2039464, 2110235, 2187595, 2262262, 2361143, 2497168, 2634874, 2801189, 2993077, 3120533, 3121960, 2958529]
5544B958529k19536k01370j80285j26699r2974p6214o4849l6464l8960k6797j4739
5533A879642p328Q657M48j9219l3015p050k2726r184j0803m629l361K4732J8339
5520A814503J1386L1794N7336N5665O5291L9267j7234m0743q3866r4701p0227
5509A768471o4247l7100m2805l5024j5253j3182k3242k5688J3418J3517J0243
5498A549108j1832N963M106k4531j1009j806k6914k180k694P610j3438o607j472
5485A464304j0068j2042R320J9138j5770p179J3120J1843K276L714K3133K761
5473A504550J4187M010l37N894n7J64R635M690O652O580o287l843o750j7628j9154
5458A502306O839j3850L353L018j0232R217R011j4852N855k887P536L6240K336
$$ y = [2958529, 2738993, 2537623, 2357338, 2230639, 2137665, 2061451, 1996602, 1960138, 1921178, 1894381, 1879642, 1872314, 1880971, 1881419, 1862200, 1829185, 1822135, 1799409, 1790225, 1779422, 1774793, 1771432, 1796164, 1814503, 1825889, 1857683, 1915019, 1970684, 2035975, 2075242, 2058008, 2017265, 1933399, 1838698, 1768471, 1704224, 1667124, 1624319, 1589295, 1574042, 1560860, 1537618, 1511930, 1525348, 1538865, 1549108, 1537276, 1543239, 1547345, 1522814, 1511805, 1509999, 1483085, 1480905, 1478211, 1485821, 1472383, 1465776, 1464304, 1454236, 1442194, 1451514, 1470652, 1454882, 1447703, 1460823, 1472666, 1474942, 1478656, 1501789, 1504550, 1518737, 1522747, 1522410, 1528304, 1528247, 1528411, 1538046, 1542736, 1549388, 1555968, 1549681, 1545838, 1539088, 1521460, 1502306, 1509145, 1495295, 1498648, 1501666, 1491434, 1500651, 1509662, 1494810, 1500665, 1497778, 1505314, 1541554, 1543890]
5445A543890j2637j300r717J949J5581O604J312P485J9511J6548J2188N826J9871
5432A627111K2798J1677J3706K2196L423J8433J4236j695j2257p028n768O760
5420A713592J5332l513K2269M843k4736l0547l4899l5711j6366m0p030M233J9134
5407A626561K0322J5733P137L8861J8377K991K70j3426P728j3054J049P692P903
5394A728144O89o693J601J1532l45m933J3283J2173Q653J7517K7042L0323L7484
5381A876470J242J314k9856k5779n3090l4067m7249l9693k4677k3731k1522m703
5369A574659m473L318r067K01N275k732L0136K2119L3905K2424K6241J4203J4005
5356A730214r10l1142j2516k0493j7962k0082k9161Q300n644J3689K2554K3207
$$ y = [1543890, 1531253, 1529953, 1520236, 1522185, 1537766, 1544370, 1545682, 1553167, 1572678, 1589226, 1601414, 1607240, 1627111, 1649909, 1661586, 1675292, 1697488, 1700911, 1719344, 1733580, 1731885, 1719628, 1712600, 1706832, 1713592, 1728924, 1725411, 1747680, 1752523, 1727787, 1697240, 1662341, 1626630, 1610264, 1610224, 1603194, 1607427, 1626561, 1646883, 1662616, 1669753, 1708614, 1726991, 1729982, 1730252, 1716826, 1724554, 1711500, 1712549, 1720241, 1728144, 1728833, 1722140, 1723741, 1735273, 1734928, 1729995, 1743278, 1755451, 1764104, 1781621, 1808663, 1838986, 1876470, 1877712, 1879026, 1849170, 1823391, 1770301, 1736234, 1688985, 1649292, 1624615, 1600884, 1579362, 1574659, 1570186, 1573504, 1564437, 1564638, 1569913, 1567181, 1597317, 1619436, 1653341, 1675765, 1702006, 1716209, 1730214, 1729304, 1698162, 1685646, 1665153, 1647191, 1627109, 1597948, 1606248, 1600604, 1614293, 1636847, 1660054]
5344A660054J1959K9832L4307M4958L6442M0311P2466R0427Q6188R0359J21723
5333B319026J40618J74166J76734K03355K43517K92377L11432L30432L87718M52439
5323E031814O08247P55530R32880J100800J231251J487673J840929J569660K17568
5314A4776352j242411j833782j759944j497160j178247r09390o89046n32721m48970
5305D684681l66181l21778l06477k42076j92071j81414j57369j45004j37366j40225
5295B494720j38824j24550q0630q3526r5397r7786p5572p4308o3593l1825n1030
5284A577679l1524l3736l2626l6503n4288l2500j9854l9626l6774j8388k6619
5273A215241j9532k3511l2559j3189p337k0614j1987k7764J932n610j3400O650
$$ y = [1660054, 1672013, 1701845, 1736152, 1781110, 1817552, 1857863, 1930329, 2020756, 2106944, 2197303, 2319026, 2459644, 2633810, 2810544, 3013899, 3257416, 3549793, 3861225, 4191657, 4579375, 5031814, 5640061, 6395591, 7328471, 8429271, 9660522, 11148195, 12989124, 14558784, 14776352, 13533941, 11700159, 9940215, 8443055, 7264808, 6355418, 5666372, 5133651, 4684681, 4318500, 3996722, 3690245, 3448169, 3256098, 3074684, 2917315, 2772311, 2634945, 2494720, 2355896, 2231346, 2150716, 2067190, 1971793, 1874007, 1798435, 1724127, 1660534, 1628709, 1577679, 1546155, 1512419, 1479793, 1443290, 1389002, 1356502, 1336648, 1297022, 1260248, 1241860, 1215241, 1195709, 1172198, 1139639, 1126450, 1119113, 1098499, 1086512, 1058748, 1060680, 1055070, 1041670, 1048320]
5261A048320o349l8643q226R642l237k184k5183n315P007j1115k0522j1356k1576
5248I11263m764J6937J1286j5700j17n211L304l543m442L264Q511o364j5917J2986
5234I11493K796l433J8723k4190l396L450J1873O113l49k1193r131j853J553j068
5220H91388O978R887j2585J9463J1615L607j4409J98j6381j632q584k0420M762
5207H73887O278J3738o294m257L422P125q377r027J2523P000J2231J5196n249
5194I18196L584K3586O544J5994m991Q783L0627J2120J8002L0257j658j022J0232
5181A070254O93P026J273J2928M1309L3938L3211J4053J4436M639j8597j4537
5169A200626l1130j7040j5457k1074j7198j3972l818L157R951m522j2091K336
$$ y = [1048320, 1041971, 1003328, 995102, 1004744, 1001507, 999323, 974140, 968825, 975832, 964717, 944195, 932839, 911263, 906499, 923436, 934722, 919022, 918905, 913694, 916998, 913455, 909013, 912277, 920788, 914424, 898507, 911493, 914289, 910856, 929579, 905389, 901993, 905443, 917316, 923429, 923080, 901887, 892756, 890903, 892456, 891388, 898366, 908253, 895668, 915131, 926746, 930353, 915944, 916142, 899761, 898129, 889545, 869125, 873887, 880165, 893903, 887609, 883352, 886774, 893899, 885522, 876495, 889018, 896018, 908249, 923445, 918196, 921780, 945366, 951910, 967904, 962913, 971696, 1002323, 1014443, 1032445, 1062702, 1061044, 1060022, 1070254, 1070947, 1077973, 1079246, 1092174, 1133483, 1167421, 1200632, 1214685, 1229121, 1233760, 1215163, 1200626, 1169496, 1152456, 1136999, 1115925, 1098727, 1084755, 1080937, 1084094, 1094045, 1089523, 1077432, 1079768]
5157A079768R069m800o640J2830J3135k391k014K425L8999J1295q681L211J7339
5144A163545J6400Q470j312J234q551J1291Q335O538J8112J1884J1146J0780k379
5131A255493J4626J2387J6705Q350P346K8763k130K1007R126J6442J7962K979
5119A409056L8020K4592L322J4945K5447K7110J7415K0688J3855l42K1465M2490
5107A658063M238K4872K2650L4791M1978N6727L2238L6999N4192O0006M2880M1883
5095B111517J6482o271n2121n3503m4931n7523k9349j475j4288k0248j1718J617
5083A838189J7633k2109L354R202j436J254P022J7759K450J2072R425Q992J3068
5070A916875Q898O834N920p777K0076J7549l921J8722k707r37j0097P481j0901
$$ y = [1079768, 1088837, 1084037, 1077397, 1090227, 1103362, 1100971, 1098957, 1101382, 1140381, 1151676, 1142995, 1146206, 1163545, 1179945, 1188415, 1187103, 1188337, 1179786, 1191077, 1199412, 1205950, 1224062, 1235946, 1247092, 1257872, 1255493, 1270119, 1282506, 1299211, 1307561, 1314907, 1343670, 1341540, 1362547, 1371673, 1388115, 1406077, 1409056, 1447076, 1471668, 1474990, 1489935, 1515382, 1542492, 1559907, 1580595, 1594450, 1594108, 1615573, 1658063, 1662301, 1687173, 1709823, 1744614, 1786592, 1843319, 1875557, 1912556, 1966748, 2026754, 2069634, 2111517, 2127999, 2121728, 2069607, 2016104, 1971173, 1913650, 1884301, 1882826, 1868538, 1848290, 1836572, 1838189, 1855822, 1833713, 1837067, 1846269, 1844833, 1846087, 1853109, 1870868, 1873318, 1885390, 1894815, 1903807, 1916875, 1925773, 1932607, 1938527, 1930750, 1950826, 1968375, 1964454, 1983176, 1980469, 1979532, 1969435, 1976916, 1966015]
5057A966015K523K1154M432O647M214J2822J5533J5397L5401O575J6281J7971
5045B124965Q13P594K555K787J4105J2622J4289K0163J7355J4936k335J0711J7599
5032B258159P976K6047P370j3214L013K1615L91n99J022N695J1239P615j7315
5019B319014j2050R145J8521K0813O636N051J8028K1643k884l687K3242L0342
5007B453814J3586K4631L218K0646M1884L3525L5836L9729L5645M8317M0036M0772
4995B831639M4763K7484R224J9517O722q339K6401R202K0239L2506J2968J1119
4983C043445J9716L3575K5150L5199N0414M6292K9465K9115M5867L7970L0924
4972C427132O0878M9015N8773N9519N4958P9088N1375N8201N7596Q2209M6901
$$ y = [1966015, 1968538, 1989692, 1994124, 2000771, 2004985, 2017807, 2033340, 2048737, 2084138, 2090713, 2106994, 2124965, 2125778, 2133372, 2135927, 2138714, 2152819, 2165441, 2179730, 2199893, 2217248, 2232184, 2229849, 2240560, 2258159, 2266135, 2292182, 2299552, 2286338, 2289351, 2310966, 2311357, 2310758, 2311780, 2317475, 2328714, 2336329, 2319014, 2306964, 2316109, 2334630, 2355443, 2362079, 2367130, 2385158, 2406801, 2403917, 2400230, 2423472, 2453814, 2467400, 2492031, 2495249, 2515895, 2557779, 2591304, 2627140, 2666869, 2702514, 2750831, 2790867, 2831639, 2876402, 2903886, 2913110, 2932627, 2939349, 2931010, 2957411, 2966613, 2986852, 3019358, 3032326, 3043445, 3063161, 3096736, 3121886, 3157085, 3207499, 3253791, 3283256, 3312371, 3358238, 3396208, 3427132, 3488010, 3537025, 3595798, 3655317, 3710275, 3789363, 3840738, 3898939, 3956535, 4038744, 4085645]
4961D085645O8230J05079P1416Q7932J01829J02245R5943J07536J14959J19481
4951E060295J25075J56245J61854J56344J74078J55887J45140J66747K18170K37755
4941F757590K46454K57701K83400K93930L12910L29423L67200M02894M39333N15906
4931A0206741N89276O92898P28581O22924N08664L76750K90515K60863J44093
4922A4421305K1842o1169o4589m999J06501K08556L06690L79615L59352K29751
4912A5902855J5904j19832j27664j03103j02391j84934j99592k12707k31700k34939
4902A4401897k00093j62994j11340p4108k0213P6481J05439J47508J97849K52707
4892A4613133K85132L71768M38833N65210O80150Q23059R61171J079823J245318
$$ y = [4085645, 4153875, 4258954, 4330370, 4418302, 4520131, 4622376, 4718319, 4825855, 4940814, 5060295, 5185370, 5341615, 5503469, 5659813, 5833891, 5989778, 6134918, 6301665, 6519835, 6757590, 7004044, 7261745, 7545145, 7839075, 8151985, 8481408, 8848608, 9251502, 9690835, 10206741, 10796017, 11488915, 12217496, 12840420, 13349084, 13725834, 14016349, 14277212, 14421305, 14443147, 14381978, 14317389, 14312390, 14418891, 14627447, 14934137, 15313752, 15673104, 15902855, 15918759, 15798927, 15671263, 15568160, 15465769, 15280835, 15081243, 14868536, 14636836, 14401897, 14201804, 14038810, 13927470, 13853362, 13833149, 13909630, 14015069, 14162577, 14360426, 14613133, 14898265, 15270033, 15708866, 16274076, 16954226, 17777285, 18738456, 19818279, 21063597]
4883B1063597J262100R00018J23818o45058j059764j112108r60146p50249n45664
4874A8276544l90146k62246j73737p1794R502P5622J54601K23498L21398L38436
4864A8501678M45600N15199N19392L40369J57487J6936j22017k12520k13761j79556
4854A9768807j18112p5251m8436j9750K0870O5446R5725J08832M6827m4922j53057
4843A9646979k15302k48552k40782k27187j99105j70783j68698j47752j50689
4834A7878129j53534j40893j60954j31650j43863j57271j87288j83672k15843
4825A6403161k02155j90517j87995j91640k02105j91191j74980j86116j82315
4816A4694147j75869j71973j92431j56599j51749j76581j54156j38787j37589
$$ y = [21063597, 22325697, 23225715, 23349533, 22704475, 21644711, 20532603, 19572457, 18822208, 18276544, 17886398, 17624152, 17450415, 17378621, 17388123, 17463745, 17618346, 17841844, 18163242, 18501678, 18947278, 19462477, 19981869, 20322238, 20479725, 20496661, 20374644, 20162124, 19948363, 19768807, 19650695, 19575444, 19527008, 19507258, 19528128, 19593574, 19689299, 19798131, 19844958, 19800036, 19646979, 19431677, 19183125, 18942343, 18715156, 18516051, 18345268, 18176570, 18028818, 17878129, 17724595, 17583702, 17422748, 17291098, 17147235, 16989964, 16802676, 16619004, 16403161, 16201006, 16010489, 15822494, 15630854, 15428749, 15237558, 15062578, 14876462, 14694147, 14518278, 14346305, 14153874, 13997275, 13845526, 13668945, 13514789, 13376002, 13238413]
4807A3238413j42236j53120j66074j59471j26908j16685j39858j40634j24153
4798A1969274j09657j20116j09545j11611j22119j34950j23154j08168j31870
4789A0898084j20149r8879j00317q9959q5198r8871j00506p3774o3385p6772r0634
4778I899640p5047o7711p6186r3192o1947p3227q3052p4429o7535o4215n4528
4767I108571m9524n8464m5914l8197n2032l7152j3902k6812j9231J3078J1983
4756H792404M386Q341R874L5127K6726L3083M9122M0374L9586O0051P7388J20669
4744I297131J44378J44062K00498K43015K87221L45888L97217M60979N29110O00428
4734A2649927N73990K90747j57711m67293n66168n31620m58634l73264k66001
$$ y = [13238413, 13096177, 12943057, 12776983, 12617512, 12490604, 12373919, 12234061, 12093427, 11969274, 11859617, 11739501, 11629956, 11518345, 11396226, 11261276, 11138122, 11029954, 10898084, 10777935, 10679056, 10578739, 10488780, 10403582, 10304711, 10204205, 10130431, 10067046, 9990274, 9899640, 9824593, 9756882, 9680696, 9587504, 9525557, 9452330, 9369278, 9294849, 9227314, 9163099, 9108571, 9059047, 9000583, 8954669, 8916472, 8864440, 8827288, 8813386, 8786574, 8767343, 8780421, 8792404, 8796790, 8805131, 8815005, 8850132, 8876858, 8909941, 8959063, 8999437, 9039023, 9099074, 9176462, 9297131, 9441509, 9585571, 9786069, 10029084, 10316305, 10662193, 11059410, 11520389, 12049499, 12649927, 13223917, 13514664, 13356953, 12889660, 12323492, 11791872, 11333238, 10959974, 10693973]
4725A0693973k14369j83803j40759j18228p4129n3356o4100m7409m1147k8025
4715I728648k4285k3972m010J9467J9803L2100N9953M6888N7840O4779P5852R2373
4703A0145436R1842Q3779Q8787J06830R3693J06294J05053J32065J50364J54700
4693A1258843J70100J76332J84577J93823K10659K24877K38208K52202K58937
4684A3168558K70420K85889K85710K78269K95833L02635L36856L45185L46338
4675A5915693L36063L38410L76788L66907L79466M06140M24196M33363M52636
4666A9429662M71778M85836N00884M97478N29806N75020N75998N83646N85775
4657B4235883N98814O08605O08838O28040O46925O26946N99089O07357O06444
$$ y = [10693973, 10479604, 10295801, 10155042, 10036814, 9962685, 9909329, 9845229, 9797820, 9756673, 9728648, 9704363, 9680391, 9676381, 9695848, 9715651, 9747751, 9807704, 9854592, 9912432, 9977211, 10053063, 10145436, 10237278, 10321057, 10409844, 10516674, 10610367, 10716661, 10821714, 10953779, 11104143, 11258843, 11428943, 11605275, 11789852, 11983675, 12194334, 12419211, 12657419, 12909621, 13168558, 13438978, 13724867, 14010577, 14288846, 14584679, 14887314, 15224170, 15569355, 15915693, 16251756, 16590166, 16966954, 17333861, 17713327, 18119467, 18543663, 18977026, 19429662, 19901440, 20387276, 20888160, 21385638, 21915444, 22490464, 23066462, 23650108, 24235883, 24834697, 25443302, 26052140, 26680180, 27327105, 27954051, 28553140, 29160497, 29766941]
4648B9766941N79914N64493N34820N28107M72018M64317M16947L76468L35316
4639C4039341K61447K30143J50395Q1728J6461l1878r9892j51897k01444k67795
4629C4026609l06479l15076l79145m29999m61395m92380n05468n49401n57359
4620C0029907n60636n85442n98769o01164n90165n88156n99644n97456n83578
4611B4724897n78560n68207n50668n38745n48711n07437n10204m90133m84255
4602A9947977m74505m82981m60245m41560m47711m45246m19488m10852m04333
4593A5961056l92866l78750l44019l51526l44333l31923k98790k95467l03627
4584A2919755l12870l04596k88543k67502k74882k59342k43429k35226k33086
$$ y = [29766941, 30346855, 30911348, 31446168, 31974275, 32446293, 32910610, 33327557, 33704025, 34039341, 34300788, 34530931, 34681326, 34763054, 34779515, 34747637, 34647745, 34495848, 34294404, 34026609, 33720130, 33405054, 33025909, 32595910, 32134515, 31642135, 31136667, 30587266, 30029907, 29469271, 28883829, 28285060, 27683896, 27093731, 26505575, 25905931, 25308475, 24724897, 24146337, 23578130, 23027462, 22488717, 21940006, 21432569, 20922365, 20432232, 19947977, 19473472, 18990491, 18530246, 18088686, 17640975, 17195729, 16776241, 16365389, 15961056, 15568190, 15189440, 14845421, 14493895, 14149562, 13817639, 13518849, 13223382, 12919755, 12606885, 12302289, 12013746, 11746244, 11471362, 11212020, 10968591, 10733365, 10500279]
4575A0500279k39104k14998j98228k18843k00768j91737j90441j90541j81215
4566H674404j93851j57435j49286j72211j58577j36714j56895j48294j29294j11884
4556G159963j18534j21540j24372j09466j16514r6595j00590j09716r1251j13609
4546F057776r5657r9464j04192j02545r2526r9049q4351p9687r1686r3133q7168
4535E028318p4944n1918p8066q6501o9713o1771p4492p3113o7358o9547n1660
4524D269235o0265o1628n1400n4130o5662n0671n1280n4026n0037n8668k6453
4513C685015m0572n0214n0118n8431m6310m0214l0360k3922l2799l8429k5754
4502C247892m9158l5663j3131m0622l8605l1051m0573k6727k2346k3766k4562
$$ y = [10500279, 10261175, 10046177, 9847949, 9629106, 9428338, 9236601, 9046160, 8855619, 8674404, 8480553, 8323118, 8173832, 8001621, 7843044, 7706330, 7549435, 7401141, 7271847, 7159963, 7041429, 6919889, 6795517, 6686051, 6569537, 6472942, 6372352, 6262636, 6171385, 6057776, 5962119, 5862655, 5758463, 5655918, 5563392, 5464343, 5379992, 5300305, 5208619, 5115486, 5028318, 4953374, 4901456, 4823390, 4736889, 4667176, 4605405, 4530913, 4457800, 4390442, 4320895, 4269235, 4208970, 4147342, 4095942, 4041812, 3976150, 3925479, 3874199, 3820173, 3770136, 3711468, 3685015, 3644443, 3594229, 3544111, 3485680, 3439370, 3399156, 3368796, 3344874, 3312075, 3273646, 3247892, 3198734, 3163071, 3149940, 3109318, 3070713, 3039662, 2999089, 2972362, 2950016, 2926250, 2901688]
4491B901688j8579k3906k1941j7253m2394j5060l1631m7876j3880j7778l2121
4480B619269j8613k7964k1690j9639j4640l0445l0177j2277k1792l3779j0828
4469B377425j5935k3467l2232k1183j2686k0460j8000j0002j7591P427j7439j8864
4457B176993j779j4145k399p189k8696P087J16J0237J0487L451J419p744M5324
4444B193162J7512K4326L6408N0082N1773O9290N7348R2279Q4706J07723J31621
4433B916230J43548J68676J61871Q0918J0903r6499j75748j87288j77310j45978
4423B699323j54832j11388r8487p6505o3637n9849n2380n5885m1377k8118k3855
4412A933010j2769k8329j3261J3082q736l6020m6343p1050n1174l9260k8586k7557
$$ y = [2901688, 2883109, 2859203, 2837262, 2820009, 2777615, 2762555, 2730924, 2683048, 2669168, 2651390, 2619269, 2600656, 2572692, 2551002, 2531363, 2516723, 2486278, 2456101, 2443824, 2422032, 2388253, 2377425, 2361490, 2338023, 2305791, 2284608, 2271922, 2251462, 2233462, 2223460, 2205869, 2213296, 2195857, 2176993, 2175214, 2161069, 2158670, 2151481, 2122785, 2129872, 2129988, 2140225, 2150712, 2154163, 2155582, 2147838, 2193162, 2210674, 2235000, 2271408, 2321490, 2373263, 2442553, 2499901, 2592180, 2676886, 2784609, 2916230, 3059778, 3228454, 3390325, 3471243, 3482146, 3385647, 3209899, 3022611, 2845301, 2699323, 2544491, 2433103, 2334616, 2258111, 2194474, 2134625, 2082245, 2026360, 1984983, 1956865, 1933010, 1920241, 1891912, 1878651, 1891733, 1882997, 1846977, 1800634, 1729584, 1678410, 1639150, 1610564, 1583007]
4400A583007k0713k9471l2619j781l2337j7086p906k091l750p557k0684l124j9075
4387A384813j3698q58j1767Q709Q246p534N6k0264m229l787K1305J9797Q012J8777
4373A407578P635K7405K4202J9360L2372N3440M8491O1075P0593Q8930Q0552P1188
4361A992821J2428o2412j02547j07401q6697o6168o9431m7786n1646m2517k3458
4350A345186j4916k4698j8927J546j2146j0407q513k6838o817L371J1092k114
4338A235819k5631n554J3995n098j1415r772o199L942K3377o157m496p71j617
4325A200423J1517R997J9147J0416J6357j4231L068J3074K2022J2667n696j3505
4313A285256K2760K1568O285K729L8256M7762L6059M1036L6607M2177q17k8365
$$ y = [1583007, 1562294, 1532823, 1500204, 1498423, 1466086, 1449000, 1441094, 1439003, 1435253, 1427696, 1407012, 1403888, 1384813, 1371115, 1370257, 1358490, 1367199, 1375445, 1367911, 1367967, 1347703, 1343474, 1339687, 1360992, 1380789, 1388801, 1407578, 1415213, 1442618, 1466820, 1486180, 1518552, 1571992, 1620483, 1681558, 1752151, 1841081, 1921633, 1992821, 2005249, 1942837, 1840290, 1732889, 1646192, 1580024, 1510593, 1462807, 1411161, 1368644, 1345186, 1330270, 1305572, 1286645, 1288191, 1276045, 1265638, 1257125, 1230287, 1223470, 1226841, 1237933, 1235819, 1210188, 1204634, 1218629, 1213531, 1202116, 1192344, 1186145, 1190087, 1213464, 1207307, 1202811, 1202040, 1200423, 1211940, 1221937, 1241084, 1251500, 1267857, 1253626, 1256694, 1269768, 1291790, 1304457, 1298761, 1285256, 1308016, 1329584, 1335869, 1338598, 1376854, 1424616, 1460675, 1501711, 1538318, 1580495, 1579678, 1551313]
4301A551313l3046k1021j7076j1626p687r824k7849M699J469l024L1998M282K245
4288A464853M067J5482J6908K0566J7330J7893J2653K294K1756K9774J3387K0777
4276A657740K2471N317Q024j33P535l468q501J3760Q661J3309L0044K1648J7348
4263A793755K5325K3717J8731M2932L9276J7985L5320O2842M3661M8987O7489
4252B220020N9696K7744L8741J4609k835j2138n872j8293J442P387O380J0839
4240B347720J42L4508L1872L3375J4920K6958L8821N5629N5528P1911N0518O0906
4228B822808P8739P0107N4646Q6444J02623J01112J16252J30391J09160J06156
4218C778438J41543J56185J55019J75037J84379J96551J94362K07018K11910K12638
$$ y = [1551313, 1518267, 1497246, 1480170, 1468544, 1460857, 1451033, 1423184, 1427883, 1429352, 1426328, 1458326, 1462608, 1464853, 1468920, 1484402, 1501310, 1521876, 1539206, 1557099, 1569752, 1572046, 1593802, 1623576, 1636963, 1657740, 1680211, 1685528, 1693552, 1693419, 1700954, 1697486, 1688985, 1702745, 1711406, 1724715, 1754759, 1776407, 1793755, 1819080, 1842797, 1861528, 1904460, 1943736, 1961721, 1997041, 2059883, 2103544, 2152531, 2220020, 2279716, 2307460, 2346201, 2360810, 2357975, 2345837, 2339965, 2321672, 2323114, 2330501, 2336881, 2347720, 2347862, 2382370, 2414242, 2447617, 2462537, 2489495, 2528316, 2583945, 2639473, 2711384, 2761902, 2822808, 2901547, 2971654, 3026300, 3112744, 3215367, 3316479, 3432731, 3563122, 3672282, 3778438, 3919981, 4076166, 4231185, 4406222, 4590601, 4787152, 4981514, 5188532, 5400442, 5613080]
4208E613080K48942K90163L43957L85909M23097M37181M85691M87672M69666M23795
4198I609153L25104K58524K29400K44806L03489L51869M38674N49557O39126P43362
4188A3693064P69974P44588O85248N28937L37300J22760j9329p5234m3829N9175
4178A6802654J84124L38924M76662O24014P28819O95581O11007L78288O8568k33265
4168B0675376m86306n96763n94600n16255l72839k10137m2370Q8689J78479K03944
4158A8327218J49241K0373k16013m63242o55783p68014p93127p54603o46657n55437
4148A3643956m63082l40392k63524k39560k13451k46297l32201m13507m92396
4139A0639546n56912n42681n20474m85742m16568m00211l78137l37011k65379
$$ y = [5613080, 5862022, 6152185, 6496142, 6882051, 7305148, 7742329, 8228020, 8715692, 9185358, 9609153, 9934257, 10192781, 10422181, 10666987, 10970476, 11322345, 11761019, 12310576, 12949702, 13693064, 14463038, 15207626, 15892874, 16421811, 16759111, 16881871, 16862542, 16787308, 16743479, 16802654, 16986778, 17325702, 17802364, 18426378, 19155197, 19850778, 20461785, 20840073, 20908641, 20675376, 20189070, 19592307, 18997707, 18481452, 18108613, 17898476, 17856106, 17944795, 18123274, 18327218, 18476459, 18496832, 18280819, 17817577, 17161794, 16393780, 15600653, 14846050, 14199393, 13643956, 13180874, 12840482, 12576958, 12337398, 12123947, 11877650, 11545449, 11131942, 10639546, 10082634, 9539953, 9019479, 8533737, 8117169, 7716958, 7338821, 7001810, 6736431]
4130F736431k71314k68486k32796k45117k44465k56383k47224k45653k25815j95237
4120D303941j85856j61189j71035j66418j41510j28399j45523j25679j16938j10563
4110B850831r1922q4255q4533j01274q6448n5575o3941q3172o3040o9088p5125
4099A992458n7521m8633n1441o3091k6221m1273n1296k4427l6676l3812l2320
4088A525747n5369k3790j5063l5580k0291l0423l5616r394k8178m0300r220j9528
4076A202995m0886K47J517k2435j3869j5262l0401j4339k351q707j9024j0634
4064A026851q718q015j7343l3076j5801o135J454j4277k3434L858j3708l1398
4052H60258j404p052L398o891m933j3937m090k6523k046k046n019l74j1430R327
$$ y = [6736431, 6465117, 6196631, 5963835, 5718718, 5474253, 5217870, 4970646, 4724993, 4499178, 4303941, 4118085, 3956896, 3785861, 3619443, 3477933, 3349534, 3204011, 3078332, 2961394, 2850831, 2758909, 2674654, 2590121, 2488847, 2402399, 2346824, 2282883, 2199711, 2136671, 2067583, 1992458, 1934937, 1886304, 1834863, 1771772, 1745551, 1704278, 1652982, 1628555, 1591879, 1558067, 1525747, 1470378, 1446588, 1431525, 1395945, 1375654, 1345231, 1309615, 1300221, 1272043, 1231743, 1222523, 1202995, 1162109, 1162356, 1163873, 1141438, 1127569, 1112307, 1081906, 1067567, 1065216, 1056509, 1037485, 1026851, 1018133, 1010118, 992775, 959699, 943898, 937763, 939217, 924940, 901506, 905364, 891656, 860258, 858854, 851802, 855200, 848309, 843376, 829439, 825349, 798826, 796780, 794734, 789715, 789341, 777911, 787238]
4038G87238k6068j7613K882j7191j1724J785K474m90j3633j4056O022J3794j4730
4025F98690O811J0419j9107j9053M817J0243k1161O01j4444j666J9774n716j0909
4012F59299m74J235o497L193Q985j652p33j0946k5593m592p417J5766j509M266
3998F33331L36M736K645k9986K840m371n942J5360q599j4350K462M478k763p366
3984E92811J5200N752j4075j2920n536k775N033L213M713j3142k0166M801M240
3971E67149J045r367J1023J5822J2966j6214o213j3512R827R183j1671n212Q165
3958E72991j5909L536j1884N225K3524k0042K861J2459k510l0104M956m34M59
3945E45128J4186P359j6751J1670J0698J341K0150j781J1262P681k967K0607P345
$$ y = [787238, 761170, 743557, 746439, 729248, 717524, 719309, 721783, 721293, 707660, 693604, 699626, 713420, 698690, 705501, 715920, 696813, 677760, 682577, 692820, 671659, 672260, 657816, 656150, 675924, 670208, 659299, 658825, 660060, 653563, 656756, 665741, 664089, 663356, 652410, 626817, 622225, 614808, 630574, 629065, 633331, 633667, 638403, 641048, 611062, 613902, 609531, 603589, 618949, 610350, 596000, 598462, 602940, 600177, 592811, 608011, 613763, 599688, 586768, 581232, 578457, 583490, 586703, 591416, 578274, 558108, 562909, 567149, 568194, 558827, 569850, 585672, 598638, 582424, 576211, 562699, 572526, 581709, 570038, 564826, 572991, 557082, 560618, 548734, 553959, 577483, 557441, 560302, 572761, 570251, 540147, 545103, 544669, 545128, 559314, 566673, 549922, 561592, 572290, 573631, 593781, 592000, 603262, 610943, 607976, 628583, 635928]
3932F35928J5752J2932J1741o265R227P169J0660J2022Q290j3621l624O45J4409
3919G15265R730n111q064o892m334j0757J0649K345l037J0722P54m073O095j4874
3905F98418R69j0309J0647J623l4894M765Q349q991j5994L452J3620L70K444M489
3891F78958K828n499J1501r147J746K6518q306J7563K0892N080q486j279K1877
3878G54246J0606K3744j4054K352J0733J2982J1788J376R658L9475K9263m843
3866H87326j0748J0223K9160K0614J5317K7591K3441J4692L3853K4542K0063J4605
3854A110679Q516K3507K4225K801L057J6137N742K914J3652J2701o658p03J2114
3841A228684L2213J8897N862j0865R555J8898Q50Q801K746J704n806J6778K89
$$ y = [635928, 651680, 664612, 676353, 670088, 679315, 686484, 697144, 709166, 717456, 703835, 700211, 700856, 715265, 724995, 719884, 711820, 704928, 700594, 689837, 700486, 702831, 699794, 710516, 711270, 707197, 713292, 698418, 699387, 689078, 699725, 701348, 666454, 671219, 679568, 670577, 654583, 658035, 671655, 672025, 674469, 678958, 681786, 676287, 687788, 678641, 680387, 706905, 698599, 716162, 737054, 742134, 733648, 732369, 754246, 764852, 788596, 774542, 776894, 787627, 800609, 812397, 813773, 823431, 862906, 892169, 887326, 876578, 886801, 915961, 936575, 951892, 979483, 1002924, 1017616, 1051469, 1076011, 1096074, 1110679, 1119195, 1142702, 1166927, 1169728, 1172785, 1188922, 1194664, 1197578, 1211230, 1223931, 1217273, 1216570, 1228684, 1260897, 1279794, 1285656, 1274791, 1284346, 1303244, 1304094, 1312895, 1315641, 1317345, 1311539, 1328317, 1328606]
3828A328606r160m274r601o322j357j4835O556Q974K781K683J4343j3503j0392
3815A294499J7440N541n258r037J2602O101k4474p841L44K725J8644j9753j3678
3802A277855j0456Q454K1752J6367j801j7911L620K1440J8231K0368L4449Q324
3790A400692J6145M3527K7729M003J6632L0576K4640L0601J3004J6984J7559N456
3778A647548J9137J1994K2950K0110J6018K2985J4438J8959N318J8196L8003J6184
3766A871840L2662L6276K6812J6422P946N6893L9298L2481N9053L1946M4835N5767
3754B312231N0708K8308K8272M5328J9557M447K4877Q441J0131N326m848j6650
3742B516128q220J5645J848l524p887r638l0383k0606r862j3336L470l832o364
$$ y = [1328606, 1319446, 1315172, 1305571, 1299249, 1297892, 1283057, 1289613, 1298587, 1301368, 1304051, 1318394, 1304891, 1294499, 1311939, 1317480, 1312222, 1303185, 1315787, 1321888, 1297414, 1289573, 1289917, 1292642, 1311286, 1291533, 1277855, 1267399, 1275853, 1297605, 1313972, 1312171, 1294260, 1297880, 1319320, 1337551, 1357919, 1392368, 1400692, 1416837, 1460364, 1488093, 1492096, 1508728, 1539304, 1563944, 1594545, 1607549, 1624533, 1642092, 1647548, 1666685, 1678679, 1701629, 1721739, 1737757, 1760742, 1775180, 1794139, 1799457, 1817653, 1855656, 1871840, 1904502, 1940778, 1967590, 1984012, 1991958, 2048851, 2088149, 2120630, 2179683, 2211629, 2256464, 2312231, 2362939, 2391247, 2419519, 2464847, 2484404, 2488851, 2513728, 2522169, 2532300, 2537626, 2532778, 2516128, 2507908, 2523553, 2525401, 2521877, 2513990, 2504352, 2473969, 2453363, 2443501, 2430165, 2433635, 2429803, 2423439]
3729B423439J2642p975L7472M1584M7695N0520J6873p729p0443n2042m6986n3601
3717B391449K676J401j1945J3718J0926J883R258K2197M3685K7105L9343L1830
3705B583526K9670L7603L1192M0636M7976M2698L1595L9964N1269K3451K4037
3694B983617M0117J5712K2837K9428L7067L2014R194N473J6514P757J6033J953
3682C217716J5739J5894J3631J3403R704J9587J4124m656P581Q801J2899Q440
3670C352863K159J8252K9046K9228R497L8796M1128K9570L6986M9453L5963K0916
3658C693857L6481N5426O7645N7727Q9333Q9327R3483R4442Q1644R1567Q9069
3647D540001Q4348P5717Q6347R3309P2961P7894Q6104Q0625P9136O6847N9744
$$ y = [2423439, 2436081, 2428106, 2465578, 2507162, 2554857, 2605377, 2622250, 2614521, 2544078, 2492036, 2445050, 2391449, 2394125, 2395526, 2383581, 2397299, 2408225, 2410108, 2419366, 2441563, 2485248, 2512353, 2551696, 2583526, 2613196, 2650799, 2681991, 2722627, 2770603, 2813301, 2844896, 2884860, 2936129, 2959580, 2983617, 3023734, 3039446, 3062283, 3091711, 3128778, 3160792, 3169986, 3175459, 3191973, 3199730, 3215763, 3217716, 3233455, 3249349, 3262980, 3276383, 3286087, 3305674, 3319798, 3315142, 3322723, 3331524, 3344423, 3352863, 3355022, 3373274, 3402320, 3431548, 3441045, 3479841, 3520969, 3550539, 3587525, 3636978, 3672941, 3693857, 3730338, 3785764, 3853409, 3911136, 4000469, 4089796, 4183279, 4277721, 4359365, 4450932, 4540001, 4624349, 4700066, 4786413, 4879722, 4952683, 5030577, 5116681, 5197306, 5276442, 5343289, 5403033]
3636E403033O3209P5142Q0599P7421Q3595O0364O3152P4685R5345Q1921O5166
3625F223632Q1598O6887O5450O6402N7665O4403O7400P5828J01557R7677R9058
3614G067557J12754J28836J20701J36001J73329J57972J85734J77504J84838K09708
3604H654934K29312K41451K39370K98003L29652L21323L28330L68750L92406M19846
3594A1823377M48342M91410N38841N76569O20311P07001P49386Q34056R08096
3585A7697389J013131J119924J268335J392603J539668J701455J913905K128652
3577B9775062K323560K507650K645915K733541K707820K569810K339284K012471
3569D9615113J638531J251174Q38100M83075K06851J0549r2512n1697K248Q6592
$$ y = [5403033, 5466242, 5541384, 5621983, 5699404, 5782999, 5843363, 5906515, 5981200, 6076545, 6158466, 6223632, 6305230, 6372117, 6437567, 6503969, 6561634, 6626037, 6693437, 6769265, 6870822, 6968499, 7067557, 7180311, 7309147, 7429848, 7565849, 7739178, 7897150, 8082884, 8260388, 8445226, 8654934, 8884246, 9125697, 9365067, 9663070, 9992722, 10314045, 10642375, 11011125, 11403531, 11823377, 12271719, 12763129, 13301970, 13878539, 14498850, 15205851, 15955237, 16789293, 17697389, 18710520, 19830444, 21098779, 22491382, 24031050, 25732505, 27646410, 29775062, 32098622, 34606272, 37252187, 39985728, 42693548, 45263358, 47602642, 49615113, 51253644, 52504818, 53342918, 53825993, 54032844, 54043393, 53950881, 53899184, 53901432, 53988024]
3559E3988024J60121J79415R2692r7294l51847o99152j064750j460748j827786
3550D8918675k128582k369294k497553k532775k446796k342085k170686j972120
3542C0458784j790446j606072j431956j283211j184702j082808r57184q81621
3534B0240784q31289p76116p08739o65639o01911n34149m94781m70312m25364
3525A4732484l94829l61743k95385k76398k46651k41711k27019k02008j61515
3516A2325225j48388j36578j30938j11146j08476r9426n9221o9814m5959l1542
3506A1383737k0919J3563J4365K5132M0619L4735M5052N7580O4101O5744J00907
3495A1824616P9962R3770J18153J10102J21055J40365J52870J41855J44783J57843
$$ y = [53988024, 54148145, 54327560, 54420252, 54322958, 53971111, 53271959, 52207209, 50746461, 48918675, 46790093, 44420799, 41923246, 39390471, 36943675, 34601590, 32430904, 30458784, 28668338, 27062266, 25630310, 24347099, 23162397, 22079589, 21122405, 20240784, 19409495, 18633379, 17924640, 17259001, 16657090, 16122941, 15628160, 15157848, 14732484, 14337655, 13975912, 13680527, 13404129, 13157478, 12915767, 12688748, 12486740, 12325225, 12176837, 12040259, 11909321, 11798175, 11689699, 11590273, 11531052, 11461238, 11415279, 11383737, 11362818, 11376381, 11390746, 11415878, 11456497, 11491232, 11536284, 11593864, 11657965, 11723709, 11824616, 11904578, 11998348, 12116501, 12226603, 12347658, 12488023, 12640893, 12782748, 12927531, 13085374]
3485A3085374J55371J20946J52301J69738J60594J82950J84925J98762K10923
3476A4621884K43065K50100K28513K42693K41048K52454K55237K44474K73530
3467A6852998K69724K94035K98960L10151L50638L65278L97902M23907M30420
3458A9994013M49148M60577M90052N04401N36750N83677O35032O96660P52221
3449B5102531Q00583Q72550R43487J034569J095435J171873J239380J282579J317500
3440C4860487J317622J310444J288135J223935J165478J165997J156631J181490
3432D4670219J258169J372197J497511J699581J935077K215318K538352K900193
3424F0086617L304693L729205M195063M621352N000392N289088N437761N409895
$$ y = [13085374, 13240745, 13361691, 13513992, 13683730, 13844324, 14027274, 14212199, 14410961, 14621884, 14864949, 15115049, 15343562, 15586255, 15827303, 16079757, 16334994, 16579468, 16852998, 17122722, 17416757, 17715717, 18025868, 18376506, 18741784, 19139686, 19563593, 19994013, 20443161, 20903738, 21393790, 21898191, 22434941, 23018618, 23653650, 24350310, 25102531, 25903114, 26775664, 27719151, 28753720, 29849155, 31021028, 32260408, 33542987, 34860487, 36178109, 37488553, 38776688, 40000623, 41166101, 42332098, 43488729, 44670219, 45928388, 47300585, 48798096, 50497677, 52432754, 54648072, 57186424, 60086617, 63391310, 67120515, 71315578, 75936930, 80937322, 86226410, 91664171, 97074066]
3416I7074066N198130M830728M294051L691106L007982K341095J788598J396297
3408A23622053J196462J189174J329204J523885J685372J809033J814955J692805
3400A35862943J405637J006138N25258k9163n32255r15691j154354j174843j068450
3391A33925220q50817o20742m14416k41625j74280j74800k42012m11422o37436
3382A30157670r24567j273328j728341k145790k387234k462215k372553k233162
3374A14630480k047595j848535j674037j513993j408087j357117j414097j537243
3366A01829776j728097j958727k233829k495629k695124k894593l031589l096940
3358H1695248l087456l035808k910274k733229k541543k265940j965890j595645
$$ y = [97074066, 102272196, 107102924, 111396975, 115088081, 118096063, 120437158, 122225756, 123622053, 124818515, 126007689, 127336893, 128860778, 130546150, 132355183, 134170138, 135862943, 137268580, 138274718, 138799976, 138770813, 138238558, 137322867, 136168513, 134993670, 133925220, 133074403, 132453661, 132039245, 131797620, 131623340, 131448540, 131206528, 130795106, 130157670, 129233103, 127959775, 126231434, 124085644, 121698410, 119236195, 116863642, 114630480, 112582885, 110734350, 109060313, 107546320, 106138233, 104781116, 103367019, 101829776, 100101679, 98142952, 95909123, 93413494, 90718370, 87823777, 84792188, 81695248, 78607792, 75571984, 72661710, 69928481, 67386938, 65120998, 63155108, 61559463]
3350F1559463j120995o58094l27341k50678j11992N24760J330146Q73735j306513
3341F0512491l429658m074593l757731l163109k555765k050265j627259j308422
3333C8545689j056593q18978o53363m99925l59549j98336l4910J10739K47528
3324C5282302M13407N88261Q47161J173819J575871J866048K130875K704187L003327
3315D9585258J755427q84752k890982l361324l106486k620441k113812j751905
3307C4610983j506875j292911j146418j089145j017244r54781q82694p88570o97920
3298B5234425o42010o13574n59466n07433m60665m00511l68338l57241l97349
3289B0927838m31848m27319m48280m02150l14610k76387k14126j50691j16951
$$ y = [61559463, 60438468, 59780374, 59453033, 59202355, 59090363, 59615123, 60945269, 61819004, 60512491, 57082833, 53008240, 49250509, 46087400, 43531635, 41481370, 39854111, 38545689, 37489096, 36670118, 36016755, 35516830, 35157281, 34958945, 34924035, 35034774, 35282302, 35695709, 36283970, 37131131, 38304950, 39880821, 41746869, 43877744, 46581931, 49585258, 51340685, 50455933, 47564951, 44203627, 41097141, 38476700, 36362888, 34610983, 33104108, 31811197, 30664779, 29575634, 28558390, 27603609, 26720915, 25932345, 25234425, 24592415, 23978841, 23419375, 22911942, 22451277, 22050766, 21682428, 21325187, 20927838, 20495990, 20068671, 19620391, 19218241, 18903631, 18627244, 18413118, 18262427, 18145476]
3280A8145476p5371l1010p682N4079R9301J70946K04251K54862K89030L55293
3270A9459175M00463M45560N22336N57992O23505P36153P98551Q85398J004684
3261B5433817J146474J309215J444618J637892J815892K033874K286372K497990
3253C9606144K688519K854020K930068K963734K925072K807213K695122K510136
3245F1980028K230345J843298J314000P07878O6705n57930j150490j683606k168178
3236F2582050k554639k872985l066200l134688l117402l043140k881674k682743
3228C9228579k479001k245659k023136j822907j657587j472299j351361j248800
3220B4927829j127501j054478r66527q94911q61839q28423p85490p18601o93873
$$ y = [18145476, 18070105, 18039095, 18031413, 18085492, 18184793, 18355739, 18559990, 18814852, 19103882, 19459175, 19859638, 20305198, 20827534, 21385526, 22009031, 22745184, 23543735, 24429133, 25433817, 26580291, 27889506, 29334124, 30972016, 32787908, 34821782, 37108154, 39606144, 42294663, 45148683, 48078751, 51042485, 53967557, 56774770, 59469892, 61980028, 64210373, 66053671, 67367671, 68075549, 68142254, 67584324, 66433834, 64750228, 62582050, 60027411, 57154426, 54088226, 50953538, 47836136, 44792996, 41911322, 39228579, 36749578, 34503919, 32480783, 30657876, 29000289, 27527990, 26176629, 24927829, 23800328, 22745850, 21779323, 20884412, 20022573, 19194150, 18408660, 17690059, 16996186]
3211A6996186o77112o72538o00669n65381n47549m98156m70564m47022m14431
3202A2102764l60788l55887l48343k95802k44679k48373k13854j83547j72957
3193I678534j56482j32691j31908j09472r3199q4381p9521q4229q1991q1518p4459
3182H568683q9900j05915j20960j43141j45860j56020j49672j51520j53498j40227
3172G211970j50298j45082j07827j08899j13145q3932p6177o2023n4913l7613
3162F272061l4921k6700l1156m2089m6728m1348l0918m9152l1248m6716m9209
3151E841876m2810m8262k3913l9084l2088n861o554k1311j6196m878J4963o368
3139E609514J6792L6891K7593L1268M7616M0289P8807N8166P5097J04801Q1526
$$ y = [16996186, 16319074, 15646536, 15045867, 14480486, 13932937, 13434781, 12964217, 12517195, 12102764, 11741976, 11386089, 11037746, 10741944, 10497265, 10248892, 10035038, 9851491, 9678534, 9522052, 9389361, 9257453, 9147981, 9054782, 8970401, 8890880, 8806651, 8724660, 8643142, 8568683, 8478783, 8372868, 8251908, 8108767, 7962907, 7806887, 7657215, 7505695, 7352197, 7211970, 7061672, 6916590, 6808763, 6699864, 6586719, 6502787, 6426610, 6364587, 6309674, 6272061, 6237140, 6210440, 6179284, 6137195, 6090467, 6049119, 6018201, 5969049, 5937801, 5891085, 5841876, 5799066, 5750804, 5726891, 5687807, 5655719, 5649858, 5643304, 5621993, 5605797, 5600919, 5615882, 5609514, 5626306, 5663197, 5690790, 5722058, 5769674, 5809963, 5888770, 5946936, 6022033, 6126834, 6208360]
3128F208360R4879Q2203Q5214N0298K9004K5356L6634K5021L011M639J4708L1333
3116F690660J9175J7994L9121L6481J3833M6871K4096K2118M5883N2594O9768
3105G078594P0074O5705N5217P6657P1571P8861R6678R2127J03670R2438R6679
3094G978271J27975J03497J12151J23746J37115J16569J07151J18969J14655J08741
3084I148840J11801J13007J01911J15199J27927J87664K06385J83115K00631K21020
3074A0717500K62633K80306L10957L29828L73501M09739M42333M62881M78425
3065A4068103M44567M15987L72956L52742L35996L49678L39706L19267L46033
3056A7345035L50740L87514M37642M93320N59698O39779P16758Q03640Q51426
$$ y = [6208360, 6303239, 6385442, 6470656, 6520954, 6549958, 6575314, 6611948, 6636969, 6639980, 6644619, 6659327, 6690660, 6709835, 6727829, 6766950, 6803431, 6817264, 6864135, 6888231, 6910349, 6956232, 7008826, 7078594, 7148668, 7214373, 7269590, 7346247, 7417818, 7496679, 7593357, 7685484, 7789154, 7881592, 7978271, 8106246, 8209743, 8321894, 8445640, 8582755, 8699324, 8806475, 8925444, 9040099, 9148840, 9260641, 9373648, 9475559, 9590758, 9718685, 9906349, 10112734, 10295849, 10496480, 10717500, 10980133, 11260439, 11571396, 11901224, 12274725, 12684464, 13126797, 13589678, 14068103, 14512670, 14928657, 15301613, 15654355, 15990351, 16340029, 16679735, 16999002, 17345035, 17695775, 18083289, 18520931, 19014251, 19573949, 20213728, 20930486, 21734126, 22585552]
3047B2585552R62690J053189J138340J249840J363456J467654J522499J488213
3039C2831433J416114J339061J353333J414710J615531J865111K113736K455591
3031D6404620K856888L263772L742388M265338M875744N502962O103446O696341
3023H3711499P309705P963465Q643215R460725J0523432J2062608J4200742J6855323
3015A70730714J9516645K1949133K4027572K4182980J8853688O385983r229966
3008B76416749k1338642k6820553k6862745k3912688j9966997j6226630j3097036
3001A28191458j0735238r006106p817381o907227o083214n260101m503736l855124
2993G4023331l336839k943338k658303k466200k313033k189623k042430j852114
$$ y = [22585552, 23548242, 24601431, 25739771, 26989611, 28353067, 29820721, 31343220, 32831433, 34247547, 35586608, 36939941, 38354651, 39970182, 41835293, 43949029, 46404620, 49261508, 52525280, 56267668, 60533006, 65408750, 70911712, 77015158, 83711499, 91021204, 98984669, 107627884, 117088609, 127612041, 139674649, 153875391, 170730714, 190247359, 212196492, 236224064, 260407044, 279260732, 285646715, 276416749, 255078107, 228257554, 201394809, 177482121, 157515124, 141288494, 128191458, 117456220, 108450114, 100632733, 93725506, 87642292, 82382191, 77878455, 74023331, 70686492, 67743154, 65084851, 62618651, 60305618, 58115995, 56073565, 54221451]
2985E4221451j600600j331516j067291q44677o89430o74143q33340j117111j481106
2976D4582237j835877k073049k203496k218669k115034j970087j825898j634648
2968B8705479j468618j322481j230482j134222j038347r39224q75718q10244p38147
2959A9147996o83940o51441o02465n96485n69562n31718n08034n02345m84246
2950A4017760m47406m16078l98244m00564l69852l43570l28700l17685l07574
2941A0688087l01629k95578k78202k76203k74432k47116k25521k15155k07080
2932H367171j78476j85792j72297j60964j32863j42573j43952j40745j35239j40646
2922F833624j22701j13892j22745j18496j20093j01383j24682j06013r2395q8704
$$ y = [54221451, 52620851, 51289335, 50222044, 49377367, 48687937, 48013794, 47180454, 46063343, 44582237, 42746360, 40673311, 38469815, 36251146, 34136112, 32166025, 30340127, 28705479, 27236861, 25914380, 24683898, 23549676, 22511329, 21572105, 20696387, 19886143, 19147996, 18464056, 17812615, 17210150, 16613665, 16044103, 15512385, 15004351, 14502006, 14017760, 13570354, 13154276, 12756032, 12355468, 11985616, 11642046, 11313346, 10995661, 10688087, 10386458, 10090880, 9812678, 9536475, 9262043, 9014927, 8789406, 8574251, 8367171, 8188695, 8002903, 7830606, 7669642, 7536779, 7394206, 7250254, 7109509, 6974270, 6833624, 6710923, 6597031, 6474286, 6355790, 6235697, 6134314, 6009632, 5903619, 5811224, 5722520]
2912E722520q3767n9971q3970r6093p5606q0823r1573j08970j21225q0421q9512
2901D750589p0634o8595q2049p0369p2842p4740q6184q1883q6852o1751n0239
2890C944451q1885p6257o8376n4591r1473j13747n4895o6548o5611l9120o4781
2879C167167o8613n2943l5887n0677m6341m8243m1456n6265l5249m3319m6561
2868B641613k2736n3889l7541k3967k0846l3468k8513k9650j9552l0440l3084
2857B307927m3691p577k8340l8097l4135m0808j6943k9457l5525k8148k6483l3236
2845A945487l3430j7514j397o225k6957k3493j1785k5779k0624k1590j0421r132
2833A737140k3463k7528j4174j7296l4414j2252j585J2565j8733J800j4811m3524
$$ y = [5722520, 5638753, 5578782, 5494812, 5398719, 5323113, 5242290, 5150717, 5041747, 4920522, 4840101, 4750589, 4679955, 4611360, 4529311, 4458942, 4386100, 4311360, 4225176, 4143293, 4056441, 3994690, 3944451, 3862566, 3786309, 3717933, 3663342, 3571869, 3458122, 3403227, 3336679, 3271068, 3231948, 3167167, 3098554, 3045611, 3009724, 2959047, 2912706, 2864463, 2823007, 2766742, 2731493, 2688174, 2641613, 2618877, 2564988, 2527447, 2503480, 2482634, 2449166, 2420653, 2391003, 2371451, 2341011, 2307927, 2264236, 2256659, 2228319, 2190222, 2156087, 2115279, 2098336, 2068879, 2033354, 2005206, 1978723, 1945487, 1912057, 1894543, 1893146, 1886921, 1859964, 1836471, 1824686, 1798907, 1778283, 1756693, 1746272, 1737140, 1713677, 1686149, 1671975, 1654679, 1620265, 1608013, 1606428, 1618993, 1600260, 1602060, 1587249, 1543725]
2821A543725l956P336k6620l8391k5899l0259l7712j6297k4127k2717k2731j4139
2809A288213j7881j3182m141J2927k0260r501o973p498j0998o256j9063l636j0192
2796A171559j8906o65j7829N988p259J948l973n066k0251K511l292q134K537P621
2782A106789L771j3293j5455P289r642N716N357k89p290k2252q135K8911k000
2769A079477k4784k276Q68l01m896n903j49J2313k106l617N701p16q61j145j306
2754A050299J1927J2798J8261J9756O952J1771L5055J7175K3272K2757J3195K4332
2742A267550j963L1331J7635O474M1751L9059L2200O3856N3516Q2481R0733J11365
2730A835988J04353J20338J06436M1812k3192r2734j29872j44979j35706j20553
$$ y = [1543725, 1539769, 1547105, 1520485, 1482094, 1456195, 1425936, 1388224, 1371927, 1347800, 1325083, 1302352, 1288213, 1270332, 1257150, 1253009, 1265936, 1245676, 1236175, 1229202, 1221704, 1210706, 1204450, 1185387, 1181751, 1171559, 1152653, 1151988, 1134159, 1140147, 1132888, 1134836, 1130863, 1125797, 1105546, 1108057, 1104765, 1096631, 1099168, 1106789, 1110560, 1097267, 1081812, 1089101, 1079459, 1085175, 1090532, 1090243, 1082953, 1060701, 1052566, 1081477, 1079477, 1054693, 1052417, 1053285, 1052984, 1048088, 1042185, 1042036, 1054349, 1052243, 1048626, 1054327, 1053611, 1052750, 1051605, 1050299, 1062226, 1075024, 1093285, 1113041, 1119993, 1131764, 1166819, 1183994, 1207266, 1230023, 1243218, 1267550, 1265587, 1296918, 1314553, 1321027, 1362778, 1401837, 1434037, 1497893, 1551409, 1633890, 1724623, 1835988, 1940341, 2060679, 2167115, 2208927, 2185735, 2093001, 1963129, 1818150, 1682444, 1561891]
2720A561891j04075o4995o5769n8675o9064n3011k1627m0662l2941k0068p488
2709A023516j5377m941k7618j8419m1370k0062k2615k8334k6248l1331j3077o141
2697G67983k6865k8769n706q094P346j8539k3047j5586l0312k5436r246o699j1767
2684E65263n482J634n918j378j6529Q74m696j8998j2924l6n120j0491J243j7728
2670D69714q35j5519P168K102j4536l3766r076m477j5171n186K597j9746j5272
2657C47997K410l295k542o401k3322K080j395J2846M71k1380k0355k129R758m752
2643B89991k227l0950j5625j163N226K313n866j1240J0805R907n339j3828j0755
2630B21249K387o970L911M656N32N693j0243j5445J0783j5544L531n845K994l600
$$ y = [1561891, 1457816, 1392821, 1327052, 1268377, 1199313, 1146302, 1124675, 1084013, 1051072, 1031004, 1023516, 1008139, 1003198, 975580, 957161, 915791, 895729, 873114, 844780, 818532, 787201, 774124, 767983, 741118, 712349, 706643, 698549, 705895, 687356, 664309, 648723, 618411, 592975, 583729, 577030, 565263, 559781, 561415, 555497, 554119, 537590, 538464, 533768, 514770, 501846, 501810, 496690, 486199, 487442, 469714, 468879, 453360, 460528, 462630, 448094, 414328, 405252, 400775, 385604, 380418, 383015, 363269, 347997, 350407, 347112, 344570, 338169, 314847, 316927, 315532, 328378, 328849, 307469, 287114, 284985, 294743, 289991, 287764, 256814, 241189, 240026, 245252, 247565, 241699, 230459, 241264, 251171, 245832, 232004, 221249, 223636, 216666, 220577, 225233, 225765, 231458, 221215, 205770, 216553, 201009, 204540, 198695, 201689, 198089]
2616A98089k1999o26J1741m581k2821o934P447p761n569k46j5094K3017J240o764
2602A49139k1457O658q1L519j0831q075o942p489M170L397p470p107L408J248
2588A02087O475o711j1841j4605J6461J5687o718P440q602l141p641J2328M942
2575A06161j1053Q726k2999m865O111J0598L315k0056r147L504n624M435L816
2562G2922p373j0931j2237J2713m940j1597j009L104K256o575J1765J5192n338
2549E7952j7378j0634Q43J4143M243J0996j2844j6731K7768k0311j4320J764K5262
2536E0753Q18J1482q473j652j936j9966N458P004O250n40J748K53J0225j5085
2522D6339m039M370k4185j0406J4486L322J2642q935J2161M799j2281j3102k90
$$ y = [198089, 176090, 175464, 187205, 182624, 159803, 152869, 160316, 152555, 146986, 146740, 131646, 154663, 155903, 149139, 127682, 134340, 134259, 137778, 126947, 118872, 111930, 104441, 108611, 112008, 104538, 97431, 100839, 102087, 108562, 101851, 90010, 75405, 91866, 107553, 100835, 108275, 99673, 96532, 88891, 101219, 106161, 95108, 103834, 80835, 75970, 82081, 92679, 95994, 75938, 66791, 70295, 64671, 69106, 72922, 65549, 54618, 42381, 55094, 50154, 38557, 37548, 40652, 42908, 36333, 48098, 63290, 57952, 40574, 29940, 30783, 44926, 49169, 60165, 47321, 30590, 58358, 38047, 23727, 25491, 50753, 51571, 63053, 54580, 52928, 50992, 31026, 36484, 43488, 49738, 49198, 50946, 51199, 61424, 46339, 42300, 46670, 22485, 12079, 26565, 29887, 42529, 33594, 45755, 50554, 38273, 25171, 24881]
2509B4881k020n039k417O881J5652j4123j2436k012j64O443o966K772O095P887
2495B5434j5144l214L436J649J1689m40J344L498l318j954q872j6248j98m960
2481g298K7820P437k8780O242K6853q226j9771P913j031O542Q671l942q753K451
2467A6128O557m964j630K597j8496P531n778K883P312l873M359j7146M054l704
2453d170n450M830O440J1126j2468n347j2732J2130O445j0318n028j7182N40L966
2439b7218j346J4140R776j708m05j6689R111J5414q868j229R655j8860L528Q19
2425a3880j4415P026M887R569J9239k001j7834R635l117j3422Q606K562n464J1221
2411B612N316J483j2409P013q772j1842J984j722J2303k894q90l182J1381K307
$$ y = [24881, 22861, 17822, 15405, 22286, 37938, 23815, 11379, 9367, 9203, 15646, 8680, 11452, 17547, 25434, 10290, 7076, 10512, 12161, 23850, 23410, 24754, 28252, 24934, 22980, 14108, -2140, -2338, -7298, 20522, 27959, -821, 5421, 32274, 24048, 4277, 12190, 11159, 17701, 26372, 22430, 13677, 16128, 22685, 17721, 16091, 18688, 192, 7723, 1945, 4828, 12140, 8267, 12626, -4520, -466, -4170, -9620, -4790, 1650, 12776, 308, -5039, -17771, -5641, 804, -9514, -14542, -31724, -31184, -27218, -28564, -14424, -4648, -6356, -6761, -23450, -14339, 1075, -7793, -9022, 633, -18227, -14699, -13880, -28295, -21269, -16382, -6813, 12426, 10425, -7409, 2226, -891, -14313, -5707, -3145, -8609, 2612, 7928, 9411, -2998, 4015, -4757, -16599, -14615, -16337, -4034, -6928, -7818, -11000, 381, 2688]
2397B688j8527r962J0724k266J825P116l374j3970P800j6624J5074J1449O326
2384a721j2580o088o851k198K0038L79l95L012k104M023R089K0962j0338j5576
2370c48J7062J258k5016j7473K1842J0640l698k152j2619J4695p120r911J825
2357a1015R487J6664j9940n312J2901j699j5939K51J2654N945K294p383l230J5558
2343A1236q364M552J023k685o7O740l384N370K664j0298q341J9904J1009j0660
2329A8699M92K516J1383j262m138l499K011J1791J0078j2280j0644R090j1924
2316B2313J9415K3135j8613J3775j909k710K318J471J9408N349N599o091K4491
2303A07951o971K3142O689l93K4286P955o779K5193J1648J4885J2834L899P193
$$ y = [2688, -15839, -25801, -15077, -17343, -15518, -8402, -11776, -25746, -17946, -34570, -19496, -8047, -1721, -14301, -20389, -27240, -29438, -9400, -9021, -9416, -6404, -8508, -4485, 4604, 25566, 15228, -348, 16714, 17972, -7044, -24517, -2675, 7965, 4267, 2115, -10504, 4191, -2929, -12840, -11015, -1528, 15136, -4804, -10116, 2785, 1086, -14853, -14602, -1948, 3997, 6291, -1092, -4322, 11236, 2872, 7424, 8447, 5762, 5695, 12435, 9051, 14421, 17085, 6787, -1554, 18350, 29359, 18699, 19191, 21707, 33090, 31828, 27690, 24191, 26202, 37993, 48071, 35791, 25147, 34237, 22313, 41728, 64863, 46250, 60025, 58116, 55406, 57724, 59195, 78603, 83952, 89551, 83460, 107951, 100980, 124122, 130811, 130418, 154704, 162659, 155880, 181073, 192721, 207606, 220440, 224339, 231532]
2290B31532L4853K4704K2876L0686K6924J8115L1647N1860L8666L4681O0664O6798
2278F74006P9542Q6944P6683J17006J06258J06098R7551J26739J32687J54251
2268A757765J95381K52154L24759M24875N28188N36077N96106Q79243R96745M14470
2258F905763n01754r66184r34539p71549n94479m35942l46093k70436k21081j74456
2248A689250j31240j09408r3824q1274p3371q8252q7500p3511p7674o7743p7728
2237G27725o2415n1189m3536o0883j6162l6309k0824j9577k5591j5740j433l0457
2225C43609l1147j0811j2122j4439j3746m437o747k5767j7487J4929o096q694
2213B07045j4693p378k3074j3181j015j8486j9729r89K364n287j2233o875Q477
$$ y = [231532, 266385, 291089, 313965, 344651, 371575, 389690, 421337, 473197, 511863, 546544, 607208, 674006, 753548, 840492, 917175, 1034181, 1140439, 1246537, 1344088, 1470827, 1603514, 1757765, 1953146, 2205300, 2530059, 2954934, 3483122, 4019199, 4615305, 5494548, 6491293, 6905763, 6404009, 5437825, 4503286, 3731737, 3137258, 2701316, 2355223, 2084787, 1863706, 1689250, 1558010, 1448602, 1354778, 1273504, 1200133, 1111881, 1024381, 950870, 873196, 805453, 727725, 665310, 614121, 570585, 509702, 493540, 457231, 436407, 416830, 391239, 375499, 374066, 343609, 312462, 301651, 289529, 275090, 261344, 256907, 250160, 224393, 206906, 221835, 215739, 207045, 192352, 184974, 161900, 148719, 147704, 129218, 109489, 108500, 110864, 105577, 93344, 86469, 94946]
2200I4946Q049j521l147k3716Q406P693j2994N097r308j8421N091K855r373M927
2186E8584o802j2477N13j02j0172l2832J044J5455Q814n316n982K3551r561j4622
2172A0095J916q779J3588N28j2651o08m316N935p693P708J204j3303P349J1316
2158A2289m502q119q770p140n289J3948r019n714J5285j2460P031R854J826j2025
2144a2805k242j057P199j1129J6257M935k444p263m375J356n145L505k2418k538
2130c8164J9161j261j5242R374j2530m874K0385j65L682k914Q202Q996j0911o453
2116b2714j5154J0462k878j4712m203r354J3802Q812J0156j4422j0253J3624R363
2103b7471j793j1760o388Q626R482j1886J7860M157k2833L569l023j1141O999
$$ y = [94946, 102995, 101474, 98327, 74611, 83017, 90710, 77716, 82813, 73505, 55084, 60175, 63030, 53657, 58584, 51782, 39305, 39818, 39716, 29544, -3288, -2244, 13211, 22025, 16709, 10727, 34278, 24717, 10095, 12011, 3232, 16820, 17348, 4697, 4089, -227, 5708, -1985, 5723, 6927, -6376, 973, 12289, 7787, -332, -9102, -16242, -21531, -7583, -16602, -22316, -7031, -19491, -12460, -2606, -780, -12805, -15047, -16104, -8905, -20034, -3777, 1158, -1286, -8549, -12924, -11568, -16713, -13208, -35626, -38164, -19003, -20264, -35506, -26132, -38662, -43536, -23151, -23316, -19634, -22548, -14346, -5350, -16261, -22714, -37868, -27406, -30284, -44996, -49199, -58553, -44751, -35939, -25783, -40205, -50458, -36834, -27471, -29264, -41024, -47412, -38786, -29304, -41190, -23330, -19173, -42006, -38437, -41460, -52601, -45602]
2090d5602J6621l421o887O061m538j254l928q500J3539R587K2980J498k2354j9746
2076d5944j5614J1259J6607o894J483r05N791O028R231k1580j0428J9125p29m779
2062c7349k0739J3802J4256o592j437l147j6488N284J2036j6510J1587j746j5490
2049f2533J3896K8261k659k5320M009j646o328K70R577R559j676j2876k701Q058
2035d2109k948j3242N740Q170K697L866k069k8450J6026J5131Q368j4859J2134
2022c1545j7763j2046L667n307n154O129J0784j7249K975r23L052P779O129M186
2008d5286J2886l296r626q124M249M316k142n223R115Q581o464m87j1465J7444
1994c5522J1876j1325J3810n232J0254k876K884n952o094l790q090o736L614N032
$$ y = [-45602, -28981, -32402, -39289, -33228, -37766, -39020, -42948, -51448, -37909, -28322, -5342, -3844, -26198, -45944, -61558, -50299, -33692, -40586, -39103, -40008, -34217, -28189, -18958, -40538, -50966, -31841, -32570, -37349, -58088, -44286, -30030, -36622, -38059, -41206, -57694, -52410, -40374, -56884, -45297, -47043, -62533, -48637, -20376, -23035, -48355, -44346, -45992, -52320, -52050, -42473, -32914, -34590, -47466, -50167, -42109, -45057, -58299, -52559, -44389, -41692, -37826, -39895, -68345, -52319, -37188, -28820, -43679, -31545, -49308, -61354, -57687, -62994, -68148, -62019, -51235, -68484, -65509, -66432, -63380, -55601, -49472, -45286, -32400, -35696, -45322, -53446, -49197, -44881, -47023, -52246, -43131, -34550, -41014, -41501, -52966, -35522, -23646, -34971, -21161, -26393, -16139, -19015, -16131, -22083, -28177, -31967, -40057, -46793, -43179, -38147]
1980c8147r360J962r179j7361J4069Q104L760K504l153n568p784l09L815o329
1966f2976m351l366Q665o316O534m45M815J2223m765k809m389R905m860n744k5050
1951h2929J5831R971m478J1485O971j8387m065J4440j4957R746l068k0704J9945
1938f0199J7015P693j171m295k721J810n575j33j5980J1322J1334J8048q499q649
1924d0000N935o387N950l81j8486P40J5884k954k149j4284n440M971Q677R432
1910c8492K700j5521J2317P55n059L095J2893k1472k595P214o210N406J1721K178
1896c1070l789L585J403q906j5627j160m608J0502J1592j0572O606p448l148J160
1882e1480q262J3342j5029L348L499p553J1001J2718k0658k100J7942N084J1342
$$ y = [-38147, -47507, -45545, -54724, -72085, -58016, -49912, -46152, -43648, -46801, -52369, -60153, -60462, -56647, -62976, -67327, -70693, -62028, -68344, -61810, -62255, -57440, -45217, -49982, -52791, -57180, -47275, -52135, -57879, -82929, -67098, -57127, -61605, -50120, -43149, -61536, -65601, -51161, -66118, -56372, -59440, -80144, -60199, -43184, -35491, -36662, -40957, -43678, -41868, -47443, -47576, -63556, -52234, -40900, -22852, -31351, -40000, -34065, -40452, -34502, -34883, -53369, -52629, -36745, -39699, -41848, -56132, -61572, -56601, -47924, -38492, -35792, -51313, -38996, -38241, -43300, -40205, -27312, -48784, -51379, -44165, -50375, -44969, -33248, -31070, -34859, -31274, -29871, -38777, -54404, -55564, -60172, -49670, -38078, -48650, -42044, -49492, -52640, -51480, -59742, -46400, -61429, -58081, -54582, -62135, -51134, -38416, -59074, -61174, -43232, -38148, -26806]
1869b6806j1913O001j362l596J2758q514m097l327j1137j0703L040K0231P24L86
1855c8315k645q179j08J5512M905R688j140j7682K287M871l191j6257Q630N867
1841c5757m522j667N732O877n524r096q577K5130n423k31R452j7671j493L933
1827c8837K011j3344q844K960N906J0337P700L504j8642m717P40J940m735k0573
1813g4594J8966J381L768K3306j2628j568j5172l542O168Q11q939N197J2547k068
1799d6367m128O274q64j3769k072J3319l204j0165P216R077K4174M857p711O199
1785a7164j9143j3455N263K169j1209J6089j065j2932O022m980L3777n63j2183
1772b9374O625O506l32j2650j1127K1246j4112l87Q968M955j4469o388N627R816
$$ y = [-26806, -38719, -32718, -34080, -37676, -24918, -33432, -37529, -40856, -51993, -62696, -59656, -39425, -38701, -38315, -40960, -49139, -49247, -33735, -28830, -19142, -20282, -37964, -35677, -30806, -33997, -50254, -41624, -35757, -40279, -41946, -36214, -29337, -34861, -43957, -52534, -27404, -32827, -33058, -23606, -41277, -42770, -38837, -36826, -50170, -59014, -56054, -50148, -39811, -32111, -28607, -47249, -51966, -51226, -49286, -54021, -74594, -55628, -54247, -50479, -27173, -39801, -41369, -56541, -60083, -53915, -53104, -62043, -56846, -44299, -46367, -50495, -44221, -45085, -58854, -60926, -47607, -50811, -60976, -53760, -44683, -20509, -15652, -23363, -17164, -36307, -49762, -44499, -42330, -53539, -37450, -38515, -51447, -45425, -50405, -16628, -17191, -29374, -22749, -16243, -16575, -29225, -40352, -19106, -33218, -33605, -24637, -19682, -34151, -40539, -34912, -25096]
1758b5096m096k028J1306L119j4897k1364m146P798K993J3826K200j046N71l004
1744c3864j8950k678Q648l000j1378J4049J3124L10j0137p9N762j491L924P172
1730b8588j0549P500J76L416L61q982N36j8773J7289N31Q65p897m361Q766R860
1715b9850o404q49J4691o023j7524J9769M752m643j2512O796P852k870j817M962
1701b3670J456J761q812O109j4617j1282N426J4485q414j4777q528J1303K0973
1688b8587j2246p208L849K677p712m811P587N707R203p860j917j0269O0J0885
1674d0642j508J8577m418J7704K34q590J175p761J575K493j456l780k717P569
1660b1545J886n181J0249k994J048p597r484p101q118O221N078N602k065K214
$$ y = [-25096, -29192, -31220, -19914, -16795, -31692, -53056, -57202, -49404, -46411, -32585, -30385, -31431, -30860, -33864, -52814, -55492, -46844, -49844, -61222, -47173, -34049, -33739, -43876, -43955, -38193, -39684, -35760, -28588, -39137, -31637, -31461, -28045, -27684, -36666, -36130, -54903, -37614, -37083, -36218, -44115, -48476, -39710, -29850, -36254, -37103, -22412, -28435, -45959, -26190, -21438, -26081, -38593, -31797, -23945, -26815, -28632, -23670, -22214, -20453, -29265, -23156, -37773, -49055, -43629, -29144, -37558, -52335, -60863, -49560, -28587, -40833, -48041, -44192, -41515, -49227, -54038, -46451, -40744, -31541, -39401, -41318, -51587, -51527, -40642, -42150, -23573, -27991, -10287, -10053, -18643, -17468, -25229, -23654, -21161, -22617, -26397, -29114, -21545, -19659, -24840, -14591, -17585, -16537, -24134, -33618, -40719, -48837, -42616, -37538, -31936, -34001, -31787]
1646c1787q075l492J5931P613k5628J8889J6412j284L933o298O490J374M779L17
1632h26m653j4884K369o1K147N903q791o821P725n037r492M306k459Q488N804
1617a6282o944l107j04J1842o866q744L254O952j7078l932J3348j818j4181K3512
1603b0148J2682j1634J0153q248q75j3721J2625o597l27p5j1821l698P968m717
1589c8433L22R444N047J6256q756J7713k76r199j194k537j0458J4680Q450j2930
1575a1871j4805L635J773j775k580p395J2845J0398L871n12j4213l632l644o329
1561c4234J6845o813J0717Q663n075k2460P809l79M89J813P428J7740K601k0431
1547a5287m316O243j6651n71L464m083J1973N57J1186j1689q007N436l674J3477
$$ y = [-31787, -39862, -43354, -27423, -19810, -45438, -26549, -10137, -11421, -7488, -13786, -7296, -5922, -1143, -826, -5479, -20363, -17994, -18055, -15908, -10005, -18796, -25617, -17892, -22929, -32421, -28115, -30574, -22086, -16282, -23226, -26333, -26437, -14595, -21461, -30205, -26951, -19999, -37077, -41009, -27661, -29479, -43660, -20148, -7466, -19100, -8947, -17195, -18070, -31791, -19166, -25763, -26090, -26165, -37986, -41684, -33716, -38433, -38111, -28667, -23620, -7364, -16120, 1593, 1317, -7882, -9076, -11613, -22071, -7391, 1059, -11871, -26676, -23041, -21268, -23043, -25623, -33018, -20173, -9775, -5904, -6416, -20629, -24261, -27905, -34234, -17389, -24202, -13485, -4822, -9897, -32357, -24548, -24927, -24438, -22625, -15197, 2543, 5144, -15287, -19603, -13360, -30011, -30582, -27118, -31201, -19228, -18671, -7485, -19174, -27181, -21745, -25419, -11942]
1533a1942P358J989j525r1J752l27j0642j0265k330J2014O509m188J658j1436
1519b1466J2907R591k1907n387L45k135J4111Q05j233r574N093l845j6497k987
1505d2179p16J2330J4765M530N867J8128j1857m307M500N476k4517K3791J1443
1492A7254j2179j5492o974O956k307K446J3726o403j4888j0231j64O782M023L470
1478a3981l275m111N813L172N561L880j4605p502o592K1451K343j4986j3770M308
1464c2294J1545J4188O832j1196J137o166q819K778N017J4827q096l446J2902
1451g91p098k4161O622O486M339J5258q269J3173p421K758R03o440Q304j3614
1437i951j8572J5971O162l627m102J995k04M455k34J072q164O333J2352K392q957
$$ y = [-11942, -4584, -2595, -4120, -4211, -2459, -2786, -13428, -23693, -26023, -14009, -7500, -11688, -10030, -21466, -8559, 1032, -20875, -26262, -25917, -28052, -13941, -13136, -14369, -23943, -18850, -22695, -39192, -42179, -42895, -30565, -15800, -11270, -5403, 12725, 868, -3439, 1061, 6537, -17980, 5811, 17254, 5075, -10417, -17391, -10435, -12742, -10296, 3430, -2973, -17861, -28092, -28256, -21474, -17451, -13981, -17256, -21367, -15554, -12382, -6821, -2941, -17546, -25048, -31640, -10189, -7846, -22832, -36602, -32294, -20749, -6561, 271, -10925, -9788, -15954, -24773, -21995, -16978, -2151, -10247, -13693, -791, -7889, -32050, -25428, -18942, -14603, 655, -7614, 5559, -1862, 896, 1799, -4641, 3663, -9951, -28523, -12552, -6390, -10017, -14119, -12124, -12328, -7873, -8107, -7035, -15199, -8866, 3486, 5878, -3079]
1422c079j4188J1815o457RJ4340n464q503J5045k266J6625l85j0410J454J056
1408I592Q507o196j0121o77N223O879j1754j094P50p070q734r5K183L237J4727
1393E357J4738j093j6366L415q623j5325K864R742J969j6409Q090K0943m035k21
1379E046j0334l415q689n264N493J7688p497j0013O311j368N888o252j3085J4981
1365a0510P564j5510k643l380n013K5713j3162j7894K4734M013M001l781l484
1352i352O247L857k845N34J0060r119j2269o815N548O068m926J685k833k427M191
1337a2396j4520P664J1272q790R863L1979J3167j3023k7169j1394K2463K0279
1325B9395m329l673j5247j0909p4p781J4150l184L260L11Q942j8935q258O73R414
$$ y = [-3079, -17267, -5452, -11909, -11900, 2440, -3024, -11527, 3518, 1252, 17877, 17492, 7082, 8536, 9592, 18099, 11903, 1782, 1105, 6328, 13207, 1453, 359, 1109, -5961, -14695, -14790, -12607, -9370, 5357, 20095, 19002, 2636, 6051, -2572, -17897, -15033, -5291, -3322, -19731, -11641, 9302, 5267, 5046, -5288, -8703, -17392, -22656, -17163, 525, -6972, -16985, -10674, -12042, -6154, -12406, -25491, -10510, -2946, -18456, -21099, -24479, -29492, -3779, -16941, -34835, -10101, -6088, -2087, -5868, -9352, -3105, 752, -2093, -1559, 8501, -618, -12887, -19702, -14154, -8086, -13012, -11327, -14160, -16587, -12396, -26916, -19252, -7980, -16770, -6907, 25072, 38239, 25216, -1953, -13347, 9116, 29395, 25066, 21393, 6146, -4763, -4837, -12618, 1532, -1652, 1608, 1919, 10861, -8074, -16332, -15659, -6245]
1310f245n06J2363j0169l3Q013Q363n063m525n091q175J9965N120j7454L235l477
1295c679Q244N831j2203J1663k11J251j7262P138n196L192Q944p582o012j1395
1281a7277J3818n029r928J329Q456p382K834K09o323M960Q853R62L911l235K559
1266a283O660j5049q563Q311R319Q90q150M550K764m914k534m11J6250j0964m460
1251g584o403N793O110o916L012J6460Q994j3046p2Q518J271l859R4r812p855
1236e295J779Q749P947j968q0n595J1867j6169m0l042J2724Q521M674k0942j1464
1221h334p260J7119k728l516J1382j0037k086K726Q172k835j6857J6148j957l962
1207d025K0925k234j6449q646J7751Q554k751j9078P747K207j1036K637Q59J4039
$$ y = [-6245, -6751, 5612, -4557, -4590, 3423, 11786, 6723, 2198, -2893, -11068, 8897, 14017, -3437, -202, -3679, 4565, 10396, -1807, 9856, 9645, 10896, -6366, 772, -4424, -1232, 7712, 130, -5882, -17277, -3459, -8488, -18416, -17087, -8631, -16013, -13179, -12970, -19293, -14333, -5480, -4518, -607, -3842, -1283, 5377, -9672, -18235, -9924, -605, 285, -7865, -3315, -551, -5465, -7999, -8410, 7840, -3124, -7584, -13987, -8194, -2084, -9000, -5988, 10472, 19466, 6420, 6348, 14866, 16137, 12278, 12372, 2560, -5295, -3516, 5233, 13180, 11212, 11132, 5537, 17404, 1235, 1195, -1847, 10877, 19398, 24072, 3130, -8334, -15594, 1525, -1203, -4719, 6663, -3374, -5460, -2734, 5438, 2603, -14254, 1894, -63, -4025, 16900, 14666, -1783, -10429, 7322, 15876, 13125, -5953, 1794, 4001, -7035, -4398, -3539, 10500]
1193A0500P115O47o019k2889J1400J9129l7760J074J8142M405O530l916K901M351
1179A5610K380r35j7131N384J7284l374j0263M601n54j0514k019R748J0544L132
1165B3893R237j8373m15J5047j0248n582j4962J994K566O11J7109k919Q025M585
1151C0568m018p811p84k3686l262J7452J4675j7759J3008m449j8152K1425J4314
1138C1521L266j1727j3980j120J1182J4983j6163j0602J377j5464l707J5784m848
1125E02J1124N413j4300k793J403O357N299j3266n062q326J3701J4263K870J260
1111A8445J2649k3854j4365K44O816O347J5720j2597l335p74O38J688j5022M342
1097c058O749N474R968j0515j3946M917m786J8870n180O393M98k073M110J0658
$$ y = [10500, 17615, 18262, 12243, -10646, 754, 19883, -17877, -16803, 1339, 5744, 12274, 8358, 11259, 15610, 17990, 17055, -76, 5308, 22592, 19218, 8955, 13556, 13002, 2488, 469, 10217, 20761, 23893, 33130, 14757, 14342, 29389, 19141, 13559, -1403, 591, 3157, 3768, 20877, 17958, 25983, 30568, 26550, 18739, 17955, -5731, -8993, 8459, 23134, 5375, 18383, 13934, -4218, 17207, 31521, 34787, 23060, 9080, 7960, 19142, 34125, 17962, 7360, 8737, -6727, -10434, 5350, 502, 11626, 17039, 2739, -54, 1349, 7706, 13005, -261, -5323, -13649, 52, 14315, 17185, 18445, 31094, 7240, -7125, -6881, -65, 6282, 22002, 9405, 6070, 5296, 5934, 7622, -7400, -3058, 3691, 9165, 19133, 8618, -5328, -411, -5197, 13673, 8493, 14886, 15384, 13311, 17421, 28079]
1083B8079l687j3648P496O602j0632J145K667o589p425R564n499j2524M369P242
1069G160m383j2974K087J1942J2933J0523j2530O157K043k2005j0245J5008J6217
1056B1933j1362r801L134j692K4953j8066l867J3957M727j633m782j2121j1216
1043e836l833J8394M973q624p15L868J2625m318P54j0533j3278O435J2956k111
1029A0757q591J1277O819j0042j2506j630Q298J2009r236J0134o58j933P140J2535
1015C4373j6948j0579M207m538l926L172J0751j6042O330P614O852k516Q078l819
1001B3009k316Q485k161K57m155k0478K04J1993M748O021K797j657l52m807n97
986B0991J2747m945j0484J0240o545j3186J083K2066M463N560j2371J8887p619
$$ y = [28079, 24392, 10744, 18240, 24842, 14210, 15355, 18022, 11433, 4008, 13572, 8073, -4451, -82, 7160, 2777, -10197, -8110, 3832, 16765, 27288, 14758, 20915, 22958, 953, -9292, 5716, 21933, 10571, 770, 3904, 2212, 27165, 9099, 5232, 19189, 23916, 22283, 17501, 5380, -5836, -9669, 8725, 13698, 5074, 4359, 8227, 20852, 16534, 17288, 6755, -6523, -88, 12868, 10757, 2166, 13443, 20262, 10220, -2286, -3916, 4382, 16391, 7155, 17289, 16631, 14698, 21838, 34373, 17425, 6846, 11053, 6515, 2589, 5761, 16512, 470, 6800, 14414, 21266, 18750, 26828, 23009, 20693, 29178, 27017, 27274, 23119, 2641, 2845, 14838, 19586, 25607, 28404, 26747, 26395, 21588, 20991, 33738, 28793, 18309, 28549, 22004, 8818, 9901, 31967, 36430, 41990, 29619, 48506, 40887]
973D0887j3444M778j1545K658j0208Q782J2414r94J105j1562j0138j721j8168
960g156K370K9057J0500l063j0613q652K579L567j8041m188P912M813O33Q413
946A8131o321o021N806k193J5406k2304O615M543l587p694l299J1526J5335r750
932A6193O718N244l403k714r318m837Q792n838J0554K359q966P347k733o824q095
917D479J0817K974J102p619Q632K891K1957L686j9995o012n88j2354l446K2091
903B8615J187R111m552r559K061j3216M963m442R655k912m261j9448R900J0676
889A7778j085j3449J0044q987n088Q557J226N864j3403K047N534L458q916O024
875I604j863K5036j1285L375O688l354p931J1784l233l81j681r400j01K43J4489
$$ y = [40887, 27443, 32221, 20676, 23334, 13126, 21908, 34322, 33328, 34433, 22871, 12733, 11012, -7156, -4786, 24271, 34771, 31708, 21095, 12443, 15022, 18589, 548, -3640, 4272, 9085, 9718, 18131, 11810, 5789, 11595, 9402, 24808, 2504, 9119, 13662, 10075, 2381, -918, 10608, 25943, 16193, 22911, 28155, 24752, 22038, 12720, 7883, 16675, 10837, 21391, 23750, 14784, 22131, 19398, 12574, 4479, 15296, 18270, 19372, 11753, 20385, 23276, 45233, 48919, 28924, 22912, 22324, 9970, 6524, 28615, 29802, 38913, 34361, 24802, 26863, 13647, 18610, 14168, 23823, 20911, 16650, -2798, 7102, 17778, 16693, 3244, 13288, 4301, -787, 7770, 8996, 14860, 1457, 3504, 9038, 12496, 3580, 9604, 7741, 32777, 21492, 24867, 31555, 28201, 20270, 32054, 28821, 28440, 26759, 17359, 17258, 17501, 31990]
860C1990r231J5193j1851m68k0166k039Q148l760R025Q676J7731j2741j2600k867
846A5040L267J1692n637p827M680p18J0350j1295k9584J2594P752j876K837J2894
832B4169J299q050j2428J0087M942j6399J0756O788j0034p346M277Q200J1347
819B7608J550j5464K479P230n362R663k450q977L36r321k1697J8106L155Q556
805A5412J826L964p426k61R193p607N083M936L202p919p776L682k646o539p57
790F367q265K645J4373j2451M503N042o048m571Q900j5666L69J1944j328L024
776H838j0791J2290O953q970m713N843R464R759N388j6463k1887M743J6026M694
762B1174O647r49q036r858J82o218J2406J3354j3532J0996N424P36p446Q590k7829
$$ y = [31990, 22759, 37952, 26101, 25633, 5467, 3428, 11576, 7816, 16841, 25517, 43248, 30507, 17907, 15040, 18307, 29999, 24362, 16535, 21215, 20497, 30847, 19552, -10032, 2562, 10314, 8438, 11275, 24169, 25468, 17418, 4990, 15077, 20019, 3620, 14376, 21164, 11130, 3784, 8061, 16261, 27608, 29158, 13694, 16173, 23403, 18041, 27704, 25254, 16277, 16613, 7292, -14405, 3701, 6856, 15412, 17238, 21202, 13776, 13515, 22708, 15101, 20184, 25120, 28322, 20403, 12627, 16309, 13663, 7124, 6367, -1898, 747, 15120, 2669, 7172, 12214, 6166, 1595, 10495, -5171, -4802, 7142, 5814, 8838, -1953, 10337, 17290, 8320, 3607, 9450, 18914, 28673, 34061, 17598, -4289, 454, 16480, 21174, 27821, 26872, 18836, 8978, 9160, 2942, 15348, 28702, 15170, 26166, 31590, 32326, 24880, 33470, 5641]
747E641j0240L2757j2143j157n652J1682j7400l232K2139j4651P578r258J0844
734A6908K653j1471o5J1239N489l891J262R554n27j7254j4627J6894p812m07j570
719F375J7615r727o357l561K706P964J3913p660k8876P24J1816R215k612k333
705I202Q992k880n177J7844k0228l228M830O851J4422j633o982n667k747l033
691A0566J3445O249j5864m772Q365j914o277J2016J091J0525n249n130m706K677
677B1022O367n923l784Q381O867q611J6236J147k9039P211q381R257K499o702
663A6547m480J106k067L262O199J591J0001j3858m450n894N463J9164k1299R779
649B1064j3704k223L20j47J8710q035l671N832k246L745p865j4864R783o420J6026
$$ y = [5641, -4599, 28158, 16015, 14858, 9206, 20888, 3488, 256, 22395, 7744, 15322, 6064, 16908, 19561, 8090, 8025, 19264, 24753, 20862, 22124, 31678, 31151, 13897, -730, 16164, 8352, 7945, 6375, 23990, 14263, 7906, 4345, 7051, 15015, 28928, 21268, -7608, -6884, 4932, 14147, 11535, 9202, 18194, 15314, 10137, 27981, 7753, 4525, 9355, 16206, 30628, 28995, 22013, 16346, 13599, 10566, 24011, 30260, 14396, 9624, 17989, 16075, 9798, 21814, 22905, 33430, 28181, 23051, 18345, 21022, 27389, 21466, 17682, 26063, 32930, 24319, 40555, 41702, 12663, 19874, 11493, 20750, 23249, 16547, 12067, 13173, 11106, 14368, 20567, 22158, 32159, 18301, 13851, 7957, 13420, 32584, 11285, 21064, 7360, 5137, 5457, 5310, 24020, 15985, 12314, 18146, 15900, 19645, 11780, -3084, 6699, 279, 16305]
634A6305Q062j1718p672r782j0262J7877K0955j2877J451N324j5869L64j2060
621i902M960J356J4443M88j3612L565n35J2095O983m819L745j369j1737M15K925
606I001J0005p824Q418R445j0980o424j2886K1312k316j0169J7281j0229j6416
593a782J7984j8794J0324j0368L187J223l231J1746J5667J9344q896J558r840
580B8122j3198k0300M661J4275K791j295p649J5019Q309k0580R84j3144P026J7979
566B3000J0084j4539j2022m380P034j3560J864K341o896N804R455J6509n641q442
552A0611n106J4181j277j6345o615l320M814M011K57N844p329L582J835J6818
538B1961j3244o361j5667L729J0878J210J5596j377N432m819m289r553q79P121
$$ y = [16305, 24367, 12649, 4977, -4805, -15067, 2810, 23765, 10888, 12339, 17663, 1794, 2158, -9902, -4942, -3586, 10857, 11345, -2267, 1298, 763, 12858, 19841, 15022, 18767, 17398, 5661, 6076, 9001, 19006, 11182, 19600, 29045, 18065, 11641, -1245, 20067, 17751, 7582, 24863, 14634, -1782, 16202, -2592, 7732, -2636, 551, 1774, -1457, 10289, 25956, 45300, 36404, 37962, 28122, 14924, -5376, -715, 13560, 16351, 15056, 7407, 22426, 30735, 10155, 11139, -2005, 5021, 23000, 33084, 18545, 6523, 2143, 9177, -4383, -2519, -178, -7074, -1270, 8185, 24694, 19053, 10611, 5505, 19686, 18409, 2064, -4551, -7871, -3057, 954, 1211, 7055, -274, 3308, 5143, 21961, 8717, 2356, -13311, -9582, 1296, 2506, 18102, 16725, 22157, 17338, 13049, 3496, 2617, 9738]
524I738P228j771k690j0890J9193N566l756n70n780j4968J332J4035J437J168
510A9272L594l036o878j993k348L632P077j3568M153O410n941j971J572p009o097
495c131O808J890m856o373O998L399j415l766M724J7560j205K011J881Q29n349
480B0005k5756J1666R707M545k608o000O417j0399l52Q722j7305k10O602J1311
466A6345m155k580K2812j0634n494q528p791J1346J2603j6664J0386J6107l397
453C0356J819j9686j2452P824p772k952N513K708J741J2284l149j9280P963l9
439D878k2191O017J7009O066k178r053p543l905J7467j5707K547J0690j460K235
425D872O639k834k3442r592P959K7656q467r379J7961k536N441m751j7275M742
$$ y = [9738, 16966, 15195, 12505, 1615, 20808, 26374, 22618, 22048, 16268, 1300, 2632, 16667, 18104, 19272, 22866, 19830, 12952, 10959, 8611, 12243, 19320, 5752, 9905, 16315, 10374, 8403, 9975, 2966, -3131, 3677, 5567, 711, -5662, 1336, 4735, 3320, -446, 4278, 21838, 20633, 22644, 24525, 25354, 20005, -5751, 5915, 15622, 20167, 17559, 11559, 17976, 7577, 7225, 15947, -1358, -1568, 5034, 16345, 12190, 9610, 32422, 21788, 16294, 7766, -25, 11321, 23924, 7260, 17646, 33753, 30356, 32175, 12489, 37, 7861, 89, -2863, 2650, 5358, 7099, 19383, 16234, -3046, 4917, 4878, -17313, -11296, 5713, 11779, 9601, 548, -6995, -10900, 6567, -9140, -6593, 4097, 2637, 4872, 11511, 8677, -14765, -24357, -16398, 11258, 2791, -6588, 11373, 8837, 14278, 9527, -7748, -3006]
411c006P045q990L952o803m820J813K481j72J5918J616o214j3502l568l038J4562
396b726j748k1917J3196M388O431J1247k380o682P031r89l982Q501l197o401p929
381g157J095L476M920l454l540L168K82Q256p228R41O492R566M499k609q245j5537
365e075j9605j2530J6377K7889m858j1576J1212O011k241L604K169n045j4516
352h184j022J022o031j3652O425J1551J3166k743j0861r21j532R029p33L341R028
337G883q105L618j7916m373O383J4281J2282j1629o533j0125l090Q295K3686j0274
323D383l537r103l617L502M725J4739K506j0399p993L343j6001J0985R614j0961
309g814p553J1444P12r149j3945K987J6593P326j0407m657J635l75J0809m830
$$ y = [-3006, 4039, -4951, -999, -7802, -12622, -10809, -8328, -8500, 7418, 9034, 2820, -10682, -14250, -17288, -2726, -4474, -26391, -13195, -8807, -2376, 8871, 6491, -191, 6840, 5851, 1869, 10370, 7173, 772, -7157, -6062, -2586, 2334, -1120, -4660, -1492, -1210, 7046, -182, 759, 7251, 16817, 21316, 18707, 10462, -5075, -24680, -37210, -20833, 7056, 2198, -9378, 1834, 7845, 5604, 9208, 11377, 6332, -8184, -9206, -8184, -14215, -27867, -21442, -9891, 3275, 532, -10329, -11250, -12782, -3753, -4486, -1145, 7883, -222, 3396, -14520, -18893, -12510, 1771, 14053, 2424, -4109, -14234, -17324, -9029, 14657, 4383, 846, -8257, -11874, -8372, -3647, 11092, 13598, 3199, -4794, -1451, -17452, -6467, 3147, -7814, -15367, -3923, -3211, -12360, -26305, -23318, -6725, 601, -9806, -14463, -12828, -13203, -2394, -7224]
295g224n273J7120l727j3965p863j0932J9112N19R167J318n285j3374K352J4150
281c905k051j7227J4832J1059K800o705J002J4041j8325L288O094m858k496j754
267d205L135N793j817j90r923k2015N40J8635J5214J2615j3387j0690N074R502
253H281j8830K830l728n401J6542l059L236M255k4659l446J4263L587k772J2523
239C622L044q890K648k421j4732j5898l745J8316J4972J147m122K815J125O172
225D053n014p553n126J5714J5656q772L078j1359O968m623j448L418m010k07r911
210i136K312o718q380K905J3996p198j3542R168p921J4980O060q121K683N422
196c490J4164n592j8645o654L651J772L283Q873r150M888j5039j1448J5852J1046
$$ y = [-7224, -12497, 4623, 896, -13069, -20932, -31864, -12752, -12233, -3066, -1748, -7033, -20407, -18055, -3905, -5956, -23183, -8351, 2708, 5508, -1197, -195, 13846, -4479, -1191, 4903, 45, -2451, -4205, -1070, 4723, 2906, 2716, -7207, -29222, -28682, -10047, 5167, 17782, 4395, -6295, -1221, 8281, -10549, -7719, -11447, -16848, -306, -3365, -129, 4126, -20533, -23979, -9716, -6129, -8901, 3622, 6666, -2224, 424, -1997, -16729, -32627, -36372, -18056, -3084, -1937, -6059, -3244, -2119, 4053, -961, -8514, -13640, 2074, 17730, 8958, 12036, 677, 7645, 3022, 1574, 4992, 982, 775, -9136, -6824, -13542, -21922, -19017, -5021, -12219, -25761, -16593, -24514, -9534, -3474, -11595, -8912, -3490, 10674, 5082, -13563, -20217, -16566, -14794, -11511, -2638, -11788, -6900, -21939, -33387, -17535, -6489]
182f489J299J800j8643N04Q822K0201k1964K592M078M744k334K414k265N183N333
167E275j0634j5135J855J7660m874Q491j5932J0029N24k135O921l125q68M955
153C007k4948K993R534p58j789J0835R172O317o162L557j4501m839J0748p284
139d118l285O247l328l434Q736K179o788l928j6389l365P667J975J2426L070L638
124A303n395n621K236k870L431j970l18J173K099m65p186j6858J9816N195r553
109a4983O632k647r789k026M591j0499M998J7103L319k617K089p409Q54P64J274
94h346L727N564j0579q828j62Q371j3636M449J3011j3697j0745J4866J782L903
80a0320o208J4219P19j5895M23m113J5969j3895p392P137M948J1193J864l666
$$ y = [-6489, -5190, -3390, -22033, -21529, -12707, 7494, -14470, -11878, -7800, -3056, -5390, -2976, -5241, -58, 5275, -5359, -20494, -18639, -979, -5853, 2638, -13294, -3265, -2741, -4876, 2045, -1080, -1948, 3007, -21941, -18948, -9414, -10172, -11961, -1126, 8046, 14363, 8201, 11758, -2743, -7582, 3166, -4118, -7403, -1156, -4484, -7918, 818, 2997, -3791, -7719, -24108, -27473, -19806, -17831, -5405, -2335, 1303, -4092, -9713, -7477, -10347, -6916, -8886, -9204, -8031, -5932, -6397, -13583, -30441, -10625, -5430, -14983, -8351, -10998, -20787, -22813, -18222, -28721, -23723, -6620, -3301, -5918, -3829, -11238, -10384, -9620, -8346, -4619, 945, -9634, -18462, -18624, -10253, -23889, -19440, -6429, -20126, -30871, -16005, -14223, -10320, -16528, -2309, -1590, -17485, -17062, -21175, -5206, -19101, -26493, -19356, -14408, -3215, -1351, -5017]
66e017J0146r898q178n043o73J3728k992K41j0227R277k149q043N218J0559K081
51i70j0171K850L140p081p886J238N765J0155P16k023k305N753j2381J497L127
36h576P597k543j904N335j2206L747n460j0395J5967k983J0787l105r590m590
22a7919P903R426l577p600o85J1713M654k347q159O08O57m020p758k636Q29n007
6b3918n26J7214p690r000K417l76
0b1879
$$ y = [-5017, 5129, -4769, -12947, -17990, -18663, -4935, -7927, -7686, -17913, -8636, -10785, -18828, -13610, -3051, -970, -11141, -8291, -5151, -12232, -20118, -18880, -13115, -2960, -2244, -4267, -6572, -819, -13200, -11703, -8576, -979, -3522, -5426, -91, -12297, -8550, -14010, -24405, -8438, -11421, -634, -3739, -13329, -17919, -10016, -590, -4167, -11767, -12452, -739, 3915, 1568, -6591, -5983, -5326, -9346, -17104, -19740, -18911, -23918, -24444, -7230, -14920, -23920, -21503, -21879]
$$ Imaginary data points
##PAGE= N=2
##DATA TABLE= (X++(I..I)), XYDATA
16383i79154J958M838K4194J4573J7380J952J3395K1673R976L900J8597K5480
16371h21238J8463J0384K4171J7694K166K3445K5937L677O478J5992J4304J0937
16359f47590K0826K1485J4557J2169O646J0743J1977P034R480K2160J5530J7996
16347d76987J8723J7901Q302J6806K1389K506J9855Q522J716K5539M679P83J4122
16334c16144K3151J1921J2541O562L079L1092J5817J25K5679J3619J6318J2534
16322a43706Q227M882K3129L0767R892Q911M940J8446L255J6339J9915K802K0077
16309B7876Q26M361J7999J7208J3506M410K3160J1570P493M291N517J7854K665
16296A58736K0577K4049J3813J0069J1339K961o125K6341L844P120P09J7501P162
$$ y = [-979154, -977196, -972358, -948164, -933591, -916211, -914259, -900864, -879191, -869215, -865315, -846718, -821238, -802775, -792391, -768220, -750526, -748360, -724915, -698978, -695301, -688823, -672831, -658527, -647590, -626764, -605279, -590722, -578553, -571907, -561164, -549187, -542153, -532673, -510513, -494983, -476987, -458264, -440363, -432061, -415255, -393866, -391360, -371505, -362983, -361267, -335728, -331049, -330266, -316144, -292993, -281072, -268531, -261969, -258890, -227798, -211981, -211856, -186177, -172558, -156240, -143706, -135479, -130597, -107468, -76701, -66809, -57898, -52958, -34512, -31257, -14918, 4997, 7799, 27876, 28702, 33063, 51062, 68270, 81776, 86186, 109346, 120916, 128409, 132700, 138217, 156071, 158736, 179313, 203362, 217175, 227244, 238583, 241544, 235419, 261760, 265604, 272724, 273433, 290934, 298096]
16283B98096L1442p17j524J7605P259L4391O238J1352M858M510Q676j428J3639
16270D34397J2737J2408J2244J9251O481J954L485p31K3082J1204P674J422P275
16257E52883J4772L3724L523K240J284J2372J0883n175k330J0246J3552J9577
16245F67551K1712j0215J5608O804J3367M400N881J7551J932J4195l47n914J1746
16232G64271R262Q539m690O415J4403Q962Q259P224J4532Q408M076r619N388J9462
16218H64892O507J3227m419q439q759K2317L13K0577J3452k07J9002m199L334
16205I37598R117l448k83J0649k939K2989J2234q930K629J0915J2546P239q149
16192A002167k620m708N098R515M982Q923K0629j524j658r776R100J0611O321
$$ y = [298096, 329538, 328821, 327297, 344902, 352161, 386552, 392790, 404142, 409000, 413510, 422186, 420758, 434397, 447134, 459542, 471786, 491037, 497518, 499472, 502957, 502226, 525308, 536512, 544186, 545608, 552883, 567655, 601379, 604902, 607142, 608426, 620798, 631681, 626506, 624176, 634422, 647974, 667551, 689263, 679048, 694656, 701460, 714827, 719227, 725108, 742659, 744591, 758786, 758439, 752525, 764271, 773533, 782072, 777382, 783797, 798200, 807162, 815421, 822645, 837177, 845585, 849661, 840042, 845430, 864892, 871399, 884626, 880207, 871768, 863009, 885326, 885639, 906216, 919668, 919461, 938463, 934264, 937598, 946715, 943267, 942984, 953633, 950694, 973683, 985917, 976987, 979616, 990531, 1003077, 1010316, 1002167, 999547, 994839, 999937, 1009452, 1014434, 1023357, 1043986, 1042462, 1040804, 1031028, 1040128, 1050739, 1057060]
16179A057060Q127K654L310o122J8235J7795r316Q217J1771N711p298N814P288
16166A123246N580k027O703j322j6435J675m67J483Q157J02O890J0982r934m281
16152A130352Q809j360L264O620J2338O586j3557l651R591J4808o333j869J0746
16139A176344K1266J176j4915J0660J1297l275j626o490j0058j3475k46K0909
16127A191567J6984j0375M200J3389O226l08q984P796K0936n915J0425j5614j850
16114A228477L602R855M947m593J524j4182O74K766J269J630L076J1615o942j8205
16100A225513J2991J2200o517Q028N864j4380M173m390L648N258R258n456q67
16087A255323k927q78l035J1025L098q778J0658l387r565k966J1062j2649r049
$$ y = [1057060, 1065187, 1067841, 1071151, 1065029, 1083264, 1101059, 1091743, 1099960, 1111731, 1117442, 1110144, 1115958, 1123246, 1128826, 1126799, 1133502, 1132180, 1115745, 1117420, 1116953, 1118436, 1126593, 1126695, 1133585, 1144567, 1134633, 1130352, 1139161, 1137801, 1141065, 1147685, 1160023, 1166609, 1153052, 1149401, 1158992, 1173800, 1167467, 1165598, 1176344, 1197610, 1198786, 1183871, 1194531, 1205828, 1202553, 1200927, 1194437, 1184379, 1170904, 1170658, 1191567, 1208551, 1198176, 1202376, 1215765, 1221991, 1221683, 1212699, 1220495, 1241431, 1235516, 1245941, 1230327, 1228477, 1232079, 1241934, 1246881, 1242288, 1243812, 1229630, 1230304, 1233070, 1234339, 1235969, 1239045, 1250660, 1243718, 1225513, 1238504, 1250704, 1244187, 1252215, 1258079, 1243699, 1247872, 1243482, 1247130, 1252388, 1261646, 1256190, 1255323, 1252396, 1251518, 1248483, 1259508, 1262606, 1253828, 1264486, 1261099, 1251534, 1248568, 1259630, 1246981, 1237932]
16074A237932J2716m894q67J2970J7740q224k5999J336J7095R573q088O071J0705
16061A278066j1763L393M972n074J606j3199l871K9403Q218k3273J623p753m47
16048A261901K838j068Q870r585L365J3394O866j0060p641k209n199o919R655
16035A264208p37Q878J2275J3212K28j0834j4094L417K1358L391p456j5893j1045
16022A266908L01J4865o586k180J4569m405j3187M779M369J5510j6515q912j347
16009A268169N875j0334P139K1467l232P669N337r889r220O625O781r341k353
15996A284693j823o946j752K456o065M028p825o660N575J1367J8437M163j9800
15983A279848k753J0998l069P728j6322N103J6414n989o226n084j1104O453K395
$$ y = [1237932, 1250648, 1245754, 1244887, 1257857, 1275597, 1267373, 1241374, 1242710, 1259805, 1269378, 1261290, 1267361, 1278066, 1266303, 1269696, 1274668, 1269594, 1271200, 1258001, 1254130, 1283533, 1291751, 1268478, 1270101, 1262348, 1261901, 1264739, 1263671, 1272541, 1262956, 1266321, 1279715, 1286581, 1276521, 1268880, 1266671, 1261472, 1254553, 1264208, 1263471, 1272349, 1284624, 1297836, 1298064, 1287230, 1273136, 1276553, 1297911, 1301302, 1293846, 1277953, 1266908, 1267209, 1282074, 1275488, 1273308, 1287877, 1283472, 1270285, 1275064, 1279433, 1294943, 1278428, 1269516, 1268169, 1274044, 1263710, 1270849, 1292316, 1289084, 1296753, 1302090, 1292201, 1282981, 1289606, 1296387, 1287046, 1284693, 1282870, 1275924, 1274172, 1276628, 1270563, 1274591, 1266766, 1260106, 1265681, 1277048, 1295485, 1299648, 1279848, 1277095, 1288093, 1285024, 1292752, 1276430, 1281533, 1297947, 1291958, 1285732, 1280648, 1269544, 1275997, 1278392]
15970A278392N674r034r696R54J3101L538K305L152K742j1732J0233l601j3791
15957A272237o618Q626R749l522O494k0357k848Q316m985J3539O889j8356M143
15944A273307k394J5203J7481k0308j5265m252K0312K0959J192n633j7819K526
15932A285309n106Q12j0116r839N435K0990m604M450Q034K327j073m100o517k336
15918A283666O504o65m975o567M232r454p957l36R307Q963J0874M34J5302j6511
15904A292817j0203j0087J2766N864o936n410M714J3627p677O374J8585n567p939
15891A300928j785J1067K880k210k6194m218L4156N9L533j8222j236L258l401
15878A298615q012q574j994m429J5808m103J6291r950j0453K0695j7680j782R280
$$ y = [1278392, 1284066, 1275032, 1265336, 1266290, 1279391, 1282929, 1285234, 1288386, 1291128, 1279396, 1289629, 1286028, 1272237, 1265619, 1274245, 1283994, 1280472, 1286966, 1266609, 1263761, 1272077, 1267092, 1280631, 1287520, 1269164, 1273307, 1270913, 1286116, 1303597, 1283289, 1268024, 1263772, 1284084, 1305043, 1306235, 1300602, 1282783, 1285309, 1280203, 1281015, 1270899, 1261060, 1266495, 1287485, 1282881, 1287331, 1295365, 1297692, 1296619, 1292519, 1286002, 1283666, 1290170, 1289505, 1284530, 1277963, 1282195, 1272741, 1264784, 1264448, 1273755, 1282718, 1293592, 1294026, 1309328, 1292817, 1282614, 1272527, 1285293, 1291157, 1284221, 1278811, 1283525, 1297152, 1289475, 1295849, 1314434, 1308867, 1300928, 1299143, 1310210, 1313090, 1310880, 1284686, 1280468, 1314624, 1314683, 1318216, 1299994, 1298758, 1302016, 1298615, 1290603, 1282029, 1280035, 1275606, 1291414, 1287311, 1303602, 1293652, 1283199, 1303894, 1286214, 1284432, 1293712]
15865A293712m59j7943l067l149J2564K0977p981j8131N209j884J2141J1857M539
15852A308385n361O887l205l661k1914Q75J1296J787J0629j1236j121l402n708
15839A284251K611P22Q331N670j5891J352m245m800j146J6525J1645m551p362
15826A293112q638n410K2996j2026j088J0695M122j923l764j7270K173K0148k3
15813A303104n26l024O805m117l208K691M5j4409r340K2675J2949N47l683K762
15799A313271l516k1724P077J087K251l820p396K3372K773j6846K308l222P102
15786A302717K2247j0154j3147Q320N036q332r112m444o488J2987m555M940N057
15773A305072K789j0381j457L9Q83P655n084l497l74Q985j652l782r660j6723
$$ y = [1293712, 1293253, 1275310, 1272243, 1269094, 1281658, 1302635, 1294654, 1276523, 1281732, 1279848, 1291989, 1303846, 1308385, 1303024, 1309911, 1306706, 1303045, 1281131, 1282006, 1293302, 1295089, 1305718, 1294482, 1293361, 1289959, 1284251, 1286862, 1287584, 1295915, 1301585, 1285694, 1287046, 1282801, 1278001, 1276855, 1293380, 1305025, 1300474, 1293112, 1284474, 1279064, 1302060, 1290034, 1288946, 1299641, 1303763, 1301840, 1298076, 1280806, 1282979, 1303127, 1303104, 1302578, 1299554, 1306359, 1302242, 1299034, 1301725, 1301770, 1287361, 1278021, 1300696, 1313645, 1314192, 1310509, 1313271, 1309755, 1288031, 1295108, 1296195, 1298446, 1294626, 1287230, 1310602, 1313375, 1296529, 1298837, 1295615, 1302717, 1324964, 1314810, 1301663, 1309983, 1315019, 1306687, 1297575, 1293131, 1286643, 1299630, 1295075, 1300015, 1305072, 1307861, 1297480, 1296023, 1296062, 1296945, 1304600, 1299516, 1296019, 1295645, 1304630, 1302978, 1299196, 1289536, 1272813]
15759A272813K259M416K1124n338O43L081p17j091J4669j996N238M813j5639o617
15745A297658Q101j864l484N876p272Q267o845m664k640J0886q811o982n269O566
$$ y = [1272813, 1275072, 1279488, 1300612, 1295274, 1295917, 1298998, 1298281, 1297190, 1311859, 1309863, 1315101, 1319914, 1304275, 1297658, 1305759, 1303895, 1300411, 1306287, 1299015, 1307282, 1300437, 1295773, 1293133, 1304019, 1295208, 1288226, 1282957, 1289523]
$$ [...]
##END NTUPLES=NMR SPECTRUM
##END=
