##TITLE=1H_DE-80H_X3
 200.13MHz, d2o
 8 sc
 
 19ns.26.2.2025
##JCAMPDX= 6.0         $$ Bruker NMR JCAMP-DX V2.0
##DATA TYPE= NMR SPECTRUM
##DATA CLASS= NTUPLES
##ORIGIN= UXNMR, Bruker Analytische Messtechnik GmbH
##OWNER= pz
$$ XWIN-NMR		Version 3.5
$$ Fri Jul 31 10:48:59 2026 Russian Standard Time (UT+4h)  Yarkov@DPX200
##.OBSERVE FREQUENCY= 200.1313
##.OBSERVE NUCLEUS= ^1H
##.ACQUISITION MODE= SIMULTANEOUS
##.ACQUISITION SCHEME= undefined
##.AVERAGES= 8
##.DIGITISER RES= 18
##SPECTROMETER/DATA SYSTEM= spect
##.PULSE SEQUENCE= zg30
##.SOLVENT NAME= DMSO
##.SHIFT REFERENCE= (INTERNAL, DMSO, 0, 15.5034)
##AUDIT TRAIL= $$ (NUMBER, WHEN, WHO, WHERE, WHAT)
$$ ##TITLE= Audit trail, XWIN-NMR		Version 3.5
$$ ##JCAMPDX= 5.01
$$ ##ORIGIN= Bruker BioSpin GmbH
$$ ##OWNER= Yarkov
$$ C:/Bruker/XWIN-NMR/data/yarkov2/nmr/H-C/1/pdata/1/auditp.txt
$$ ##AUDIT TRAIL=  $$ (NUMBER, WHEN, WHO, WHERE, WHAT)
(   1,<2026-07-31 10:48:17.93 +0400>,<Yarkov>,<DPX200>,
      <created by zg, POWCHK disabled, PULCHK disabled
       configuration hash MD5:
       00 E9 B6 7A A2 85 ED C7 34 08 36 98 17 FE 4E 26
       data hash MD5: 16K
       C5 BC 59 62 A8 AE 10 C5 A8 DB 6C 12 FA A0 49 11>)
(   2,<2026-07-31 10:48:23.42 +0400>,<Yarkov>,<DPX200>,
      <Start of raw data processing
       efp BC_mod = 2 LB = 0.25 FT_mod = 6 PKNL = 1 PHC0 = -7253.183 PHC1 = 2.82197 SI = 16K 
       data hash MD5: 16K
       ED B5 D2 D2 B4 50 9D D0 DD 8F 08 91 0F 5B 3B 3F>)
$$ ##END=
$$ 
$$ hash MD5
$$ 71 24 0A AC 6B C9 E7 DC B9 D0 13 3C A8 B3 34 1C
##$RELAX= 
##$RELAX= 
##$RELAX= 
##$RELAX= 
##$RELAX= 
##$RELAX= 
$$ Bruker specific parameters
$$ --------------------------
##$DU= <C:/Bruker/XWIN-NMR>
##$EXPNO= 1
##$NAME= <H-C>
##$PROCNO= 1
##$TYPE= <nmr>
##$USER= <yarkov2>
##$AMP= (0..31)
100 100 100 100 100 100 100 100 100 100 100 100 100 100 100 100 100 100 
100 100 100 100 100 100 100 100 100 100 100 100 100 100 
##$AQSEQ= 0
##$AQ_mod= 1
##$AUNM= <au_zg>
##$AUTOPOS= <>
##$BF1= 200.13
##$BF2= 200.13
##$BF3= 200.13
##$BF4= 200.13
##$BF5= 200.13
##$BF6= 200.13
##$BF7= 200.13
##$BF8= 200.13
##$BYTORDA= 1
##$CFDGTYP= 0
##$CFRGTYP= 5
##$CHEMSTR= <none>
##$CNST= (0..31)
1 1 145 1 1 1 1 1 1 1 1 1 1 1 1 1 1 1 1 1 1 1 1 1 1 1 1 1 1 1 1 1 
##$CPDPRG= <>
##$CPDPRG1= <>
##$CPDPRG2= <>
##$CPDPRG3= <>
##$CPDPRG4= <mlev>
##$CPDPRG5= <mlev>
##$CPDPRG6= <mlev>
##$CPDPRG7= <mlev>
##$CPDPRG8= <mlev>
##$CPDPRGB= <>
##$CPDPRGT= <>
##$D= (0..31)
0 0.7 0 0 0 0 0 0 0 0 0 0.03 0 0 0 0 0 0 0 0 0 0 0 0 0 0 0 0 0 0 0 0 
##$DATE= 1785480497
##$DBL= (0..7)
120 120 120 120 120 120 120 120 
##$DBP= (0..7)
150 150 150 150 150 150 150 150 
##$DBP07= 0
##$DBPNAM0= <>
##$DBPNAM1= <>
##$DBPNAM2= <>
##$DBPNAM3= <>
##$DBPNAM4= <>
##$DBPNAM5= <>
##$DBPNAM6= <>
##$DBPNAM7= <>
##$DBPOAL= (0..7)
0.5 0.5 0.5 0.5 0.5 0.5 0.5 0.5 
##$DBPOFFS= (0..7)
0 0 0 0 0 0 0 0 
##$DE= 6
##$DECBNUC= <off>
##$DECIM= 32
##$DECNUC= <off>
##$DECSTAT= 4
##$DIGMOD= 1
##$DIGTYP= 9
##$DL= (0..7)
0 120 120 120 120 120 120 120 
##$DP= (0..7)
$$ [...]
##$SUBNAM2= <"">
##$SUBNAM3= <"">
##$SUBNAM4= <"">
##$SUBNAM5= <"">
##$SUBNAM6= <"">
##$SUBNAM7= <"">
##$SUBNAM8= <"">
##$SUBNAM9= <"">
##$SW= 18.0517328524113
##$SWIBOX= (0..15)
0 0 2 0 0 0 0 0 0 0 0 0 0 0 0 0 
##$SW_h= 3612.71676300578
##$TD= 16384
##$TD0= 1
##$TE= 0
##$TE2= 300
##$TE3= 300
##$TEG= 300
##$TL= (0..7)
0 120 120 120 120 120 120 120 
##$TP= (0..7)
150 150 150 150 150 150 150 150 
##$TP07= 0
##$TPNAME0= <>
##$TPNAME1= <>
##$TPNAME2= <>
##$TPNAME3= <>
##$TPNAME4= <>
##$TPNAME5= <>
##$TPNAME6= <>
##$TPNAME7= <>
##$TPOAL= (0..7)
0.5 0.5 0.5 0.5 0.5 0.5 0.5 0.5 
##$TPOFFS= (0..7)
0 0 0 0 0 0 0 0 
##$TUNHIN= 0
##$TUNHOUT= 0
##$TUNXOUT= 0
##$USERA1= <user>
##$USERA2= <user>
##$USERA3= <user>
##$USERA4= <user>
##$USERA5= <user>
##$V9= 5
##$VALIST= <valist>
##$VCLIST= <CCCCCCCCCCCCCCC>
##$VD= 0
##$VDLIST= <DDDDDDDDDDDDDDD>
##$VPLIST= <PPPPPPPPPPPPPPP>
##$VTLIST= <TTTTTTTTTTTTTTT>
##$WBST= 1024
##$WBSW= 4
##$XGAIN= (0..3)
0 0 0 0 
##$XL= 0
##$YL= 0
##$YMAX_a= 162593
##$YMIN_a= -203982
##$ZGOPTNS= <>
##$ZL1= 120
##$ZL2= 120
##$ZL3= 120
##$ZL4= 120
##$ABSF1= 0
##$ABSF2= 0
##$ABSG= 0
##$ABSL= 0
##$ALPHA= 0
##$AQORDER= 0
##$ASSFAC= 0
##$ASSFACI= 0
##$ASSFACX= 0
##$ASSWID= 0
##$AUNMP= <proc_1d>
##$AZFE= 0.1
##$AZFW= 0.1
##$BCFW= 0
##$BC_mod= 2
##$BYTORDP= 0
##$COROFFS= 0
##$CY= -3
##$DATMOD= 1
##$DC= 0
##$DFILT= <>
##$DTYPP= 0
##$F1P= 0
##$F2P= 0
##$FCOR= 1
##$FTSIZE= 16384
##$FT_mod= 6
##$GAMMA= 0
##$GB= 0
##$INTBC= 1
##$INTSCL= 3.241238e-09
##$ISEN= 128
##$LB= 0.25
##$LEV0= 0
##$LPBIN= 0
##$MAXI= 10000
##$MC2= 0
##$MEAN= 0
##$ME_mod= 0
##$MI= 1.114404
##$NCOEF= 0
##$NC_proc= -6
##$NLEV= 6
##$NOISF1= 3.799351
##$NOISF2= 2.8
##$NSP= 0
##$NTH_PI= 0
##$NZP= 0
##$OFFSET= 15.50339
##$PC= 1
##$PHC0= -7253.183
##$PHC1= 2.82197
##$PH_mod= 1
##$PKNL= yes
##$PPARMOD= 0
##$PSCAL= 0
##$PSIGN= 0
##$REVERSE= no
##$SF= 200.13000366458
##$SI= 16384
##$SIGF1= 3
##$SIGF2= 2
##$SINO= 0.751879
##$SIOLD= 32768
##$SREGLST= <19F.Aceton>
##$SSB= 0
##$STSI= 16384
##$STSR= 0
##$SW_p= 3612.71676300578
##$SYMM= 0
##$S_DEV= 0
##$TDeff= 16384
##$TDoff= 0
##$TI= <>
##$TILT= no
##$TM1= 0
##$TM2= 0
##$TOPLEV= 0
##$USERP1= <user>
##$USERP2= <user>
##$USERP3= <user>
##$USERP4= <user>
##$USERP5= <user>
##$WDW= 1
##$XDIM= 16384
##$YMAX_p= 341110074
##$YMIN_p= -366854
$$ End of Bruker specific parameters
$$ ---------------------------------
##NTUPLES= NMR SPECTRUM
##VAR_NAME=  FREQUENCY,     SPECTRUM/REAL,   SPECTRUM/IMAG
##SYMBOL=    X,             R,               I
##VAR_TYPE=  INDEPENDENT,   DEPENDENT,       DEPENDENT
##VAR_FORM=  AFFN,          ASDF,            ASDF
##VAR_DIM=   16384,         16384,           16384
##UNITS=     HZ,            ARBITRARY UNITS, ARBITRARY UNITS
##FACTOR=    0.220516191357247, 1,           1
##FIRST=     3102.69355999296, 0,            0
##LAST=      -510.023203012816, 0,           0
##MIN=       -510.023203012816, -366854,     0
##MAX=       3102.69355999296, 341110074,    0
$$ Real data points
##PAGE= N=1
##DATA TABLE= (X++(R..R)), XYDATA
$$ [...]
$$ plain form
9280 -46130 -27197 52892 40399 -86886 -93779 -10940 80855 -46240 -43360 -102526 -108319 -60576
9268 -60576 -98565 -84208 -36501 -61736 -36521 -23864 -19131 9223 -17842 -50177 -78021 -132552
9256 -132552 -126942 -106187 -59053 -42325 -16026 -46764 -36779 10225 -109966 -165448 -109146 -78787
9244 -78787 -66085 -58736 -82344 -107277 -77156 -100522 -92247 -77543 -78461 -91186 -89069 -98057 -78924
9231 -78924 -16510 -70942 -34328 -18261 -46503 -59130 -22272 -41466 -83565 -127776 -94196 -107020
9219 -107020 -121504 -145492 -99187 -66902 -140875 -83403 -63614 -64875 -51712 -74553 -61226 -89121
9207 -89121 -60740 -34322 -67453 -61853 -45592 -45150 -11001 -31930 -50472 32782 4402 3039 -5311
9194 -5311 6346 38168 -54071 -45302 -84977 -41556 -63307 -76574 -14175 -39503 -51060 -79008
$$ packed form
9280d6130J8933Q0089j2493j27285o893Q2839R1795j27095K880n9166n793M7743
9268f0576l7989J4357M7707k5235K5215J2657M733K8354k7065l2335k7844n4531
9256a32552N610K0755M7134J6728K6299l0738R985M7004j20191n5482N6302L0359
9244g8787J2702P349k3608k4933L0121k3366Q275J4704r18j2725K117q988J9133
9231g8924O2414n4432L6614J6067k8242j2627L6858j9194m2099m4211L3580j2824
9219a07020j4484k3988M6305L2285p3973N7472J9789j261J3163k2841J3327k7895
9207h9121K8381K6418l3131N600J6261M42L4149k0929j8542Q3254k8380j363q350
9194e311J1657L1822r2239Q769l9675M3421k1751j3267O2399k5328j1557k7948
$$ plain form
9182 -79008 -55408 -63661 -52858 -81694 -61068 -82790 -81590 -79137 -90828 -60135 -79857 -93096
9170 -93096 -53107 -18790 -73224 -121158 -64826 -74724 -118197 -92023 -46931 -27684 -92154 -154819
9158 -154819 -112143 -19152 -70424 -131688 -28093 -83293 -109673 20369 -15976 -6913 -27819
9147 -27819 -60788 -94031 -80289 -63809 -76536 -46699 -7511 22617 23204 67291 10296 -31936
9135 -31936 -26453 -40971 -71852 -74990 -97012 -75561 -90050 -54096 -10251 49224 53626 -8106
9123 -8106 -34295 -531 38374 989 19169 8754 -66257 -85215 -11075 -33423 -48124 -61759
9111 -61759 -75079 -78615 -71276 -76847 -80205 -95759 -88409 -42149 -36991 -31663 13270 307 -48067
9098 -48067 -80663 -78134 -89315 -82501 -61584 -60693 -77621 -29182 38386 31748 -49939 -42227 -17368
$$ packed form
9182g9008K3600q253J0803k8836K0626k1722J200K453j1691L0693j9722j3239
9170i3096L9989L4317n4434m7934N6332r898m3473K6174M5092J9247o4470o2665
9158a54819M2676R2991n1272o1264J03595n5200k6380J30042l6345R063k0906
9147b7819l2969l3243J3742J6480j2727K9837L9188L0128N87M4087n6995m2232
9135c1936N483j4518l0881l138k2022K1451j4489L5954M3845N9475M402o1732
9123h106k6189L3764L8905l7385J8180j0415p5011j8958P4140k2348j4701j3635
9111f1759j3320l536P339n571l358j5554P350M6260N158N328M4933j2963m8374
9098d8067l2596K529j1181O814K0917Q91j6928M8439O7568o638q1687P712K4859
$$ plain form
9085 -17368 -85103 -26326 10792 -24320 -26978 -29620 -5186 30416 -57161 -42778 -3892 -32404
9073 -32404 -135757 -94282 -50468 -62963 -88880 -80621 -48680 13541 540 -18515 21429 6472
9061 6472 6664 -95321 -50912 -54003 -77192 -21689 44361 -41600 -33289 3305 27012 -44693 23038
9048 23038 42503 -61320 -36389 24156 -54936 -56352 -84464 -72016 -22150 -56703 -106457 -85895
9036 -85895 43463 64224 69928 -1762 29490 10789 -18452 -19947 -30762 -24550 -18264 -70291
9024 -70291 -21297 766 -17116 -57224 -91545 -87739 -29989 -53823 -119977 -60723 -39460 16957
9012 16957 43693 43440 29479 63266 83504 25453 -19986 10514 96982 61242 20828 23329
9000 23329 -42431 -25034 -40719 -108504 -101408 -64889 -1982 -20710 -38353 40281 -16034 -56668
$$ packed form
9085a7368o7735N8777L7118l5112k658k642K4434L5602q7577J4383L8886k8512
9073c2404j03353M1475M3814j2495k5917Q259L1941O2221j3001j9055L9944j4957
9061F472J92j01985M4409l091k3189N5503O6050q5961Q311L6594K3707p1705O7731
9048B3038J9465j03823K4931O0545p9092j416k8112J2448M9866l4553m9754K0562
9036h5895J29358K0761N704p1690L1252j8701k9241j495j0815O212O286n2027
9024g0291M8994K2063j7882m0108l4321L806N7750k3834o6154N9254K1263N6417
9012A6957K6736k53j3961L3787K0238n8051m5439L0500Q6468l5740m0414K501
9000B3329o5760J7397j5685o7785P096L6519O2907j8728j7643P8634n6315m0634
$$ plain form
8988 -56668 -37259 -18231 -42466 -39907 25876 -62375 -93269 -35846 52376 35945 -35972 -22350
8976 -22350 -700 -69450 -30901 -76010 -58561 4345 34843 22031 31897 27215 29799 28800 52269
8963 52269 24081 -28174 -44949 -34970 -53805 -28213 4769 -3468 -14926 -29214 -48897 -30358
8951 -30358 -57 -14615 35626 57929 31545 46209 -20485 36453 24715 -51263 -16103 21803
8939 21803 -18126 42751 110971 46152 -13409 -13693 -18662 29360 42707 76881 47352 21829
8927 21829 69772 10000 17245 7734 78487 99301 136660 85256 35225 71922 168338 63099
8915 63099 11375 35926 -14696 10438 9174 -21805 -7137 39713 60778 -2457 21725 -10495
8903 -10495 46339 -447 3428 -18490 44825 71510 49313 18659 31646 61816 65912 45098
$$ packed form
8988e6668J9409J9028k4235K559O5783q8251l0894N7423Q8222j6431p1917J3622
8976b2350K1650o8750L8549m5109J7449O2906L0498j2812R866m682K584r99K3469
8963E2269k8188n2255j6775R979j8835K5592L2982q237j1458j4288j9683J8539
8951c0358L0301j4558N0241K2303k6384J4664o6694N6938j1738p5978L5160L7906
8939B1803l9929O0877O8220o4819n9561k84m969M8022J3347L4174k9529k5523
8927B1829M7943n9772P245r511P0753K0814L7359n1404n0031L6697R6416j05239
8915F3099n1724K4551n0622K5134j264l0979J4668M6850K1065o3235K4182l2220
8903a0495N6834m6786L875k1918O3315K6685k2197l0654J2987L0170M096k0814
$$ plain form
8891 45098 24820 82805 52690 48712 45722 1108 115503 112856 77035 65901 62891 98059
8879 98059 85653 89999 73496 79882 77846 53484 78421 98616 124909 130186 137505 121575 93874
8866 93874 84556 85067 98981 119357 110258 84622 41214 34067 61083 55729 65115 30821 23093
8853 23093 38908 -10422 42415 110575 98824 105970 101510 93899 17419 43420 83954 99924
8841 99924 150047 127581 92102 98323 103164 156893 100228 145477 108624 156003 177419 190562
8829 190562 159613 170355 138940 131115 137457 111850 142377 140127 116869 108926 129910 177499
8817 177499 177426 259469 218739 150704 198960 194473 232860 241086 229717 203091 240792 269651 271495
8804 271495 248546 238928 273870 307913 294622 239433 262243 208061 173934 188474 255234 267431
$$ packed form
8891D5098k0278N7985l0115l978k990m4614J14395k647l5821j1134l010L5168
8879I8059j2406M346j6503O386k036k4362K4937K0195K6293N277P319j5930k7701
8866I3874r318N11J3914K0376r099k5636m3408p147K7016n354R386l4294p728
8853B3093J5815m9330N2837O8160j1751P146m460p611p6480K6001M0534J5970
8841I9924N0123k2466l5479O221M841N3729n6665M5249l6853M7379K1416J3143
8829A90562l0949J0742l1415p825O342k5607L0527k250k3258p943K0984M7589
8817A77499p3Q2043m0730o8035M8256m487L8387Q226j1369k6626L7701K8859J844
8804B71495k2949r618L4942L4043j3291n5189K2810n4182l4127J4540O6760J2197
$$ plain form
8792 267431 245677 260215 253477 290723 353657 264607 222706 216183 224043 240680 287314 337522
8780 337522 304778 316930 334989 362206 399307 435639 365655 389008 304523 306972 322029 357912
8768 357912 356641 321165 371730 341865 358330 315081 337500 392933 428571 433720 483908 440803
8756 440803 406627 464425 465161 506449 468314 504472 558689 540251 576633 566982 566417 611330 589280
8743 589280 562123 532575 545797 619685 612450 574724 621642 646438 661682 633405 654320 616918
8731 616918 628986 644361 607658 643446 668160 672130 610103 599132 660483 666976 752259 773834
8719 773834 833719 831635 745675 756194 723782 751226 800937 861535 814866 809961 814658 743928
8707 743928 772591 768243 774807 733355 739260 776396 809153 818277 750074 747060 781711 764347 704984
$$ packed form
8792B67431k1754J4538o738L7246O2934q9050m1901o523P860J6637M6634N0208
8780C37522l2744J2152J8059K7217L7101L6332o9984K3353q4485K449J5057L5883
8768C57912j271l5476N0565k9865J6465m3249K2419N5433L5638N149N0188m3105
8756D40803l4176N7798P36M1288l8135L6158N4217j8438L6382r651n65M4913k2050
8743E89280k7157k9548J3222P3888p235l7726M6918K4796J5244k8277K0915l7402
8731F16918J2068J5375l6703L5788K4714L970o2027j0971O1351O493Q5283K1575
8719G73834N9885k084q5960J0519l2412K7444M9711O0598m6669m905M697p0730
8707G43928K8663m348O564m1452N905L7136L2757R124o8203l014L4651j7364n9363
$$ plain form
8694 704984 715556 734059 711660 699003 645776 629096 597685 611477 622469 636947 626039 636435
8682 636435 672204 692627 683307 651321 642428 589000 601678 625884 657603 662684 621795 592213
8670 592213 627707 659454 587820 562633 582832 542256 513701 573251 561657 471902 508905 569023
8658 569023 570638 605368 589559 590321 574436 551972 536895 546134 453635 456750 490698 462124 520450
8645 520450 494904 398849 409278 432316 460646 418720 389260 397904 412520 419756 360337 412894
8633 412894 518666 471222 429481 433495 417230 406906 348309 374897 336620 310073 323107 352428
8621 352428 334802 302166 363965 381116 284487 306568 299579 309579 276342 270352 222195 240090
8609 240090 224440 219879 231231 278344 257922 275877 291558 305437 256914 248304 247514 132767
$$ packed form
8694G04984J0572J8503k2399j2657n3227j6680l1411J3792J0992J4478j0908J0396
8682F36435L5769K0423r320l1986q893n3428J2678K4206L1719N081m0889k9582
8670E92213L5494L1747p1634k5187K0199m0576k8555N9550j1594q9755L7003O0118
8658E69023J615L4730j5809P62j5885k2464j5077R239r2499L115L3948k8574N8326
8645E20450k5546r6055J0429K3038K8330m1926k9460Q644J4616P236n9419N2557
8633D12894J05772m7444m1741M014j6265j0324n8597K6588l8277k6547J3034K9321
8621C52428j7626l2636O1799J7151r6629K2081o989J0000l3237n990m8157J7895
8609B40090j5650m561J1352M7113k0422J7955J5681J3879m8523q610p90j14747
$$ plain form
8597 132767 111537 105698 135072 152082 167340 212469 272716 274775 253676 185199 107317 168180
8585 168180 150052 133102 238676 286125 317100 291584 242117 201736 205753 260159 274541 221302
8573 221302 220954 259207 244515 275733 264634 267047 301673 280345 256101 367682 376760 398195
8561 398195 403655 435105 495860 464291 449215 479374 464888 529907 579696 648567 847203 1021113
8549 1021113 1277284 1611550 2117451 2682736 3303992 3718727 3875289 3819071 3691364 3444112
8539 3444112 3117583 2816362 2574418 2057948 1552075 1199554 990270 854700 798265 746089
8529 746089 679771 568837 503684 379339 457787 456431 399943 316107 305639 280793 251904
8518 251904 304671 251780 226033 261277 248142 183475 202967 203459 214729 197498 209059 198880
$$ packed form
8597A32767k1230n839K9374J7010J5258M5129O0247K059k1099o8477p7882O0863
8585A68180j8128j6950J05574M7449L0975k5516m9467m0381M017N4406J4382n3239
8573B21302l48L8253j4692L1218j1099K413L4626k1328k4244J11581R078K1435
8561C98195N460L1450O0755l1569j5076L0159j4486O5019M9789O8871J98636J73910
8549A021113K56171L34266N05901N65285O21256M14735J56562n6218j27707k47252
8539C444112l26529l01221k41944n16470n05873l52521k09284j35570n6435n2176
8529G46089o6318j10934o5153j24345P8448j356n6488q3836j0468k4846k8889
8518B51904N2767n2891k5747L5244j3135o4667J9492M92J1270j7231J1561j0179
$$ plain form
8506 198880 213672 165873 181636 166986 160622 160304 221700 192960 149460 182152 201511 125331
8494 125331 108726 133829 159441 171403 130796 124010 146586 118946 85200 167967 153208 86629
8482 86629 86556 66738 3249 17742 81157 59860 35708 129445 137353 50491 44770 90756 83730
8469 83730 47317 62886 29589 28917 96812 85083 11515 33634 24207 58718 101802 104954 133044
8456 133044 71430 31784 56965 -2848 -11842 48474 42983 12666 22213 16791 -5246 59793
8444 59793 67988 49308 6941 -33796 -10832 34717 -42868 -72047 -34840 -7531 -21953 8284
8432 8284 -13796 -37525 -21853 5271 60440 -6595 29111 40231 45747 16990 36101 31740
8420 31740 14164 35241 31074 -20775 -18454 -10766 82589 45540 36078 21864 6388 26210 -6543
$$ packed form
8506A98880J4792m7799J5763j4650o364l18O1396k8740m3500L2692J9359p6180
8494A25331j6605K5103K5612J1962m0607o786K2576k7640l3746Q2767j4759o6579
8482H6629p3j9818o3489J4493O3415k1297k4152R3737P908q6862n721M5986p026
8469H3730l6413J5569l3297o72O7895j1729p3568K2119r427L4511M3084L152K8090
8456A33044o1614l9646K5181n9813q994O0316n491l0317R547n422k2037O5039
8444E9793Q195j8680m2367m0737K2964M5549p7585k9179L7207K7309j4422L0237
8432H284k2080k3729J5672K7124N5169o7035L5706J1120N516k8757J9111m361
8420C1740j7576K1077m167n1849K321P688R3355l7049r462j4214j5476J9822l2753
$$ plain form
8407 -6543 36019 84525 54816 -26224 45595 53771 6604 -14262 -19581 45867 3170 -52487
8395 -52487 -43422 -30092 -61664 -9571 61819 27888 -69497 -98171 -26671 14461 2188 -22985
8383 -22985 2279 39402 -27891 -18603 -1540 3701 53859 105332 85897 27434 31 -6098
8371 -6098 12381 -40011 -87603 -17426 23347 -36095 -16233 -12985 15022 -71760 -37379 21266
8359 21266 39426 6109 45093 34629 -61971 -34341 -70650 -90513 -50443 -35883 -24677 -73715
8347 -73715 1002 29668 28859 4739 1586 -9927 -53701 -87142 -120320 -126233 -36100 -46315 11558
8334 11558 -7117 -57403 -27179 -54644 -56413 -46977 -47503 -68957 -38867 -46453 -59448 -80793 -104291
8321 -104291 -57470 -2947 -15751 40051 4467 -21038 9961 39137 84060 15643 -46918 -65762
$$ packed form
8407f543M2562M8506k9709q1040P1819Q176m7167k0866n319O5448m2697n5657
8395e2487R065J3330l1572N2093P1390l3931r7385k8674P1500M1132j2273k5173
8383b2985K5264L7123o7293R288J7063N241N0158N1473j9435n8463k7403o129
8371f098J8479n2392m7592P0177M0773n9442J9862L248K8007q6782L4381N8645
8359B1266J8160l3317L8984j0464r6600K7630l6309j9863M0070J4560J1206m9038
8347g3715P4717K8666q09k4120l153j1513m3774l3441l3178n913R0133j0215N7873
8334A1558j8675n0286L0224k7465j769R436n26k1454L0090p586j2995k1345k3498
8321a04291M6821N4523j2804N5802l5584k5505L0999K9176M4923o8417o2561j8844
$$ plain form
8309 -65762 -72817 -75361 -65683 -45058 -513 3920 -7944 66196 94025 74234 14641 -77818 7368
8296 7368 47306 -39967 -61901 34931 -23452 -76480 -84567 -95952 -79113 -32018 10694 -3400
8284 -3400 -17168 -133614 -165293 -155232 -86773 -39451 -29708 -29895 -13252 -60984 6472 -63348
8272 -63348 -24012 -33592 -13289 18031 -36605 -48980 4551 -52026 -54264 -26911 -48360 -82833
8260 -82833 -78133 -101387 -53259 -48126 -75309 -17623 -21787 -36735 -79181 -37643 28443 -8245
8248 -8245 -54909 17775 -33526 -55851 -47465 -52435 -108372 -123400 -53511 -58221 -94393 -93379 -79651
8235 -79651 -15264 3205 -2288 40827 33104 12911 38459 41131 -503 -107600 -135677 -104894
8223 -104894 -101356 -44171 42614 29983 -17783 4980 38448 37161 37031 -1266 60444 11532
$$ packed form
8309f5762p055k544R678K0625M4545M433j1864P4140K7829j9791n9593r2459Q5186
8296G368L9938q7273k1934R6832n8383n3028q087j1385J6839M7095M2712j4094
8284c400j3768j16446l1679J0061O8459M7322R743j87J6643m7732O7456o9820
8272f3348L9336r580K0303L1320n4636j2375N3531n6577k238K7353k1449l4473
8260h2833M700k3254M8128N133k7183N7686m164j4948m2446M1538O6086l6688
8248h245m6664P2684n1301k2325Q386m970n5937j5028O9889m710l6172J014J3728
8235g9651O4387J8469n493M3115p723k0193K5548K672m1634j07097k8077L0783
8223a04894L538N7185Q6785j2631m7766K2763L3468j287j30l8297O1710m8912
$$ plain form
8211 11532 -17907 -1716 -33965 -6955 23287 27230 47585 -46953 -48854 -83769 -20655 -5197
8199 -5197 73817 95052 92931 16802 72904 1955 182184 47079 -323629 -125086 -141404
8188 -141404 -61702 -70551 -74144 -131550 -46397 -55256 -2434 -74502 -80477 -45967 -46581 -47996 -34468
8175 -34468 -24852 11014 -17750 -26848 -119262 -147574 -100529 -70616 -98043 -90131 -101524 -124892
8163 -124892 -36957 -53822 -111369 -73783 17424 28216 -31429 -85327 19902 -1498 -21153
8152 -21153 59540 134473 3381 -6780 -2913 -46682 -26467 -831 46632 -51245 -95146 -58839
8140 -58839 -93000 -36001 -18218 -94883 3829 91117 44794 15484 19486 -4560 -77245 -93113
8128 -93113 -90110 -93892 -73334 -83782 -22444 17792 -8497 18822 -32322 8018 -2000 -87124
$$ packed form
8211A1532k9439J6191l2249K7010L0242L943K0355r4538j901l4915O3114J5458
8199e197P9014K1235k121p6129N6102p0949J80229j35105l70708J98543j6318
8188a41404P9702q849l593n7406Q5153q859N2822p2068n975L4510o14j415J3528
8175c4468R616L5866k8764r098r2414k8312M7045K9913k7427P912j1393k3368
8163a24892Q7935j6865n7547L7586R1207J0792n9645n3898J05229k1400j9655
8152b1153Q0693P4933j31092j0161L867m3769K0215K5636M7463r7877m3901L6307
8140e8839l4161N6999J7783p6665R8712Q7288m6323k9310M002k4046p2685j5868
8128i3113L003l782K0558j0448O1338M0236k6289K7319n1144M0340j0018q5124
$$ plain form
8116 -87124 -50596 43164 5861 -76648 -73165 -27948 -38658 -25129 -78954 -95231 -47348 -28249
8104 -28249 -79369 -94274 -57494 -23642 -32398 24048 -4599 -34878 -67845 10227 23820 -20041
8092 -20041 -35989 -44149 51683 -3692 -109778 -23077 7061 2928 -20464 -32402 34819 -42351
8080 -42351 -75191 -7961 35623 -10311 -63114 -14142 -15585 -69200 -16315 -15303 -76650 -96096
8068 -96096 -101154 -39512 -484 -84592 -45915 -47341 -40303 -51935 -55135 -41162 7968 -44586 -49974
8055 -49974 -37058 -22508 45401 23268 -40731 -93044 -135430 -27222 -83245 -94434 -47078 -67320
8043 -67320 -87118 -29470 -39288 -50157 -42795 -11768 -31448 -83518 -103446 -112269 -98540 -100461 -71259
8030 -71259 -19691 -45750 -77170 -61034 -30929 -54412 -13460 -25934 -73781 -88577 -68726 -31301
$$ packed form
8116h7124L6528R3760l7303q2509L483M5217j0710J3529n3825j6277M7883J9099
8104b8249n1120j4905L6780L3852q756N6446k8647l0279l2967P8072J3593m3861
8092b0041j5948q160R5832n5375j06086Q6701L0138m133k3392j1938O7221p7170
8080d2351l2840O7230M3584m5934n2803M8972j443n3615N2885J012o1347j9446
8068i6096n058O1642L9028q4108L8677j426P038j1632l200J3973M9130n2554n388
8055d9974J2916J4550O7909k2133o3999n2313m2386J08208n6023j1189M7356k0242
8043f7320j9798N7648r818j0869P362L1027j9680n2070j9928q823J3729j921K9202
8030g1259N1568k6059l1420J6136L0105k3483M0952j2474m7847j4796J9851L7425
$$ plain form
8018 -31301 17047 -79103 -64163 -44073 -81055 -66376 -141426 -81798 -30877 -9220 -6977 -10990
8006 -10990 -68361 -48642 -7176 27416 -46307 -47498 -28648 -29494 448 38546 -40566 -14325
7994 -14325 623 25600 -3250 -18067 14055 -7021 -15163 -5525 -12774 -39551 -35217 1862 -69058
7981 -69058 -38143 30978 -29273 -63463 -78796 -85424 -11378 1573 3239 4992 -33568 -23091
7969 -23091 -64309 -134190 -125518 -115352 -99996 -22405 26112 56561 -39561 -58605 -50527 -32547
7957 -32547 -105753 -25350 90480 106094 18960 -26412 -25821 -106076 -93965 -74710 -108066 -127699
7945 -127699 -89755 -44774 -13969 -77218 -58172 -79832 -96605 -109185 -54611 -4542 -39523 -82590
7933 -82590 -4771 22813 33389 1395 -21735 -70719 -22176 -52595 -69205 -11690 -7619 -66202
$$ packed form
8018c1301M8348r6150J4940K0090l6982J4679p5050N9628N0921K1657K243m013
8006a0990n7371J9719M1466L4592p3723j191J8850q46K9942L8098p9112K6241
7994a4325J4948K4977k8850j4817L2122k1076q142R638p249k6777M334L7079p0920
7981f9058L0915O9121o0251l4190j5333o628P4046J2951J666J753l8560J0477
7969b3091m1218o9881Q672J0166J5356P7591M8517L0449r6122j9044Q078J7980
7957c2547p3206Q0403J15830J5614q7134m5372N91q0255J2111J9255l3356j9633
7945a27699L7944M4981L0805o3249J9046k1660j6773j2580N4574N0069l4981m3067
7933h2590P7819K7584J0576l1994k3130m8984M8543l0419j6610N7515M071n8583
$$ plain form
7921 -66202 -39728 -23128 -38234 -31397 -90310 -95604 -32911 5250 -18860 3033 -8365 -29093
7909 -29093 -1187 50779 36800 -46252 -67665 -10526 -9976 -573 25393 37182 7372 -12179
7897 -12179 -26734 -41512 -55371 -49175 -65726 -2863 -52575 -87946 -83843 -56978 -45879 -86172
7885 -86172 -30816 -53523 -79668 -27668 -70158 -35896 -8395 -13089 -28729 -33567 -45909 -84569
7873 -84569 -77140 -46823 -72557 -145571 -121976 -27961 -69449 -41288 -95693 -156448 -85308 -59077
7861 -59077 -23553 -61263 -50856 -6316 -47314 919 -38700 -54142 -38587 -21300 59887 -1617
7849 -1617 -18981 -29117 14229 64106 -9969 -73908 -57170 -59644 -49842 -50676 -82006 -62475 -78574
7836 -78574 -43480 -97601 -110897 -101836 -24277 -10863 -69331 -104215 -132559 -115676 -75065 -153222
$$ packed form
7921f6202K6474J6600j5106O837n8913n294O2693L8161k4110K1893j1398k0728
7909b9093K7906N1966j3979q3052k1413N7139N50R403K5966J1789k9810j9551
7897a2179j4555j4778j3859O196j6551O2863m9712l5371M103K6865J1099m0293
7885h6172N5356k2707k6145N2000m2490L4262K7501m694j5640m838j2342l8660
7873h4569P429L0317k5734p3014K3595R4015m1488K8161n4405o0755P1140K6231
7861e9077L5524l7710J0407M4540m0998M8233l9619j5442J5555J7287Q1187o1504
7849a617j7364j0136M3346M9877p4075o3939J6738k474R802q34l1330J9531j6099
7836g8574L5094n4121j3296R061P7559J3414n8468l4884k8344J6883M0611p8157
$$ plain form
7824 -153222 -172303 -143635 -67734 -59109 -40269 -44643 -46396 -44326 -57239 -52908 -113892 -165977 -140724
7811 -140724 -39422 -99035 -172425 -107643 -73471 -82186 -165542 -171827 -203723 -72874 342353
7800 342353 227439 83086 18541 103853 74216 18053 20755 -6501 -14306 -21043 -60763 -44476
7788 -44476 -43205 -8018 44377 -2597 -57568 -81032 -87163 -22857 -65683 -31843 -10946 -3318
7776 -3318 91239 43611 55327 141800 121921 129583 107270 71550 88883 98251 97500 88278 106611
7763 106611 81243 65023 48964 41003 60800 82175 114863 37093 23319 34355 17186 85590
7751 85590 57941 56863 48615 54287 113416 161021 174610 217271 312171 375638 357136 421962
7739 421962 446618 345716 356484 360391 305900 319257 314565 300788 249939 216107 130820 29884
$$ packed form
7824a53222j9081K8668P5901Q625J8840m374j753K070j2913M331o0984n2085K5253
7811a40724J01302n9613p3390O4782L4172q715q3356o285l1896J30849M15227
7800C42353j14914j44353o4545Q5312k9637n6163K702k7256p805o737l9720J6287
7788d4476J271L5187N2395m6974n4971k3464o131O4306m2826L3840K0897P628
7776c318R4557m7628J1716Q6473j9879P662k2313l5720J7333R368p51r222J8333
7763A06611k5368j6220j6059p961J9797K1375L2688p7770j3774J1036j7169O8404
7751H5590k7649j078q248N672N9129M7605J3589M2661R4900O3467j8502O4826
7739D21962K4656j00902J0768L907n4491J3357m692j3777n0849l3832q5287j00936
$$ plain form
7727 29884 60846 69038 83233 100239 79751 122809 114765 59882 52324 102831 159057 134360
7715 134360 107239 175505 215602 240124 303274 436521 480903 405315 374036 417585 453943
7704 453943 403228 354542 328550 221349 122207 119220 124856 150940 142347 37801 15782 23539
7692 23539 129316 162716 162911 155375 91510 40088 66262 25700 5266 42763 58061 131424
7680 131424 72786 59047 94005 91469 174800 219532 210806 183154 141755 57805 99617 17370
7668 17370 -37578 41197 13780 43069 32699 49197 12600 -7686 -25653 -40220 -5861 56279
7656 56279 29621 64563 9030 -22904 28545 6956 -4027 -28048 -9054 16937 2450 -46509
7644 -46509 -27701 28568 31804 -10194 -50405 -51436 -72595 -77940 -122983 -74143 -62966 33855
$$ packed form
7727B9884L0962Q192J4195J7006k0488M3058q044n4883p558N0507N6226k4697
7715A34360k7121O8266M0097K4522O3150J33247M4382p5588l1279M3549L6358
7704D53943n0715m8686k5992j07201r9142k987N636K6084q593j04546k2019P757
7692B3539J05777L3400J95p536o3865n1422K6174m0562k0434L7497J5298P3363
7680A31424n8638j3739L4958k536Q3331M4732q726k7652m1399q3950M1812q2247
7668A7370n4948P8775k7417K9289j0370J6498l6597k0286j7967j4567L4359O2140
7656E6279k6658L4942n5533l1934N1449k1589j0983k4021J8994K5991j4487m8959
7644d6509J8808N6269L236m1998m0211j031k1159n345m5043M8840J1177R6821
$$ plain form
7632 33855 -39359 -90340 -14296 -6159 24492 2367 -63195 -48794 -71045 -106256 -72609 -28466
7620 -28466 -62333 -83050 -18665 -19099 40661 5168 5283 -16902 -33811 8392 26895 21589 47762
7607 47762 40393 56644 -6491 1312 -4027 -17592 -35365 -28130 -52577 -60283 -81967 -49326 -108712
7594 -108712 -44309 57560 -10661 -76152 -88372 -25400 42027 -5160 -64719 -87750 -67276
7583 -67276 -4155 2437 3117 -60021 -105830 -92835 -120416 -107761 -88550 -39586 -13258 -44840
7571 -44840 -37588 -10488 17651 17112 13027 -46485 7460 55655 -45014 -97815 -21688 -30526 -3002
7558 -3002 12722 39636 -16464 -80513 -91371 -47322 -4609 -13751 -20149 62416 19347 -22522
7546 -22522 -47276 -25170 -18220 -6389 -66963 -72822 -50484 -12012 -64572 -71557 -33737 -44831
$$ packed form
7632C3855p3214n0981P6044Q137L0651k2125o5562J4401k2251l5211L3647M4143
7620b8466l3867k0717O4385m34N9760l5493J15k2185j6909M2203J8503n306K6173
7607D7762p369J6251o3135P803n339j3565j7773P235k4447p706k1684L2641n9386
7594a08712O4403J01869o8221o5491j2220O2972O7427m7187n9559k3031K0474
7583f7276O3121O592O80o3138m5809J2995k7581J2655J9211M8964K6328l1582
7571d4840P252K7100K8139n39m085n9512N3945M8195j00669n2801P6127q838K7524
7558c002J5724K6914n6100o4049j0858M4049M2713r142o398Q2565m3069m1869
7546b2522k4754K2106O950J1831o0574n859K2338L8472n2560o985L7820j1094
$$ plain form
7534 -44831 1706 -18263 -42260 -62440 -6632 -75169 -149752 -119845 -53316 -69582 12468 -35313
7522 -35313 -26686 6721 -4093 -51702 -120858 -59447 -71861 -66210 869 -4854 -136530 -162272
7510 -162272 -54247 -70934 -131019 -104667 -94857 -53255 -13729 -32935 -35503 -57854 -103046 -109863
7498 -109863 -90298 -61789 -63860 -65432 -80531 -78436 -102550 -61360 -62999 -69740 -78789 -33291 -56930
7485 -56930 -91241 -70974 -61665 -81671 -164710 -169200 -93846 -94133 -95459 -23408 -6557 23411 8289
7472 8289 -28069 -105627 -74036 -58241 -77419 -111028 -125504 -104298 -12161 -29594 -86520 -59382
7460 -59382 -28199 -73904 -101834 -97573 -43880 -35256 -2594 35247 7030 42455 -9712 -40603
7448 -40603 -44875 -99763 18865 92026 30132 -21908 -28127 6539 -16298 -15130 -13636 -68148
$$ packed form
7534d4831M6537j9969k3997k0180N5808o8537p4583K9907O6529j6266Q2050m7781
7522c5313Q627L3407j0814m7609o9156O1411j2414N651O7079n723j31676k5742
7510a62272J08025j6687o0085K6352R810M1602L9526j9206k568k2351m5192o817
7498a09863J9565K8509k071j572j5099K095k4114M1190j639o741r049M5498k3639
7485e6930l4311K0267R309k0006q3039m490P5354k87j326P2051J6851K9968j5122
7472H289l6358p7558L1591J5795j9178l3609j4476K1206R2137j7433n6926K7138
7460e9382L1183m5705k7930M261N3693Q624L2662L7841k8217L5425n2167l0891
7448d0603m272n4888J18628P3161o1894n2040o219L4666k2837J168J494n4512
$$ plain form
7436 -68148 8165 -36508 -95599 -70248 -39360 -70731 -69067 -70020 -63907 -48348 -36420 -63934 -125748
7423 -125748 -87802 -32830 -6721 -20487 -47083 -85164 -49012 -26566 4441 1364 2773 -40611
7411 -40611 -7906 -21234 -40096 -49176 -71341 -34487 10012 27296 3624 -50876 -86259 -88976
7399 -88976 -32416 -48132 -34941 -32986 -39345 19156 29912 -44028 -31941 -82455 -98567 -49378
7387 -49378 -33996 -62567 -41943 -33177 -30543 9242 6837 -63463 -48638 -14732 9856 16906 45890
7374 45890 -1595 -55183 -39259 -90940 -44620 18995 22916 -66914 -68097 -47727 -81264 -87748
7362 -87748 -54831 -96055 -53692 -59567 -36357 12742 -44733 -70624 -38959 12132 68949 27754
7350 27754 -26432 -50443 -41069 -52373 -48101 -136509 -106329 -50292 -64139 -67820 -44207 -55051
$$ packed form
7436f8148P6313m4673n9091K5351L0888l1371J664r53O113J5559J1928k7514o1814
7423a25748L7946N4972K6109j3766k6596l8081L6152K2446L1007l077J409m3384
7411d0611L2705j3328j8862r080k2165L6854M4499J7284k3672n4500l5383k717
7399h8976N6560j5716J3191J955o359N8501J0756p3940J2087n0514j6112M9189
7387d9378J5382k8571K0624Q766K634L9785k405p0300J4825L3906K4588P050K8984
7374D5890m7485n3588J5924n1681M6320O3615L921q9830j183K0370l3537o484
7362h7748L2917m1224M2363n875K3210M9099n7475k5891L1665N1091N6817m1195
7350B7754n4186k4011R374j1304M272q8408L0180N6037j3847l681K3613j0844
$$ plain form
7338 -55051 -30501 -2533 65893 91219 32862 -10769 -69864 -21310 1761 23107 8815 15474
7326 15474 46895 7535 -73569 -16290 31969 7290 -9169 -59353 -71839 -70392 -7879 25292
7314 25292 13304 -12977 -23501 -8466 47346 142663 156802 139036 217991 359552 474387
7303 474387 585866 669030 642404 548757 458740 423482 488014 446306 356002 224462 131482
7292 131482 70323 46601 2735 7718 93756 113401 39347 4289 -15356 -38952 -50123 -1179
7280 -1179 -20185 -11743 12926 -40987 -2926 31126 26187 21977 20947 13372 -68283 -52212 2015
7267 2015 -5372 -44055 -69631 -10142 -21457 15991 34028 51433 4337 -71029 -50580 -55434
7255 -55434 -55301 -45712 -41595 -5722 -33818 -32371 -2885 -19266 -77684 -71978 722 2802 19478
$$ packed form
7338e5051K4550K7968O8426K5326n8357m3631n9095M8554K3071K1346j4292O659
7326A5474L1421l9360q1104N7279M8259k4679j6459n0184j2486J447O2513L3171
7314B5292j1988k6281j0524J5035N5812R5317J4139j7766P8955J41561J14835
7303D74387J11479Q3164k6626r3647r0017l5258O4532m1708r0304j31540r2980
7292A31482o1159k3722m3866M983Q6038J9645p4054l5058j9645k3596j1171M8944
7280a179j9006Q442K4669n3913L8061L4052m939m210j030p575q1655J6071N4227
7267B015p387l8683k5576N9489j1315L7448J8037J7405m7096p5366K0449m854
7255e5434J33R589M117L5873k8096J447K9486j6381n8418N706P2700K080J6676
$$ plain form
7242 19478 -13119 -17279 -21901 -31310 -8261 -19801 -33240 13890 -19195 -32391 55425 52664 -44309
7229 -44309 -45798 -2684 -37845 31840 23869 -13520 -11382 -49391 -44889 -32596 22040 -32999 -12422
7216 -12422 9933 -20752 -5257 -154764 -150379 -52265 100 -8850 -17041 -16620 16701 47106 -41873
7203 -41873 -46583 -10520 12784 -9575 -14840 5496 -6824 -34941 -13516 -8996 -31833 27953
7191 27953 -1462 -9545 -23710 4744 20271 20941 58213 -1083 -23645 4697 -16507 -17520 -48252
7178 -48252 -8471 -22743 -100886 -76560 -108220 -39332 -12238 -17645 -48350 6088 7361 -79607
7166 -79607 -70319 -54392 -78014 -79039 -28294 -16600 -32817 -35746 -33242 -11731 -29590 -41397 1943
7153 1943 -26174 -81322 -54426 -20545 -19316 -29307 -60394 -71648 -73049 -20869 3985 5155 -13097
$$ packed form
7242A9478l2597m160m622r409K3049j1540j3439M7130l3085j3196Q7816k761r6973
7229d4309j489M3114l5161O9685p971l7389K138l8009M502J2293N4636n5039K0577
7216a2422K2355l0685J5495j49507M385R8114N2365q950q191M21L3321L0405q8979
7203d1873m710L6063K3304k2359n265K0336j2320k8117K1425M520k2837N9786
7191B7953k9415q083j4165K8454J5527O70L7272n9296k2562K8342k1204j013l0732
7178d8252L9781j4272p8143K4326l1660O8888K7094n407l0705N4438J273q6968
7166g9607R288J5927k3622j025N0745J1694j6217k929K504K1511j7859j1807M3340
7153A943k8117n5148K6896L3881J229r991l1087j1254j401N2180K4854J170j8252
$$ plain form
7140 -13097 12781 39695 65894 74034 51482 31901 53743 -3761 -49028 -53910 4568 -81433
7128 -81433 -76976 -88294 -106654 -30367 32209 15585 25146 -18915 -35866 -37836 -38360 7938 25906
7115 25906 73737 11618 -6443 36671 21558 -6589 -3700 -24625 -60951 36306 55721 18568
7103 18568 -1598 -49892 -67283 -53825 -61763 -37583 2409 -55576 -36219 -8058 96737 77699
7091 77699 27341 -31215 29700 246 16681 -58061 -78851 -130525 -78320 -86093 -95595 14601
7079 14601 16182 -41369 -5054 -47945 -80038 9847 201 -48565 14307 114889 83579 10340
7067 10340 3415 -31042 37710 119169 36026 -15146 -39430 -14773 -27683 55118 85910 108541
7055 108541 52683 -10471 -23469 -39998 -3320 7949 -14013 -2523 -47123 -8740 -39824 -42744
$$ packed form
7140a3097K5878K6914K6199Q140k2552j9581K1842n7504m5267m882N8478q6001
7128h1433M457j1318j8360P6287O2576j6624R561m4061j6951j970n24M6298J7968
7115B5906M7831o2119j8061M3114j5113k8147K889k0925l6326R7257J9415l7153
7103A8568k0166m8294j7391J3458p938K4180L9992n7985J9357K8161J04795j9038
7091G7699n0358n8556O0915k9454J6435p4742k0790n1674N2205p773r502J10196
7079A4601J581n7551L6315m2891l2093Q9885r646m8766O2872J00582l1310p3239
7067A0340o925l4457O8752Q1459q3143n1172k4284K4657j2910Q2801L0792K2631
7055A08541n5858o3154j2998j6529L6678J1269k1962J1490m4600L8383l1084k920
$$ plain form
7043 -42744 14840 36950 63892 -10687 60466 98154 88530 5104 -21809 14832 24483 20176
7031 20176 62109 20325 9181 -15650 48649 105386 -17259 -49693 -103034 8491 56781
7020 56781 64198 72429 68827 73313 64071 -83805 -124290 -56765 11794 50722 44454 30168 37687
7007 37687 39954 -17830 -11839 -8800 -65775 -24940 -20337 -32709 -19938 -84042 -46990 2588 -71460
6994 -71460 -54068 -45956 -73377 -49604 -33318 -14483 -32957 -82046 -89317 -18779 -6613 -61495
6982 -61495 -3440 46931 315 29619 22701 24334 -22001 -14560 -25055 -28324 27143 58584 77863
6969 77863 29708 61225 5014 27463 9898 31734 44575 -3279 -42183 -58527 -63031 -42213
6957 -42213 -76108 -78431 -71251 -27606 -43680 -75146 -74584 -7120 85364 60322 29574 41319 31298
$$ packed form
7043d2744N7584K2110K6942p4579P1153L7688r624q3426k6913L6641R651m307
7031B0176M1933m1784j1144k4831O4299N6737j22645l2434n3341J11525M8290
7020E6781P417Q231l602M486r242j47876m0485O7525O8559L8928o268j4286P519
7007C7687K267n7784N991L039n6975M0835M603j2372J2771o4104L7052M9578p4048
6994g1460J7392Q112k7421K3773J6286J8835j8474m9089p271P0538J2166n4882
6982f1495N8055N0371m6616K9304o918J633m6335P441j0495l269N5467L1441J9279
6969G7863m8155L1517n6211K2449j7565K1836J2841m7854l8904j6344m504K0818
6957d2213l3895k323P180M3645j6074l1466N62O7464R2484k5042l0748J1745j0021
$$ plain form
6944 31298 16364 61109 43550 64386 22385 10050 -3552 64533 20492 -15096 58388 96306
6932 96306 81096 39196 5395 -32022 38715 15009 29045 8533 -54241 -36436 -94265 -69007
6920 -69007 -21516 -21419 -51072 -3224 4786 3954 43378 48570 5728 28085 -203 -66371 -53469
6907 -53469 21950 19457 12685 11134 17180 -21043 8519 39305 8036 -38444 -102719 -119974 41023
6894 41023 50272 -66584 -16561 13274 -23156 12605 41056 -3945 17483 -1852 23151 -14958
6882 -14958 -20943 -8035 -44420 913 30291 13374 48854 -43003 -76686 -32125 -55305 -65922
6870 -65922 -13199 -43337 50997 42328 -33648 29698 3342 -33988 -25567 -29655 -31025 -33216 -12623
6857 -12623 681 -50306 -16923 -32578 -34313 -49998 -82190 -71667 -66510 -63942 -49242 -52586 -51825
$$ packed form
6944C1298j4934M4745j7559K0836m2001j2335j3602O8085m4041l5588P3484L7918
6932I6306j5210m1900l3801l7417P0737k3706J4036k0512o2774J7805n7829K5258
6920f9007M7491R7k9653M7848Q010q32L9424N192m2842K2357k8288o6168J2902
6907e3469P5419k493o772j551O046l8223K9562L0786l1269m6480o4275j7255J60997
6894D1023R249j16856N0023K9835l6430L5761K8451m5001K1428j9335K5003l8109
6882a4958n985J2908l6385M5333K9378j6917L5480r1857l3683M4561k3180j0617
6870f5922N2723l0138R4334q669p5976O3346k6356l7330Q421m088j370k191K0593
6857a2623J3304n0987L3383j5655j735j5685l2192J0523N157K568J4700l344P61
$$ plain form
6844 -51825 11050 -12643 -40247 -31127 -48373 18427 -5840 7168 18551 -13888 -44855 47182
6832 47182 27099 5330 36450 46484 -14948 -37435 -36816 -24886 802 -31463 16408 49381
6820 49381 88998 116088 18020 -4319 21965 -42127 -26245 -57177 -31020 2906 71247 77607
6808 77607 26550 1891 14917 -23948 -115778 -123097 -20096 37105 4640 -14942 -9497 -4496
6796 -4496 54613 50535 32489 43792 59291 48301 42361 -24649 -25609 60074 13144 4804 -2687
6783 -2687 30691 115069 103704 96049 67479 64425 53679 48615 85601 135333 102636 58663 108470
6770 108470 85685 39646 117236 102304 19697 46121 73773 85388 -5613 -9694 24062 47320
6758 47320 14738 -25357 -4451 42438 41360 -16533 -4683 -43818 19694 36031 57727 -22796
$$ packed form
6844e1825O2875k3693k7604R120j7246O6800k4267J3008J1383l2439l0967R2037
6832D7182k0083k1769L1120J0034o1432k2487O19J1930K5688l2265M7871L2973
6820D9381L9617K7090r8068k2339K6284o4092J5882l0932K6157L3926O8341O360
6808G7607n1057k4659J3026l8865r1830p319J03001N7201l2465j9582N445N001
6796d496N9109m078j8046J1303J5499j0990n940o7010r60Q5683m6930q340p491
6783b687L3378Q4378j1365p655k8570l054j0746n064L6986M9732l2697m3973M9807
6770A08470k2785m6039P7590j4932q2607K6424K7652J1615r1001m081L3756K3258
6758D7320l2582m0095K0906M6889j078n7893J1850l9135O3512J6337K1696q0523
$$ plain form
6746 -22796 18536 26979 -44388 -42413 33094 49171 26634 48321 75052 46805 19139 39620
6734 39620 57839 90667 67065 4164 2636 24760 44155 19221 38435 88667 15880 -40936
6722 -40936 -2513 50201 27698 28828 -5610 25383 50753 47679 69596 51018 28518 60540
6710 60540 197 12772 9478 6511 15881 2919 -29128 -179 -14884 10345 -25989 -4809
6698 -4809 -29833 -31660 48429 44318 13428 17581 8393 -51693 -26058 10852 24489 109960 42574
6685 42574 3599 44963 36355 86147 26338 2252 62042 76906 11141 14551 25548 -55013
6673 -55013 -77805 47945 106018 26863 16388 23606 31465 9069 6035 27475 42148 28589
6661 28589 -40822 -94894 -53134 15581 -19067 -49233 -40422 48669 72162 36949 72993 34901
$$ packed form
6746b2796M1332Q443p1367J975P5507J6077k2537K1687K6731k8247k7666K0481
6734C9620J8219L2828k3602o2901j528K2124J9395k4934J9214N0232p2787n6816
6722d0936L8423N2714k2503J130l4438L0993K5370l074K1917j8578k2500L2022
6710F0540o0343J2575l294k967R370j2962l2047K8949j4705K5229l6334K1180
6698d809k5024j827Q0089m111l0890M153r188o0086K5635L6910J3637Q5471o7386
6685D2574l8975M1364q608M9792n9809k4086N9790J4864o5765L410J0997q0561
6673e5013k2792J25750N8073p9155j0475P218P859k2396l034K1440J4673j3559
6661B8589o9411n4072M1760O8715l4648l0166Q811Q9091K3493l5213L6044l8092
$$ plain form
6649 34901 49768 9330 412 18855 18878 -7654 13072 -17325 -31987 28367 -79311 -6905
6637 -6905 13525 48253 106921 64078 12354 27721 54842 57633 160189 135083 48180 19181
6625 19181 36421 24943 51010 60541 92949 83735 14008 17826 56761 102862 89100 126549
6613 126549 116024 110951 19836 6153 17673 3242 10977 11670 13719 8724 24443 -9641 -29475
6600 -29475 4302 -41713 -12555 -8497 32186 44856 24536 47996 15004 41172 -13013 35426
6588 35426 106029 52466 -2753 3438 42254 55904 58504 68828 28832 82617 196360 135528
6576 135528 147417 57620 21358 25620 -2739 -8212 43834 39261 16615 4735 16133 28292
6564 28292 -6460 -29574 49779 98850 72103 -19848 -26661 181 -50451 -31831 -85981 -24933
$$ packed form
6649C4901J4867m0438q918J8443K3k6532K0726l0397j4662O0354j07678P2406
6637f905K0430L4728N8668m2843n1724J5367K7121K791J02556k5106q6903k8999
6625A9181J7240j1478K6067R531L2408r214o9727L818L8935M6101j3762L7449
6613A26549j0525n073r1115j3683J1520j4431P735O93K049m995J5719l4084j9834
6600b9475L3777m6015K9158M058M0683J2670k0320K3460l2992K6168n4185M8439
6588C5426P0603n3563n5219O191L8816J3650K600J0324l9996N3785J13743o0832
6576A35528J1889q9797l6262M262k8359n473N2046m573k2646j1880J1398J2159
6564B8292l4752k3114P9353M9071k6747r1951o813K6842n0632J8620n4150O1048
$$ plain form
6552 -24933 -10287 39278 -13066 -25940 -33892 -7199 -16329 -61735 -32353 -4980 13798 2748
6540 2748 -7817 -50771 5851 41215 39566 12788 6525 25912 27667 59645 64265 58212 72320
6527 72320 20412 49598 27075 34634 72021 -22505 -10071 54033 70829 59212 74437 72032
6515 72032 54430 58149 84353 78263 64889 131556 165646 111689 115878 85316 11291 27122
6503 27122 39656 86345 143721 87811 104638 117694 70636 -5372 40552 100907 104972 81051
6491 81051 158333 132999 65132 110720 99993 106237 59910 30373 51990 63407 42561 46031
6479 46031 12946 -41370 -19756 2005 -499 -6822 45483 43309 32060 102977 101103 117500 119528
6466 119528 61357 146335 145619 111725 68106 93407 120736 76199 87630 8588 59543 95198
$$ packed form
6552b4933J4646M9565n2344j2874p952K6693r130m5406K9382K7373J8778j1050
6540B748j0565m2954N6622L5364j649k6778o263J9387J755L1978M620o053J4108
6527G2320n1908K9186k2523P559L7387r4526J2434O4104J6796j1617J5225k405
6515G2032j7602L719K6204o090j3374O6667L4090n3957M189l0562p4025J5831
6503B7122J2534M6689N7376n5910J6827J3056m7058p6008M5924O0355M065k3921
6491H1051P7282k5334o7867M5588j0727O244m6327k9537K1617J1417k0846L470
6479D6031l3085n4316K1614K1761k504o323N2305k174j1249P0917j874J6397K028
6466A19528n8171Q4978p16l3894m3619K5301K7329m4537J1431p9042N0955L5655
$$ plain form
6454 95198 120148 90298 103137 93665 65343 85932 72447 31958 65829 91046 61205 127674
6442 127674 105199 89819 102528 81076 83376 98473 58314 66334 31787 7269 72020 68949
6430 68949 52718 54328 123617 116089 62771 57464 52879 76487 69629 131000 139347 66316 70461
6417 70461 129523 67303 8626 -44123 6038 25076 8865 36948 97547 141425 60501 64687
6405 64687 86870 106871 33227 95736 130613 143301 112300 76742 14948 50849 81767 64561
6393 64561 54590 21520 31895 49095 16499 127344 159508 77779 84630 80035 98756 49741
6381 49741 125493 86020 30459 37795 115602 121175 110573 91335 53643 8919 -43784 -14752
6369 -14752 -11791 -26092 -11906 7789 16667 16248 67640 71562 73472 79712 73343 98064 157792
$$ packed form
6454I5198K4950k9850J2839r472k8322K0589j3485m0489L3871K5217k9841O6469
6442A27674k2475j5380J2709k1452K300J5097m0159Q020l4547k4518O4751l071
6430F8949j6231J610O9289p528n3318n307m585K3608o858O1371Q347p3031M145
6417G0461N9062o2220n8677n2749N0161J9038j6211K8083O0599M3878q0924M186
6405F4687K2183K0001p3644O2509L4877J2688l1001l5558o1794L5901L0918j7206
6393F4561r971l3070J0375J7200l2596J10845L2164q1729O851m595J8721m9015
6381D9741P5752l9473n5561P336P7807N573j0602j9238l7692m4724n2703K9032
6369a4752K961j4301J4186J9695Q878m19N1392L922J910O240o369K4721N9728
$$ plain form
6356 157792 170187 139288 140479 90160 122143 102499 115450 67258 130467 139900 57044 5205
6344 5205 7785 84147 49084 132157 141008 116106 103387 108859 149003 142743 218653 185417 172122
6331 172122 150258 168459 177226 215179 213272 159907 164839 111374 103930 99867 100406 80011 111311
6318 111311 139618 256389 255329 196961 184025 180629 266229 267267 265588 350691 347829 353095 334241
6305 334241 328146 338602 322092 348632 322735 315323 317124 352230 374157 327902 251630 249888
6293 249888 203263 159944 145338 112364 178704 199725 263084 248515 270828 268283 283339 340745
6281 340745 391204 406925 385434 457344 469687 468588 509762 549378 599782 600316 571447 554244
6269 554244 487756 385885 363454 411280 313061 285268 298575 292165 296768 268998 228095 171747
$$ packed form
6356A57792J2395l0899J191n0319L1983j9644J2951m8192O3209R433q2856n1839
6344E205K580P6362l5063Q3073Q851k4902j2719N472M0144o260P5910l3236j3295
6331A72122k1864J8201Q767L7953j907n3365M932n3465p444m063N39k0395L1300
6318A11311K8307J16771j060n8368j2936l396Q5600J038j679Q5103k862N266j8854
6305C34241o095J0456j6510K6540k5897p412J801L5106K1927m6255p6272j742
6293B49888m6625m3319j4606l2974O6340K1021O3359j4569K2313k545J5056N7406
6281C40745N0459J5721k1491P1910J2343j099M1174L9616N0404N34k8869j7203
6269E54244o6488j01871k2431M7826r8219k7793J3307o410M603k7770m0903n6348
$$ plain form
6257 171747 207104 203481 213704 251072 280081 224640 160590 159741 162540 243385 320140 416866
6245 416866 448799 477184 495689 555840 520473 514192 476516 522783 464176 465198 458113 336765
6233 336765 338266 315624 272248 281978 303424 286910 377183 360019 307930 295831 278486 306392
6221 306392 320163 245113 214612 267771 359126 320805 301308 350562 335307 294528 373050 410439
6209 410439 364117 290850 347967 388890 398494 384235 381924 280775 280263 313172 276815 324332
6197 324332 296358 298812 367694 374674 313879 410417 479804 470882 543981 544849 614818 781043
6185 781043 906416 1002294 1118177 1369906 1631919 1858562 2077933 2181498 2172362 2062642
6175 2062642 1896184 1752460 1577526 1483654 1287685 1079415 958010 825772 732232 681020
$$ packed form
6257A71747L5357l623J0223L7368K9009n5441o4050q49K799Q0845P6755R6726
6245D16866L1933K8385J8505O0151l5367o281l7676M6267n8607J022p085j21348
6233C36765J501k2642m3376R730K1446j6514R0273j7164n2089j2099j7345K7906
6221C06392J3771p5050l0501N3159R1355l8321j9497M9254j5255m0779P8522L7389
6209D10439m6322p3267N7117M0923R604j4259k311j01149n12L2909l6357M7517
6197C24332k7974K454O8882O980o0795R6538O9387q922P3099Q68O9969J66225
6185G81043J25373R5878J15883K51729K62013K26643K19371J03565r136j09720
6175B062642j66458j43724j74934r3872j95969k08270j21405j32238r3540n1212
$$ plain form
6165 681020 612873 559948 537481 617515 582149 552477 585506 519853 467899 456958 544525 552205
6153 552205 542503 499846 529346 508034 513278 558571 496698 442601 435471 433834 382669 381123 350769
6140 350769 362267 392098 456035 484896 434709 426488 432663 463984 433766 460599 467724 480967
6128 480967 491101 432700 401346 402286 344646 348070 361417 298630 332212 332032 352369 341112 307787
6115 307787 302640 279172 337487 469889 469263 413839 443014 473723 482584 517217 513999 461356
6103 461356 476816 505136 527456 566577 507469 517737 550567 564822 543868 482916 468892 486138
6091 486138 491767 473916 449827 437250 466766 479987 468556 492967 467385 434827 362543 384391
6079 384391 361289 357783 414588 478308 445003 401791 423092 450380 487022 526409 552881 578035
$$ packed form
6165F81020o8147n2925k2467Q0034l5366k9672L3029o5653n1954j0941Q7567P680
6153E52205r702m2657K9500k1312N244M5293o1873n4097p130j637n1165j546l0354
6140C50769J1498K9831O3937K8861n0187q221O175L1321l0218K6833P125J3243
6128D80967J0134n8401l1354R40n7640L424J3347o2787L3582j80K0337j1257l3325
6115C07787n147k3468N8315J32402o26n5424K9175L0709Q861L4633l218n2643
6103D61356J5460K8320K2320L9121n9108J0268L2830J4255k0954o0952j4024J7246
6091D86138N629j7851k4089j2577K9516J3221j1431K4411k5582l2558p2284K1848
6079C84391k3102l506N6805O3720l3305m3212K1301K7288L6642L9387K6472K5154
$$ plain form
6067 578035 619294 615852 577103 566012 587039 591518 605229 684452 672023 615294 679789 725662
6055 725662 691046 629887 674533 666794 706050 712394 730729 798549 763921 776985 872063 868077
6043 868077 864074 899957 830742 816744 854841 842748 836445 749760 727069 659573 656873 733935
6031 733935 648124 566717 590656 641271 632405 612589 625576 651418 652623 696065 706735 743115
6019 743115 767515 834710 903571 907441 993207 1042684 1048980 1136293 1223160 1237265 1259513 1313003
6007 1313003 1378336 1402765 1367955 1336721 1306510 1219056 1178548 1230390 1341698 1439038 1543803
5996 1543803 1636981 1701017 1754146 1875575 1983194 1966567 1985869 2021763 2020375 1980131 1899331
5985 1899331 1896661 1814701 1743513 1661818 1657321 1581249 1549031 1470285 1415405 1415147 1434233 1435407
$$ packed form
6067E78035M1259l442l8749j1091K1027M479J3711P9223j2429n6729O4495M5873
6055G25662l4616o1159M4646p739L9256O344J8335O7820l4628J3064R5078l986
6043H68077m003L5883o9215j3998L8097j2093o303q6685k2691o7496k700P7062
6031G33935q5811q1407K3939N0615q866j9816J2987K5842J205M3442J0670L6380
6019G43115K4400O7195O8861L870Q5766M9477O296Q7313Q6867J4105K2248N3490
6007A313003O5333K4429l4810l1234l0211q7454m0508N1842J11308R7340J04765
5996A543803R3178O4036N3129J21429J07619j6627J9302L5894j388m0244q0800
5985A899331k670q1960p1188q1695m497p6072l2218p8746n4880k58J9086J174
$$ plain form
5973 1435407 1367376 1397772 1473947 1540990 1734049 1724718 1691599 1774466 1893282 1922389 1950567
5962 1950567 2009291 1989240 2011467 1977204 1860415 1751241 1772388 1767118 1758057 1830983 1874830
5951 1874830 1980694 1996896 2016256 2020222 2014331 2079840 2006020 1995650 1943668 1932229 1938051 1948788
5939 1948788 1965572 1974822 2045379 2156849 2261424 2220412 2263687 2404294 2369436 2470654 2560407
5928 2560407 2585843 2559962 2641683 2698596 2731355 2757412 2930802 2999483 3092842 3331814 3398001
5917 3398001 3526956 3653139 3692344 3747003 3850680 3968168 3991396 4039932 4140594 4278719
5907 4278719 4442551 4660224 4866923 4989983 5104666 5190622 5280086 5429127 5602260 5809858
5897 5809858 5973384 6076776 6258678 6358444 6542326 6842458 7044321 7298281 7658580 8005680
$$ packed form
5973A435407o8031L0396P6175O7043J93059r331l3119Q2867J18816K9107K8178
5962A950567N8724k0051K2227l4263j16789j09174K1147n270r061P2926M3847
5951A874830J05864J6202J9360L966n891O5509p3820j0370n1982j1439N822J0737
5939A948788J6784R250P0557J11470J04575m1012M3275J40607l4858J01218Q9753
5928B560407K5436k5881Q1721N6913L2759K6057J73390O8681R3359K38972O6187
5917C398001J28955J26183L9205N4659J03677J17488K3228M8536J00662J38125
5907D278719J63832K17673K06699J23060J14683Q5956Q9464J49041J73133K07598
5897E809858J63526J03392J81902R9766J83882L00132K01863K53960L60299L47100
$$ plain form
5887 8005680 8258481 8544633 8829122 9032258 9197503 9372941 9524949 9785573 10095364 10566976
5877 10566976 11255430 12021591 12864654 13881941 15010046 16194951 17374804 18687638 19934821
5868 19934821 21080572 22303082 23665386 25139438 26768860 28523282 30481490 32670711
5860 32670711 35211770 38218719 42105044 46778698 52872392 60610710 70774114 84197614
5852 84197614 102122415 126500270 160018042 204354601 255810397 300765138 329752721
5845 329752721 341110074 337507085 323978397 301571572 275321312 248278490 220462651
5838 220462651 188355140 153457217 123190250 101142963 85326387 73376531 64081569
5831 64081569 56392465 49832912 44332888 39903770 36317001 33201829 30263120 27603138
$$ packed form
5887H005680K52801K86152K84489K03136J65245J75438J52008K60624L09791M71612
5877A0566976O88454P66161Q43063J017287J128105J184905J179853J312834J247183
5868A9934821J145751J222510J362304J474052J629422J754422J958208K189221
5860C2670711K541059L006949L886325M673654O093694P738318J0163404J3423500
5852H4197614J7924801K4377855L3517772M4336559N1455796M4954741K8987583
5845C29752721J1357353l602989j3528688k2406825k6250260k7042822k7815839
5838B20462651l2107511l4897923l0266967k2047287j5816576j1949856r294962
5831F4081569p689104o559553n500024m429118l586769l115172k938709k659982
$$ plain form
5823 27603138 25322828 23467037 22031082 20827422 19809871 18934322 18244236 17738303 17363142
5814 17363142 17054946 16699358 16410464 16024504 15502918 14991878 14318983 13759263 13219420
5805 13219420 12640161 12136347 11670251 11150947 10741432 10448970 10287139 9996660 9613829
5796 9613829 9406531 9213944 8911980 8790378 8654383 8395785 8092898 7794886 7607208 7449816
5786 7449816 7344198 7166921 7042345 6870805 6749018 6736639 6676640 6554242 6429281 6228509
5776 6228509 6107377 6095566 6043913 5985762 5967172 5987736 6010111 6003744 5974773 5966983 5976895 5937498
5764 5937498 5890893 5909284 5966519 5951676 5951058 5977942 6173772 6489740 6942211 7551300 8440458
5753 8440458 9794752 11670575 14175359 16673118 18204191 18898186 18694856 17991820 16856275
$$ packed form
5823B7603138k280310j855791j435955j203660j017551q75549o90086n05933l75161
5814A7363142l08196l55588k88894l85960n21586n11040o72895n59720n39843
5805A3219420n79259n03814m66096n19304m09515k92462j61831k90479l82831
5796I613829k07298j92587l01964j21602j35995k58598l02887k98012j87678j57392
5786G449816j05618j77277j24576j71540j21787j2379n9999j22398j24961k00772
5776F228509j21132j1811n1653n8151j8590K0564K2375o367k8971p790R912l9397
5764E937498m6605J8391N7235j4843o18K6884J95830L15968M52471O09089Q89158
5753H440458J354294J875823K504784K497759J531073O93995k03330p03036j135545
$$ plain form
5744 16856275 15525420 14192601 12848731 11344218 9435452 7778767 6797608 6110328
5736 6110328 5650067 5258607 4926535 4576779 4239175 4010285 3798702 3563095 3349469 3198578
5726 3198578 3080402 2907375 2773946 2686109 2595334 2612216 2628766 2639327 2648125 2657710 2713399
5715 2713399 2690720 2668338 2672945 2587969 2558102 2457086 2325741 2220589 2139791 2044235 1901959
5704 1901959 1822866 1749991 1682903 1542135 1506470 1434319 1389580 1397549 1489574 1555100 1664367
5693 1664367 1792832 1840523 1994533 1992588 2067439 2093492 2155597 2164488 2149663 2256766 2349469
5682 2349469 2449865 2562017 2609322 2781653 3066462 3519631 4016115 4656238 5555814 6792826
5672 6792826 8564115 10605135 12647688 14050945 14691912 14637471 14125616 13327476 12367259
$$ packed form
5744A6856275j330855j332819j343870j504513j908766j656685r81159o87280
5736F110328m60261l91460l32072l49756l37604k28890k11583k35607k13626j50891
5726C198578j18176j73027j33429q7837r0775J6882J6550J0561Q798R585N5689
5715B713399k2679k2382M607q4976k9867j01016j31345j05152q0798r5556j42276
5704A901959p9093p2875o7088j40768l5665p2151m4739P969R2025O5526J09267
5693A664367J28465M7691J54010j945P4851K6053O2105Q891j4825J07103R2703
5682B349469J00396J12152M7305J72331K84809M53169M96484O40123Q99576J237012
5672F792826J771289K041020K042553J403257O40967n4441n11855p98140r60217
$$ plain form
5663 12367259 11273285 10106451 8869614 7390497 6065696 5054755 4451634 3920982
5655 3920982 3458898 3147758 2798920 2542021 2302708 2132647 1948271 1792165 1664531 1537268
5645 1537268 1495551 1437235 1411753 1364658 1325797 1257865 1223420 1239460 1246684 1214624 1256255 1245534
5633 1245534 1181409 1174664 1070422 1007820 1037356 980072 919591 911850 861133 855794 760253 771681
5621 771681 777045 810817 851565 856061 857587 903155 887605 828610 787170 721970 754767 745393
5609 745393 791437 718981 659241 700468 679954 737467 677566 639798 615550 563666 579326 611188
5597 611188 603414 524265 521969 559115 564079 504187 463866 434054 438698 404000 412561 394518 435839
5584 435839 366041 382082 458796 435774 394154 451725 427496 460801 486310 457998 456532 542072
$$ packed form
5663A2367259j093974j166834j236837j479117j324801j010941o03121n30652
5655C920982m62084l11140l48838k56899k39313j70061j84376j56106j27634j27263
5645A537268m1717n8316k5482m7095l8861o7932l4445J6040P224l2060M1631j0721
5633A245534o4125o745j04242o2602K9536n7284o0481p741n0717n339r5541J1428
5621G71681N364L3772M0748M496J526M5568j5550n8995m1440o5200L2797r374
5609G45393M6044p2456n9740M1227k0514N7513n9901l7768k4248n1884J5660L1862
5597F11188p774p9149k296L7146M964n9892m0321k9812M644l4698Q561j8043M1321
5584D35839o9798J6041P6714k3022m1620N7571k4229L3305K5509k8312j466Q5540
$$ plain form
5572 542072 556486 544026 621069 644193 556709 506026 505942 525457 525893 481935 402240 355449 333381
5559 333381 333235 381608 313336 312441 276586 284143 306629 330954 273035 226977 223948 246852 298675
5546 298675 301408 276550 323863 260464 256622 239857 193675 191190 168894 257496 196964 197621 249925
5533 249925 258006 362504 399804 308744 329772 414473 464651 410270 372546 437489 460558 471569
5521 471569 521565 588866 617313 626857 725792 820233 830827 971254 1098210 1305428 1557172
5510 1557172 1771688 1989512 2086760 2036081 1973558 1883456 1721627 1604980 1482439 1332781
5500 1332781 1136928 956182 855804 830062 766475 722429 679779 639806 652432 598945 553105
5489 553105 544832 560766 520350 445758 354913 414588 393721 453125 492760 462306 390517 359676
$$ packed form
5572E42072J4414j2460P7043K3124q7484n0683q4J9515M36m3958p9695m6791k2068
5559C33381j46M8373o8272q95l5855P557K2486K4325n7919m6058l029K2904N1823
5546B98675K733k4858M7313o3399l842j6765m6182k485k2296Q8602o0532O57N2304
5533B49925Q081J04498L7300r1060K1028Q4701N0178n4381l7724O4943K3069J1011
5521D71569M9996O7301K8447R544R8935R4441J0594J40427J26956K07218K51744
5510A557172K14516K17824R7248n0679o2523r0102j61829j16647j22541j49658
5500A332781j95853j80746j00378k5742o3587m4046m2650l9973J2626n3487m5840
5489E53105q273J5934m0416p4592r0845N9675k0867N9404L9635l0454p1789l0841
$$ plain form
5477 359676 361265 366715 361759 357392 286593 299144 297441 235030 249307 257030 246613 243581 286432
5464 286432 297392 286262 347332 374114 343942 328969 302166 280796 353404 369874 364259 370851
5452 370851 341605 353354 331309 322637 309716 351494 322767 350829 322626 310542 367768 410729
5440 410729 410878 406371 383696 303187 334974 343128 337497 389295 330356 356867 397926 406160 412511
5427 412511 400131 361152 350553 326016 319147 364036 367538 353526 324838 341315 360952 418108
5415 418108 386150 323722 343353 374412 345177 335942 258351 226849 208372 203191 280814 314974
5403 314974 303194 356393 359065 295391 362823 346422 356140 416131 414423 386331 396255 381313
5391 381313 345461 421019 432252 349109 260417 262669 279136 283467 326777 363966 428383 402433
$$ packed form
5477C59676J589N450m956m367p0799J2551j703o2411J4277P723j0417l032M2851
5464B86432J0960j1130O1070K6782l0172j4973k6803k1370P2608J6470n615O592
5452C70851k9246J1749k2045q672j2921M1778k8727K8062k8203j2084N7226M2961
5440D10729J49m507k2675q0509L1787Q154n631N1798n8939K6511M1059Q234O351
5427D12511j2380l8979j0599k4537o869M4889L502j4012k8688J6477J9637N7156
5415D18108l1958o2428J9631L1059k9235r235p7591l1502j8477n181P7623L4160
5403C14974j1780N3199K672o3674O7432j6401R718N9991j708k8092R924j4942
5391C81313l5852P5558J1233q3143q8692K252J6467M331M3310L7189O4417k5950
$$ plain form
5379 402433 345075 332179 380659 384503 411173 383186 387327 404877 465114 417828 436376 445900
5367 445900 455757 464149 502596 444211 364159 439047 530009 527456 455598 421520 478683 469828
5355 469828 416952 399585 387766 398832 454972 460416 419672 431944 406125 501549 504870 424559
5343 424559 457055 486278 494405 498221 431326 410971 421838 405039 363648 398743 477401 448600
5331 448600 468256 537107 570694 540558 512980 507274 435656 535663 573610 518657 576408 564205
5319 564205 547796 576166 640156 569341 555233 607437 636876 659445 602371 606413 633195 620141
5307 620141 615750 603939 686380 699010 650810 624052 667333 697967 698129 659546 586728 656134
5295 656134 638265 624406 591550 650124 630820 567733 536704 526809 578832 622704 598571 547051
$$ packed form
5379D02433n7358j2896M8480L844K6670k7987M141J7550O0237m7286J8548R524
5367D45900R857Q392L8447n8385q0052P4888R0962k553p1858l4078N7163q855
5355D69828n2876j7367j1819J1066N6140N444m0744J2272k5819R5424L321q0311
5343D24559L2496K9223Q127L816o6895k0355J0867j6799m1391L5095P8658k8801
5331D48600J9656O8851L3587l0136k7578n706p1618J00007L7947n4953N7751j2203
5319E64205j6409K8370O3990p0815j4108N2204K9439K2569n7074M042K6782j3054
5307F20141m391j1811Q2441J2630m8200k6758M3281L0634J62l8583p2818O9406
5295F56134j7869j3859l2856N8574j9304o3087l1029r895N2023M3872k4133n1520
$$ plain form
5283 547051 562063 612148 656064 700434 613652 613553 624741 657754 686124 693547 752617 720807
5271 720807 715988 760368 723451 774011 772205 800667 785568 787238 777430 793570 828411 839364
5259 839364 884095 865925 848284 873119 891250 942020 941433 921089 966473 912906 918585 898821
5247 898821 909404 960938 928380 961737 907853 959893 954353 923068 928767 1006766 1098217 1065710
5235 1065710 1038905 963524 1006140 943591 1002320 1008165 1000207 1051020 1057257 1086699 1029251 1036425
5223 1036425 1009416 1030140 1052505 1120896 1174183 1196367 1233151 1276014 1292023 1339594 1389993
5212 1389993 1390034 1412600 1421701 1434632 1502575 1466029 1441934 1568334 1532868 1490680 1521139 1555793
5200 1555793 1542330 1511071 1528521 1516202 1634690 1615646 1541657 1643829 1606430 1678915 1744710
$$ packed form
5283E47051J5012N0085M3916M4370q6782r9J1188L3013K8370P423N9070l1810
5271G20807m819M4380l6917N0560j806K8462j5099J670r808J6140L4841J0953
5259H39364M4731j8170j7641K4835J8131N0770n87k0344M5384n3567N679j9764
5247H98821J0583N1534l2558L3357n3884N2040n540l1285N699P7999R1451l2507
5235A065710k6805p5381M2616o2549N8729N845p958N0813O237K9442n7448P174
5223A036425k7009K0724K2365O8391N3287K2184L6784M2863J6009M7571N0399
5212A389993M1K2566R101J2931O7943l6546k4095J26400l5466m2188L0459L4654
5200A555793j3463l1259J7450j2319J18488j9044p3989J02172l7399P2485O5795
$$ plain form
5189 1744710 1794643 1771392 1769626 1838484 1962010 1945231 1944849 1943614 2046356 2152374 2134062 2093564
5177 2093564 2189757 2261498 2328398 2457067 2446580 2465007 2538852 2580392 2648043 2727234 2749883
5166 2749883 2782819 2803825 2850924 2903628 2997379 3134415 3184160 3229617 3351334 3510633 3471690
5155 3471690 3556802 3715515 3797503 3909428 3987787 4190380 4356502 4474020 4618149 4832864
5145 4832864 5011177 5111950 5269227 5521371 5714728 5964039 6202875 6429250 6647398 6867767
5135 6867767 7101937 7342623 7659870 7920663 8259702 8591101 8931778 9298416 9741987 10162917
5125 10162917 10552892 11039663 11564535 11984839 12563072 13151055 13693743 14238545 14856974
5116 14856974 15526584 16161679 16786689 17451036 18184825 18837486 19528509 20125855 20701894
$$ packed form
5189A744710M9933k3251j766O8858J23526j6779l82j235J02742J06018j8312m0498
5177B093564R6193P1741O6900J28669j0487J8427P3845M1540O7651P9191K2649
5166B749883L2936K1006M7099N2704R3751J37036M9745M5457J21717J59299l8943
5155C471690Q5112J58713Q1988J11925P8359K02593J66122J17518J44129K14715
5145D832864J78313J00773J57277K52144J93357K49311K38836K26375K18148K20369
5135F867767K34170K40686L17247K60793L39039L31399L40677L66638M43571M20930
5125A0162917L89975M86771N24872M20304N78233N87983N42688N44802O18429
5116A4856974O69610O35095O25010O64347P33789O52661O91023N97346N76039
$$ plain form
5107 20701894 21216882 21637634 21939677 22222528 22416861 22472210 22525886 22434347 22190921 21896859
5097 21896859 21469098 20999967 20549385 19991927 19361400 18773368 18048343 17408591 16796622
5088 16796622 16104158 15417308 14754476 14180318 13566317 13031323 12544046 12026113 11565401
5079 11565401 11042405 10572531 10181616 9777305 9419119 9026277 8748077 8512352 8164222
5070 8164222 7868122 7539816 7367385 7156798 6857334 6654177 6530273 6367101 6138064 5999499
5060 5999499 5864802 5689058 5575422 5420139 5221979 5122645 5050944 4940449 4860057 4752010
5050 4752010 4620128 4513075 4513635 4418624 4316667 4184377 4110693 4043151 3963764 3904018 3862553
5039 3862553 3777932 3692934 3686025 3623205 3502961 3480445 3443468 3285090 3253948 3225466 3219678
$$ packed form
5107B0701894N14988M20752L02043K82851J94333N5349N3676r1539k43426k94062
5097B1896859m27761m69131m50582n57458o30527n88032p25025o39752o11969
5088A6796622o92464o86850o62832n74158o14001n34994m87277n17933m60712
5079A1565401n22996m69874l90915m04311l58186l92842k78200k35725l48130
5070H164222k96100l28306j72431k10587k99464k03157j23904j63172k29037j38565
5060E999499j34697j75744j13636j55283j98160r9334p1701j10495q0392j08047
5050D752010j31882j07053N60r5011j01957j32290p3684o7542p9387n9746m1465
5039C862553q4621q4998o909o2820j20244k2516l6977j58378l1142k8482n788
$$ plain form
5028 3219678 3131432 3027691 3070496 3064883 3019902 2923779 2889125 2929021 2864232 2786754 2696850
5017 2696850 2717218 2702859 2619865 2567289 2541881 2569547 2559974 2534560 2455548 2422948 2405720 2368591
5005 2368591 2379612 2388042 2387272 2405186 2361953 2371312 2389871 2369672 2350694 2478640 2574114 2545455
4993 2545455 2495797 2499526 2508901 2471720 2433302 2376971 2360032 2245666 2229260 2175251 2137357 2171795
4981 2171795 2150460 2095174 2062372 2092191 2032627 1997089 2032608 2106191 2182430 2099327 2163786
4970 2163786 2207658 2209244 2172060 2160235 2075219 2046839 2084116 2117366 2119828 2091150 2044248 2052127
4958 2052127 2107358 2066230 2146108 2184410 2143810 2208446 2193279 2216787 2237686 2203270 2219304
4947 2219304 2251142 2261668 2269625 2317805 2334419 2359237 2296751 2264817 2294011 2255178 2293074 2300340
$$ packed form
5028C219678q8246j03741M2805n613m4981r6123l4654L9896o4789p7478q9904
5017B696850K0368j4359q2994n2576k5408K7666r573k5414p9012l2600j7228l7129
5005B368591J1021Q430p70J7914m3233R359J8559k0199j8978J27946R5474k8659
4993B545455m9658L729R375l7181l8418n6331j6939j14366j6406n4009l7894L4438
4981B171795k1335n5286l2802K9819n9564l5538L5519P3583P6239q3103O4459
4970B163786M3872J586l7184j1825q5016k8380L7277L3250K462k8678m6902P879
4958B052127N5231m1128P9878L8302m0600O4636j5167K3508K0899l4416J6034
4947B219304L1838J0526P957M8180J6614K4818o2486l1934K9194l8833L7896P266
$$ plain form
4935 2300340 2359597 2426050 2473345 2429369 2426496 2406382 2456541 2477261 2454817 2517775 2500675 2534429
4923 2534429 2594559 2674347 2735416 2667975 2673116 2680568 2704429 2668757 2792188 2828284 2837750 2928832
4911 2928832 2966799 2999239 2979921 3056502 3096177 3113954 3143050 3243950 3225889 3283461 3345714
4900 3345714 3436049 3401381 3406536 3563798 3674755 3736290 3769859 3772443 3791723 3922899 4047750
4889 4047750 4029378 4076042 4124040 4245376 4279832 4362799 4486361 4641326 4679803 4775984 4855316
4878 4855316 4906491 5035298 5116645 5227685 5402221 5541116 5643549 5847605 6015367 6174635
4868 6174635 6386035 6558845 6752377 6968301 7225962 7487540 7718892 8043265 8421972 8793306
4858 8793306 9211748 9677289 10062517 10559428 11060243 11480488 12122873 12738805 13345375 14079651
$$ packed form
4935B300340N9257O6453M7295m3976k873k0114N0159K0720k2444O2958j7100L3754
4923B534429O0130P9788O1069o7441N141P452K3861l5672J23431L6096R466R1082
4911B928832L7967L2440j9318P6581L9675J7777K9096J00900j8061N7572O2253
4900C345714R0335l4668N155J57262J10957O1535L3569K584J9280J31176J24851
4889D047750j8372M6664M7998J21336L4456Q2967J23562J54965L8477R6181P9332
4878D855316N1175J28807Q1347J11040J74536J38895J02433K04056J67762J59268
4868F174635K11400J72810J93532K15924K57661K61578K31352L24373L78707L71334
4858H793306M18442M65541L85228M96911N00815M20245O42385O15932O06570P34276
$$ plain form
4848 14079651 14877990 15789619 16820684 17958150 19166660 20524195 21876269 23301859
4840 23301859 24692626 26154023 27629744 29053069 30600223 32090871 33571224 35040659
4832 35040659 36517889 37951437 39294722 40639957 41978392 43384531 44963652 46970300
4824 46970300 49467321 52023369 54065873 55607942 56713923 57749185 58833907 59933111
4816 59933111 61184760 62706348 64187060 65381290 66706693 68454549 70392254 72345039
4808 72345039 74262728 75976779 77512138 78649697 79493358 80029027 80199668 80148407 79859716
4799 79859716 79413455 78771897 77894757 76914067 75876847 74997036 74228808 73568430 73158268
4790 73158268 72997505 72979340 73102915 73441888 73981049 74672075 75408710 76234239 77039562 77737247
$$ packed form
4848A4079651P98339R11629J031065J137466J208510J357535J352074J425590
4840B3301859J390767J461397J475721J423325J547154J490648J480353J469435
4832C5040659J477230J433548J343285J345235J338435J406139J579121K006648
4824D6970300K497021K556048K042504J542069J105981J035262J084722J099204
4816E9933111J251649J521588J480712J194230J325403J747856J937705J952785
4808G2345039J917689J714051J535359J137559Q43661N35669J70641n1261k88691
4799G9859716m46261o41558q77140r80690j037220q79811p68228o60378m10162
4790G3158268j60763j8165J23575L38973N39161O91026P36635Q25529Q05323O97685
$$ plain form
4780 77737247 78355684 78732936 78875010 78926460 78709861 78301653 77724733 77071688 76360933 75604859
4770 75604859 74829299 74121372 73548313 73079779 72760085 72561284 72705961 73039682 73556763
4761 73556763 74221152 74996001 75704349 76504555 77502486 78459164 79451619 80365515 81044250
4752 81044250 81415924 81435605 81025594 80341822 79465578 78397699 76918250 75135363 73050567
4743 73050567 70710421 68236567 65699138 63264493 60826502 58555802 56472973 54495776
4735 54495776 52778237 51341093 50148920 49093648 48184364 47492534 46746079 45932670 45210410
4726 45210410 44371531 43377111 42397673 41296834 40039172 38761140 37441368 35996624 34407304
4717 34407304 32816631 31206020 29613894 28045467 26437576 24915703 23457258 22113447
$$ packed form
4780G7737247O18437L77252J42074N1450k16599m08208n76920o53045p10755p56074
4770G5604859p75560p07927n73059m68534l19694j98801J44677L33721N17081
4761G3556763O64389P74849P08348Q00206R97931R56678R92455R13896O78735
4752H1044250L71674J9681m10011o83772q76244j067879j479449j782887k084796
4743G3050567k340146k473854k537429k434645k437991k270700k082829j977197
4735E4495776j717539j437144j192173j055272r09284o91830p46455q13409p22260
4726D5210410q38879r94420r79438j100839j257662j278032j319772j444744j589320
4717C4407304j590673j610611j592126j568427j607891j521873j458445j343811
$$ plain form
4709 22113447 20831351 19656197 18623281 17672400 16815214 15985162 15276518 14641031 14076228
4700 14076228 13503128 12994230 12592331 12200791 11808064 11414225 11087596 10766757 10369287
4691 10369287 10106834 9821315 9600834 9376531 9187620 9055433 8850013 8702402 8615592 8447182
4681 8447182 8338000 8284302 8193447 8239779 8165807 8124432 8097559 8007013 7918684 7894358 7791159
4670 7791159 7722482 7689148 7578911 7457606 7295024 7139378 6994124 6929000 6810545 6599193
4660 6599193 6417818 6261839 6167439 6014621 5873324 5790608 5645809 5560544 5488434 5443181
4650 5443181 5301020 5203920 5186727 5090581 4967625 4856095 4773430 4593050 4561420 4537988 4465248
4639 4465248 4323926 4171424 4054336 3927723 3917433 3911707 3810396 3822556 3968353 4146318
$$ packed form
4709B2113447j282096j175154j032916r50881q57186q30052p08644o35487n64803
4700A4076228n73100n08898m01899l91540l92727l93839l26629l20839l97470
4691A0369287k62453k85519k20481k24303j88911j32187k05420j47611q6810j68410
4681H447182j09182n3698r0855M6332p3972m1375k6873r0546q8329k4326j03199
4670G791159o8677l3334j10237j21305j62582j55646j45254o5124j18455k11352
4660F599193j81375j55979r4400j52818j41297q2716j44799q5265p2110m5253
4650E443181j42161r7100j7193r6146j22956j11530q2665j80380l1630k3432p2740
4639D465248j41322j52502j17088j26613j0290n726j01311J2160J45797J77965
$$ plain form
4629 4146318 4390106 4773792 5034681 5305994 5346743 5285435 5227709 5011956 4863151 4546093
4619 4546093 4405443 4261759 4015680 3825303 3715992 3726407 3786124 3901039 4105671 4329904
4609 4329904 4534208 4732959 4888774 5161291 5338049 5571525 5933058 6252671 6570962 6880021
4599 6880021 7095203 7231461 7381325 7544468 7885795 8233571 8549159 8706940 8738106 8728266
4589 8728266 8600021 8494609 8407052 8304347 8151235 7990385 7738308 7380908 7052194 6737274
4579 6737274 6436218 6058259 5772211 5570411 5338639 5008838 4667297 4361701 4083175 3831448
4569 3831448 3658068 3454259 3256022 3062543 2897125 2819560 2739660 2646141 2642125 2619978 2606473
4558 2606473 2625419 2693419 2675067 2623243 2733972 2792411 2809046 2837995 2866328 2937725 2968038
$$ packed form
4629D146318K43788L83686K60889K71313M0749o1308n7726k15753j48805l17058
4619D546093j40650j43684k46079j90377j09311J0415N9717J14915K04632K24233
4609D329904K04304J98751J55815K72517J76758K33476L61533L19613L18291L09059
4599F880021K15182J36258J49864J63143L41327L47776L15588J57781L1166r840
4589H728266j28245j05412q7557j02705j53112j60850k52077l57400l28714l14920
4579F737274l01056l77959k86048k01800k31772l29801l41541l05596k78526k51727
4569C831448j73380k03809j98237j93479j65418p7565p9900r3519m016k2147j3505
4558B606473J8946O8000j8352n1824J10729N8439J6635K8949K8333P1397L0313
$$ plain form
4547 2968038 2918672 2898174 2891580 2953105 3050710 3054622 3051193 3054657 3128451 3201321 3204017 3282060
4535 3282060 3325659 3398874 3436273 3550319 3635761 3676003 3683114 3715120 3669310 3731509 3695181
4524 3695181 3645049 3612927 3520729 3396078 3357199 3281236 3157183 3095646 3000791 2868517 2863334
4513 2863334 2795754 2696306 2671555 2536409 2558181 2579486 2554677 2504262 2506950 2495061 2485816 2417114
4501 2417114 2362683 2298856 2315865 2242544 2137628 2138909 2053466 1952180 1919093 1837851 1746253
4490 1746253 1696727 1567879 1456941 1476258 1442514 1341421 1332451 1230475 1156387 1150695 1124860
4479 1124860 1134504 1053400 1012173 1056046 1003947 1037096 1020314 950453 901369 856366 965158
4468 965158 946285 957034 856116 766470 770444 733553 815677 843098 893786 936878 945472 913674
$$ packed form
4547B968038m9366k0498o594O1525R7605L912l429L464P3794P2870K696P8043
4535C282060M3599P3215L7399J14046Q5442M0242P111L2006m5810O2199l6328
4524C695181n0132l2122r2198j24651l8879p5963j24053o1537r4855j32274n183
4513B863334o7580r9448k4751j35146K1772K1305k4809n0415K688j1889r245o8702
4501B417114n4431o3827J7009p3321j04916J281q5443j01286l3087q1242r1598
4490A746253m9526j28848j10938J9317l3744j01093q970j01976p4088n692k5835
4479A124860R644q1104m1227M3873n2099L3149j6782o9861m9084m5003J08792
4468I65158j8873J0749j00918q9646L974l6891Q2124K7421N0688M3092Q594l1798
$$ plain form
4456 913674 877804 856514 844312 829581 777191 728035 761699 732918 747037 801827 723955 714391
4444 714391 743175 743565 621264 565432 582161 602757 576093 613968 565435 608664 612404 604075
4432 604075 592793 563882 565648 605440 644958 615663 637258 619463 519643 551349 532159 440181
4420 440181 460863 488145 545102 514877 474858 470132 485720 485587 533700 433212 333655 399635
4408 399635 414217 421426 447795 356469 368785 356122 416226 462050 426099 386917 344188 417781
4396 417781 443768 434002 356955 389440 424865 418970 405372 384671 293876 274451 306666 262001
4384 262001 327418 378649 323684 359171 447447 323795 304640 326001 345710 415306 378109
4373 378109 313050 336948 359362 281339 248791 304321 314457 326320 288567 289261 292200 377548
$$ packed form
4456I13674l5870k1290j2202j4731n2390m9156L3664k8781J4119N4790p7872r564
4444G14391K8784L90j22301n5832J6729K0596k6664L7875m8533M3229L740q329
4432F04075j1282k8911J766L9792L9518k9295K1595j7795r9820L1706j9190r1978
4420D40181K0682K7282N6957l0225m0019m726J5588j33M8113j00488r9557O5980
4408C99635J4582P209K6369r1326J2316j2663O0104M5824l5951l9182m2729P3593
4396D17781K5987r766p7047L2485L5425n895j3598k0701r0795j9425L2215m4665
4384B62001O5417N1231n4965L5487Q8276j23652j9155K1361J9709O9596l7197
4373C78109o5059K3898K2414p8023l2548N5530J0136J1863l7753O94K939Q5348
$$ plain form
4361 377548 347652 326487 279183 286609 307988 222492 246749 241095 218381 203854 297107 303088
4349 303088 353576 338371 277388 329412 360796 362015 298219 346324 386495 396012 388207 377090
4337 377090 358213 378602 418236 386622 329813 373508 337199 361111 414205 424184 353547 284430
4325 284430 321054 238447 289381 379822 418679 391555 389778 397937 393845 452018 506287 518797
4313 518797 506928 494271 500135 517643 526005 521833 469855 456005 528922 502901 488786 512169
4301 512169 513990 567866 598241 565263 515312 517286 516857 567582 527373 548344 610829 579936
4289 579936 560797 555952 613722 694628 737910 708678 742658 841031 838090 808978 836468 834637
4277 834637 781156 810164 902230 946280 894061 866284 826754 849724 858109 873809 906291 830201
$$ packed form
4361C77548k9896k1165m7304P426K1379q5496K4257n654k2714j4527R3253N981
4349C03088N0488j5205o0983N2024L1384J219o3796M8105M0171R517p805j1117
4337C77090j8877K0389L9634l1614n6809M3695l6309K3912N3094R979p0637o9117
4325B84430L6624q2607N0934R0441L8857k7124j777Q159m092N8173N4269J2510
4313E18797j1869j2657N864J7508Q362m172n1978j3850P2917k6021j4115K3383
4301E12169J821N3876L0375l2978m9951J974m29N0725m0209K0971O2485l0893
4289E79936j9139m845N7770Q0906M3282k9232L3980R8373k941k9112K7490j831
4277H34637n3481K9008R2066M4050n2219k7777l9530K2970Q385J5700L2482p6090
$$ plain form
4265 830201 918550 919764 905927 849898 939600 909717 912788 906885 938570 972967 988494 1001133
4253 1001133 1004285 1014664 944250 978491 1016354 1044151 998401 1014600 1010999 994583 1050358 1033160
4241 1033160 1075838 1117414 1042418 1072308 1095450 1126607 1113978 1036012 1045657 1099360 1135419 1133907
4229 1133907 1159213 1067579 1050467 1056750 1122504 1237628 1199896 1170695 1113539 1141018 1134377 1105081
4217 1105081 1074427 1091638 1119084 1079753 1069358 1056998 1118752 1129061 1075579 1057532 1085575
4206 1085575 1110292 1086403 1047115 1076631 1109190 1123803 1146350 1081590 1137688 1112534 1104778 1126340
4194 1126340 1078270 1059372 1115053 1122020 1088113 1127663 1068877 1062293 1036394 1073434 1048987 989616
4182 989616 1008968 1086333 1142437 1075413 1045883 1000331 993057 1094897 1131280 1108496 1054752 1055261
$$ packed form
4265H30201Q8349J214j3837n6029Q9702k9883L071n903L1685L4397J5527J2639
4253A001133L152J0379p0414L4241L7863K7797m5750J6199l601j6416N5775j7198
4241A033160M2678M1576p4996K9890K3142L1157j2629p7966R645N3703L6059j512
4229A133907K5306r1634j7112O283O5754J15124l7732k9201n7156K7479o641k9296
4217A105081l0654J7211K7446l9331j0395j2360O1754J0309n3482j8047K8043
4206A085575K4717k3889l9288K9516L2559J4613K2547o4760N6098k5154p756K1562
4194A126340m8070j8898N5681O967l3907L9550n8786o584k5899L7040k4447n9371
4182I89616J9352P7365N6104o7024k9530m5552p274J01840L6383k2784n3744N09
$$ plain form
4170 1055261 1116826 1130689 1183882 1176438 1179767 1166477 1123226 1207325 1237568 1298826 1326774 1317138
4158 1317138 1320422 1271714 1294089 1295416 1292386 1271088 1292059 1290725 1277510 1254636 1274562 1286333
4146 1286333 1345043 1322312 1269101 1339611 1379246 1349705 1352133 1328063 1354486 1440659 1393071 1457429
4134 1457429 1529172 1497884 1526616 1541184 1585513 1626261 1641128 1574914 1630878 1651869 1647160 1658470
4122 1658470 1701603 1710086 1752935 1785504 1860302 1906584 1932754 1946123 2003759 2050325 2048251 2096366
4110 2096366 2108424 2128111 2169327 2131776 2129737 2148052 2170100 2237533 2310546 2399322 2352744 2285738
4098 2285738 2351488 2436810 2399845 2482255 2505830 2502285 2521394 2576544 2619051 2612902 2614263 2661351
4086 2661351 2696654 2729517 2753835 2869995 2876008 2892084 2828738 2870990 2919618 2907533 3009275
$$ packed form
4170A055261O1565J3863N3193p444L329j3290m3251Q4099L0243O1258K7948r636
4158A317138L284m8708K2375J327l030k1298K0971j334j3215k2874J9926J1771
4146A286333N8710k2731n3211P0510L9635k9541K428k4070K6423Q6173m7588O4358
4134A457429P1743l1288K8732J4568M4329M0748J4867o6214N5964K0991m709J1310
4122A658470M3133Q483M2849L2569P4798M6282K6170J3369N7636M6566k074M8115
4110B096366J2058J9687M1216l7551k039J8315K2048O7433P3013Q8776m6578o7006
4098B285738O5750Q5322l6965Q2410K3575l545J9109N5150M2507o149J361M7088
4086B661351L5303L2863K4318J16160O013J6076o3346M2252M8628j2085J01742
$$ plain form
4075 3009275 3065284 3090423 3126861 3190815 3228988 3281808 3312982 3348768 3411335 3416382 3441168 3492993
4063 3492993 3560574 3682236 3783286 3862131 3879835 3906249 4001418 4035096 4205208 4402843 4605113
4052 4605113 4838001 5027188 5149082 5254979 5362951 5470254 5618776 5674567 5723325 5833731
4042 5833731 5969283 6063971 6247763 6419786 6667887 7063226 7333126 7588043 7892453 8224098
4032 8224098 8622257 9017390 9514201 9915877 10244640 10727575 11103005 11543207 12012643 12404371
4022 12404371 12836531 13277808 13707378 14177260 14668871 15137711 15737521 16275031 16768732
4013 16768732 17287027 17795084 18199339 18642981 19078574 19501449 19856878 20207996 20692031
4004 20692031 21181039 21700678 22185686 22941631 23692617 24467460 25360429 26409369 27543892
$$ packed form
4075C009275N6009K5139L6438O3954L8173N2820L1174L5786O2567N047K4786N1825
4063C492993O7581J21662J01050P8845J7704K6414R5169L3678J70112J97635K02270
4052D605113K32888J89187J21894J05897J07972J07303J48522N5791M8758J10406
4042E833731J35552R4688J83792J72023K48101L95339K69900K54917L04410L31645
4032H224098L98159L95133M96811M01676L28763M82935L75430M40202M69436L91728
4022A2404371M32160M41277M29570M69882M91611M68840N99810N37510M93701
4013A6768732N18295N08057M04255M43642M35593M22875L55429L51118M84035
4004B0692031M89008N19639M85008P55945P50986P74843Q92969J048940J134523
$$ plain form
3995 27543892 28815209 30153897 31554638 33091536 34743472 36631938 38665549 40754835
3987 40754835 42837810 45077901 47287273 49343980 51356637 53300657 55117116 56954432
3979 56954432 58660710 60396927 62207599 64037016 65988666 68013707 70281778 72863288
3971 72863288 75809877 79213657 83130155 87310322 91480547 95506043 99097048 102225429
3963 102225429 104809244 107044790 109014971 110894281 112645580 114301106 115941650 117420664
3955 117420664 118897046 120323229 121728491 122952848 123882255 124630289 125023938 125123304 124713287
3946 124713287 123761275 122474082 120888820 119117390 117268534 115718129 114308344 113033845
3938 113033845 111612634 109709883 107343655 104523273 101228793 97520847 93757627 89941024
$$ packed form
3995B7543892J271317J338688J400741J536898J651936J888466K033611K089286
3987D0754835K082975K240091K209372K056707K012657J944020J816459J837316
3979E6954432J706278J736217J810672J829417J951650K025041K268071K581510
3971G2863288K946589L403780L916498M180167M170225M025496L591005L128381
3963A02225429K583815K235546J970181J879310J751299J655526J640544J479014
3955A17420664J476382J426183J405262J224357R29407P48034L93649R9366m10017
3946A24713287r52012j287193j585262j771430j848856j550405j409785j274499
3938A13033845j421211j902751k366228k820382l294480l707946l763220l816603
$$ plain form
3930 89941024 86129904 82347835 78805225 75483529 72489092 69855968 67579194 65588612
3922 65588612 63755144 62004424 60544105 59103106 57675114 56274703 54758884 53107943
3914 53107943 51264555 49361133 47398602 45375473 43420446 41544426 39691500 37935865
3906 37935865 36189641 34625879 33177268 31885400 30633086 29461736 28437561 27548021
3898 27548021 26757287 26128200 25575954 25100675 24648827 24299037 23980704 23650689 23315927
3889 23315927 22996798 22647114 22266352 21930197 21477328 21080130 20548594 20099108 19583817
3880 19583817 19081210 18599348 18111670 17610551 17128607 16658464 16232056 15872093 15352506
3871 15352506 14938715 14644065 14235286 13883665 13659189 13230963 12922873 12522118 12136245
$$ packed form
3930H9941024l811120l782069l542610l321696k994437k633124k276774j990582
3922F5588612j833468j750720j460319j440999j427992j400411j515819j650941
3914E3107943j843388j903422j962531k023129j955027j876020j852926j755635
3906C7935865j746224j563762j448611j291868j252314j171350j024175q89540
3898B7548021p90734o29087n52246m75279m51848l49790l18333l30015l34762
3889B3315927l19129l49684l80762l36155m52869l97198n31536m49486n15291
3880A9583817n02607m81862m87678n01119m81944m70143m26408l59963n19587
3871A5352506m13791k94650m08779l51621k24476m28226l08090m00755l85873
$$ plain form
3862 12136245 11704262 11215221 10732713 10302905 9906557 9585573 9280588 8906525 8561947
3853 8561947 8224016 7869363 7559943 7320881 7081287 6798506 6578997 6473773 6364615 6202050
3843 6202050 6036667 5859658 5711808 5639559 5465807 5319385 5210118 5038963 4905885 4807155
3833 4807155 4659457 4539541 4418386 4238776 4079134 4013070 3908609 3766123 3653142 3518771
3823 3518771 3433598 3381226 3238906 3081110 3050418 3024056 2825523 2684092 2644778 2656766 2600887
3812 2600887 2563355 2507709 2403449 2341921 2282584 2220832 2168315 2098938 1985188 1953814 1947752
3801 1947752 1920217 1860651 1783672 1695903 1645293 1604414 1544887 1390839 1310128 1400477 1345030
3790 1345030 1368867 1315042 1245921 1251636 1245694 1254454 1186758 1180795 1134256 1147565 1042930 1019176
$$ packed form
3862A2136245m31983m89041m82508m29808l96348l20984l04985l74063l44578
3853H561947l37931l54653l09420k39062k39594k82781k19509j05224j09158j62565
3843F202050j65383j77009j47850p2249j73752j46422j09267j71155j33078r8730
3833D807155j47698j19916j21155j79610j59642o6064j04461j42486j12981j34371
3823C518771q5173n2372j42320j57796l0692k6362j98533j41431l9314J1988n5879
3812B600887l7532n5646j04260o1528n9337o1752n2517o9377j13750l1374o062
3801A947752k7535n9566p6979q7769n0610m0879n9527j54048q0711R0349n5447
3790A345030K3837n3825o9121N715n942Q760o7696n963m6539J3309j04635k3754
$$ plain form
3778 1019176 1051470 1032152 964324 955279 939948 939025 930986 872942 850701 840792 843627 782403 762598
3765 762598 722982 698432 652298 682420 690155 689664 602324 656434 692766 655208 621632 676919
3753 676919 650261 610283 551603 582679 597709 550738 541195 473308 541564 511376 461650 457714
3741 457714 464439 415113 442167 507673 470737 378330 392862 405251 454226 475424 455297 430166
3729 430166 348852 388357 431837 383230 417842 370485 359001 396035 342401 397176 392551 373837
3717 373837 348817 312078 364403 286966 346353 330257 321620 305945 304414 362283 322802 344111
3705 344111 341329 318465 323527 378945 377926 348076 391780 408697 358945 370392 412420 489207
3693 489207 447613 429849 448889 496317 497687 508533 449091 365001 402154 427808 424980 469598
$$ packed form
3778A019176L2294j9318o7828r045j5331r23q039n8044k2241r909K835o1224j9805
3765G62598l9616k4550m6134L0122P735m91q7340N4110L6332l7558l3576N5287
3753F76919k6658l9978n8680L1076J5030m6971r543o7887O8256l0188m9726l936
3741D57714O725m9326K7054O5506l6936r2407J4532J2389M8975K1198k0127k5131
3729D30166q1314L9505M3480m8607L4612m7357j1484L7034n3634N4775m625j8714
3717C73837k5020l6739N2325p7437N9387j6096q637j5675j531N7869l9481K1309
3705C44111k782k2864N062N5418j019k9850M3704J6917m9752J1447M2028P6787
3693D89207m1594j7764J9040M7428J370J0846n9442q4090L7153K5654k828M4618
$$ plain form
3681 469598 429887 420651 419482 414931 397918 368537 388409 360473 386959 443212 453768 472257
3669 472257 495745 401487 383583 396684 457427 476189 490247 443294 470016 475766 484187 452667
3657 452667 373235 341023 338863 335230 329645 409079 437544 455339 463968 484101 465697 495214
3645 495214 501275 453276 363019 366509 393305 339316 341832 386453 281213 335697 410998 371651
3633 371651 376592 387335 347442 293751 309395 398436 373630 392864 460618 454329 433212 464078
3621 464078 586153 598962 666063 677822 616828 670337 722072 645183 608316 593964 588822 571886
3609 571886 541703 424802 363162 366277 305002 321362 327082 296307 280640 284588 308232 279592
3597 279592 235543 242984 279176 209931 307517 331427 316574 473243 596950 718068 825000
$$ packed form
3681D69598l9711r236j169m551j7013k9381J9872k7936K6486N6253J0556J8489
3669D72257K3488r4258j7904J3101O0743J8762J4058m6953K6722N750Q421l1520
3657D52667p9432l2212k160l633n585P9434K8465J7795Q629K0133j8404K9517
3645D95214O061m7999r0257L490K6796n3989K516M4621j05240N4484P5301l9347
3633C71651M941J0743l9893n3691J5644Q9041k4806J9234O7754o289k1117L0866
3621D64078J22075J2809O7101J1759o0994N3509N1735p6889l6867j4352n142j6936
3609E71886l0183j16901o1640L115o1275J6360N720l0775j5667L948K3644k8640
3597B79592m4049P441L6192o9245R7586K3910j4853J56669J23707J21118J06932
$$ plain form
3586 825000 918786 967423 917997 900044 868538 778766 717676 620997 520163 439528 369041
3575 369041 292372 291887 368216 290272 221324 270400 243646 218498 164761 181143 215482 212506
3563 212506 261313 227464 231448 227000 256133 246157 279849 432592 464094 523931 612982 575269
3551 575269 468890 457894 509029 519067 385699 390342 385136 365469 358166 347230 344486 311530
3539 311530 308662 301641 286341 279554 250309 273815 293686 283922 300247 314816 285215 274553
3527 274553 362137 347220 373224 419046 461916 485616 491463 445055 389206 412741 434255 430251
3515 430251 380688 408923 484659 489630 471649 509023 530670 507868 535464 589800 611781 587339
3503 587339 614847 637051 594062 669710 778248 762673 795604 918780 893760 919502 1030443
$$ packed form
3586H25000R3786M8637m9426j7953l1506q9772o1090r6679j00834q0635p0487
3575C69041p6669m85P6329p7944o8948M9076k6754k5148n3737J6382L4339k976
3563B12506M8807l3849L984m448K9133r976L3692J52743L1502N9837Q9051l7713
3551E75269j06379j0996N1135J0038j33368M643n206j9667p303j0936k744l2956
3539C11530k868p021j5300o787k9245K3506J9871r764J6325J4569k9601j0662
3527B74553Q7584j4917K6004M5822M2870K3700N847m6408n5849K3535K1514m004
3515D30251m9563K8235P5736M971j7981L7374K1647k2802K7596N4336K1981k4442
3503E87339K7508K2204m2989P5648J08538j5575L2931J23176k5020K5742J10941
$$ plain form
3492 1030443 1126920 1183435 1168981 1181895 1197552 1186513 1235952 1250441 1302514 1331544 1291216
3481 1291216 1249500 1251990 1285439 1337723 1432290 1498430 1587182 1652944 1754869 1896784 2104493
3470 2104493 2238119 2375146 2555548 2723566 2871545 3048504 3172044 3213467 3253255 3162446
3460 3162446 3102504 3109477 2976675 2858883 2799001 2736962 2615009 2507051 2449424 2340418 2257606
3449 2257606 2119987 2084391 1971862 1863651 1856871 1758928 1655797 1579990 1487564 1397194 1350539
3438 1350539 1281998 1187116 1073369 948012 831776 802473 778817 779197 694463 618922 596672
3427 596672 550251 493607 425823 341956 387689 406838 410322 362928 403563 424564 392802 342698
3415 342698 313770 372360 309713 264503 230396 223563 243644 178800 139769 141077 158548 191304
$$ packed form
3492A030443R6477N6515j4454J2914J5657j1039M9439J4489N2073K9030m0328
3481A291216m1716K490L3449N2284R4567O6140Q8752O5762J01925J41915K07709
3470B104493J33626J37027J80402J68018J47979J76959J23540M1423L9788r0809
3460C162446n9942O973j32802j17792n9882o2039j21953j07958n7627j09006q2812
3449B257606j37619l5596j12529j08211o780r7943j03131p5807r2426r0370m6655
3438A350539o8541r4882j13747j25357j16236k9303k3656L80q4734p5541k2250
3427E96672m6421n6644o7784q3867M5733J9149L484m7394M0635K1001l1762n0104
3415C42698k8928N8590o2647m5210l4107o833K0081o4844l9031J308J7471L2756
$$ plain form
3403 191304 197409 213617 191166 143105 144781 144219 112839 56744 27936 27781 2827 30294 -39502
3390 -39502 -55032 -18545 13770 8447 32124 12907 54677 -17429 1245 32309 -16561 42067
3378 42067 70745 26378 12459 57465 32490 -760 -25246 -18487 -37982 -24371 -10876 16761
3366 16761 103956 42288 24911 43934 38244 -48148 -14937 42999 61056 13203 -89309 -20382
3354 -20382 1826 20384 -21370 -14568 -30775 7040 -3617 26978 8692 -22588 -78539 -111339
3342 -111339 -95648 -91442 -14663 -38194 -6090 22749 37600 -26878 33748 34186 33511 50424 92580
3329 92580 64238 -20458 5481 -5675 38493 25962 14622 32961 37511 -68642 -112190 -32956
3317 -32956 10991 -15831 -31758 12442 -11975 -8236 2359 -31186 -16256 -64284 -123602 -53667
$$ packed form
3403A91304O105J6208k2451m8061J676n62l1380n6095k8808j55k4954K7467o9796
3390c9502j5530L6487L2315n323K3677j9217M1770p2106J8674L1064m8870N8628
3378D2067K8678m4367j3919M5006k4975l3250k4486O759j9495J3611J3495K7637
3366A6761Q7195o1668j7377J9023n690q6392L3211N7936J8057m7853j02512O8927
3354b0382K2208J8558m1754O802j6207L7815j0657L0595j8286l1280n5951l2800
3342a11339J5691M206P6779k3531L2104K8839J4851o4478O0626M38o75J6913M2156
3329I2580k8342q4696K5939j1156M4168j2531j1340J8339M550j06153m3548P9234
3317c2956M3947k6822j5927M4200k4417L739J0595l3545J4930m8028n9318O9935
$$ plain form
3305 -53667 -27041 -46463 -24340 -86309 -33211 28767 -30265 -45229 -354 -17781 23501 -11829
3293 -11829 -35403 -50821 -34807 -63475 -131812 -109498 -64613 -67761 -6572 -58316 -148474 -117319
3281 -117319 -66148 -9066 -62464 -88500 -63325 -45021 -10438 42408 30269 49506 7814 24378
3269 24378 -3032 -340 -35395 -48130 -73661 -94414 -76866 -95527 -71675 -75776 -23511 -89895
3257 -89895 -100663 -142153 -167030 -176265 -178586 -115712 -43180 -30674 -73074 -140503 -186284 -152481
3245 -152481 -132237 -109563 -112229 -110492 -72131 -94741 -77636 20426 -48301 -159506 -102447 -148924
3233 -148924 -121578 -72992 -72090 -39966 -68797 -21162 -65682 -93634 -94563 -109059 -79908 -100154
3221 -100154 -95700 -59879 -73522 -127613 -147413 -98149 -108025 -81229 -58479 -58635 -43582 -46302 -70502
$$ packed form
3305e3667K6626j9422K2123o1969N3098O1978n9032j4964M4875j7427M1282l5330
3293a1829k3574j5418J6014k8668o8337K2314M4885l148O1189n1744r0158L1155
3281a17319N1171N7082n3398k6036K5175J8304L4583N2846j2139J9237m1692J6564
3269B4378k7410K692l5055j2735k5531k0753J7548j8661K3852m101N2265o6384
3257h9895j0768m1490k4877r235k321O2874P2532J2506m2400o7429m5781L3803
3245a52481K0244K2674k666J737L8361k2610J7105R8062o8727j11205N7059m6477
3233a48924K7346M8586R02L2124k8831M7635m4520k7952r29j4496K9151k0246
3221a00154M454L5821j3643n4091j9800M9264r876K6796K2750j56J5053k720k4200
$$ plain form
3208 -70502 -84080 -111034 -68845 -57443 -21299 -58000 -48062 -48575 -86673 -75907 -26622 -71999
3196 -71999 -51214 -89004 -55148 -43761 -34447 -24796 -115337 -45908 -38282 -38414 -82499 -83749 -40576
3183 -40576 21154 24789 48366 58828 90850 1415 -29283 16081 42751 93608 139913 186475
3171 186475 276790 267775 218502 207663 164669 168329 254150 216941 253220 315533 317863 302054
3159 302054 396365 464868 462090 469700 548481 614712 663628 742566 775035 859974 918930 966371
3147 966371 994152 1046361 1039660 1046326 1012400 1010222 1003229 974584 994492 1040124 1066711 1061512 1032588
3134 1032588 1025709 1032406 1066830 1122132 1170054 1123488 1183676 1323610 1452570 1539871 1715821
3123 1715821 1912830 2036642 2144847 2198750 2159774 2062450 1905830 1790782 1645071 1514938
$$ packed form
3208g0502j3578k6954M2189J1402L6144l6701R938n13l8098J0766M9285m5377
3196g1999K0785l7790L3856J1387R314R651r0541O9429P626j32m4085j250M3173
3183d0576O1730L635K3577J0462L2022q9435l0698M5364K6670N0857M6305M6562
3171A86475R0315r015m9273j0839m2994L660Q5821l7209L6279O2313K330j5809
3159C02054R4311O8503k778P610P8781O6231M8916P8938L2469Q4939N8956M7441
3147I66371K7781N2209o701O666l3926k178o993k8645J9908M5632K6587n199k8924
3134A032588o879O697L4424N5302M7922m6566O0188J39934J28960Q7301J75950
3123A715821J97009J23812J08205N3903l8976r7324j56620j15048j45711j30133
$$ plain form
3113 1514938 1386389 1285843 1082110 960304 916723 890550 853044 761945 779970 766583 735714
3102 735714 702067 641997 698050 794400 740805 743444 765158 855289 862146 850604 865365 863347
3090 863347 858879 821924 844883 828985 822870 801008 738688 667592 554938 490335 453264 397258
3078 397258 369340 332714 296192 254710 211956 227142 264637 274035 226883 198972 188053 176618
3066 176618 148785 132082 95751 111145 107168 56531 8836 37142 36731 -19157 -53291 65667
3054 65667 93455 36635 -12990 -8242 -92623 -87293 -40619 27648 -17982 -5955 20310 -38309
3042 -38309 -86434 -95157 -72959 -61571 -145856 -148887 -127448 -123421 -107641 -80613 -103940 -93226
3030 -93226 -78764 -132173 -122390 -94757 -122073 -180899 -185072 -142806 -105135 -123373 -164555 -144562
$$ packed form
3113A514938j28549j00546k03733j21806m3581k6173l7506r1099J8025j3387l0869
3102G35714l3647o0070N6053R6350n3595K639K1714R0131O857j1542J4761k018
3090H63347m468l6955K2959j5898o115k1862o2320p1096j12654o4603l7071n6006
3078C97258k7918l6626l6522m1482m2754J5186L7495R398m7152k7911j0919j1435
3066A76618k7833j6703l6331J5394l977n0637m7695K8306m11n5888l4134J18958
3054F5667K7788n6820m9625M748q4381N330M6674O8267m5630J2027K6265n8619
3042c8309m8125q723K2198J1388q4285l031K1439M027J5780K7028k3327J0714
3030i3226J4462n3409R783K7633k7316n8826m173M2266L7671j8238m1182J9993
$$ plain form
3018 -144562 -115214 -134759 -78805 -143387 -180696 -173368 -155411 -177855 -170768 -217580 -129135 -130698
3006 -130698 -101631 -110723 -145052 -135667 -142045 -143570 -105077 -113812 -118471 -152792 -164052 -134359 -89744
2993 -89744 -124098 -134140 -88820 -140186 -211034 -187154 -99666 -121129 -220065 -194444 -180238 -157024
2981 -157024 -174364 -181669 -141568 -168191 -220771 -170145 -158775 -142745 -80062 -79754 -80290 -185231
2969 -185231 -239215 -204287 -189885 -162343 -157106 -147670 -122461 -135153 -197465 -206121 -206343 -161819 -156047
2956 -156047 -145223 -101807 -220725 -219734 -158305 -162699 -184763 -169584 -129556 -153630 -192242 -154214
2944 -154214 -133289 -72313 -86825 -74248 -124411 -161287 -151009 -169868 -120447 -149879 -160240 -176952
2932 -176952 -175965 -198214 -143085 -105613 -118610 -78342 -120264 -112139 -118194 -138676 -118693 -111319 -114822
$$ packed form
3018a44562K9348j9545N5954o4582l7309P328J7957k2444P087m6812Q8445j563
3006a30698K9067r092l4329R385o378j525L8493q735m659l4321j1260K9693M4615
2993h9744l4354j0042M5320n1366p0848K3880Q7488k1463r8936K5621J4206K3214
2981a57024j7340p305M0101k6623n2580N0626J1370J6030O2683L08n36j04941
2969a85231n3984L4928J4402K7542N237R436K5209j2692o2312q656k22M4524N772
2956a56047J0824M3416j18918R91O1429m394k2064J5179M0028k4074l8612L8028
2944a54214K0925O0976j4512J2577n0163l6876J0278j8859M9421k9432j0361j6712
2932a76952R87k2249N5129L7472j2997M0268m1922Q125o055k0482J9983P374l503
$$ plain form
2919 -114822 -167835 -119124 -87558 -161527 -195631 -165490 -182752 -222947 -188286 -170766 -206198 -170710
2907 -170710 -127089 -198654 -237303 -256186 -241915 -188268 -146047 -151278 -117332 -171213 -214021 -210030
2895 -210030 -169828 -202044 -193508 -172089 -153872 -216276 -176093 -173391 -141314 -131429 -140514 -108462
2883 -108462 -125259 -142126 -114539 -168440 -157338 -78190 -176020 -237420 -196115 -178241 -185152 -164629
2871 -164629 -154621 -114002 -56882 -59533 -165954 -163905 -250288 -229695 -146369 -100387 -97867 -94923
2859 -94923 -113617 -115179 -125629 -162790 -183031 -192784 -131574 -179554 -211532 -94889 -98442 -173536
2847 -173536 -245965 -229669 -197839 -167767 -193266 -227027 -212382 -184977 -123808 -171779 -180063 -239176
2835 -239176 -256267 -183092 -188939 -194302 -124479 -171366 -91079 -92485 -139189 -118571 -122643 -89374
$$ packed form
2919a14822n3013M8711L1566p3969l4104L0141j7262m0195L4661J7520l5432L5488
2907a70710M3621p1565l8649j8883J4271N3647M2221n231L3946n3881m2808L991
2895b10030M0202l2216Q536K1419J8217o2404M0183K702L2077R885r085L2052
2883a08462j6797j6867K7587n3901J1102P9148r7830o1400M1305J7874o911K0523
2871a64629J0008M0619N7120k651j06421K049q6383K0593Q3326M5982K520K944
2859i4923j8694j562j0450l7161k0241r753O1210m7980l1978J16643l553p5094
2847a73536p2429J6296L1830L0072k5499l3761J4645K7405O1169m7971q284n9113
2835b39176j7091P3175n847n363O9823m6887Q0287j406m6704K0618m072L3269
$$ plain form
2823 -89374 -140231 -189425 -169143 -150692 -155612 -189427 -205184 -126165 -107352 -130367 -187143 -162386
2811 -162386 -111362 -114024 -71968 -111711 -138861 -114571 -110271 -67305 -79984 -101889 -176716 -169163
2799 -169163 -149656 -105936 -147269 -211000 -200010 -128552 -132900 -191282 -144004 -148776 -87966 -74819
2787 -74819 -163593 -183149 -170424 -206728 -160399 -130580 -170527 -147278 -182557 -172464 -206146 -182238
2775 -182238 -177887 -152340 -190443 -179608 -135590 -85945 -114583 -130080 -154159 -192956 -140621 -222055
2763 -222055 -214788 -200240 -153544 -118077 -41364 -20414 -65453 -59235 -78757 -149214 -133305 -168185
2751 -168185 -147983 -141441 -167152 -117553 -96659 -178231 -201099 -143479 -73319 -90249 -100395 -126181
2739 -126181 -204084 -145656 -95016 -55690 -109770 -126824 -188301 -201412 -166050 -143758 -152786 -132434
$$ packed form
2823h9374n0857m9194K0282J8451m920l3815j5757P9019J8813k3015n6776K4757
2811a62386N1024k662M2056l9743k7150K4290M300M2966j2679k1905p4827P553
2799a69163J9507M3720m1333o3731J0990P1458m348n8382M7278m772O0810J3147
2787g4819q8774j9556J2725l6304M6329K9819l9947K3249l5279J0093l3682K3908
2775a82238M351K5547l8103J0835M4018M9645k8638j5497k4079l8797N2335q1434
2763b22055P267J4548M6696L5467P6713K0950m5039O218j9522p0457J5909l4880
2751a68185K0202O542k5711M9599K0894q1572k2868N7620P0160j6930j0146k5786
2739a26181p7903N8428N0640L9326n4080j7054o1477j3111L5362K2292r028K0352
$$ plain form
2727 -132434 -90790 -166799 -124392 -120164 -176469 -219553 -218344 -112839 -87405 -117435 -144594 -160750
2715 -160750 -107838 -129991 -94913 -137262 -208248 -162124 -87179 -4897 -74071 -116478 -163987 -125667
2703 -125667 -82704 -39172 -132222 -158510 -127175 -170203 -147663 -110218 -139647 -185188 -154746 -150413
2691 -150413 -160022 -134650 -71299 -134901 -135727 -102637 -122329 -134692 -113676 -128103 -73537 -110142
$$ packed form
2727a32434M1644p6009M2407M228n6305m3084J209J05505K5434l0030k7159j6156
2715a60750N2912k2153L5078m2349p0986M6124P4945Q2282o9174m2407m7509L8320
2703a25667M2963M3532r3050k6288L1335m3028K2540L7445k9429m5541L0442M333
2691a50413r609K5372O3351o3602q26L3090j9692j2363K1016j4427N4566l6605
$$ [...]
##END NTUPLES=NMR SPECTRUM
##END=
