##TITLE=1H_DE-80H_X3
 200.13MHz, d2o
 8 sc
 
 19ns.26.2.2025
##JCAMPDX= 6.0         $$ Bruker NMR JCAMP-DX V2.0
##DATA TYPE= NMR SPECTRUM
##DATA CLASS= NTUPLES
##ORIGIN= UXNMR, Bruker Analytische Messtechnik GmbH
##OWNER= pz
$$ XWIN-NMR		Version 3.5
$$ Thu Jul 23 14:28:04 2026 Russian Standard Time (UT+4h)  Yarkov@DPX200
##.OBSERVE FREQUENCY= 200.1313
##.OBSERVE NUCLEUS= ^1H
##.ACQUISITION MODE= SIMULTANEOUS
##.ACQUISITION SCHEME= undefined
##.AVERAGES= 8
##.DIGITISER RES= 18
##SPECTROMETER/DATA SYSTEM= spect
##.PULSE SEQUENCE= zg30
##.SOLVENT NAME= DMSO
##.SHIFT REFERENCE= (INTERNAL, DMSO, 0, 15.499)
##AUDIT TRAIL= $$ (NUMBER, WHEN, WHO, WHERE, WHAT)
$$ ##TITLE= Audit trail, XWIN-NMR		Version 3.5
$$ ##JCAMPDX= 5.01
$$ ##ORIGIN= Bruker BioSpin GmbH
$$ ##OWNER= Yarkov
$$ C:/Bruker/XWIN-NMR/data/yarkov2/nmr/H-C/1/pdata/1/auditp.txt
$$ ##AUDIT TRAIL=  $$ (NUMBER, WHEN, WHO, WHERE, WHAT)
(   1,<2026-07-23 14:27:25.51 +0400>,<Yarkov>,<DPX200>,
      <created by zg, POWCHK disabled, PULCHK disabled
       configuration hash MD5:
       00 E9 B6 7A A2 85 ED C7 34 08 36 98 17 FE 4E 26
       data hash MD5: 16K
       5C B2 2B B0 C6 9B 2B 3A BC B1 A6 F9 EF 0B FD 2D>)
(   2,<2026-07-23 14:27:33.25 +0400>,<Yarkov>,<DPX200>,
      <Start of raw data processing
       efp BC_mod = 2 LB = 0.25 FT_mod = 6 PKNL = 1 PHC0 = -7254.183 PHC1 = 2.82197 SI = 16K 
       data hash MD5: 16K
       F1 15 64 C5 2B F0 31 9C 79 63 D9 0B 30 BF 48 33>)
$$ ##END=
$$ 
$$ hash MD5
$$ 21 51 67 60 F9 66 A8 03 49 55 4D F0 61 E5 4A 40
##$RELAX= 
##$RELAX= 
##$RELAX= 
##$RELAX= 
##$RELAX= 
##$RELAX= 
$$ Bruker specific parameters
$$ --------------------------
##$DU= <C:/Bruker/XWIN-NMR>
##$EXPNO= 1
##$NAME= <H-C>
##$PROCNO= 1
##$TYPE= <nmr>
##$USER= <yarkov2>
##$AMP= (0..31)
100 100 100 100 100 100 100 100 100 100 100 100 100 100 100 100 100 100 
100 100 100 100 100 100 100 100 100 100 100 100 100 100 
##$AQSEQ= 0
##$AQ_mod= 1
##$AUNM= <au_zg>
##$AUTOPOS= <>
##$BF1= 200.13
##$BF2= 200.13
##$BF3= 200.13
##$BF4= 200.13
##$BF5= 200.13
##$BF6= 200.13
##$BF7= 200.13
##$BF8= 200.13
##$BYTORDA= 1
##$CFDGTYP= 0
##$CFRGTYP= 5
##$CHEMSTR= <none>
##$CNST= (0..31)
1 1 145 1 1 1 1 1 1 1 1 1 1 1 1 1 1 1 1 1 1 1 1 1 1 1 1 1 1 1 1 1 
##$CPDPRG= <>
##$CPDPRG1= <>
##$CPDPRG2= <>
##$CPDPRG3= <>
##$CPDPRG4= <mlev>
##$CPDPRG5= <mlev>
##$CPDPRG6= <mlev>
##$CPDPRG7= <mlev>
##$CPDPRG8= <mlev>
##$CPDPRGB= <>
##$CPDPRGT= <>
##$D= (0..31)
0 0.7 0 0 0 0 0 0 0 0 0 0.03 0 0 0 0 0 0 0 0 0 0 0 0 0 0 0 0 0 0 0 0 
##$DATE= 1784802445
##$DBL= (0..7)
120 120 120 120 120 120 120 120 
##$DBP= (0..7)
150 150 150 150 150 150 150 150 
##$DBP07= 0
##$DBPNAM0= <>
##$DBPNAM1= <>
##$DBPNAM2= <>
##$DBPNAM3= <>
##$DBPNAM4= <>
##$DBPNAM5= <>
##$DBPNAM6= <>
##$DBPNAM7= <>
##$DBPOAL= (0..7)
0.5 0.5 0.5 0.5 0.5 0.5 0.5 0.5 
##$DBPOFFS= (0..7)
0 0 0 0 0 0 0 0 
##$DE= 6
##$DECBNUC= <off>
##$DECIM= 32
##$DECNUC= <off>
##$DECSTAT= 4
##$DIGMOD= 1
##$DIGTYP= 9
##$DL= (0..7)
0 120 120 120 120 120 120 120 
##$DP= (0..7)
$$ [...]
##$SUBNAM2= <"">
##$SUBNAM3= <"">
##$SUBNAM4= <"">
##$SUBNAM5= <"">
##$SUBNAM6= <"">
##$SUBNAM7= <"">
##$SUBNAM8= <"">
##$SUBNAM9= <"">
##$SW= 18.0517328524113
##$SWIBOX= (0..15)
0 0 2 0 0 0 0 0 0 0 0 0 0 0 0 0 
##$SW_h= 3612.71676300578
##$TD= 16384
##$TD0= 1
##$TE= 0
##$TE2= 300
##$TE3= 300
##$TEG= 300
##$TL= (0..7)
0 120 120 120 120 120 120 120 
##$TP= (0..7)
150 150 150 150 150 150 150 150 
##$TP07= 0
##$TPNAME0= <>
##$TPNAME1= <>
##$TPNAME2= <>
##$TPNAME3= <>
##$TPNAME4= <>
##$TPNAME5= <>
##$TPNAME6= <>
##$TPNAME7= <>
##$TPOAL= (0..7)
0.5 0.5 0.5 0.5 0.5 0.5 0.5 0.5 
##$TPOFFS= (0..7)
0 0 0 0 0 0 0 0 
##$TUNHIN= 0
##$TUNHOUT= 0
##$TUNXOUT= 0
##$USERA1= <user>
##$USERA2= <user>
##$USERA3= <user>
##$USERA4= <user>
##$USERA5= <user>
##$V9= 5
##$VALIST= <valist>
##$VCLIST= <CCCCCCCCCCCCCCC>
##$VD= 0
##$VDLIST= <DDDDDDDDDDDDDDD>
##$VPLIST= <PPPPPPPPPPPPPPP>
##$VTLIST= <TTTTTTTTTTTTTTT>
##$WBST= 1024
##$WBSW= 4
##$XGAIN= (0..3)
0 0 0 0 
##$XL= 0
##$YL= 0
##$YMAX_a= 80684
##$YMIN_a= -122746
##$ZGOPTNS= <>
##$ZL1= 120
##$ZL2= 120
##$ZL3= 120
##$ZL4= 120
##$ABSF1= 0
##$ABSF2= 0
##$ABSG= 0
##$ABSL= 0
##$ALPHA= 0
##$AQORDER= 0
##$ASSFAC= 0
##$ASSFACI= 0
##$ASSFACX= 0
##$ASSWID= 0
##$AUNMP= <proc_1d>
##$AZFE= 0.1
##$AZFW= 0.1
##$BCFW= 0
##$BC_mod= 2
##$BYTORDP= 0
##$COROFFS= 0
##$CY= -3
##$DATMOD= 1
##$DC= 0
##$DFILT= <>
##$DTYPP= 0
##$F1P= 0
##$F2P= 0
##$FCOR= 1
##$FTSIZE= 16384
##$FT_mod= 6
##$GAMMA= 0
##$GB= 0
##$INTBC= 1
##$INTSCL= 3.241238e-09
##$ISEN= 128
##$LB= 0.25
##$LEV0= 0
##$LPBIN= 0
##$MAXI= 10000
##$MC2= 0
##$MEAN= 0
##$ME_mod= 0
##$MI= 1.114404
##$NCOEF= 0
##$NC_proc= -7
##$NLEV= 6
##$NOISF1= 3.799351
##$NOISF2= 2.8
##$NSP= 0
##$NTH_PI= 0
##$NZP= 0
##$OFFSET= 15.49899
##$PC= 1
##$PHC0= -7254.183
##$PHC1= 2.82197
##$PH_mod= 1
##$PKNL= yes
##$PPARMOD= 0
##$PSCAL= 0
##$PSIGN= 0
##$REVERSE= no
##$SF= 200.130004546282
##$SI= 16384
##$SIGF1= 3
##$SIGF2= 2
##$SINO= 0.751879
##$SIOLD= 32768
##$SREGLST= <19F.Aceton>
##$SSB= 0
##$STSI= 16384
##$STSR= 0
##$SW_p= 3612.71676300578
##$SYMM= 0
##$S_DEV= 0
##$TDeff= 16384
##$TDoff= 0
##$TI= <>
##$TILT= no
##$TM1= 0
##$TM2= 0
##$TOPLEV= 0
##$USERP1= <user>
##$USERP2= <user>
##$USERP3= <user>
##$USERP4= <user>
##$USERP5= <user>
##$WDW= 1
##$XDIM= 16384
##$YMAX_p= 294810830
##$YMIN_p= -604239
$$ End of Bruker specific parameters
$$ ---------------------------------
##NTUPLES= NMR SPECTRUM
##VAR_NAME=  FREQUENCY,     SPECTRUM/REAL,   SPECTRUM/IMAG
##SYMBOL=    X,             R,               I
##VAR_TYPE=  INDEPENDENT,   DEPENDENT,       DEPENDENT
##VAR_FORM=  AFFN,          ASDF,            ASDF
##VAR_DIM=   16384,         16384,           16384
##UNITS=     HZ,            ARBITRARY UNITS, ARBITRARY UNITS
##FACTOR=    0.220516191357247, 1,           1
##FIRST=     3101.81295095022, 0,            0
##LAST=      -510.903812055558, 0,           0
##MIN=       -510.903812055558, -604239,     0
##MAX=       3101.81295095022, 294810830,    0
$$ Real data points
##PAGE= N=1
##DATA TABLE= (X++(R..R)), XYDATA
$$ [...]
$$ plain form
8998 78494 181919 270220 239729 288800 250021 252126 233994 296701 128911 320578 242167
8987 242167 400667 190347 122623 208722 208147 287888 124751 268785 210515 401955 425123
8976 425123 339943 203912 121242 216346 183747 -7741 -26459 24147 112372 285078 267745
8965 267745 272734 184349 364078 273033 186538 258877 274882 374111 220582 119529 106870
8954 106870 406106 297175 216138 359091 452001 276061 253951 377971 469073 389416 361002
8943 361002 275421 363220 427867 389121 315914 418636 450733 273415 216504 285865 291540
8932 291540 280972 238867 285174 265323 230493 67536 77248 147188 297065 439120 516301
8921 516301 584096 300595 264960 334568 438277 506059 500612 437587 432881 452641 474390 284468
$$ packed form
8998G8494J03425Q8301l0491M9071l8779K105j8132O2707j67790J91667p8411
8987B42167J58500k10320o7724Q6099n75P9741j63137J44034n8270J91440K3168
8976D25123q5180j36031q2670R5104l2599j91488j8718N0606Q8225J72706j7333
8965B67745M989q8385J79729r1045q6495P2339J6005R9229j53529j01053j2659
8954A06870K99236j08931q1037J42953R2910j75940k2110J24020R1102p9657k8414
8943C61002q5581Q7799O4647l8746p3207J02722L2097j77318n6911O9361N675
8932B91540j0568m2105M6307j9851l4830j62957R712O9940J49877J42055P7181
8921E16301O7795k83501l5635O9608J03709O7782n447o3025m706J9760K1749j89922
$$ plain form
8909 284468 300405 301336 348217 227907 254596 459366 509769 506714 440301 573511 482519 276166
8897 276166 285031 274287 320132 181051 340508 417280 446975 437414 328221 493199 576996
8886 576996 547757 454418 587586 705624 566548 546602 538841 725294 688288 544539 600774
8875 600774 664665 765524 559773 461458 516741 461321 538378 554495 504002 471972 516133
8864 516133 587037 617540 675204 656489 627463 728753 837408 519911 511749 686011 527885
8853 527885 576886 524956 559997 522097 770796 802259 651588 558096 576181 771494 906037
8842 906037 868645 875962 976263 831661 720605 623451 733851 825283 686027 586968 697025
8831 697025 864392 862012 793663 910711 1033726 1188954 1115366 1094339 1198644 1133044 1186128
$$ packed form
8909B84468J5937R31M6881j20310K6689K04770N0403l055o6413J33210r0992k06353
8897B76166Q865j0744M5845j39081J59457P6772K9695r561j09193J64978Q3797
8886E76996k9239r3339J33168J18038j39076j9946p761J86453l7006j43749N6235
8875F00774O3891J00859k05751r8315N5283n5420P7057J6117n0493l2030M4161
8864E16133P0904L0503N7664j8715k9026J01290J08655l17497q162J74262j58126
8853E27885M9001n1930L5041l7900K48699L1463j50671r3492J8085J95313J34543
8842I06037l7392P317J00301j44602j11056r7154J10400R1432j39256r9059J10057
8831F97025J67367k380o8349J17048J23015J55228p3588k1027J04305o5600N3084
$$ plain form
8820 1186128 1285390 1250691 1241306 1161383 1093936 987091 1085694 1032032 931755 1137526 1178329
8809 1178329 1439815 1469666 1451974 1399502 1372293 1428829 1394254 1485442 1587669 1577391 1457891
8798 1457891 1430176 1616366 1596047 1496014 1660161 1736304 1821070 1742593 1809383 2023704 2073544
8787 2073544 2018205 1991622 2388179 2291292 2208484 2381590 2424539 2528765 2436263 2372536 2367375
8776 2367375 2527061 2529211 2589607 2744083 2958993 3099991 3135391 2909695 3059073 3150383
8766 3150383 3344287 3527050 3463151 3514408 3599748 3931371 3984829 4127603 4234208 4272569
8756 4272569 4328734 4260357 4413162 4595173 4955402 5146839 5316052 5619790 5689556 5754145
8746 5754145 5941479 6263692 6469577 6642935 6974127 7261955 7409343 7543309 7834957 8308734
$$ packed form
8820A186128R9262l4699r385p9923o7447j06845R8603n3662j00277K05771M0803
8809A178329K61486K9851j7692n2472k7209N6536l4575R1188J02227j0278j19500
8798A457891k7715J86190k0319j00033J64147P6143Q4766p8477O6790K14321M9840
8787B073544n5339k6583L96557r6887q2808J73106M2949J04226r2502o3727n161
8776B367375J59686K150O0396J54476K14910J40998L5400k25696J49378R1310
8766C150383J93904J82763o3899N1257Q5340L31623N3458J42774J06605L8361
8756D272569N6165o8377J52805J82011L60229J91437J69213L03738O9766O4589
8746E754145J87334L22213K05885J73358L31192K87828J47388J33966K91648M73777
$$ plain form
8736 8308734 8608011 8695289 9051404 9540474 10081786 10346795 10757051 11319113 11652274 12109813
8726 12109813 12305282 12737506 13248525 13582253 13883746 14156473 14589522 14802176 15138048
8717 15138048 15395738 15542993 15898634 15963759 15997215 16243782 16459990 16611231 16438031 16299362
8707 16299362 16216477 16093544 15956756 15752366 15693885 15492938 14932919 14383727 14305307 14114254
8697 14114254 13579481 13165287 12939136 12751803 12317049 11906344 11433284 10940020 10886312 10596980
8687 10596980 10245594 9904379 9522211 9217261 8906730 8561391 8393427 8159945 7797993
8678 7797993 7554673 7296076 7052139 6812684 6602320 6554699 6369637 6192076 6054095 5961083
8668 5961083 5641089 5472116 5347138 5040526 4968198 4778048 4590190 4340716 4123730 4209462
$$ packed form
8736H308734K99277Q7278L56115M89070N41312K65009M10256N62062L33161M57539
8726A2109813J95469M32224N11019L33728L01493K72727M33049K12654L35872
8717A5138048K57690J47255L55641O5125L3456K46567K16208J51241j73200j38669
8707A6299362q2885j22933j36788k04390n8481k00947n60019n49192p8420j91053
8697A4114254n34773m14194k26151j87333m34754m10705m73060m93264n3708k89332
8687A0596980l51386l41215l82168l04950l10531l45339j67964k33482l61952
8678G797993k43320k58597k43937k39455k10364m7621j85062j77561j37981r3012
8668E961083l19994j68973j24978l06612p2328j90150j87858k49474k16986Q5732
$$ plain form
8658 4209462 4225641 4039559 3842672 3862020 3865958 3576382 3497565 3595544 3540577 3354802 3232911
8647 3232911 3070297 2925948 2820058 2634548 2684061 2642897 2599151 2478243 2380073 2536065
8637 2536065 2398955 2428633 2271772 2434519 2475419 2453754 2255440 2173682 2166173 2111169 2135631
8626 2135631 2031073 2038579 1865432 1699393 1551924 1740537 1726885 1724302 1743903 1866330 1814458
8615 1814458 1499935 1628988 1770848 1729106 1679300 1697160 1643659 1673277 1610538 1378390 1483388
8604 1483388 1617209 1576623 1380507 1467086 1358063 1288883 1368214 1384906 1316505 1350179 1381270
8593 1381270 1175966 1079145 1193999 1209846 1303094 1414569 1388457 1192411 1141790 1019330
8583 1019330 1008294 788753 906655 1104909 1068369 1296181 1095500 1167976 1183980 1191839 1008981
$$ packed form
8658D209462J6179j86082j96887J9348L938k89576p8817R7979n4967j85775j21891
8647C232911j62614j44349j05890j85510M9513m1164m3746j20908r8170J55992
8637B536065j37110K9678j56861J62747M0900k1665j98314q1758p509n5004K4462
8626B135631j04558P506j73147j66039j47469J88613j3652k583J9601J22427n1872
8615A814458l14523J29053J41860m1742m9806J7860n3501K9618o2739k32148J04998
8604A483388J33821m0586j96116Q6579j09023o9180P9331J6692o8401L3674L1091
8593A381270k05304r6821J14854J5847R3248J11475k6112j96046n0621j22460
8583A019330j1036k19541J17902J98254l6540K27812k00681P2476J6004P859j82858
$$ plain form
8572 1008981 902844 1069576 1131727 1134735 1069348 1164274 1207806 1306692 1184792 1181486 1232132
8561 1232132 1229347 1200086 1373725 1578818 1631146 1777191 1677621 2097081 2327468 2758700
8551 2758700 3269108 3877044 4914889 6025271 7655158 9196912 9829612 9304116 8571575
8542 8571575 7801244 6818939 5741105 4822996 3980463 3402325 2889559 2635307 2351622
8533 2351622 1912263 1862214 1717673 1615372 1325215 1477394 1334346 1173944 1067341 906157
8523 906157 925717 888332 891618 1049020 1108504 1070013 965880 978482 955824 911713 805847
8512 805847 884562 1107270 948822 697586 653452 691433 760676 692649 589083 576205 617789
8501 617789 545792 523004 570637 716575 682926 569593 418537 458988 439497 185158 338930
$$ packed form
8572A008981j06137J66732O2151L008o5387R4926M3532R8886j21900l306N0646
8561A232132k785k9261J73639K05093N2328J46045r9570M19460K30387M31232
8551B758700N10408O07936J037845J110382J629887J541754O32700n25496p32541
8542H571575p70331r82305j077834r18109q42533n78138n12766k54252k83685
8533B351622m39359n0049j44541j02301k90157J52179j43048j60402j06603j61184
8523I06157J9560l7385L286J57402N9484l8491j04133J2602k2658m4111j05866
8512H05847P8715K22708j58448k51236m4134L7981O9243o8027j03566j2878M1584
8501F17789p1997k2788M7633J45938l3649j13333j51056M0451j9491k54339J53772
$$ plain form
8490 338930 439437 502695 298292 215673 330756 448517 356516 293703 191746 323498
8480 323498 483218 435202 350627 365554 424318 377087 547211 442153 560571 482605 317925
8469 317925 199957 282847 556436 358163 493651 410984 494950 371989 155749 91624
8459 91624 284053 369132 421781 497923 414200 290782 155106 231852 353663 479863 421083
8448 421083 344434 334589 216623 128313 283284 515770 349949 338113 415414 310591 327899
8437 327899 215904 439534 448820 365377 364906 92282 -44193 -43814 12717 13822 66551 81917
8425 81917 46435 -61894 -6201 143383 331875 227569 318517 299008 187438 249470 124858
8414 124858 153841 7180 104247 74082 175534 284741 101157 10195 -2230 218119 264567
$$ packed form
8490C38930J00507O3258k04403q2619J15083J17761r2001o2813j01957J31752
8480C23498J59720m8016q4575J4927N8764m7231J70124j05058J18418p7966j64680
8469C17925j17968Q2890K73589j98273J35488q2667Q3966j22961k16240o4125
8459I1624J92429Q5079N2649P6142q3723j23418j35676P6746J21811J26200n8780
8448D21083p6649r845j17966q8310J54971K32486j65821j1836P7301j04823J7308
8437C27899j11995K23630R286q3443m71k72624j36475L79N6531J105N2729J5366
8425H1917l5482j08329N5693J49584J88492j04306R0948j9509j11570O2032j24612
8414A24858K8983j46661R7067l0165J01452J09207j83584r0962j2425K20349M6448
$$ plain form
8403 264567 170093 40221 15744 231201 225214 105781 204198 301327 277488 207689 88895
8392 88895 -14139 -94592 172016 182519 288600 246959 95189 181768 268610 399794 290266
8381 290266 220216 165885 158307 220721 139307 87851 276189 315484 209438 183471 228767
8370 228767 196664 -6020 157621 264934 395046 378024 93240 130329 107681 -56524
8360 -56524 -165140 129647 248534 168723 10195 56388 108288 182415 47668 25943 251938
8349 251938 241193 127841 -13668 134902 282988 328900 217048 202851 245168 98803
8339 98803 -5436 100048 274984 270307 87283 102526 165840 106834 -148427 -80062 -932
8328 -932 32125 83675 68157 175323 217533 136102 37158 -16877 164506 131011 -27203 -61255
$$ packed form
8403B64567r4474j29872k4477K15457n987j19433R8417R7129k3839o9799j18794
8392H8895j03034q0453K66608J0503J06081m1641j51770Q6579Q6842J31184j09528
8381B90266p0050n4331p578O2414q1414n1456J88338L9295j06046k5967M5296
8370B28767l2103k02684J63641J07313J30112j7022k84784L7089k2648j64205
8360e6524j08616K94787J18887p9811j58528M6193N1900P4127j34747k1725K25995
8349B51938j0745j13352j41509J48570J48086M5912j11852j4197M2317j46365
8339I8803j04239J05484J74936m677j83024J5243O3314n9006k55261O8365P9130
8328i32L3057N1550j5518J07166M2210q1431r8944n4035J81383l3495j58214l4052
$$ plain form
8316 -61255 -86286 -48055 -236984 -111189 -42668 166442 248957 -94111 124132 326000 349599
8305 349599 247627 267851 415331 166931 -179991 -266188 -58566 29707 15118 -83012 -108758
8294 -108758 161379 -72318 -211756 89557 315520 309315 -16618 35089 247170 217504
8284 217504 7614 -76638 118781 216378 161086 -141558 -91112 95907 83788 68143 99110
8273 99110 270238 84912 54765 116828 283996 366200 270607 110203 317729 260315 207983
8262 207983 -6877 -129724 168930 69604 -90362 -45461 162093 -31796 -214714 -151830
8252 -151830 243141 278800 156732 -8318 130381 173463 31076 106615 150368 332444
8242 332444 214184 64178 -22487 168632 102135 -32996 -27613 76168 124001 -42983 -71152
$$ packed form
8316f1255k5031L8231j88929J25795O8521K09110Q2515l43068K18243K01868K3599
8305C49599j01972K0224J47480k48400l46922q6197K07622Q8273j4589r8130k5746
8294a08758K70137k33697j39438L01313K25963o205l25933N1707K12081k9666
8284B17504k09890q4252J95419R7597n5292l02644N0446J87019j2119j5645L0967
8273I9110J71128j85326l0147O2063J67168Q2204r5593j60404K07526n7414n2332
8262B07983k14860j22847K98654r9326j59966M4901K07554j93889j82918O2884
8252a51830L94971L5659j22068j65050J38699M3082j42387P5539M3753J82076
8242C32444j18260j50006q6665J91119o6497j35131N383J03781M7833j66984k8169
$$ plain form
8231 -71152 70773 313163 159228 74759 144014 298092 315835 125173 34041 14549 59969
8220 59969 -198244 -112642 16674 168983 -183486 -133951 81268 91843 127254 -229790 -97377
8209 -97377 -16623 42115 19045 9840 98287 129329 -109256 -374988 -124383 16631 -157213
8198 -157213 -102096 64372 -159285 -149266 -144596 53985 1890747 1189998 258565 450527
8188 450527 480798 437626 151977 57499 181139 438271 109478 -26008 -36924 265677
8178 265677 107387 37105 242295 496744 384429 88200 92017 204500 195831 63339 7037
8167 7037 192400 357650 92984 -48848 54971 -28068 14720 -70265 173170 337365 161419
8156 161419 -43212 -36365 249378 357786 196197 -5132 74396 210640 52751 -156478
$$ packed form
8231g1152J41925K42390j53935q4469O9255J54078J7743j90662r1132j9492M5420
8220E9969k58213Q5602J29316J52309l52469M9535K15219J0575L5411l57044J32413
8209i7377Q0754N8738k3070r205Q8447L1042k38585k65732K50605J41014j73844
8198a57213N5117J66468k23657J0019M670J98581J836762p00749r31433J91962
8188D50527L0271m3172k85649r4478J23640K57132l28793j35486j0916L02601
8178B65677j58290p0282K05190K54449j12315k96229L817J12483q669j32492n6302
8167G037J85363J65250k64666j41832J03819q3039M2788q4985K43435J64195j75946
8156A61419k04631O847K85743J08408j61589k01329P9528J36244j57889k09229
$$ plain form
8146 -156478 -73517 224249 130061 -117649 30082 66366 42573 62904 125154 245757 145445
8135 145445 -28247 -154061 -5760 -84 -92973 -88440 85281 326519 110562 -1623 -80069
8124 -80069 49595 99767 28741 16282 88100 231848 148894 -59021 58347 234684 125159
8113 125159 6810 3345 84347 113238 97538 156155 307544 363647 -83410 -116355 76842
8102 76842 56581 -178317 -159391 101287 253214 137590 -145870 52414 211989 276748
8092 276748 120504 119044 241337 370399 82036 -179360 -48620 86146 84149 -172268
8082 -172268 26319 131427 -17378 -113420 82353 223020 116617 127529 248533 238925
8072 238925 246188 31526 -113257 127353 199323 3935 -209212 84890 92639 -59050 -205496
$$ packed form
8146a56478Q2961K97766r4188k47710J47731L6284k3793K0331O2250J20603j00312
8135A45445j73692j25814J48301N676r2889M533J73721K41238k15957j12185p8446
8124h0069J29664N0172p1026j2459P1818J43748q2954k07915J17368J76337j09525
8113A25159j18349l465Q1002K8891j5700N8617J51389N6103m47057l2945J93197
8102G6842k0261k34898J8926K60678J51927j15624k83460J98284J59575O4759
8092B76748j56244j460J22293J29062k88363k61396J30740J34766j997k56417
8082a72268J98587J05108j48805r6042J95773J40667j06403J0912J21004r608
8072B38925P263k14662j44783K40610P1970j95388k13147K94102P749j51689j46446
$$ plain form
8061 -205496 83345 273743 165304 15389 -1434 157643 244531 182191 105532 89857 87930
8050 87930 -41929 -163121 -77766 -85760 -96437 -146003 -44436 144876 6537 98698 45136
8039 45136 237650 224784 188746 70306 -56656 54726 -99991 39977 60224 274031
8029 274031 -27124 -130618 -166140 17259 88824 124243 50878 -15393 -7849 -336928 -138498
8018 -138498 -34240 157021 61113 185611 194042 83460 -10279 -137389 131402 95123 123717
8007 123717 -121305 102943 259451 148706 8028 17748 199865 281091 311259 88456
7997 88456 93204 212719 257927 19116 23915 142280 60163 -7712 -46485 57273 -128601
7986 -128601 -91581 8643 38248 180766 73617 -19105 -18465 80499 128432 130348 105852 166870
$$ packed form
8061b05496K88841J90398j08439j49915j6823J59077Q6888o2340p6659j5675j927
8050H7930j29859j21192Q5355p994j0677m9566J01567J89312j38339R2161n3562
8039D5136J92514j2866l6038j18440j26962J11382j54717J39968K0247K13807
8029B74031l01155j03494l5522J83399P1565L5419p3365o6271P544l29079J98430
8018a38498J04258J91261r5908J24498Q431j10582r3739j27110K68791l6279K8594
8007A23717k45022K24248J56508j10745j40678R720J82117Q1226L0168k22803
7997H8456M748J19515M5208k38811M799J18365q2117o7875l8773J03758j85874
7986a28601L7020J00224K9605J42518j07149r2722O40R8964M7933J916k4496O1018
$$ plain form
7974 166870 77930 -25989 -25996 22779 152017 127434 215049 126738 140033 43883 -79347 92509
7962 92509 370691 347840 240313 277102 143366 319992 175945 228641 188667 259252 212094
7951 212094 -32735 71608 -110785 -31157 -32446 150941 145347 154878 63868 24207 -23495
7940 -23495 -2230 -51091 133204 204364 67324 265012 -22036 181211 163253 165171 112030
7929 112030 -21413 33548 -101385 -52203 34597 194428 248536 155845 200926 150013 45544
7918 45544 156265 271314 285177 209346 123287 123000 993 15293 66222 102851 106017 50227
7906 50227 169058 204361 64191 50456 237487 319296 263737 270110 202484 91869 -138667
7895 -138667 -233091 -21466 155195 237773 21349 70333 47913 73268 134397 46686 223638
$$ packed form
7974A66870q8940j03919pM8775J29238k4583Q7615q8311J3295r6150j23230J71856
7962I2509K78182k2851j07527L6789j33736J76626j44047N2696l9974P0585m7158
7951B12094k44829J04343j82393P9628j289J83387n594R531r1010l9661m7702
7940b3495K1265m8861J84295P1160j37040J97688k87048K03247j7958J918n3141
7929A12030j33443N4961j34933M9182Q6800J59831N4108r2691M5081n0913j04469
7918D5544J10721J15049J3863p5831q6059k87j22007J4300N0929L6629L166n5790
7906E0227J18831L5303j40170j3735J87031Q1809n5559O373o7626j10615k30536
7895a38667r4424K11625J76661Q2578k16424M8984k2420K5355O1129q7711J76952
$$ plain form
7884 223638 284633 72160 -71605 79773 18202 186682 134456 177873 61589 47496 3330
7873 3330 88768 97725 79313 91915 -16643 -31742 -86023 -105996 -3173 167500 327105
7862 327105 323606 128863 59093 34579 -64776 26656 73480 -74251 74016 151705 82146
7851 82146 152628 240911 224691 98968 287714 203788 36431 102512 169556 146132 72598
7840 72598 204621 193956 56649 -111183 -115515 -205639 631 -74305 -19790 -106209 -55666
7829 -55666 -53695 -100660 -75328 -61600 51758 179862 164877 176416 201859 102236 227399
7818 227399 -63873 -85401 -118106 -95743 -44763 -206318 -32449 -56336 174011 69514 228331
7807 228331 142628 91240 -113232 -8029 -46313 -121327 196254 3819 57495 -27120 125334
$$ packed form
7884B23638O0995k12473j43765J51378o1571J68480n2226M3417j16284j4093m4166
7873C330Q5438Q957j8412J2602j08558j5099n4281j9973J02823J70673J59605
7862C27105l499j94743o9770k4514r9355R1432M6824j47731J48267P7689o9559
7851H2146P0482Q8283j6220j25723J88746q3926j67357O6081O7044k3424p3534
7840G2598J32023j0665j37307j67832m332r0124K06270p4936N4515q6419N0543
7829e5666J971m6965K5332J3728J13358J28104j4985J1539K5443r9623J25163
7818B27399k91272k1528l2705K2363N0980j61555J73869k3887K30347j04497J58817
7807B28331q5703n1388k04472J05203l8284p5014L17581j92435N3676q4615J52454
$$ plain form
7796 125334 -19474 160183 127611 168043 133301 154427 166208 51382 114797 141139 466812
7785 466812 187884 113537 -132201 21393 51430 46181 61229 182032 303630 154669 132493
7774 132493 87651 276024 304785 531154 612017 553604 366786 245918 345501 340697 400974
7763 400974 403135 400885 328838 164237 -3507 -149881 83647 170940 185837 136376 -27372
7752 -27372 -7412 108411 168360 257215 470200 522344 539367 564168 542226 743053 985534
7741 985534 1134746 1151536 1046209 977801 817950 531843 657122 463646 458358 527806 395725
7730 395725 425048 347708 427955 192753 280008 237578 178599 209011 -197 268232 188204
7719 188204 200326 218549 555612 464565 309106 371616 612283 890240 1165890 1206448 1275148
$$ packed form
7796A25334j44808J79657l2572M0432l4742K1126J1781j14826O3415K6342L25673
7785D66812k78928p4347k45738J53594L0037n249J5048J20803J21598j48961k2176
7774A32493m4842J88373K8761K26369Q0863n8413j86818j20868R9583m804O0277
7763D00974K161k250p2047j64601j67744j46374K33528Q7293J4897m9461j63748
7752b7372J9960J15823N9949Q8855K12985N2144J7023K4801k1942K00827K42481
7741I85534J49212J6790j05327o8408j59851k86107J25279j93476n288O9448j32081
7730C95725K9323p7340Q0247k35202Q7255m2430n8979L0412k09208K68429q0028
7719A88204J2122J8223L37063r1047j55459O2510K40667K77957K75650M0558O8700
$$ plain form
7708 1275148 1330799 1272105 1145938 742718 729591 573549 435916 258352 449383 377376
7698 377376 146154 212495 320195 485545 379338 368989 239434 179508 272219 289705 457135
7687 457135 612930 488132 350457 64078 88369 267107 259039 324077 455203 510297 325028
7676 325028 278710 352150 377678 381162 377820 234798 331763 203157 5586 -11739 15658
7665 15658 142758 140407 186830 30602 -24200 -34334 91069 151214 286464 209421 249977
7654 249977 408696 193478 124106 78214 48991 -36887 321223 130788 221557 93483 -4061
7643 -4061 -56722 7478 125342 97512 206959 224623 295342 44450 134607 350385 342619
7632 342619 227066 222458 208280 29233 -21834 68591 203652 43360 -14314 -106122 -159173
$$ packed form
7708A275148N5651n8694j26167m03220j3127j56042j37633j77564J91031p2007
7698C77376k31222O6341J07700J65350j06207j0349j29555n9926R2711J7486J67430
7687D57135J55795j24798j37675k86379K4291J78738q068O5038J31126N5094j85269
7676C25028m6318P3440K5528L484l342j43022R6965j28606j97571j7325K7397
7665A5658J27100k351M6423j56228n4802j0134J25403O0145J35250p7043M0556
7654B49977J58719k15218o9372m5892k9223q5878L58110j90435R0769j28074r7544
7643d061n2661O4200J17864k7830J09447J7664P0719k50892R0157K15778p766
7632C42619j15553m608j4178j79047n1067R0425J35061j60292n7674r1808n3051
$$ plain form
7621 -159173 -181459 -61510 80089 211096 222949 15699 -42583 20080 152121 17138
7611 17138 14334 115828 57008 104830 52679 76933 -15741 78571 109534 -96170 -29481 51604
7599 51604 71815 36371 142873 27228 103130 150581 197563 268969 203059 113041 13546
7588 13546 203480 96518 23636 62399 21353 -78377 -82569 178206 -7844 129138 94365
7577 94365 11445 -88002 133841 282247 261794 303780 47535 -72932 -153197 -125746 -154824
7566 -154824 21386 104934 118785 -54893 -118987 -188306 -24156 22271 97974 239200 110353
7555 110353 103581 52676 90952 65838 253465 210281 110112 104981 94624 9716 -91404
7544 -91404 5413 189823 30789 136490 250780 165254 124567 110610 76448 -30023 -66046
$$ packed form
7621a59173k2286J19949J41599J31007J1853k07250n8282O2663J32041j34983
7611A7138k804J01494n8820M7822n2151K4254r2674R4312L0963k05704O6689Q1085
7599E1604K0211l5444J06502j15645P5902M7451M6982P1406o5910r0018r9495
7588A3546J89934j06962p2882L8763m1046r9730m192K60775j86050J36982l4773
7577I4365q2920r9447K21843J48406k0453M1986k56245j20467q0265K7451k9078
7566a54824J76210Q3548J3851j73678o4094o9319J64150M6427P5703J41226j28847
7555A10353o772n0905L8276k5114J87627m3184j00169n131j0357q4908j01120
7544i1404R6817J84410j59034J05701J14290q5526m0687j3957l4162j06471l6023
$$ plain form
7533 -66046 -42217 31915 -78773 -141415 -34857 15080 -30923 -14021 -65932 -63722 -34493 -72674
7521 -72674 -63536 10405 164120 126536 145154 171308 228948 -15431 -93375 57884 -29588
7510 -29588 -106813 113823 244475 -71321 -93644 -106342 18621 62242 162573 122001 -35774
7499 -35774 65060 -33339 6022 43352 217392 124704 -134413 -143120 -63407 -33530 -118057
7488 -118057 74574 68160 168055 87745 51513 18862 247861 250809 155870 -12341 140179
7477 140179 104031 120852 68100 -89256 128711 61348 106356 -53676 14396 -47752 126340
7466 126340 101572 92502 100953 60600 100258 155225 179558 137377 57483 139275 219913 -22362
7454 -22362 -118523 -153734 -80376 -68332 150087 -12386 71125 98601 15965 30256 109942
$$ packed form
7533f6046K3829P4132j10688o2642J06558M9937m6003J6902n1911K210K9229l8181
7521g2674R138P3941J53715l7584J8618K6154N7640k44379p7944J51259q7472
7510b9588p7225K20636J30652l15796k2323j2698J24963M3621J00331m0572j57775
7499c5774J00834r8399L9361L7330J74040r2688k59117q707P9713K9877q4527
7488a18057J92631o414R9895q0310l6232l2651K28999K948r4939j68211J52520
7477A40179l6148J6821n2752j57356K17967o7363M5008j60032O8072o2148J74092
7466A26340k4768r070Q451m0353L9658N4967K4333m2181p9894Q1792Q0638k42275
7454b2362r6161l5211P3358J2044K18419j62473Q3511K7476q2636J4291P9686
$$ plain form
7443 109942 369043 286176 279831 111737 139197 9425 -59234 -187466 545 -87403 -158252
7432 -158252 -63306 -94623 4827 -119913 -12903 93061 198070 56040 82653 -34424
7422 -34424 75897 290572 115716 136767 191097 184060 -65721 -62668 17666 83170 -28373
7411 -28373 -69071 -156568 -145249 -52440 -43037 61289 100857 318683 167685 58889 157949
7400 157949 171331 45023 80541 108807 38801 -148372 -95456 -105415 -307792 -140961 -12432
7389 -12432 129251 1146 164441 -7114 -107377 28903 55249 213811 88751 112307
7379 112307 145098 78268 -132775 -181880 -26393 14474 -110666 -207219 -267361 -210184 -138934
7368 -138934 -34301 -47897 116507 301707 152818 -82072 12025 73550 54062 96489 90212
$$ packed form
7443A09942K59101q2867o345j68094K7460j29772o8659j28232J88011q7948p0849
7432a58252R4946l1317R9450j24740J07010J05964J05009j42030K6613j17077
7422c4424J10321K14675j74856K1051N4330p037k49781L053Q0334O5504j11543
7411b8373m0698q7497J1319R2809R403J04326L9568K17826j50998j08796R9060
7400A57949J3382j26308L5518K8266p0006j87173N2916r959k02377J66831J28529
7389a2432J41683j28105J63295j71555j00263J36280K6346J58562j25060K3556
7379A12307L2791o6830k11043m9105J55487M0867j25140r6553o0142N7177P1250
7368a38934J04633j3596J64404J85200j48889k34890R4097O1525j9488M2427o277
$$ plain form
7357 90212 81213 -39045 -18543 -112156 13662 -20925 -55785 -6020 76576 148192 -159049
7346 -159049 -93794 66115 207125 145083 191365 224822 107954 1619 21947 -4317 84998
7335 84998 189951 143659 126294 -22177 146724 115214 59194 100601 244118 260334 115925
7324 115925 120031 49333 -43408 50121 166004 65164 36946 -17067 -29431 -110052 79238
7313 79238 204959 106366 100930 102168 63649 123292 153011 200923 321497 362681 487369 333109
7301 333109 291417 221759 314049 203631 147116 186229 197928 205772 122369 30995 43175 162906
7289 162906 36802 43766 -118093 3178 11049 -35931 10422 88585 104731 -83192 -102060
7278 -102060 -96523 -230991 -98366 272335 347457 273074 63216 69154 78223 83055 154980 377043
$$ packed form
7357I0212q999j20258K0502r3613J25818l4587l4860M9765Q2596P1616l07241
7346a59049O5255J59909J41010o2042M6282L3457j16868j06335K0328k6264Q9315
7335H4998J04953m6292j7365j48471J68901l1510n6020M1407J43517J6216j44409
7324A15925M106p0698r2741R3529J15883j00840k8218n4013j2364q0621J89290
7313G9238J25721r8593n436J238l8519N9643K9719M7912J20574M1184J24688j54260
7301C33109m1692o9658R2290j10418n6515L9113J1699P844q3403r1374J2180J19731
7289A62906j26104O964j61859J21271P871m6980M6353P8163J6146j87923j8868
7278a02060N537j34468J32625L70701P5122p4383k09858N938R069M832P1925K22063
$$ plain form
7266 377043 165158 73689 132225 94853 11083 -25211 38478 -19975 150159 133172 -14649
7255 -14649 -96961 60985 67703 168084 326546 146417 84029 -35562 93093 178279 81117
7244 81117 22301 163623 139734 -52398 -96636 -15413 -120440 -200708 -60644 9958 72915
7233 72915 72682 147318 -30376 108330 82304 228664 150281 237943 85360 -7409 183558
7222 183558 22295 135944 222571 342892 80469 -148086 -57564 -28342 -63249 82940
7212 82940 197765 164116 -19872 36467 43868 -1640 230263 174243 27579 -171928 -202288
7201 -202288 -56910 52890 -22282 16669 138015 -57123 68677 -39871 123084 161793
7191 161793 188951 191304 138993 196476 169602 73286 -64939 113165 15981 134907 92709
$$ packed form
7266C77043k11885r1469N8536l7372q3770l6294O3689n8453J70134j6987j47821
7255a4649q2312J57946O718J00381J58462j80129o2388j19591J28655Q5186r7162
7244H1117n8816J41322k3889j92132m4238Q1223j05027q0268J40064P0602O2957
7233G2915k33P4636j77694J38706k6026J46360p8383Q7662j52583r2769J90967
7222A83558j61263J13649Q6627J20321k62423k28555R0522K9222l4907J46189
7212H2940J14825l3649j83988N6339P401m5508K31903n6020j46664j99507l0360
7201b02288J45378J09800p5172L8951J21346j95138J25800j08548J62955L8709
7191A61793K7158K353n2311N7483k6874r6316j38225J78104r7184J18926m2198
$$ plain form
7180 92709 -87828 -138011 -147645 -86033 28292 -19908 -22023 123588 102596 230913 33912
7169 33912 132482 183320 186509 91501 -497 -46753 -53162 21371 -81942 142369 216535 73508
7157 73508 -2568 71039 122636 241241 237229 254427 160510 155391 -137778 28616 39608 57541
7145 57541 139556 11377 226375 26499 -103266 -59091 45910 61510 36045 15601 90266
7134 90266 50615 84300 23561 97342 190924 117791 19649 -118652 11274 61328 -56259
7123 -56259 -56327 29098 133132 31184 41538 131314 11535 -84177 961 154957 226297 94782
7111 94782 -26821 6366 10991 88924 57174 -16958 -40789 47054 -148492 -205096 -28428
7100 -28428 167447 214222 96578 119840 206850 123373 -34033 -71302 143767 209556 137338
$$ packed form
7180I2709j80537n0183r634O1612J14325m8200k115J45611k0992J28317j97001
7169C3912R8570N0838L189r5008r1998m6256o409P4533j03313K24311P4166j43027
7157G3508p6076P3607N1597J18605m012J7198r3917n119k93169J66394J0992J7933
7145E7541Q2015j28179K14998j99876j29765M4175J05001J5600k5465k0444P4665
7134I0266l9651L3685o0739P3781R3582p3133r8142j38301J29926N0054j17587
7123e6259o8Q5425J04034j01948J0354Q9776j19779r5712Q5138J53996P1340j31515
7111I4782j21603L3187M625P7933l1750p4132k3831Q7843j95546n6604J76668
7100b8428J95875M6775j17644K3262Q7010q3477j57406l7269K15069O5789p2218
$$ plain form
7089 137338 173167 16518 -11360 -35665 18739 84120 207750 265592 110718 -49870 -41623
7078 -41623 212344 123230 137936 274790 190834 148046 59752 102976 100765 91225 68118 -196179
7066 -196179 98291 145371 -28074 -202473 54282 139586 -39871 -73709 -164304 55913
7056 55913 -63944 -7209 26802 206816 196308 -11708 18043 83753 62763 -144791 -4966
7045 -4966 213447 183784 42721 -22118 127737 235683 12270 -114083 175482 282058
7035 282058 172773 -142426 -31586 90058 199819 67208 107225 164624 -1576 32269
7025 32269 -20921 -5880 201243 200616 200250 274767 140387 -8836 97438 205269 202940 237319
7013 237319 194435 75165 -96273 -47946 -120097 132784 60718 1930 -4948 -139436 -79665
$$ packed form
7089A37338L5829j56649k7878k4305N4404O5381J23630N7842j54874j60588Q247
7078d1623K53967q9114J4706J36854q3956m2788q8294M3224k211r540k3107k64297
7066a96179K94470M7080j73445j74399K56755Q5304j79457l3838r0595K20217
7056E5913j19857N6735L4011J80014j0508k08016K9751O5710k0990k07554J39825
7045d966K18413k9663j41063o4839J49855J07946k23413j26353K89565J06576
7035B82058j09285l15199J10840J21644J09761j32611M0017N7399j66200L3845
7025C2269n3190J5041K07123o27l66P4517j34380j49223J06274J07831k329L4379
7013B37319m2884j19270j71438M8327p2151K52881p2066n8788o878j34488N9771
$$ plain form
7002 -79665 20089 131106 55234 16407 -2115 -9573 -201173 -106376 -30394 -32102 152127 203723
6990 203723 16176 -15171 -20982 13993 53752 -43653 150823 156627 121532 -71173 -163611
6979 -163611 -60394 -12738 215640 159494 156781 80152 14997 110625 98749 38484 53034
6968 53034 174556 23254 -47831 -17480 16017 129728 122080 107173 105351 107736 163454 9869
6956 9869 134077 120664 202112 182181 58670 58416 -37377 -50401 -149936 182151 176797 91025
6944 91025 48246 78466 56542 24224 144930 237298 241508 60446 -18675 -114958 12698
6933 12698 154348 78792 20118 222833 112447 -112784 -208553 -67989 1417 151850 266167
6922 266167 285137 101280 -53283 122138 -47645 31784 9622 -6606 124339 69403 78393
$$ packed form
7002g9665R9754J11017p5872l8827j8522p458j91600R4797P5982j708J84229N1596
6990B03723j87547l1347n811L4975L9759r7405J94476N804l5095j92705r2438
6979a63611J03217M7656K28378n6146k713p6629o5155R5628j1876o0265J4550
6968E3034J21522j51302p1085L0351L3497J13711p648j4907j822K385N5718j53585
6956I869J24208j3413Q1448j9931j23511k54r5793j3024r9535L32087n354q5772
6944I1025m2779L0220k1924l2318J20706R2368M210j81062p9121r6283J27656
6933A2698J41650p5556n8674K02715j10386k25231r5769J40564O9406J50433J14317
6922B66167J8970j83857j54563J75421j69783P9429k2162j6228J30945n4936Q990
$$ plain form
6911 78393 -35274 -92212 -52387 54403 157592 157720 68449 -80210 24885 -32701 -22749
6900 -22749 188303 80825 36448 -12149 -9680 -9976 -610 72204 89190 183072 -38095 -45393
6888 -45393 -4735 -152890 80971 -17734 123900 259447 78504 -9397 54454 74987 11637
6877 11637 58315 5533 8146 60670 -23495 -18084 28330 34889 48628 46449 140421 140583 153990
6864 153990 135270 252285 214616 347006 245168 138504 205810 46925 -23993 156652
6854 156652 75358 -14467 37187 8036 -10753 -76733 66772 119251 82714 34102 167977
6843 167977 30170 -59053 188448 248638 207643 -36047 -14206 -27418 125009 107626 -53513
6832 -53513 96320 49281 47301 25153 35064 58830 194948 209191 162993 172980 -37946 -148963
$$ packed form
6911G8393j13667n6938L9825J06790J03189J28q9271j48659J05095n7586R952
6900b2749K11052j07478m4377m8597K469k96R366P2814J6986R3882k21167p298
6888d5393M0658j48155K33861r8705J41634J35547j80943q7901O3851K0533o3350
6877A1637M6678n2782K613N2524q4165N411M6414O559J3739k179R3972J62J3407
6864A53990j8720J17015l7669J32390j01838j06664O7306j58885p0918J80645
6854A56652q1294q9825N1654k9151j8789o5980J43505N2479l6537m8612J33875
6843A67977j37807q9223K47501O0190m0995k43690K1841j3212J52427j7383j61139
6832e3513J49833m7039j980k2148R911K3766J36118J4243m6198R987k10926j11017
$$ plain form
6820 -148963 43931 84649 128014 229008 216129 235842 203201 98418 -82728 -7575 138766
6809 138766 178038 132389 242614 295761 83257 169450 204236 356099 372477 324205 147929
6798 147929 54994 -18739 -49818 184804 115067 242879 215822 105274 23986 -106204 61138
6787 61138 333067 385383 264721 172787 24531 109025 68938 16399 61146 186989 75893
6776 75893 26227 43301 61494 12822 1511 154767 140104 270881 267727 130166 130747 67090
6764 67090 136510 208076 225507 208789 60168 -130995 -74101 171132 165664 199969 169980
6753 169980 290099 178494 113651 15618 140734 343078 273358 50462 98498 178011 140612
6742 140612 34077 126095 253136 237911 104671 130733 118472 79349 34677 116243 219716
$$ packed form
6820a48963J92894M0718M3365J00994j2879J9713l2641j04783j81146P5153J46341
6809A38766L9272m5649J10225N3147k12504Q6193L4786J51863J6378m8272j76276
6798A47929r2935p3733l1079K34622o9737J27812k7057j10548q1288j30190J67342
6787F1138K71929N2316j20662r1934j48256Q4494m0087n2539M4747J25843j11096
6776G5893m9666J7074J8193m8672j1311J53256j4663J30777l154j37561N81o3657
6764F7090O9420P1566J7431j6718j48621j91163N6894K45233n468L4305k9989
6753A69980J20119j11605o4843r8033J25116K02344o9720k22896M8036P9513l7399
6742A40612j06535R2018J27041j5225j33240K6062j2261l9123m4672Q1566J03473
$$ plain form
6731 219716 -17478 28747 92289 7864 336514 239675 170505 257403 245430 188636 -70928
6720 -70928 -13481 51636 53671 58209 165774 178944 118400 53365 70682 -11033 235411 237292
6708 237292 195816 28149 128712 222548 151485 178532 145977 235349 43986 -41522 -21846
6697 -21846 69158 85655 92946 162586 157746 253949 81806 170736 156457 221094 316249 179317
6685 179317 221647 261493 183301 208702 78621 132129 248357 190479 297125 99679 32946
6674 32946 91712 119295 -52541 132498 204174 -83999 13416 124484 187820 72945 35605
6663 35605 115571 140751 -27073 -37720 27349 81081 80656 168945 219069 333541 267682 113390
6651 113390 -55908 -11152 269309 207002 166558 199335 197181 207735 176520 128989 262518
$$ packed form
6731B19716k37194M6225O3542q4425L28650r6839o9170Q6898j1973n6794k59564
6720g0928N7447O5117K035M538J07565J3170o0544o5035J7317q1715K46444J881
6708B37292m1476j67667J00563R3836p1063K7047l2555Q9372j91363q5508J9676
6697b1846R1004J6497P291O9640m840R6203j72143Q8930j4279O4637R5155j36932
6685A79317M2330L9846p8192K5401j30081N3508J16228n7878J06646j97446o6733
6674C2946N8766K7583j71836J85039P1676k88173R7415J11068O3336j14875l7340
6663C5605P9966K5180j67824j0647O5069N3732m25Q8289N0124J14472o5859j54292
6651A13390j69298M4756K80461o2307m0444L2777k154J0554l1215m7531J33529
$$ plain form
6640 262518 425114 291286 262041 204468 148425 102658 68728 234688 186544 26703 -36104
6629 -36104 186561 90040 129025 259718 234679 252172 105790 65524 138774 104291 359949
6618 359949 409972 310291 157644 305541 253742 3014 131984 258038 358475 220770
6608 220770 118665 176095 116805 131416 319227 188336 19290 114690 181176 131069 130624
6597 130624 242587 170200 173043 130434 225215 -10265 10578 -18554 74466 73144 233531
6586 233531 244133 933 83969 61041 138049 1757 159788 159141 64638 60490 125640 261477
6574 261477 323118 267620 286361 315828 335268 304677 266425 159765 260000 375086 298482
6563 298482 186775 288661 315287 90637 74258 262253 248598 265736 355734 176229 42217
$$ packed form
6640B62518J62596j33828k9245n7573n6043m5767l3930J65960m8144j59841o2807
6629c6104K22665r6521L8985J30693k5039J7493j46382m0266P3250l4483K55658
6618C59949N0023r9681j52647J47897n1799k50728J28970J26054J00437j37705
6608B20770j02105N7430n9290J4611J87811j30891j69046R5400O6486n0107m45
6597A30624J11963p2387K843m2609R4781k35480K0843k9132R3020j322J60387
6586B33531J0602k43200Q3036k2928P7008j36292J58031o47r4503m148O5150J35837
6574B61477O1641n5498J8741K9467J9440l0591l8252j06660J00235J15086p6604
6563B98482j11707J01886K6626k24650j6379J87995j3655J7138Q9998j79505j34012
$$ plain form
6552 42217 67334 227425 148077 43258 181272 135504 52228 144596 223494 19157 56781
6541 56781 200342 115276 68245 17069 90348 190236 245821 289763 190287 121979 303598
6530 303598 166423 58215 276297 334211 256310 12088 -188468 36952 95668 170237
6520 170237 143363 74465 244882 135483 142598 -27098 161629 188467 186837 31290 134708
6509 134708 251577 -15811 60288 61810 182949 196211 175852 15702 33526 115960 28645
6498 28645 -30436 160073 391439 335093 118109 79525 179248 -5558 -23532 86372 256201
6487 256201 179595 58801 77812 129391 75050 48074 78790 153900 441922 424862 287904
6476 287904 162464 153999 198261 274312 349536 204402 58098 -13883 46051 91290 90790 170860
$$ packed form
6552D2217K5117J60091p9348j04819J38014m5768q3276R2368P8898k04337L7624
6541E6781J43561q5066m7031n1176P3279R9888N5585M3942r9476o8308J81619
6530C03598j37175j08208K18082N7914p7901k44222k00556K25420N8716P4569
6520A70237k6874o8898J70417j09399P115j69696J88727K6838j630j55547J03418
6509A34708J16869k67388P6099J522J21139J3262k0359j60150J7824Q2434q7315
6498B8645n9081J90509K31366n6346k16984l8584R9723j84806j7974J09904J69829
6487B56201p6606j20794J9011N1579n4341k6976L0716P5110K88022j7060j36958
6476B87904j25440q465M4262P6051P5224j45134j46304p1981N9934M5239n00Q0070
$$ plain form
6464 170860 230483 31250 136426 233832 5799 -104478 107487 237763 89627 312928
6454 312928 282433 164988 132835 250988 142564 159877 336670 217460 153683 233871 469840
6443 469840 302014 2841 164177 320204 363970 235119 23031 157418 188667 139161
6433 139161 166332 218086 273016 111570 96201 226372 408642 277312 185741 183387 435904
6422 435904 406631 177563 194374 380734 513304 326813 342327 251962 210780 166369 179738
6411 179738 148467 246361 256833 215425 12517 152420 240187 221659 332835 260018 238565
6400 238565 75343 61804 154974 305213 179498 174149 81815 79415 191448 181719 186999 270313
6388 270313 314866 246123 175136 26705 317561 214886 104461 139311 192348 194168 159529
$$ packed form
6464A70860N9623j99233J05176R7406k28033j10277K11965J30276j48136K23301
6454C12928l0495j17445l2153J18153j08424J7313J76793j19210o3777Q0188K35969
6443D69840j67826k99173J61336J56027M3766j28851k12088J34387L1249m9506
6433A39161K7171N1754N4930j61446j5369J30171J82270j31330r1571k354K52517
6422D35904k9273k29068J6811J86360J32570j86491J5514r0365m1182m4411J3369
6411A79738l1271R7894J0472m1408k02908J39903Q7767j8528J11176p2817k1453
6400B38565j63222j3539R3170J50239j25715n349r2334k400J12033r729N280Q3314
6388B70313M4553o8743p0987j48431K90856j02675j10425L4850N3037J820l4639
$$ plain form
6377 159529 98351 179221 220426 202955 255191 139044 398167 205797 163671 121301 193541
6366 193541 289492 353872 413123 214347 258907 236459 373482 476744 587174 629255 506597
6355 506597 381305 286471 188436 178305 275299 452808 518684 273190 354339 390184 324664
6344 324664 267457 447761 522469 635491 558572 285119 268802 452907 706766 539015
6334 539015 479820 521470 606792 516467 378064 491120 578197 509526 551942 748099 711321
6323 711321 724847 741060 860649 955268 1020512 1099204 995649 1203178 1306580 1298130 1637923
6312 1637923 2060427 2483989 2842688 3148832 3413135 3284405 3119859 2881411 2809082 2566884
6302 2566884 2437394 2120308 1874946 1801046 1785547 1751251 1635273 1638744 1502125 1328856
$$ packed form
6377A59529o1178Q0870M1205j7471N2236j16147K59123j92370m2126m2370P2240
6366A93541R5951O4380N9251j98776M4560k2448J37023J03262J10430M2081j22658
6355E06597j25292r4834r8035j0131R6994J77509O5876k45494Q1149L5845o5520
6344C24664n7207J80304P4708J13022p6919k73453j6317J84105K53859j67751
6334E39015n9195M1650Q5322r0325j38403J13056Q7077o8671M2416J96157l6778
6323G11321J3526J6213J19589R4619O5244P8692j03555K07529J03402q450L39793
6312A637923M22504M23562L58699L06144K64303j28730j64546k38448p2329k42198
6302B566884j29490l17086k45362p3900j5499l4296j15978L471j36619j73269
$$ plain form
6292 1328856 1374672 1793076 1859111 1768824 1889330 2074864 2131565 2253376 2747548 3260934
6282 3260934 3770237 4376877 5100036 5925310 7081754 8393093 9235095 9458763 9067522
6273 9067522 8458369 7654672 6714751 5984036 5290681 4565345 4161626 3762905 3316358 2927182
6263 2927182 2790494 2524535 2383431 2218744 2312977 2394529 2240875 2309058 2393644 2557917
6253 2557917 2706431 3171483 3499234 3934039 4515132 5281391 6109520 7219651 8502510
6244 8502510 9299682 9642844 9445589 9050262 8046425 7149427 6296402 5490451 4818989
6235 4818989 4232731 3679758 3151741 2750702 2547226 2313784 2130572 2054354 2012446 1927225
6225 1927225 1768273 1760450 1735682 1726997 1766608 1922681 1901644 2047849 2237764 2361257 2576020
$$ packed form
6292A328856M5816M18404O6035r0287J20506J85534N6701J21811M94172N13386
6282C260934N09303O06640P23159Q25274J156444J311339Q42002K23668l91241
6273I067522o09153q03697r39921p30715o93355p25336m03719l98721m46547l89176
6263B927182j36688k65959j41104j64687R4233Q1552j53654O8183Q4586J64273
6253B557917J48514M65052L27751M34805N81093P66259Q28129J110131J282859
6244H502510P97172L43162j97255l95327j003837q96998q53025q05951o71462
6235D818989n86258n52973n28017m01039k03476k33442j83212p6218m1908q5221
6225A927225j58952p823k4768q685L9611J56073k1037J46205J89915J23493K14763
$$ plain form
6214 2576020 2987499 3391349 3610524 3722263 3783586 3499073 3264071 3075973 2745785 2369329
6204 2369329 2015746 1906830 1788969 1599772 1590124 1340914 1288400 1227248 1234042 1132716 981211
6193 981211 1062401 939207 735564 862927 1000480 1019721 978695 1094009 1338482 1614671
6183 1614671 1781527 1889788 2021557 2138436 2421483 2287274 2177001 2038241 1854069 1574746
6173 1574746 1410840 1240562 1043033 958940 939535 1045522 907296 831270 889440 786892
6163 786892 845570 840389 713702 886496 831532 837696 868432 762577 824242 869022 950395
6152 950395 989471 1035002 905223 1004641 1003777 1133397 1079524 1139140 1185792 1368339 1470580
6141 1470580 1522517 1549510 1172282 1222286 1257217 1277299 1205754 1152355 1091959 863181 1048291
$$ packed form
6214B576020M11479M03850K19175J11739O1323k84513k35002j88098l30188l76456
6204B369329l53583j08916j17861j89197r648k49210n2514o1152O794j01326j51505
6193I81211Q1190j23194k03643J27363J37553J9241m1026J15314K44473K76189
6183A614671J66856J08261J31769J16879K83047j34209j10273j38760j84172k79323
6173A574746j63906j70278j97529q4093j9405J05987j38226p6026N8170j02548
6163G86892N8678n181j26687J72794n4964O164L0736j05855O1665M4780Q1373
6152I50395L9076M5531j29779R9418q64J29620n3873N9616M6652J82547J02241
6141A470580N1937K6993l77228N0004L4931K0082p1545n3399o0396k28778J85110
$$ plain form
6130 1048291 1006607 978605 948448 1012740 1100243 1000101 1013452 1067111 1064787 1126777 1279723
6119 1279723 1433755 1433738 1391163 1638477 1542447 1717729 1841775 2165753 2555871 3042999 3225080
6108 3225080 3109892 2924199 2808197 2556004 2219317 1985919 1816201 1691009 1469492 1500071
6098 1500071 1383703 1367463 1152188 1048129 1132229 1265727 1238013 984056 1020506 1066320
6088 1066320 1239912 1260878 1366541 1575010 1707729 1959960 1983721 2087576 2489680 2747217
6078 2747217 3094619 3371641 3393657 3265964 3130220 2754204 2370161 2394656 2080984 1741369
6068 1741369 1665068 1513695 1296854 1228381 1248245 1094772 1178325 1157807 1134314 982121 1060458
6057 1060458 1118375 965788 929685 1037227 1297666 1251303 1346552 1332036 1263489 1412958 1687558
$$ packed form
6130A048291m1684k8002l0157O4292Q7503j00142J3351N3659k324O1990J52946
6119A279723J54032j7m2575K47314r6030J75282J24046L23978L90118M87128J82081
6108C225080j15188j85693j16002k52193l36687k33398j69718j25192k21517L0579
6098A500071j16368j6240k15275j04059Q4100J33498k7714k53957L6450M5814
6088A066320J73592K0966J05663K08469J32719K52231K3761J03855M02104K57537
6078B747217L47402K77022K2016j27693j35744l76016l84043K4495l13672l39615
6068A741369p6301j51373k16841o8473J9864j53473Q3553k0518k3493j52193P8337
6057A060458N7917j52587l6103J07542K60439m6363R5249j4516o8547J49469K74600
$$ plain form
6046 1687558 1786870 1848030 1754969 1643632 1534573 1437234 1545501 1371720 1193614 1134849
6036 1134849 1168710 1121953 1009919 1097295 1120890 953114 865159 972684 1074400 1036376 907711
6025 907711 1012107 1006195 1039807 891831 967541 1080260 1176138 1244057 1154622 1072309 1300035
6014 1300035 1232846 1184971 1211630 1131051 865460 843488 1165394 1027471 1060317 1090283 1105000
6003 1105000 1105333 1257477 1219207 1220182 1514343 1529419 1511342 1337506 1231733 1259414 1210336
5992 1210336 1112251 1089227 1226346 1216801 1290204 1461533 1539320 1455081 1592833 1527330 1528923
5981 1528923 1596556 1777070 1768286 1667166 1627774 1514727 1472950 1440335 1674264 1610546 1572277
5970 1572277 1504759 1497415 1558091 1593247 1513883 1421166 1404388 1470269 1522052 1473785 1605016
$$ packed form
6046A687558R9312O1160r3061j11337j09059r7339J08267j73781j78106n8765
6036A134849L3861m6757j12034Q7376K3595j67776q7955J07525J01716l8024j28665
6025I07711J04396n912L3612j47976P5710J12719R5878O7919q9435q2313K27726
6014A300035o7189m7875K6659q0579k65591k1972L21906j37923L2846K9966J4717
6003A105000L33J52144l8270R75K94161J5076j8077j73836j05773K7681m9078
5992A210336r8085k3024J37119r545P3403J71329P7787q4239J37752o5503J593
5981A528923O7633J80514q784j01120l9392j13047m1777l2615K33929o3718l8269
5970A572277o7518p344O0676L5156p9364r2717j6778O5881N1783m8267J31231
$$ plain form
5959 1605016 1507857 1555119 1741567 2109559 2127587 2195572 2252015 2393278 2472127 2546940 2386207
5948 2386207 2287283 2339988 2248184 2280032 2299059 2330394 2168593 2147125 2401432 2566770 2649607
5937 2649607 2696701 2670129 2756323 2722200 2571303 2599127 2811595 2887528 2968297 2913957 3059539
5926 3059539 3224797 3211325 3234871 3528440 3628853 3779786 3779399 3758666 3916011 3966841 4057743
5915 4057743 4157010 4226898 4353568 4449924 4461424 4548886 4684941 4567439 4621762 4998180 5102811
5904 5102811 5231082 5302419 5388058 5560337 5816840 5663584 5609455 5791956 5730394 5525201
5894 5525201 5551029 5839264 6137228 6215452 6357744 6766681 7119475 7365539 7374958 7402046
5884 7402046 7632023 7909594 8130874 8494489 8897163 9338088 9594106 9905408 10461403 11054899
$$ packed form
5959A605016r7159M7262J86448L67992J8028O7985N6443J41263P8849P4813j60733
5948B386207r8924N2705r1804L1848J9027L1335j61801k1468K54307J65338Q2837
5937B649607M7094k6572Q6194l4123j50897K7824K12468P5933Q0769n4340J45582
5926C059539J65258j3472K3546K93569J00413J50933l87k0733J57345N0830R0902
5915D057743R9267O9888J26670R6356J1500Q7462J36055j17502N4323L76418J04631
5904E102811J28271P1337Q5639J72279K56503j53256n4129J82501o1562k05193
5894E525201K5828K88235K97964P8224J42292M08937L52794K46064R419K7088
5884G402046K29977K77571K21280L63615M02674M40925K56018L11302N55995N93496
$$ plain form
5874 11054899 11393214 12004951 12819141 13680412 14433106 15303111 16519403 17857833 19652495
5865 19652495 21473758 23518354 25658920 27961100 30523085 33170999 36952052 41536757
5857 41536757 47511502 54975613 65027218 78506783 96011096 117907939 146152471
5850 146152471 181697122 224568761 267678012 294122391 294810830 277704758 253802366
5843 253802366 223284119 191195004 162367218 136080499 112982515 94545624 80456302
5836 80456302 69570572 60594932 52985290 46655078 41001196 35896326 31476461 28124652
5828 28124652 25716343 23930813 22381850 21127434 20140285 19024485 18294883 17571084 16983411
5819 16983411 16247243 15490591 14901440 14131244 13508751 12993467 12585035 12230002 11822487
$$ packed form
5874A1054899L38315O11737Q14190Q61271P52694Q70005J216292J338430J794662
5865A9652495J821263K044596K140566K302180K561985K647914L781053M584705
5857D1536757N974745P464111J0051605J3479565J7504313K1896843K8244532
5850A46152471L5544651M2871639M3109251K6444379O88439j7106072k3902392
5843B53802366l0518247l2089115k8827786k6286719k3097984j8436891j4089322
5836H0456302j0885730q975640p609642o330212n653882n104870m419865l351809
5828B8124652k408309j785530j548963j254416r87149j115800p29602p23799n87673
5819A6983411p36168p56652n89151p70196o22493n15284m08432l55033m07515
$$ plain form
5810 11822487 11348094 10925514 10467978 10023354 9685460 9479392 9189642 9204340 8994598 8635011
5800 8635011 8297268 8109595 7969703 7778931 7389544 6925384 6782859 6406214 6112773 6064044
5790 6064044 5982208 5832661 5842679 5772195 5713158 5665634 5656334 5363225 5260809 5330379 5214594
5779 5214594 4967633 4939836 5281312 5183960 5093011 5154453 5145453 5296375 5271708 5227916 5458279
5768 5458279 5448488 5529705 5696725 5973203 6171998 6309296 6534431 6678924 7044038 7455055
5758 7455055 8063026 8790395 10105112 11913483 13885580 16546700 20118702 24936791 31179355
5749 31179355 37318564 39860715 38459170 35354197 32054828 27807400 23657307 20399237
5741 20399237 17184552 14669422 12759917 11357556 10143739 9405784 8862904 8283662 7628218
$$ packed form
5810A1822487m74393m22580m57536m44624l37894k06068k89750J4698k09742l59587
5800H635011l37743j87673j39892j90772l89387m64160j42525l76645k93441m8729
5790F064044q1836j49547J0018p0484n9037m7524r300k93109j02416O9570j15785
5779E214594k46961k7797L41476r7352r0949O1442r000J50922k4667m3792K30363
5768E458279r791Q1217J67020K76478J98795J37298K25135J44493L65114M11017
5758G455055O07971P27369J314717J808371J972097K661120L572002M818089O242564
5749C1179355O139209K542151j401545l104973l299369m247428m150093l258070
5741B0399237l214685k515130j909505j402361j213817p37955n42880n79242o55444
$$ plain form
5732 7628218 7120364 6919984 6511823 6169681 6050465 6136721 6026937 5897780 5790896 5699033
5722 5699033 5566212 5469303 5462691 5393989 5098267 5036548 4984051 4883769 4997827 4926851 4897055
5711 4897055 4981174 5022533 5048010 5036185 5013838 5301536 5410203 5373600 5457264 5669400 5832127
5700 5832127 5968758 6041452 6126066 6427417 6471919 6915757 7149794 7315616 7449507 7851920
5690 7851920 8471474 9038509 9900986 10424394 11219595 12000928 12923820 14027214 15410420
5681 15410420 17067691 19133236 22214722 26161268 31371302 38270433 47030737 58112464
5673 58112464 71955497 89130087 105825187 115104455 114223999 107171482 97680329 85643849
5665 85643849 73086657 62013479 52144721 43579732 36348355 30914269 26940025 23565786
$$ packed form
5732G628218n07854k00380m08161l42142j19216Q6256j09784j29157j06884r1863
5722E699033j32821r6909o612o8702k95722o1719n2497j00282J14058p0976k9796
5711D897055Q4119M1359K5477j1825k2347K87698J08667l6603Q3664K12136J62727
5700E832127J36631P2694Q4614L01351M4502M43838K34037J65822J33891M02413
5690G851920O19554N67035Q62477N23408P95201P81333R22892J103394J383206
5681A5410420J657271K065545L081486L946546N210034O899131Q760304J1081727
5673E8112464J3843033J7174590J6695100R279268q80456p052517r491153j2036480
5665H5643849j2557192j1073178r868758q564989p231377n434086l974244l374239
$$ plain form
5657 23565786 20655464 18072925 15895209 13974451 12281462 11082640 10195041 9444668
5649 9444668 8809238 8298332 8091832 7673854 7298082 7130225 6850086 6737253 6676875 6291264
5639 6291264 5878944 5592387 5393054 5222992 4956109 4925338 4879466 4701781 4327365 4181245
5629 4181245 4043095 3903145 3696602 3607728 3705725 3519446 3566542 3347622 3034309 3036739
5619 3036739 2902953 2738627 2550681 2370899 2158818 2023185 2109303 2121867 2203931 2084523
5609 2084523 2234787 2122260 2043378 2044044 1972342 2089517 1994568 1978040 1777932 1882011 2083008
5598 2083008 1814939 1729227 1604169 1523952 1526120 1473691 1600106 1739748 1386553 1387719 1393950
5587 1393950 1459027 1456493 1416305 1515530 1311962 1320182 1168332 1295472 1265862 1303375 1144743
$$ packed form
5657B3565786k910322k582539k177716j920758j692989j198822q87599p50373
5649I444668o35430n10906k06500m17978l75772j67857k80139j12833o0378l85611
5639F291264m12320k86557j99333j70062k66883l0771m5872j77685l74416j46120
5629D181245j38150j39950k06543q8874R7997j86279M7096k18920l13313K430
5619C036739j33786j64326j87946j79782k12081j35633Q6118J2564Q2064j19408
5609B084523J50264j12527p8882O66p1702J17175r4949j6528k00108J04079K00997
5598B083008k68069q5712j25058q0217K168n2429J26415J39642l53195J166O231
5587A393950O5077k534m0188R9225k03568Q220j51850J27140k9610L7513j58632
$$ plain form
5576 1144743 1088686 1175199 1151895 1004560 925606 921734 1109830 1288602 1246287 1287323 1227848
5565 1227848 1246400 1145698 969563 861223 828782 1073680 1176810 1142507 1155141 1153365 1066191
5554 1066191 882453 922383 920263 1138593 1290968 1269588 1167194 1093071 1032636 1006632 1157477
5543 1157477 983443 858508 925724 859410 785950 853848 864928 894894 921166 986774 920407
5532 920407 882316 1004980 882718 946017 956474 839261 1117781 1284884 1171635 1008144
5522 1008144 1070343 1091063 1120933 1155661 1295272 1300619 1290146 1400787 1468987 1689809 1891612
5511 1891612 1938306 2258407 2272200 2120913 2150607 1937737 2040187 1801044 1571805 1452445
5501 1452445 1456125 1172296 931469 943315 986443 1014681 907753 1037034 906698 810685 750036
$$ packed form
5576A144743n6057Q6513k3304j47335p8954l872J88096J78772m2315M1036n9475
5565A227848J8552j00702j76135j08340l2441K44898J03130l4303J2634j776q7174
5554A066191j83738L9930k120K18330J52375k1380j02394p4123o0435k6004J50845
5543A157477j74034j24935O7216o6314p3460O7898J1080K9966K6272O5608o6367
5532I20407l8091J22664j22262O3299J0457j17213K78520J67103j13249j63491
5522A008144O2199K0720K9870L4728J39611N347j0473J10641O8200K20822K01803
5511A891612M6694L20101J3793j51287K9694k12870J02450k39143k29239j19360
5501A452445L680k83829k40827J1846M3128K8238j06928J29281j30336r6013o0649
$$ plain form
5490 750036 692469 600486 720879 685108 646498 706436 705580 697450 512530 754554 738093 648870
5478 648870 494147 689358 740512 649304 544686 588291 616544 545525 524106 539251 569233
5467 569233 466065 624108 579173 469204 441580 617914 499969 482310 578757 438758
5457 438758 500315 484430 507800 548640 550847 624449 765014 667710 606346 432418 500182
5446 500182 752321 758424 515399 468253 616886 595378 524744 335631 556917 618147 513404
5435 513404 517734 595954 615806 518901 625155 640092 651854 648947 612062 636944 714961 770473
5423 770473 813905 623656 753148 569079 342670 523659 449179 560972 475921 512022
5413 512022 621641 655643 679011 784686 610773 590226 652247 621218 590781 690743 732326
$$ packed form
5490G50036n7567r1983J20393l5771l8610N9938q56q130j84920K42024j6461q9223
5478F48870j54723J95211N1154r1208j04618M3605K8253p1019k1419J5145K9982
5467E69233j03168J58043m4935j09969k7624J76334j17945j7659R6447j39999
5457D38758O1557j5885K3370M0840K207P3602J40565r7304o1364j73928O7764
5446E00182K52139O103k43025m7146J48633k1508p0634j89113K21286O1230j04743
5435E13404M330P8220J9852r6905J06254J4937J1762k907l6885K4882P8017N5512
5423G70473M3432j90249J29492j84069k26409J80989p4480J11793q5051L6101
5413E12022J09619L4002K3368J05675j73913k0547O2021l1029l0437R9962M1583
$$ plain form
5402 732326 771334 609466 500021 628984 731692 737883 596506 641191 682439 632947 692467
5391 692467 716346 673815 738689 983085 961938 1024207 815571 639519 648022 681060 624663
5380 624663 551633 618489 737219 869335 524750 529166 582298 672196 661798 667971 715276
5369 715276 689851 779554 581171 552975 662893 567775 480782 637930 670896 674220 671458
5358 671458 790222 671902 595327 807785 789483 705641 699878 815680 713076 718616 794606
5347 794606 922502 876238 853943 917145 960693 881139 877443 982674 1137580 1312762 1341321
5336 1341321 1358604 1233747 1251796 1159358 1193820 1069493 1044393 963249 936213 1035363 873760
5325 873760 796876 907378 1009001 758033 758109 894072 824868 627397 623576 766050 878817
$$ packed form
5402G32326L9008j61868j09445J28963J02708O191j41377M4685M1248m9492N9520
5391F92467K3879m2531O4874K44396k1147O2269k08636j76052Q503L3038n6397
5380F24663p3030O6856J18730J32116l44585M416N3132Q9898j0398O173M7305
5369G15276k5425Q9703j98383k8196J09918r5118q6993J57148L2966L324k762
5358F71458J18764j18320p6575K12458j8302q3842n763J15802j02604N540P5990
5347G94606J27896m6264k2295O3202M3548p9554l696J05231J54906J75182K8559
5336A341321J7283j24857J8049r2438L4462j24327k5100q1144k7036R9150j61603
5325H73760p6884J10502J01623k50968P6J35963o9204j97471l821J42474J12767
$$ plain form
5314 878817 944373 975890 1012652 818310 844683 858144 911327 894280 863978 848512 798306
5303 798306 801369 773749 919913 845011 906256 754205 808850 873525 1092591 810604 826990
5292 826990 918350 910945 954561 1043734 1061975 963801 922690 934345 974107 931249 908040 907113
5280 907113 967004 1069956 998393 893678 918994 982253 872954 866307 985736 1094878 1039053
5269 1039053 878808 1019544 929828 908303 791359 978369 948286 876275 999901 1180356
5259 1180356 1270195 1025179 1050315 1097354 1191532 1192327 1167969 1000905 1004422 1175926 1016688
5248 1016688 1065571 1093742 1022010 872338 1078026 1055073 1197451 1185817 1205849 1227810 1355015
5237 1355015 1411547 1313019 1307175 1195660 1389485 1388129 1336485 1375851 1474895 1340762 1241647
$$ packed form
5314H78817O5556L1517L6762j94342K6373J3461N3183j7047l0302j5466n0206
5303G98306L063k7620J46164p4902O1245j52051N4645O4675K19066k81987J6386
5292H26990R1360p405M3616Q9173J8241r8174m1111J1655L9762m2858k3209r27
5280I07113N9891J02952p1563j04715K5316O3259j09299o647J19429J09142n5825
5269A039053j60245J40736q9716k1525j16944J87010l0083p2011J23626J80455
5259A180356Q9839k45016K5136M7039R4178P95k4358j67064L517J71504j59238
5248A016688M8883K8171p1732j49672K05688k2953J42378j1634K0032K1961J27205
5237A355015N6532r8528n844j11515J93825j356n1644L9366R9044j34133r9115
$$ plain form
5226 1241647 1273550 1315475 1348240 1363555 1390652 1514510 1675346 1632099 1560411 1598642 1685196
5215 1685196 1620730 1588134 1635899 1822294 1665475 1513240 1616155 1764366 1778248 1694875
5205 1694875 1882683 1900372 1839647 1949005 2371337 2475114 2532808 2661330 2803134 2891646
5195 2891646 3007073 3186178 3133130 3272632 3194629 3195297 3053140 3109922 3088163 2756763 2602062
5184 2602062 2777127 2896518 2788373 2869657 2935141 2883638 2961981 3017070 3032463 3022509 3234668
5173 3234668 3278674 3249087 3366177 3688777 3808478 3929395 4222348 4841181 5103808 5462260
5163 5462260 5938998 6283044 6661169 6958928 7066793 6991173 6843724 6562453 6242327 5867892
5153 5867892 5781287 5394404 5283512 5045773 5083807 4893708 4840869 4688234 4658945 4805736
$$ packed form
5226A241647L1903M1925L2765J5315K7097J23858J60836m3247p1688L8231Q6554
5215A685196o4466l2596M7765J86395j56819j52235J02915J48211J3882q3373
5205A694875J87808J7689o0725J09358M22332J03777N7694J28522J41804Q8512
5195B891646J15427J79105n3048J39502p8003O68j42157N6782k1759l31400j54701
5184B602062J75065J19391j08145Q1284O5484n1503P8343N5089J5393r954K12159
5173C234668M4006k9587J17090L22600J19701J20917K92953O18833K62627L58452
5163E462260M76738L44046L78125K97759J07865p5620j47449k81271l20126l74435
5153E867892q6605l86883j10892k37739L8034j90099n2839j52635k9289J46791
$$ plain form
5143 4805736 4832201 4956897 5028131 5224769 5440750 5665586 5792596 5943948 6161979 6376562
5133 6376562 6798903 7248565 7675043 8065216 8499287 9017997 9308758 9464406 9797099 9779230
5123 9779230 9551562 9264635 9155632 8855895 8614294 8298872 8231999 8194403 8204563 8247827
5113 8247827 8198505 8179904 8295917 8573228 8679140 8879496 8953672 9193096 9437994 9678905
5103 9678905 10000931 10386605 10667431 10933901 11457828 11959443 12490021 12876464 13404133 14062573
5093 14062573 14589278 14903259 15244659 15841286 16229204 16844731 17348044 18201151 18853316
5084 18853316 19589219 20347487 21200135 22213107 23282658 24334877 25426749 26725767 28103851
5075 28103851 29380543 30626162 32241997 33632595 35171793 36755550 38238426 39635246
$$ packed form
5143D805736K6465J24696P1234J96638K15981K24836J27010J51352K18031K14583
5133F376562M22341M49662M26478L90173M34071N18710K90761J55648L32693j7869
5123I779230k27668k86927j09003k99737k41601l15422o6873l7596J0160M3264
5113H247827m9322j8601J16013K77311J05912K00356P4176K39424K44898K40911
5103I678905L22026L85674K80826K66470N23927N01615N30578L86443N27669O58440
5093A4062573N26705L13981L41400N96627L87918O15527N03313Q53107O52165
5084A8853316P35903P58268Q52648J012972J069551J052219J091872J299018J378084
5075B8103851J276692J245619J615835J390598J539198J583757J482876J396820
$$ plain form
5067 39635246 40967729 42190979 43174273 44108755 44760952 45286139 45465646 45465617 45103887 44563220
5057 44563220 43730646 42759753 41763967 40495499 39004473 37607718 36323316 34879720 33450599
5048 33450599 31811412 30356352 28930391 27632699 26488971 25347369 24190353 23089606
5040 23089606 21924907 20810333 19989233 19174209 18215381 17502002 16831323 16121515 15349644
5031 15349644 14822322 14373874 13631638 13083791 12614056 12243524 11893822 11641565 11254127
5022 11254127 10898151 10544982 10172808 9861578 9386891 9185077 9020832 8591119 8317806
5013 8317806 8122264 7812020 7636750 7598348 7477285 7192200 7049876 6986324 6729037 6629220
5003 6629220 6542477 6508511 6469062 6429118 6404792 6103066 6082518 6173691 6294594 6286284 6141832
$$ packed form
5067C9635246J332483J223250R83294R34482O52197N25187J79507k9l61730n40667
5057D4563220q32574r70893r95786j268468j491026j396755j284402j443596j429121
5048C3450599j639187j455060j425961j297692j143728j141602j157016j100747
5040B3089606j164699j114574q21100q15024r58828p13379o70679p09808p71871
5031A5349644n27322m48448p42236n47847m69735l70532l49702k52257l87438
5022A1254127l55976l53169l72174l11230m74687k01814j64245m29713k73313
5013H317806j95542l10244j75270l8402j21063k85085j42324o3552k57287r9817
5003F629220q6743l3966l9449l9944k4326l01726k0548R1173J20903q310j44452
$$ plain form
4992 6141832 6001317 5914210 5857258 5591536 5470483 5249179 4969577 4955626 4812701 4749390
4982 4749390 4587496 4493383 4309628 4054924 4006952 3953439 4148891 4166237 3933555 3730642
4972 3730642 3717297 3787106 3991040 3891855 3911131 3885582 3861783 3821120 3672123 3620756 3589765
4961 3589765 3708801 3708939 3610172 3382023 3418601 3393608 3265309 3301120 3288531 3312529 3351788
4950 3351788 3406904 3301666 3242533 3324607 3329240 3333643 3419149 3231391 3240967 3291689 3220952 3226346
4938 3226346 3090266 3195438 3294907 3281395 3329852 3396641 3322118 3302447 3280325 3562653 3565229
4927 3565229 3550544 3611956 3465000 3554970 3525480 3589267 3575385 3537834 3527879 3517325 3561925
4916 3561925 3579742 3542840 3565541 3826274 3924882 3852541 3835002 3890326 3933332 3942347 3938390 4254000
$$ packed form
4992F141832j40515q7107n6952k65722j21053k21304k79602j3951j42925o3311
4982D749390j61894r4113j83755k54704m7972n3513J95452J7346k32682k02913
4972C730642j3345O9809K03934r9185J9276k5549k3799m0663j48997n1367l0991
4961C589765J19036J38r8767k28149L6578k4993j28299L5811j2589K3998L9259
4950C351788N5116j05238n9133Q2074M633M403Q5506j87758R576N0722p0737N394
4938C226346j36080J05172R9469j3512M8457O6789p4523j9671k2122K82328K576
4927C565229j4685O1412j46956Q9970k9490O3787j3882l7551r955j0554M4600
4916C561925J7817l6902K2701K60733R8608p2341j7539N5324M3006R015l957L15610
$$ plain form
4904 4254000 4153058 4257165 4279044 4502317 4481300 4434445 4589580 4487389 4540669 4501345
4894 4501345 4682166 4780451 5047836 5169554 5218123 5204586 5553669 5633991 5711137 5804478 5933745
4883 5933745 5963222 5976190 6269490 6403067 6660139 6690763 6961870 7149649 7303671 7489566
4873 7489566 7742224 8006363 8213391 8732475 9012316 9434458 9852105 10279981 10579034 11256677
4863 11256677 11720940 12288830 13070399 13887768 14545684 15401217 16591706 17562086 18801097
4854 18801097 19941247 21379469 22514688 23780395 24877146 26078911 27237045 28220991
4846 28220991 29383571 30632817 31885553 32948279 34112701 35025382 36215136 37296723
4838 37296723 38442186 39223078 40114193 41146847 42037771 43214207 44502868 46067863 47897785
$$ packed form
4904D254000j00942J04107K1879K23273k1017m6855J55135j02191N3280l9324
4894D501345J80821R8285K67385J21718M8569j3537L49083Q0322P7146R3341J29267
4883E933745K9477J2968K93300J33577K57072L0624K71107J87779J54022J85895
4873G489566K52658K64139K07028N19084K79841M22142M17647M27876K99053O77643
4863A1256677M64263N67890P81569Q17369O57916Q55533J190489R70380J239011
4854A8801097J140150J438222J135219J265707J096751J201765J158134R83946
4846B8220991J162580J249246J252736J062726J164422R12681J189754J081587
4838C7296723J145463P80892Q91115J032654Q90924J176436J288661J564995J829922
$$ plain form
4829 47897785 50376916 53179907 56670959 60831413 65527862 70774351 77286130 83430598
4821 83430598 86509296 86744593 86247728 85359494 83530802 81808498 80361912 78782737 77141634
4812 77141634 75552314 74259936 73249159 72177304 71051308 69866506 68421507 67194082
4804 67194082 66061305 65161057 64374171 63984545 63594094 63451849 63605019 63779354 63835513
4795 63835513 64245264 64687087 65115084 65480926 65790861 66320056 66560676 66761063 66478971
4786 66478971 66300336 66052492 65756059 65187386 64688069 64157811 63846492 63612080 63402766
4777 63402766 63186529 62926676 62931416 62939147 63056704 63518919 64294547 65018279 65834671 66726188
4767 66726188 67528637 68296130 69002526 69789539 70666569 71563145 71937192 72105732 71912908
$$ packed form
4829D7897785K479131K802991L491052M160454M696449N246489O511779O144468
4821H3430598L078698K35297m96865q88234j828692j722304j446586j579175j641103
4812G7141634j589320j292378j010777j071855j125996j184802j444999j227425
4804F7194082j132777r00248p86886l89626l90451j42245J53170J74335N6159
4795F3835513M09751M41823M27997L65842L09935N29195K40620K00387k82092
4786F6478971j78635k47844k96433n68673m99317n30258l11319k34412k09314
4777F3402766k16237k59853M740P731J17557M62215P75628P23732Q16392Q91517
4767F6726188Q02449P67493P06396P87013Q77030Q96576L74047J68540j92824
$$ plain form
4758 71912908 71527200 70535043 69519185 68269389 66883087 65143154 63155523 61164673
4750 61164673 58676050 56490382 54218278 52338421 50530836 48906416 47070767 45757532
4742 45757532 44980693 44164333 43279567 42672981 42390892 41777324 41098894 40335509 39605412
4733 39605412 38624587 37851362 36985244 35889435 34694950 33570636 32407328 31059785 29990537
4724 29990537 28792776 27544850 26008917 24782784 23832190 22839854 21972569 21341413 20945785
4715 20945785 20621091 20323203 20002147 19745888 19539648 19467917 19222475 19069993 19213901 19474573
4705 19474573 19347052 19311260 19501710 19716981 19750512 19801810 20050699 19964605 19739863 19650911
4695 19650911 19699513 19617540 19559941 19661239 19879144 20074605 20462899 20971970 21683368 22430611
$$ packed form
4758G1912908l85708r92157j015858j249796j386302j739933j987631j990850
4750F1164673k488623k185668k272104j879857j807585j624420j835649j313235
4742D5757532p76839q16360q84766o06586k82089o13568o78430p63385p30097
4733C9605412r80825p73225q66118j095809j194485j124314j163308j347543j069248
4724B9990537j197761j247926j535933j226133r50594r92336q67285o31156l95628
4715B0945785l24694k97888l21056k56259k06240p1731k45442j52482J43908K60672
4705A9474573j27521l5792J90450K15271L3531N1298K48889q6094k24742q8952
4695A9650911M8602q1973n7599J01298K17905J95461L88294N09071P11398P47243
$$ plain form
4685 22430611 22749520 23301439 24098739 24724068 25261088 25649803 26099189 26619959 27189395
4676 27189395 27604340 27610659 27516000 27338250 27022256 26514613 25870783 25443192 24996582 24340153
4666 24340153 23669267 23177652 22761955 22285684 21730255 21255132 20879897 20426723 20155502
4657 20155502 20001627 19834574 19586554 19152988 18926217 18576321 18107584 17662471 16992905
4648 16992905 16645708 16156470 15514345 14519257 13834803 13084774 12466997 11936472 11346927
4639 11346927 11062293 10638501 10149088 9724572 9465112 9159898 9034042 9005542 9188421 9125955
4629 9125955 9475650 9974781 10567914 11396976 12085633 12336629 12110843 11582462 10992266 10404910
4619 10404910 9687598 9025329 8884366 8494798 8368951 8538279 8558357 8791677 9122302 9427016
$$ packed form
4685B2430611L18909N51919P97300O25329N37020L88715M49386N20770N69436
4676B7189395M14945O319r4659j77750l15994n07643o43830m27591m46610o56429
4666B4340153o70886m91615m15697m76271n55429m75123l75235m53174k71221
4657B0155502j53875j67053k48020m33566k26771l49896m68737m45113o69566
4648A6992905l47197m89238o42125r95088o84454p50029o17777n30525n89545
4639A1346927k84634m23792m89413m24516k59460l05214j25856k8500J82879o2466
4629I125955L49695M99131N93133Q29062O88657K50996k25786n28381n90196n87356
4619A0404910p17312o62269j40963l89568j25847J69328K0078K33320L30625L04714
$$ plain form
4609 9427016 10150320 10751290 11166989 11366184 11880040 12327669 12821434 13451738 14326588 15402582
4599 15402582 16219813 16689006 16881305 17317526 17468415 17852167 18338473 19269430 19924693
4590 19924693 20303050 20168944 19752375 19468895 18871043 18458895 18358654 18385854 17949970 17457453
4580 17457453 17127471 16295889 15644046 15047115 14642360 14359369 14018242 13702839 13317999
4571 13317999 13063083 12856564 12594476 12326852 12308094 12533214 12809610 13308843 13692997 14136557
4561 14136557 14649477 15053041 15352973 15716641 16330250 16664280 16806232 17133319 17541700
4552 17541700 17467703 17444429 17671745 18098720 18390903 18699843 18946118 19574405 20298485 20504532
4542 20504532 21044370 21680662 22311903 22795859 23357675 23730774 24348349 24705995 24906497
$$ packed form
4609I427016P23304O00970M15699J99195N13856M47629M93765O30304Q74850J075994
4599A5402582Q17231M69193J92299M36221J50889L83752M86306R30957O55263
4590A9924693L78357j34106m16569k83480n97852m12148j00241K7200m35884m92517
4580A7457453l29982q31582o51843n96931m04755k82991l41127l15403l84840
4571A3317999k54916k06519k62088k67624j8758K25120K76396M99233L84154M43560
4561A4136557N12920M03564K99932L63668O13609L34030J41952L27087M08381
4552A7541700p3997k3274K27316M26975K92183L08940K46275O28287P24080K06047
4542B0504532N39838O36292O31241M83956N61816L73099O17575L57646K00502
$$ plain form
4533 24906497 25098393 25022890 24881930 24597017 24211110 23693518 23089459 22449066 21921734 21246915
4523 21246915 20404574 19403555 18311573 17634535 17055808 16604610 16139054 15851462 15663992
4514 15663992 15490907 15258874 15112192 15036488 15135172 15185423 14915140 14515558 14321570 14032774
4504 14032774 13447425 12894393 12574350 12313775 11745464 11185529 10509160 9954047 9263032
4495 9263032 8765483 8331587 7739758 7149931 6491400 6076437 5842199 5542518 4952711 4744596
4485 4744596 4505351 4278404 4004937 3734953 3709083 3691073 3529467 3301119 3350127 3060305
4475 3060305 3115510 2898259 2794923 2734378 2614835 2698013 2763915 2720802 2544812 2570926 2444023
4464 2444023 2543008 2451804 2331428 2233058 2203708 2083587 1950252 2019218 1772305 1812890 1767997
$$ packed form
4533B4906497J91896p5503j40960k84913l85907n17592o04059o40393n27332o74819
4523B1246915q42341j001019j091982o77038n78727m51198m65556k87592j87470
4514A5663992j73085k32033j46682p5704R8684N0251k70283l99582j93988k88796
4504A4032774n85349n53032l20043k60575n68311n59935o76369n55113o91015
4495I263032m97549m33896n91829n89827o58531m14963k34238k99681n89807k08115
4485D744596k39245k26947k73467k69984k5870j8010j61606k28348M9008k89822
4475C060305N5205k17251j03336o0545j19543Q3178O5902m3113j75990K6114j26903
4464B444023R8985r1204j20376r8370k9350j20121j33335O8966k46913M0585m4893
$$ plain form
4453 1767997 1694977 1561651 1577707 1567932 1462733 1309903 1366799 1548094 1459693 1351435 1312741
4442 1312741 1326908 1444724 1472925 1333567 1280999 1259330 1070735 960820 1055249 1348570
4432 1348570 1252681 1136974 949163 975636 868522 981685 1088140 1188202 1227522 884039
4422 884039 939708 886744 854361 699839 802954 817624 817180 852566 794975 951863 1028513
4411 1028513 928629 1022503 1046449 907768 939075 903439 746013 732300 976263 992917 979891
4400 979891 849768 851253 830960 541824 524278 831281 940033 846571 698066 789434 847345
4389 847345 727168 678836 691946 994979 935667 785837 615464 727674 712906 634128 736944
4378 736944 783647 727659 616683 511507 631041 691918 647999 741047 756253 836091 630562
$$ packed form
4453A767997p3020j33326J6056r775j05199j52830N6896J81295q8401j08258l8694
4442A312741J4167J17816K8201j39358n2568k1669j88595j09915R4429K93321
4432A348570r5889j15707j87811K6473j07114J13163J06455J00062L9320l43483
4422H84039N5669n2964l2383j54522J03115J4670m44L5386n7591J56888P6650
4411A028513r9884R3874K3946j38681L1307l5636j57426j3713K43963J6654j3026
4400I79891j30123J485k0293k89136j7546L07003J08752r3462j48505R1368N7911
4389H47345j20177m8332J3110L03033n9312j49830j70373J12210j4768p8778J02816
4378G36944M6703n5988j10976j05176J19534O0877m3919R3048J5206P9838k05529
$$ plain form
4367 630562 571794 652472 426706 458377 463473 539450 400237 439192 553120 526704 607365
4356 607365 611100 606050 668585 800705 775643 546865 435189 658944 808753 719428 703765
4345 703765 457785 505652 702754 739186 648854 601786 635183 782021 754886 620660 775816
4334 775816 854145 732754 599581 685608 778035 534068 402130 475511 524589 572797 563553
4323 563553 723634 651519 576316 481696 621812 891902 790142 745146 676460 820681 750695
4312 750695 649106 815082 848371 945188 932451 903655 766640 756057 904313 841218 748702
4301 748702 802432 683431 768385 453869 497853 642369 726837 629176 543067 785050 681432
4290 681432 612690 646781 744243 938195 871692 848434 1045774 1021127 941590 770858 937751
$$ packed form
4367F30562n8768Q0678k25766L1671N096P5977j39213L8955J13928k6416Q0661
4356F07365L735n050O2535J32120k5062k28778j11676K23755J49809q9325j5663
4345G03765k45980M7867J97102L6432r0332m7068L3397J46838k7135j34226J55156
4334G75816P8329j21391j33173Q6027R2427k43967j31938P3381M9078M8208r244
4323E63553J60081p2115p5203r4620J40116K70090j01760m4996o8686J44221o9986
4312G50695j01589J65976L3289R6817j2737k8796j37015j0583J48256o3095r2516
4301G48702N3730j19001Q4954l14516M3984J44516Q4468r7661q6109K41983j03618
4290F81432o8742L4091R7462J93952o6503k3258J97340k4647p9537j70732J66893
$$ plain form
4279 937751 1171019 1163844 983361 848284 915227 997462 1135186 1035913 1233244 1371223 1240610
4268 1240610 1039296 1027060 1315875 1055677 1094079 1193663 1189492 954393 936039 930626 1024085
4257 1024085 1215993 1263175 1251603 1149292 1086436 951953 1087126 1017260 1201708 1269282
4247 1269282 1151034 1383048 1467509 1521104 1357626 1246860 1405894 1491041 1191005 1221215
4237 1221215 1390890 1486590 1459924 1437874 1537335 1610714 1714213 1474981 1452028 1526595 1600461
4226 1600461 1783770 1719358 1851419 1604381 1417535 1444547 1581293 1552623 1391704 1396311
4216 1396311 1378318 1518549 1333292 1365101 1390220 1699275 1553060 1292744 1202400 1150406
4206 1150406 1250357 1253871 1379512 1446235 1446154 1380046 1207765 1309166 1312396 1301453 1413674 1504399
$$ packed form
4279I37751K33268p175j80483j35077O6943Q2235J37724r9273J97331J37979j30613
4268A240610k01314j2236K88815k60198L8402R9584m171k35099j8354n413R3459
4257A024085J91908M7182j1572j02311o2856j34483J35173o9866J84448O7574
4247A269282j18248K32014Q4461N3595j63478j10766J59034Q5147l00036L0210
4237A221215J69675R5700k6666k2050R9461P3379J03499k39232k2953P4567P3866
4226A600461J83309o4412J32061k47038j86846K7012J36746k8670j60919M607
4216A396311j7993J40231j85257L1809K5119L09055j46215k60316r0344n1994
4206A150406R9951L514J25641O6723q1o6108j72281J01401L230j0943J12221R0725
$$ plain form
4194 1504399 1326352 1250383 1258578 1191318 1144995 1292491 1475193 1307766 1276203 1353655 1243871
4183 1243871 1088030 1213890 1417581 1417122 1435092 1411049 1459903 1392350 1264880 1210272 1268080
4172 1268080 1522280 1518896 1343820 1353122 1392764 1308765 1106097 1288384 1478265 1527608 1281198
4161 1281198 1533344 1618389 1488248 1452957 1540742 1459453 1508248 1529515 1222154 1268032 1294395
4150 1294395 1465179 1505604 1675183 1614358 1607261 1487926 1598613 1539996 1522867 1565672 1528066
4139 1528066 1500835 1571308 1711576 1640016 1597168 1674293 1793988 1577151 1431278 1555832
4129 1555832 1641514 1613178 1457735 1825127 1688875 1799230 1631726 1692620 1862351 1803848
4119 1803848 1671756 1686069 1871075 1825161 1873296 1777845 1939898 1918216 1784914 1788319 1965150
$$ packed form
4194A504399j78047p5969Q195o7260m6323J47496J82702j67427l1563P7452j09784
4183A243871j55841J25860K03691m59J7970k4043M8854o7553j27470n4608N7808
4172A268080K54200l384j75076R302L9642q3999k02668J82287J89881M9343k46410
4161A281198K52146Q5045j30141l5291Q7785q1289M8795K1267l07361M5878K6363
4150A294395J70784M0425J69579o0825p097j19335J10687n8617j7129M2805l7606
4139A528066k7231P0473J40268p1560m2848P7125J19695k16837j45873J24554
4129A555832Q5682k8336j55443L67392j36252J10355j67504O0894J69731n8503
4119A803848j32092J4313J85006m5914M8135r5451J62053k1682j33302L405J76831
$$ plain form
4108 1965150 1939262 1764207 1636892 1771557 1921339 2028261 2233494 2161840 2039325 2095417
4098 2095417 2220894 2138124 2110701 2327411 2302763 2173209 2224515 2305669 2460598 2619444
4088 2619444 2732587 2696193 2651166 2620883 2468432 2544203 2757272 2862772 2777287 2831414 2878515
4077 2878515 2812911 2687911 2937772 3056505 3111087 3096066 3177937 3359966 3304806 3361402 3332123
4066 3332123 3597332 3642980 3788250 3883271 3909993 3939901 3873618 4038890 4374839 4735830
4056 4735830 4863299 4961174 5151431 5701343 5824528 6241614 6693947 7114197 7324316 7176683
4046 7176683 7159077 7079556 7349623 7213802 7339054 7633244 7869059 8190850 8204307 8399154
4036 8399154 8880054 9449983 9784606 10136901 10445209 10740997 11034599 11415520 11861346 12359947
$$ packed form
4108A965150k5888j75055j27315J34665J49782J06922K05233p1654j22515N6092
4098B095417J25477q2770k7423K16710k4648j29554N1306Q1154J54929J58846
4088B619444J13143l6394m5027l0283j52451P5771K13069J05500q5485N4127M7101
4077B878515o5604j25000K49861J18733N4582j5021Q1871J82029n5160N6596k9279
4066C332123K65209M5648J45270R5021K6722K9908o6283J65272L35949L60991
4056D735830J27469R7875J90257N49912J23185M17086M52333M20250K10119j47633
4046G176683j7606p9521K70067j35821J25252K94190K35815L21791J3457J94847
4036H399154M80900N69929L34623L52295L08308K95788K93602L80921M45826M98601
$$ plain form
4026 12359947 12702102 13194338 13482101 13882816 14157134 14546435 14873688 15450792 16241718
4017 16241718 16473326 16818717 17064208 17555118 17685451 18012106 18602271 19023110 19062416 19591141
4007 19591141 20176365 20727582 21585838 22063004 22964375 23829641 24904578 25976509 26970768
3998 26970768 28090462 29374084 30779289 32226971 33997849 35963155 38002892 40140715
3990 40140715 42374116 44366524 46570280 48442519 49945167 51476535 53165599 54647816
3982 54647816 56147702 57825721 59612402 61283861 63131210 65387057 68008697 71014400
3974 71014400 74282015 78157176 82288151 86505023 90200783 93448865 96050008 98173586
3966 98173586 99811444 101108072 102653987 104179996 105793386 107545643 109501624 111439241
$$ packed form
4026A2359947L42155M92236K87763M00715K74318L89301L27253N77104P90926
4017A6241718K31608L45391K45491M90910J30333L26655N90165M20839L9306N28725
4007A9591141N85224N51217Q58256M77166R01371Q65266J074937J071931R94259
3998B6970768J119694J283622J405205J447682J770878J965306K039737K137823
3990D0140715K233401J992408K203756J872239J502648J531368J689064J482217
3982E4647816J499886J678019J786681J671459J847349K255847K621640L005703
3974G1014400L267615L875161M130975M216872L695760L248082K601143K123578
3966I8173586J637858J296628J545915J526009J613390J752257J955981J937617
$$ plain form
3958 111439241 113278399 114678796 115730291 116609391 117066849 117279499 117135642 116854157 116405559
3949 116405559 115475343 114221114 112734379 110963465 109447438 107997178 106678365 105499715
3941 105499715 103919649 101455635 98536892 95042940 91300502 87664610 84054853 80832594
3933 80832594 78022427 75532190 73179955 71285856 69642807 68280741 66989700 65693894
3925 65693894 64843369 63997812 62886157 61976073 61542068 60654344 59628247 58747779 57830498
3916 57830498 56587911 54764390 52933575 51480394 49951033 48510555 47054378 45776347
3908 45776347 44903587 44008026 43411202 43067241 43105269 43147104 43429413 43865360 44796643 45857679
3898 45857679 46914909 48126738 49198007 50004709 50358472 50532134 50525249 50023184 49528857
$$ packed form
3958A11439241J839158J400397J051495Q79100M57458K12650j43857k81485m48598
3949A16405559r30216j254229j486735j770914j516027j450260j318813j178650
3941A05499715j580066k464014k918743l493952l742438l635892l609757l222259
3933H0832594k810167k490237k352235j894099j643049j362066j291041j295806
3925F5693894q50525q45557j111655r10084m34005q87724j026097q80468r17281
3916E7830498j242587j823521j830815j453181j529361j440478j456177j278031
3908D5776347q72760q95561n96824l43961L8028M1835K82309M35947R31283J061036
3898D5857679J057230J211829J071269Q06702L53763J73662o885n02065m94327
$$ plain form
3889 49528857 49110939 48391242 47678453 47139769 46812559 46289572 45990672 45633432 45177197
3880 45177197 44937390 44393769 43936326 43277917 42801526 42533937 42462323 42316056 42117259 41843134
3870 41843134 41655020 41209947 40728585 39867253 38781863 37495976 35746416 34057438 32362041
3861 32362041 30944372 29357578 27980943 26811260 25797465 24798072 23642101 22948478
3853 22948478 22354042 21676743 21105636 20537081 20056465 19744823 19310870 18700805 18406193
3844 18406193 18239845 17957616 17580162 17168137 16742140 16172466 15556933 15169612 14773628
3835 14773628 14151277 13538391 13033890 12751679 12308936 11865128 11451955 10899878 10576827
3826 10576827 10278604 9772987 9485868 9261402 9015283 8752311 8710552 8646316 8461518 8048779
$$ packed form
3889D9528857m17918p19697p12789n38684l27210n22987k98900l57240m56235
3880D5177197k39807n43621m57443o58409m76391k67589p1614j46267j98797k74125
3870D1843134j88114m45073m81362q61332j085390j285887j749560j688978j695397
3861C2362041j417669j586794j376635j169683j013795r99393j155971o93623
3853B2948478n94436o77299n71107n68555m80616l11642m33953o10065k94612
3844A8406193j66348k82229l77454m12025m25997n69674o15533l87321l95984
3835A4773628o22351o12886n04501k82211m42743m43808m13173n52077l23051
3826A0576827k98223n05617k87119k24466k46119k62972m1759o4236j84798m12739
$$ plain form
3816 8048779 7775490 7743085 7642377 7593091 7307892 7183436 7097537 6727309 6283199 6208636
3806 6208636 6169737 5918073 5652257 5701386 5541644 5313702 4852227 4641284 4609158 4503336
3796 4503336 4343404 4204422 4171700 3983403 3650192 3341691 3302391 3460245 3331194 3039047
3786 3039047 2829014 2918737 2795372 2633934 2629318 2758262 2656185 2484326 2374691 2418661
3776 2418661 2287439 2248963 2259120 1953420 1945635 1929295 1943981 1784017 1864184 1795346 1635571
3765 1635571 1605449 1662121 1642342 1544610 1598965 1606898 1733798 1622474 1633353 1300954 1357178
3754 1357178 1240605 1229452 1216149 1181684 1365275 1085275 953182 897187 1202228 1148621
3744 1148621 1145665 1369001 1445103 1227817 1033089 773100 895268 1007270 1055023 1067553
$$ packed form
3816H048779k73289l2405j00708m9286k85199j24456q5899l70228m44110p4563
3806F208636l8899k51664k65816M9129j59742k27942m61475k10943l2126j05822
3796D503336j59932j38982l2722j88297l33211l08501l9300J57854j29051k92147
3786C039047k10033Q9723j23365j61438m616J28944j02077j71859j09635M3970
3776B418661j31222l8476J0157l05700p785j6340J4686j59964Q0167o8838j59775
3765A635571l0122N6672j9779r7732N4355P933J26900j11324J0879l32399N6224
3754A357178j16573j1153j3303l4465J83591k80000j32093n5995L05041n3607
3744A148621k956K23336P6102k17286j94728k59989J22168J12002M7753J2530
$$ plain form
3734 1067553 1050707 1171531 878107 599830 736766 989732 1079471 994935 904761 861526
3724 861526 870278 740151 933889 1055219 1037661 1056951 938214 770042 669715 633990 677410
3713 677410 591349 790304 755088 746538 762613 653813 873243 679762 942808 939500 973921
3702 973921 1014283 949664 878231 935052 1111902 935954 1006273 1004389 1007440 769322 772204 878783
3690 878783 1043832 873817 875313 913969 793682 931931 822332 939892 922757 1018502 909882
3679 909882 885820 1090097 1007613 814291 834242 989599 1097703 960089 769646 902551
3669 902551 895763 888859 907610 1063320 1142356 1061834 961880 1056839 1202173 1296087 1211654 1034897
3657 1034897 1100872 988071 782856 942700 1224211 1207156 1138558 1166565 1370072 1384233
$$ packed form
3734A067553j6846J20824k93424k78277J36936K52966Q9739q4536r0174m3235
3724H61526Q752j30127J93738J21330j7558J9290j18737j68172j00327l5725M3420
3713F77410q6061J98955l5216q550J6075j08800K19430j93481K63046l308L4421
3702I73921M0362o4619p1433N6821J76850j75948P0319j884L051k38118K882J06579
3690H78783J65049j70015J496L8656j20287J38249j09599J17560j7135R5745j08620
3679I09882k4062K04277q2484j93322J9951J55357J08104j37614j90443J32905
3669I02551o788o904J8751J55710P9036q0522r9954R4959J45334R3914q4433j76757
3657A034897O5975j12801k05215J59844K81511j7055o8598K8007K03507J4161
$$ plain form
3647 1384233 1421461 1433149 1477357 1648578 1637206 1496149 1300505 1443285 1653247 1621021
3637 1621021 1652796 1888910 1982199 1883704 1727851 1862661 1991928 2148743 2310743 2559088
3627 2559088 2907798 2948894 3389161 4034877 4781706 5524105 6618736 7734264 8956466
3618 8956466 10010659 10092936 9878972 9620586 9022136 7998900 7151802 6341755 5525820
3609 5525820 4913302 4394869 4160612 4006850 3820769 3611424 3532503 3459947 3631662 3596561
3599 3596561 3610401 3748675 3926575 4165389 4341206 4943662 5534105 6681531 7817525
3590 7817525 9304755 11070429 13311384 16043385 18318936 19551144 19326009 18265207
3582 18265207 16616491 14725597 12846659 11026016 9260307 7843256 6963837 6236043
$$ packed form
3647A384233L7228J1688M4208J71221j1372j41057j95644J42780K09962l2226
3637A621021L1775K36114R3289r8495j55853J34810J29267J56815J62000K48345
3627B559088L48710M1096M40267O45716P46829P42399J094631J115528J222202
3618H956466J054193Q2277k13964k58386n98450j023236q47098q10047q15935
3609E525820o12518n18433k34257j53762j86081k09345p8921p2556J71715l5101
3599C596561J3840J38274J77900K38814J75817O02456N90443J147426J135994
3590G817525J487230J765674K240955K732001K275551J232208k25135j060802
3582A8265207j648716j890894j878938j820643j765709j417051q79419p27794
$$ plain form
3574 6236043 5401036 4831445 4615503 4378421 4066641 3779409 3770874 3727616 3514386 3548693
3564 3548693 3586841 3766746 4026261 4112662 4512366 5240382 5831014 6507828 7398116 8505626
3554 8505626 9730065 10600135 10738665 10269431 9755926 8865006 7953451 7352559 7007957
3545 7007957 6376505 5732430 5475032 5135159 5006955 4784093 4755996 5051256 5355532 5426761
3535 5426761 5245471 5247666 5169220 4903519 4826722 4859550 5115883 5236366 5282107 5341069 5965776
3524 5965776 6646873 7164473 7735691 8074901 7909384 7305028 6931172 6724684 6676612 6583725
3514 6583725 6303645 5958407 5931084 5777290 5607359 5722742 6070315 6624324 7044487 7661277
3504 7661277 8278400 8609367 8300122 7835426 7545311 7214296 6919307 6843684 6814982 6940792
$$ packed form
3574F236043q35007n69591k15942k37082l11780k87232q535m3258k13230L4307
3564C548693L8148J79905K59515Q6401L99704P28016N90632O76814Q90288J107510
3554H505626J224439Q70070J38530m69234n13505q90920r11555o00892l44602
3545G007957o31452o44075k57398l39873j28204k22862k8097K95260L04276P1229
3535E426761j81290K195p8446k65701p6797L2828K56333J20483M5741N8962O24707
3524E965776O81097N17600N71218L39210j65517o04356l73856k06488m8072r2887
3514F583725k80080l45238k7323j53794j69931J15383L47573N54009M20163O16790
3504G661277O17123L30967l09245m64696k90115l31015k94989p5623k8702J25810
$$ plain form
3494 6940792 7577230 8224619 9210915 10508628 11999842 13058283 13242801 12939290 12348912
3485 12348912 11590312 10574320 9721820 8632349 7889410 7182569 6708495 6515805 6283820
3476 6283820 6134354 6146897 6416162 6789090 6878059 6846438 6841123 6894015 6942560 6602495 6361265
3465 6361265 6397855 6306745 6095285 6190994 6503074 6642724 6778146 7197064 7661057 7915136
3455 7915136 7883490 7857955 7569574 7363967 6670885 6115338 5590947 5079339 4599649 4171236
3445 4171236 3907143 3694041 3443142 3161167 2793834 2663182 2554953 2318080 2271580 2072410
3435 2072410 1965094 1886324 1641622 1641293 1616021 1633796 1578440 1442033 1212917 1255958 1248963
3424 1248963 1002877 991738 986431 1095849 1024839 744849 745064 924282 962688 775160 764442
$$ packed form
3494F940792O36438O47389R86296J297713J491214J058441J84518l03511n90378
3485A2348912p58600j015992q52500j089471p42939p06841m74074j92690k31985
3476F283820j49466J2543K69265L72928Q8969l1621n315N2892M8545l40065k41230
3465F361265L6590r1110k11460R5709L12080J39650J35422M18918M63993K54079
3455G915136l1646k5535k88381k05607o93082n55547n24391n11608m79690m28413
3445D171236k64093k13102k50899k81975l67333j30652j08229k36873m6500j99170
3435B072410j07316p8770k44702l29k5272J7775n5356j36407k29116M3041o995
3424A248963k46086j1139n307J09418p1010k79990K15J79218L8406j87528j0718
$$ plain form
3413 764442 1002486 840885 601751 605616 791541 844074 719575 752384 777053 553399 506220
3402 506220 471652 571464 659697 477030 468943 443389 279359 460007 552688 395630 374437
3391 374437 551734 532919 418859 402523 343367 323826 378213 445399 453083 372198 351035
3380 351035 301630 261328 290147 521340 491299 647880 592683 343085 406348 265199 387905
3369 387905 481604 573421 587709 567227 363194 219310 283992 247971 212466 290403 235844
3358 235844 392831 434005 397372 504595 507146 468424 145516 154538 261809 139463 -4938
3347 -4938 156747 233229 223710 341017 160934 238882 278638 293492 182006 274381 571747
3336 571747 613014 580563 402881 544073 439783 557082 536722 463400 405441 280381 210830
$$ packed form
3413G64442K38044j61601k39134L865J85925N2533j24499L2809K4669k23654m7179
3402E06220l4568R9812Q8233j82667q087k5554j64030J80648R2681j57058k1193
3391C74437J77297j8815j14060j6336n9156j9541N4387O7186P684q0885k1163
3380C51035m9405m0302K8819K31193l0041J56581n5197k49598O3263j41149J22706
3369C87905R3699R1817J4288k0482k04033j43884O4682l6021l5505P7937n4559
3358B35844J56987M1174l6633J07223K551l8722l22908R022J07271j22346j44401
3347d938J61685P6482r519J17307j80083P7948L9756J4854j11486R2375K97366
3336E71747M1267l2451j77682J41192j04290J17299k0360p3322n7959j25060o9551
$$ plain form
3325 210830 150282 329741 247726 234166 130684 82814 82553 67370 -4974 127597 233849
3314 233849 -13195 -43285 -11444 70931 -73125 -123793 -130941 92089 39620 -8206 -215117
3303 -215117 -96807 122669 -2432 254009 269984 413413 309340 89371 37877 101917
3293 101917 184520 234389 221695 58391 -29389 -25038 -86537 -211273 -155211 -203605 -96571
3282 -96571 -111224 -64196 -27061 -28310 54498 116044 155273 -25588 26290 1126 820 -124448
3270 -124448 -97766 58844 98927 25427 -10775 -125397 -88566 94722 28180 116459 265353
3259 265353 258889 203443 65585 -61731 31938 -22040 -32724 -18515 -30517 -7929 -50392
3248 -50392 -357494 -259682 -46435 -124085 -86546 -202193 -106265 -76583 67888 101109 -14543
$$ packed form
3325B10830o0548J79459q2015j3560j03482m7870k61j5183p2344J32571J06252
3314B33849k47044l0090L1841Q2375j44056n0668p148K23030n2469m7826k06911
3303b15117J18310K19476j25101K56441J5975J43429j04073k19969n1494O4040
3293A01917Q2603M9869j2694j63304q7780M351o1499j24736N6062m8394J07034
3282i6571j4653M7028L7135j249Q2808O1546L9229j80861N1878k5164l06j25268
3270a24448K6682J56610M0083p3500l6202j14622L6831J83288o6542Q8279J48894
3259B65353o464n5446j37858j27316R3669n3978j0684J4209j2002K2588m2463
3248e0392l07102R7812K13247p7650L7539j15647R5928K9682J44471L3221j15652
$$ plain form
3237 -14543 -442 43441 180926 91383 118917 27489 -72469 -6903 -57602 -19116 -103820 -154204
3225 -154204 -59206 37117 -134922 1885 200468 52076 33135 175563 56485 -38256
3215 -38256 -13799 121102 161008 -23241 -65517 -98164 -69295 30686 -13274 66895 84018
3204 84018 172723 -26582 6863 144276 204118 157213 112377 216213 237044 13956 6115
3193 6115 139211 253101 176125 -6185 -28720 -40394 150728 117825 65333 85924 69773
3182 69773 43287 83171 29768 126528 193739 237540 409850 387100 23055 -16426 178565
3171 178565 389536 401052 291866 369167 179556 368981 389292 329437 371876 502558 636978
3160 636978 751219 833541 655451 689479 373000 630188 825703 872891 733881 784912
$$ packed form
3237a4543J4101M3883J37485q9543K7534r1428r9958O5566n0699L8486q4704n0384
3225a54204R4998R6323j72039J36807J98583j48392j8941J42428j19078r4741
3215c8256K4457J34901L9906j84249m2276l2647K8869R9981m3960Q0169J7123
3204H4018Q8705j99305L3445J37413N9842m6905m4836J03836K0831k23088p841
3193F115J33096J13890p6976j82310k2535j1674J91122l2903n2492K0591j6151
3182F9773k6486L9884n3403R6760O7211M3801J72310k2750l64045l9481J94991
3171A78565K10971J1516j09186P7301j89611J89425K0311n9855M2439J30682J34420
3160F36978J14241Q2322j78090L4028l16479K57188J95515M7188j39010N1031
$$ plain form
3150 784912 746530 847800 951204 921051 1037184 1019018 1079375 1010754 966047 996160 884303
3139 884303 843881 866053 932533 892356 721584 799964 921691 1076553 1094948 954567 1110818
3128 1110818 1213440 1162710 1185562 1425837 1767177 1973835 2022448 1940960 1846312 1705369
3118 1705369 1639002 1283456 1226768 1294527 1123283 1043713 1068120 991570 811414 786821 808699
3107 808699 816975 982589 1006655 835590 801251 785826 643777 768917 715692 777367 853334
3096 853334 853629 800344 686786 747256 733670 783520 670536 765555 796711 839868 761378 755299
3084 755299 739228 688803 769816 537723 295676 386845 500665 540253 378074 221682 211488
3073 211488 152029 280347 322636 370424 485517 617997 421281 216086 298602 291534 284809
$$ packed form
3150G84912l8382J01270J03404l0153J16133j8166O0357o8621m4707L0113j11857
3139H84303m0422K2172O6480m0177j70772P8380J21727J54862J8395j40381J56251
3128A110818J02622n0730K2852K40275L41340K06658M8613q1488r4648j40943
3118A705369o6367l55546n6688O7759j71244p9570K4407p6550j80156k4593K1878
3107H08699Q276J65614K4066j71065l4339j5425j42049J25140n3225O1675P5967
3096H53334K95n3285j13558O0470j3586M9850j12984R5019L1156M3157p8490o079
3084G55299j6071n0425Q1013k32093k42047R1169J13820L9588j62179j56392j0194
3073B11488n9459J28318M2289M7788J15093J32480j96716k05195Q2516p068o725
$$ plain form
3062 284809 283263 69537 -7133 70623 52903 28636 21006 46317 85108 67100 127737 130388
3050 130388 76101 -100078 -16980 104330 111771 75836 139094 143004 -110177 -186905 171405
3039 171405 129217 71017 29547 -114663 139370 -11999 85504 -45432 92369 159150 136712
3028 136712 197237 54553 83114 -58751 41325 139901 189443 74466 -151875 -228844 -236402
3017 -236402 -260328 -183311 -48460 -43613 9975 -55851 -55905 -199964 -262912 -282714 -254177 -40198
3005 -40198 -91627 -134162 -254525 -227108 -109261 -103279 -199370 -48001 -112237 -171081 -165649 -183396
2993 -183396 -139844 -143360 -56082 -31420 13745 -50585 -30756 -34080 73969 47381 -223745 -188978
2981 -188978 -108192 -156397 -195868 -213443 -156219 -51344 -14025 -7781 48265 76682 161120 -6037
$$ packed form
3062B84809j546k13726p6670P7756j7720k4267p630K5311L8791j8008O0637K651
3050A30388n4287j76179Q3098J21310P441l5935O3258L910k53181p6728L58310
3039A71405m2188n8200m1470j44210K54033j51369R7503j30936J37801O6781k2438
3028A36712O0525j42684K8561j41865J00076R8576M9542j14977k26341p6969p558
3017b36402k3926P7017J34851M847N3588o5826n4j44059o2948j9802K8537K13979
3005d0198n1429m2535j20363K7417J17847N982r6091J51369o4236n8844N432j7747
2993a83396M3552l516Q7278K4662M5165o4330J9829l324J08049k6588k71126L4767
2981a88978Q0786m8205l9471j7575N7224J04875L7319O244N6046K8417Q4438j67157
$$ plain form
2969 -6037 -223651 -7139 -49732 -71881 -48872 -37695 -39900 -22401 -80275 -83478 -116829 -293042
2957 -293042 -253685 -180758 -127388 -52860 31785 -206329 -21802 37274 56074 -36722 -63335
2946 -63335 -36217 -110067 -205970 -150322 85403 -41872 -161383 -245981 -187925 -117985 -115396
2935 -115396 -112241 -114654 -115831 17762 -30661 -95001 120449 105564 -144599 -206656 -71198
2924 -71198 -145483 -265761 -172421 -161403 -231946 -326562 -308706 -274629 -196716 -154514 -299712
2913 -299712 -169872 -4859 32974 -124947 -292308 -199550 -89686 -97748 -242201 -107871
2903 -107871 -144926 -258600 -251030 -160726 -195029 -119927 -207917 -337119 -229581 -154501 -75842
2892 -75842 18148 -66898 41806 20256 -85125 -118340 -158364 -261729 -223506 -114525 -46306
$$ packed form
2969f037k17614K16512m2593k2149K3009J1177k205J7499n7874l203l3351j76213
2957b93042L9357P2927N3370P4528Q4645k38114J84527N9076J8800r2796k6613
2946f3335K7118p3850r5903N5648K35725j27275j19511q4598N8056O9940K589
2935a15396L155k413j177J33593m8423o4340K15450j4885k50163o2057J35458
2924g1198p4285j20278R3340J1018p0543r4616J7856L4077P7913M2202j45198
2913b99712J29840J65013L7833j57921j67361R2758J09864q062j44453J34330
2903a07871l7055j13674P570R0304l4303P5102q7990j29202J07538P5080P8659
2892g5842R3990q5046J08704k1550j05381l3215m0024j03365L8223J08981O8219
$$ plain form
2881 -46306 -119996 -148554 9248 -40313 -8171 -79265 -25348 -64088 -59945 -115642 -70087 -92904
2869 -92904 10339 43266 -13435 -97547 -108517 -81083 -167186 2214 -120197 -255095 -112729
$$ packed form
2881d6306p3690k8558J57802m9561L2142p1094N3917l8740M143n5697M5555k2817
2869i2904J03243L2927n6701q4112j0970K7434q6103J69400j22411j34898J42366
$$ [...]
##END NTUPLES=NMR SPECTRUM
##END=
