##TITLE=1H_DE-80H_X3
 200.13MHz, d2o
 8 sc
 
 19ns.26.2.2025
##JCAMPDX= 6.0         $$ Bruker NMR JCAMP-DX V2.0
##DATA TYPE= NMR SPECTRUM
##DATA CLASS= NTUPLES
##ORIGIN= UXNMR, Bruker Analytische Messtechnik GmbH
##OWNER= pz
$$ XWIN-NMR		Version 3.5
$$ Mon Jul 27 11:29:17 2026 Russian Standard Time (UT+4h)  Yarkov@DPX200
##.OBSERVE FREQUENCY= 200.1313
##.OBSERVE NUCLEUS= ^1H
##.ACQUISITION MODE= SIMULTANEOUS
##.ACQUISITION SCHEME= undefined
##.AVERAGES= 8
##.DIGITISER RES= 18
##SPECTROMETER/DATA SYSTEM= spect
##.PULSE SEQUENCE= zg30
##.SOLVENT NAME= DMSO
##.SHIFT REFERENCE= (INTERNAL, DMSO, 0, 15.5012)
##AUDIT TRAIL= $$ (NUMBER, WHEN, WHO, WHERE, WHAT)
$$ ##TITLE= Audit trail, XWIN-NMR		Version 3.5
$$ ##JCAMPDX= 5.01
$$ ##ORIGIN= Bruker BioSpin GmbH
$$ ##OWNER= Yarkov
$$ C:/Bruker/XWIN-NMR/data/yarkov2/nmr/H-C/1/pdata/1/auditp.txt
$$ ##AUDIT TRAIL=  $$ (NUMBER, WHEN, WHO, WHERE, WHAT)
(   1,<2026-07-27 11:28:20.53 +0400>,<Yarkov>,<DPX200>,
      <created by zg, POWCHK disabled, PULCHK disabled
       configuration hash MD5:
       00 E9 B6 7A A2 85 ED C7 34 08 36 98 17 FE 4E 26
       data hash MD5: 16K
       74 F2 02 46 41 0C 68 CC 0F 33 21 39 52 BF E3 21>)
(   2,<2026-07-27 11:28:26.23 +0400>,<Yarkov>,<DPX200>,
      <Start of raw data processing
       efp BC_mod = 2 LB = 0.25 FT_mod = 6 PKNL = 1 PHC0 = -7257.783 PHC1 = 2.82197 SI = 16K 
       data hash MD5: 16K
       94 AD AD 4B 95 B8 04 B2 2E F7 5D DA 84 70 CF 76>)
(   3,<2026-07-27 11:28:38.28 +0400>,<Yarkov>,<DPX200>,
      <pk PHC0 = 4.600001 PHC1 = 0 
       data hash MD5: 16K
       56 6D 59 4A AA 2C A0 69 F8 D3 1F 04 67 87 B5 31>)
$$ ##END=
$$ 
$$ hash MD5
$$ 0C 99 0B A5 E4 CC 2D EF 44 C8 1C 6F DF 03 42 D9
##$RELAX= 
##$RELAX= 
##$RELAX= 
##$RELAX= 
##$RELAX= 
##$RELAX= 
$$ Bruker specific parameters
$$ --------------------------
##$DU= <C:/Bruker/XWIN-NMR>
##$EXPNO= 1
##$NAME= <H-C>
##$PROCNO= 1
##$TYPE= <nmr>
##$USER= <yarkov2>
##$AMP= (0..31)
100 100 100 100 100 100 100 100 100 100 100 100 100 100 100 100 100 100 
100 100 100 100 100 100 100 100 100 100 100 100 100 100 
##$AQSEQ= 0
##$AQ_mod= 1
##$AUNM= <au_zg>
##$AUTOPOS= <>
##$BF1= 200.13
##$BF2= 200.13
##$BF3= 200.13
##$BF4= 200.13
##$BF5= 200.13
##$BF6= 200.13
##$BF7= 200.13
##$BF8= 200.13
##$BYTORDA= 1
##$CFDGTYP= 0
##$CFRGTYP= 5
##$CHEMSTR= <none>
##$CNST= (0..31)
1 1 145 1 1 1 1 1 1 1 1 1 1 1 1 1 1 1 1 1 1 1 1 1 1 1 1 1 1 1 1 1 
##$CPDPRG= <>
##$CPDPRG1= <>
##$CPDPRG2= <>
##$CPDPRG3= <>
##$CPDPRG4= <mlev>
##$CPDPRG5= <mlev>
##$CPDPRG6= <mlev>
##$CPDPRG7= <mlev>
##$CPDPRG8= <mlev>
##$CPDPRGB= <>
##$CPDPRGT= <>
##$D= (0..31)
0 0.7 0 0 0 0 0 0 0 0 0 0.03 0 0 0 0 0 0 0 0 0 0 0 0 0 0 0 0 0 0 0 0 
##$DATE= 1785137300
##$DBL= (0..7)
120 120 120 120 120 120 120 120 
##$DBP= (0..7)
150 150 150 150 150 150 150 150 
##$DBP07= 0
##$DBPNAM0= <>
##$DBPNAM1= <>
##$DBPNAM2= <>
##$DBPNAM3= <>
##$DBPNAM4= <>
##$DBPNAM5= <>
##$DBPNAM6= <>
##$DBPNAM7= <>
##$DBPOAL= (0..7)
0.5 0.5 0.5 0.5 0.5 0.5 0.5 0.5 
##$DBPOFFS= (0..7)
0 0 0 0 0 0 0 0 
$$ [...]
##$SUBNAM2= <"">
##$SUBNAM3= <"">
##$SUBNAM4= <"">
##$SUBNAM5= <"">
##$SUBNAM6= <"">
##$SUBNAM7= <"">
##$SUBNAM8= <"">
##$SUBNAM9= <"">
##$SW= 18.0517328524113
##$SWIBOX= (0..15)
0 0 2 0 0 0 0 0 0 0 0 0 0 0 0 0 
##$SW_h= 3612.71676300578
##$TD= 16384
##$TD0= 1
##$TE= 0
##$TE2= 300
##$TE3= 300
##$TEG= 300
##$TL= (0..7)
0 120 120 120 120 120 120 120 
##$TP= (0..7)
150 150 150 150 150 150 150 150 
##$TP07= 0
##$TPNAME0= <>
##$TPNAME1= <>
##$TPNAME2= <>
##$TPNAME3= <>
##$TPNAME4= <>
##$TPNAME5= <>
##$TPNAME6= <>
##$TPNAME7= <>
##$TPOAL= (0..7)
0.5 0.5 0.5 0.5 0.5 0.5 0.5 0.5 
##$TPOFFS= (0..7)
0 0 0 0 0 0 0 0 
##$TUNHIN= 0
##$TUNHOUT= 0
##$TUNXOUT= 0
##$USERA1= <user>
##$USERA2= <user>
##$USERA3= <user>
##$USERA4= <user>
##$USERA5= <user>
##$V9= 5
##$VALIST= <valist>
##$VCLIST= <CCCCCCCCCCCCCCC>
##$VD= 0
##$VDLIST= <DDDDDDDDDDDDDDD>
##$VPLIST= <PPPPPPPPPPPPPPP>
##$VTLIST= <TTTTTTTTTTTTTTT>
##$WBST= 1024
##$WBSW= 4
##$XGAIN= (0..3)
0 0 0 0 
##$XL= 0
##$YL= 0
##$YMAX_a= 138338
##$YMIN_a= -216574
##$ZGOPTNS= <>
##$ZL1= 120
##$ZL2= 120
##$ZL3= 120
##$ZL4= 120
##$ABSF1= 0
##$ABSF2= 0
##$ABSG= 0
##$ABSL= 0
##$ALPHA= 0
##$AQORDER= 0
##$ASSFAC= 0
##$ASSFACI= 0
##$ASSFACX= 0
##$ASSWID= 0
##$AUNMP= <proc_1d>
##$AZFE= 0.1
##$AZFW= 0.1
##$BCFW= 0
##$BC_mod= 2
##$BYTORDP= 0
##$COROFFS= 0
##$CY= -3
##$DATMOD= 1
##$DC= 0
##$DFILT= <>
##$DTYPP= 0
##$F1P= 0
##$F2P= 0
##$FCOR= 1
##$FTSIZE= 16384
##$FT_mod= 6
##$GAMMA= 0
##$GB= 0
##$INTBC= 1
##$INTSCL= 3.241238e-09
##$ISEN= 128
##$LB= 0.25
##$LEV0= 0
##$LPBIN= 0
##$MAXI= 10000
##$MC2= 0
##$MEAN= 0
##$ME_mod= 0
##$MI= 1.114404
##$NCOEF= 0
##$NC_proc= -6
##$NLEV= 6
##$NOISF1= 3.799351
##$NOISF2= 2.8
##$NSP= 0
##$NTH_PI= 0
##$NZP= 0
##$OFFSET= 15.50119
##$PC= 1
##$PHC0= -7253.183
##$PHC1= 2.82197
##$PH_mod= 1
##$PKNL= yes
##$PPARMOD= 0
##$PSCAL= 0
##$PSIGN= 0
##$REVERSE= no
##$SF= 200.130004106422
##$SI= 16384
##$SIGF1= 3
##$SIGF2= 2
##$SINO= 0.751879
##$SIOLD= 32768
##$SREGLST= <19F.Aceton>
##$SSB= 0
##$STSI= 16384
##$STSR= 0
##$SW_p= 3612.71676300578
##$SYMM= 0
##$S_DEV= 0
##$TDeff= 16384
##$TDoff= 0
##$TI= <>
##$TILT= no
##$TM1= 0
##$TM2= 0
##$TOPLEV= 0
##$USERP1= <user>
##$USERP2= <user>
##$USERP3= <user>
##$USERP4= <user>
##$USERP5= <user>
##$WDW= 1
##$XDIM= 16384
##$YMAX_p= 274347539
##$YMIN_p= -1312993
$$ End of Bruker specific parameters
$$ ---------------------------------
##NTUPLES= NMR SPECTRUM
##VAR_NAME=  FREQUENCY,     SPECTRUM/REAL,   SPECTRUM/IMAG
##SYMBOL=    X,             R,               I
##VAR_TYPE=  INDEPENDENT,   DEPENDENT,       DEPENDENT
##VAR_FORM=  AFFN,          ASDF,            ASDF
##VAR_DIM=   16384,         16384,           16384
##UNITS=     HZ,            ARBITRARY UNITS, ARBITRARY UNITS
##FACTOR=    0.220516191357247, 1,           1
##FIRST=     3102.25325548792, 0,            0
##LAST=      -510.463507517856, 0,           0
##MIN=       -510.463507517856, -1312993,    0
##MAX=       3102.25325548792, 274347539,    0
$$ Real data points
##PAGE= N=1
##DATA TABLE= (X++(R..R)), XYDATA
$$ [...]
11453 -178740 -184037 -188220 -197292 -249814 -229109 -232183 -232294 -179269 -202411 -171237 -179701 -184910 -118369
11440 -118369 -109557 -113074 -165709 -152810 -126336 -61818 -90723 -42710 -133068 -143725 -134457 -158183
11428 -158183 -152405 -107759 -79968 -26758 -24610 -94658 -122527 -155796 -126904 -177213 -112407 -129287
11416 -129287 -166121 -155421 -165008 -152383 -82239 -121965 -144780 -129387 -165598 -147103 -85273 -143901
11404 -143901 -116603 -117593 -158805 -124112 -133122 -128809 -122964 -112467 -94576 -192294 -174928 -128097
11392 -128097 -180638 -164274 -108586 -124566 -105626 -83367 -50874 -141965 -167467 -98706 -109046
11381 -109046 -92938 -65971 -126826 -165607 -209866 -214825 -170478 -176553 -183349 -161717 -147024 -108331
11369 -108331 -118407 -161125 -142400 -141731 -146910 -181889 -133554 -106322 13118 -4039 -136293 -123623
11357 -123623 -138160 -72954 -91122 -126042 -135100 -151170 -90249 -101062 -101761 -133058 -106441 -163364
11345 -163364 -188264 -138334 -91161 -184112 -173508 -200945 -143946 -138516 -184069 -195438 -146247 -124576
11333 -124576 -65785 -95096 -73396 -72022 -140249 -148082 -97262 -76885 -111754 -148004 -132128 -144522
11321 -144522 -85122 -99037 -113364 -79659 -65234 -107005 -140225 -225336 -251903 -132756 -138305
11310 -138305 -92878 -146519 -141651 -176065 -187565 -184332 -131073 -123178 -160185 -143373 -112967 -176002
11298 -176002 -142289 -126538 -89042 -70121 -101674 -63920 -85638 -169812 -162940 -119823 -122654 -134339
11286 -134339 -156694 -204085 -216681 -241967 -188358 -153672 -148993 -107827 -105985 -86330 -69314 -57615
11274 -57615 -134503 -146155 -148475 -89682 -82171 -157569 -119370 -120070 -160445 -180702 -133920 -113938
11262 -113938 -187899 -167088 -178565 -194909 -96799 -86301 -132706 -154779 -145764 -123955 -173961 -239639
11250 -239639 -205074 -148223 -90642 -94872 -91161 -77413 -116831 -97504 -135210 -128302 -112591 -114087
11238 -114087 -112825 -169865 -124131 -101034 -58487 -97250 -161059 -147819 -55601 -129205 -160147 -144725
11226 -144725 -103437 -97015 -217915 -181026 -161488 -148201 -115161 -98016 -124297 -154976 -139590
11215 -139590 -105039 -44130 -70267 -63070 -129387 -199869 -232976 -128375 -117304 -193326 -164601
11204 -164601 -192693 -162776 -146043 -178623 -147178 -152640 -148886 -134190 -145017 -111447 -70297 -159502
11192 -159502 -165324 -199825 -159572 -104912 -154252 -160672 -215311 -151444 -172576 -170084 -114932 -151470
11180 -151470 -135399 -159523 -155911 -154489 -184494 -124728 -155860 -169301 -160609 -159987 -188696 -191486 -158839
11167 -158839 -220170 -191404 -124799 -85284 -117460 -85644 -67848 -135049 -165177 -177089 -143228
11156 -143228 -107294 -44685 -73811 -77722 -70675 -77623 -59567 -114021 -157719 -118786 -133327 -125334
11144 -125334 -177921 -180996 -158215 -87734 -100192 -169934 -157086 -125513 -85535 -80457 -137461 -142846
11132 -142846 -150054 -130206 -106889 -158475 -117753 -88328 -95963 -69496 -127337 -120780 -177008 -148079
11120 -148079 -117387 -141935 -164265 -173146 -126014 -55430 -130169 -203979 -152974 -135681 -197779 -192566
11108 -192566 -202635 -228641 -228019 -173417 -140366 -157340 -191821 -224769 -119047 -87249 -131329 -146065
11096 -146065 -168566 -130133 -114526 -118094 -137037 -143293 -133645 -99686 -66459 -97086 251 -53396
11084 -53396 -155777 -214682 -225483 -114298 -175833 -233530 -200400 -176360 -155547 -183264 -126336
11073 -126336 -122217 -129342 -148346 -112137 -65660 -51476 -74344 -129534 -122022 -107866 -123695 -151419
11061 -151419 -157297 -156373 -180428 -175301 -156687 -116745 -90060 -139974 -161509 -161273 -141521 -136990 -223248
11048 -223248 -131001 -77540 -115903 -108503 -127903 -180314 -164277 -127970 -117637 -131461 -121312 -136828
11036 -136828 -145752 -131473 -174720 -147730 -146480 -208780 -212871 -156670 -129181 -164781 -211592 -163122
11024 -163122 -147846 -187869 -127332 -168252 -121252 -111410 -113424 -90769 -95198 -149928 -167185 -193928
11012 -193928 -196384 -150356 -166570 -147010 -169926 -156146 -131717 -153532 -156964 -141181 -182525 -224132
11000 -224132 -226145 -216651 -220977 -161645 -166618 -174632 -172028 -183797 -204880 -183701 -124871 -123845 -138296
10987 -138296 -133957 -56604 -79160 -146038 -160468 -111598 -66084 -77538 -105300 -80905 -104176 -126697
10975 -126697 -86443 -44411 -73639 -90424 -96647 -152731 -154768 -169120 -212482 -219599 -174697 -154476
10963 -154476 -188222 -142754 -86859 -67808 -51766 -103868 -99859 -118240 -140358 -112442 -108007 -162454
10951 -162454 -128980 -123099 -177815 -201427 -231730 -245758 -237913 -239364 -190241 -144378 -120962 -148560
10939 -148560 -127422 -108696 -133537 -101943 -72777 -34840 -58171 -159194 -168326 -158722 -112245 -104068
10927 -104068 -163425 -195588 -206525 -186948 -193062 -195114 -183662 -132233 -105150 -88583 -207096 -187514
10915 -187514 -217989 -239268 -100988 -148136 -157224 -105803 -173354 -250528 -227775 -173033 -182512 -215293
10903 -215293 -214694 -248321 -180085 -180157 -170282 -123341 -191636 -198701 -175819 -183147 -164534 -171154 -151087
10890 -151087 -49617 -53646 -100240 -124328 -148919 -163707 -161838 -179812 -193100 -193606 -191948 -115835
10878 -115835 -84722 -105988 -156110 -61107 -51552 -125474 -88214 -45065 -53722 -120900 -175955 -144481
10866 -144481 -133238 -153307 -176447 -160231 -104147 -96030 -136337 -172113 -230868 -215354 -211339 -101597
10854 -101597 -61432 -56796 -122068 -136510 -123692 -100312 -121146 -129415 -135107 -193855 -220977 -240773
10842 -240773 -233423 -239249 -214485 -194159 -201675 -156218 -187489 -182826 -96319 -120870 -197519 -204704
10830 -204704 -166135 -163667 -141687 -107922 -88826 -141413 -130942 -113434 -92844 -135028 -123445 -128346
10818 -128346 -164816 -120230 -82189 -178823 -184063 -139037 -71082 -58440 -80916 -125186 -91094 -84834
10806 -84834 -122099 -140998 -78909 -117057 -108666 -64406 -81067 -58464 -77176 -69864 -144740 -183008
10794 -183008 -130482 -201938 -250286 -225880 -117451 -100966 -95424 -101318 -90840 -142797 -153253 -163735
10782 -163735 -137541 -110432 -86687 -117441 -186182 -203384 -227335 -176310 -93855 -103136 -143673 -164018
10770 -164018 -172656 -195078 -156668 -89212 -145543 -115777 -125150 -190535 -208512 -211849 -215840 -167476
10758 -167476 -128136 -118013 -151427 -162909 -169391 -182477 -182493 -122279 -115486 -204846 -144463 -122880
10746 -122880 -151673 -107373 -108729 -113031 -110368 -107760 -82508 -97858 -82260 -101493 -139424 -97411
10734 -97411 -131329 -157219 -110670 -117770 -90524 -121922 -164841 -104201 -53732 -85260 -77014 -127926
10722 -127926 -184877 -125116 -131101 -215695 -164709 -80922 -57825 -62447 -102767 -34391 -115682 -78607
10710 -78607 -118762 -93739 -140885 -226647 -133056 -89591 -131665 -185541 -163421 -123810 -168087 -143175
10698 -143175 -103679 -71622 -132581 -155075 -167616 -175525 -176523 -210810 -209974 -181348 -162668 -120236
10686 -120236 -147573 -108245 -177003 -195790 -180802 -190206 -113345 -114939 -99767 -120707 -77641 -86124
10674 -86124 -164565 -154845 -134714 -114428 -130054 -129817 -137597 -155460 -172890 -204760 -239354 -188754
10662 -188754 -190132 -129978 -87413 -155138 -105410 -98887 -189460 -194110 -188103 -208609 -154300 -113242
10650 -113242 -116402 -111366 -119923 -185969 -211706 -114975 -82916 -163813 -196591 -192708 -228577 -187184
10638 -187184 -148937 -168175 -219455 -251184 -199633 -204261 -198093 -231616 -169308 -155563 -187037 -214503
10626 -214503 -169067 -89948 -123306 -191722 -139328 -185363 -159853 -177085 -161530 -99609 -170246
10615 -170246 -123562 -96613 -220147 -151826 -152611 -174807 -147847 -164893 -159554 -163422 -161363 -98965
10603 -98965 -90411 -173986 -198619 -144166 -201548 -173139 -184576 -149569 -149689 -136182 -111304 -157328
10591 -157328 -101080 -151679 -197642 -127764 -185744 -215165 -221801 -198884 -219925 -179983 -83005 -119974
10579 -119974 -78193 -99113 -177737 -174802 -172994 -173263 -135239 -140894 -106312 -108874 -118017 -161968 -181982
10566 -181982 -141176 -157502 -146247 -135529 -156005 -111174 -143600 -186156 -171801 -137569 -93296
10555 -93296 -82322 -60189 -17882 -60285 -112352 -105883 -110458 -165378 -153959 -94960 -77836 -120868
10543 -120868 -200804 -204682 -141429 -138632 -122911 -193315 -157110 -66977 -49899 -62149 -94224 -93454
10531 -93454 -148186 -167765 -126460 -184539 -172555 -183406 -235382 -208649 -156258 -113866 -137609 -126416
10519 -126416 -147155 -185975 -139833 -140339 -152607 -95751 -95339 -100814 -70346 -84723 -120085 -162017
10507 -162017 -167911 -188504 -197678 -219545 -189508 -201188 -237960 -176552 -223665 -208462 -178196 -174310
10495 -174310 -172030 -187728 -162164 -165297 -181469 -191751 -145370 -130429 -170352 -167711 -130758 -66572
10483 -66572 -66417 -142657 -141039 -119109 -127761 -132612 -141475 -167551 -97784 -76630 -102884 -106039 -124970
10470 -124970 -136369 -108664 -98426 -80980 -88645 -126798 -153665 -132138 -170966 -176027 -194719 -206664
10458 -206664 -189456 -127047 -90813 -72860 -105602 -94152 -117694 -112029 -87679 -141244 -93092 -82627
10446 -82627 -141637 -166141 -124995 -69545 -104262 -138588 -172643 -155778 -74715 -61809 -63005 -118375
10434 -118375 -120056 -139632 -225127 -210710 -167387 -228821 -204830 -133908 -156787 -147144 -147654 -161787
10422 -161787 -163298 -181728 -147677 -103412 -163807 -132171 -27090 -73915 -120696 -117366 -124287 -108043
10410 -108043 -94992 -118532 -63012 -81202 -113564 -195986 -204936 -209578 -102848 -170714 -156917 -145989
10398 -145989 -174079 -164313 -164458 -173623 -202248 -172141 -157642 -164729 -172809 -198881 -153995 -148076 -173120
10385 -173120 -180700 -172985 -169435 -212769 -237477 -122631 -72951 -93198 -108884 -100838 -155645 -176855
10373 -176855 -191218 -201755 -174303 -181563 -147151 -139641 -137037 -132742 -122746 -141700 -160750 -133147
10361 -133147 -166489 -172029 -126112 -151033 -154100 -102287 -22642 -4173 -87931 -189794 -103231 -162568
10349 -162568 -201211 -269515 -223577 -124508 -87451 -89486 -128848 -95686 -24315 -84728 -75596 -116653
10337 -116653 -210310 -134473 -154477 -135389 -112195 -186816 -188711 -163390 -70933 -72321 -101615 -56224
10325 -56224 -70826 -120202 -94898 -135600 -182696 -142955 -59138 -48846 -105132 -128248 -186834 -198551
10313 -198551 -144376 -136302 -181594 -175143 -120021 -124475 -113624 -95657 -108458 -61386 -115414 -69261
10301 -69261 -56490 -125297 -20686 -72762 -173158 -131648 -93332 -10948 -31913 -147084 -160836
10290 -160836 -118499 -75945 -75463 -129611 -170092 -222117 -217061 -131782 -148648 -144621 -115266 -151483
10278 -151483 -219243 -156743 -140069 -90203 -116992 -170488 -144872 -145176 -130125 -156275 -157498 -92933
10266 -92933 -79863 -111198 -111999 -149226 -215815 -202509 -172697 -159338 -128152 -126160 -147552 -194302
10254 -194302 -180865 -182319 -161381 -166045 -133149 -152681 -190429 -182896 -193050 -211976 -234036 -194845
10242 -194845 -109783 -96963 -84951 -42940 -84502 -152155 -152706 -132849 -182660 -154335 -122262 -95294
10230 -95294 -48881 -77933 -94039 -112192 -157715 -184013 -166473 -148010 -111761 -134495 -108261 -116785
10218 -116785 -141146 -172869 -185276 -162374 -189657 -232772 -195420 -184277 -146510 -86063 -131328
10207 -131328 -130259 -106875 -133821 -176828 -224504 -235217 -172371 -162455 -220979 -206578 -184248 -165904
10195 -165904 -120144 -105900 -107780 -61293 -74730 -128340 -133982 -175029 -173962 -127004 -119069 -122706
10183 -122706 -165046 -123173 -131293 -150746 -190548 -124345 -180544 -171014 -110922 -168834 -106259 -121421
10171 -121421 -195526 -226821 -193989 -172428 -145778 -108235 -96790 -139265 -162262 -171373 -133872 -203165
10159 -203165 -205900 -167686 -103032 -84264 -154107 -120478 -122379 -203568 -155382 -151059 -98337 -148947
10147 -148947 -172095 -129925 -230523 -256670 -106267 -89924 -145325 -111677 -119534 -126971 -86131
10136 -86131 -126152 -177471 -110166 -115577 -213837 -205557 -181778 -147056 -185407 -198257 -134050 -207898
10124 -207898 -157891 -182447 -128207 -150332 -159780 -112905 -169950 -161164 -115353 -127206 -146434 -122194
10112 -122194 -137754 -176431 -184612 -181356 -150033 -121638 -171221 -135700 -142593 -152146 -112229 -79605
10100 -79605 -120666 -153700 -107485 -157712 -152770 -70214 -132261 -152921 -148296 -163144 -139946 -147645
10088 -147645 -159700 -107622 -137894 -120130 -120409 -229992 -191567 -166634 -144772 -91024 -135135 -193008
10076 -193008 -140147 -176135 -125482 -84759 -119196 -108301 -139903 -97910 -88524 -88978 -56702 -76007
10064 -76007 -133061 -80255 -166846 -212290 -154366 -182291 -171563 -205057 -192745 -175106 -122799 -152150
10052 -152150 -127118 -105836 -100215 -171645 -165121 -175768 -171057 -155289 -130761 -112600 -132327 -116672
10040 -116672 -132184 -163988 -140569 -132695 -171304 -127867 -138968 -125084 -148424 -112157 -55040 -116873
10028 -116873 -152994 -91562 -131001 -126281 -101808 -59723 -109572 -83803 -156155 -137707 -158035 -165932
10016 -165932 -113673 -115059 -118625 -158022 -126997 -92955 -152532 -224472 -225587 -210662 -148917 -195636
10004 -195636 -179194 -201867 -152835 -165287 -180386 -133480 -99357 -79331 -156759 -123987 -104244
9993 -104244 -150876 -169427 -102999 -84961 -179526 -146002 -119810 -80864 -96622 -124471 -88107 -92157
9981 -92157 -103232 -190717 -167122 -63256 -52453 -58701 -130096 -181630 -154755 -111837 -117527 -178659
9969 -178659 -235042 -195662 -125744 -79189 -31862 -82386 -54922 -79062 -111053 -105671 -129747 -92446
9957 -92446 -120570 -155328 -140410 -117447 -89584 -107814 -181461 -182596 -148853 -110095 -182515 -179233
9945 -179233 -157483 -204191 -202034 -149190 -132606 -207773 -224601 -180045 -177456 -151051 -189006 -225966
9933 -225966 -151728 -165237 -161689 -202596 -186002 -145197 -74621 -74367 -74852 -128122 -158230 -73243 -78141
9920 -78141 -149173 -158906 -122138 -171719 -201892 -146938 -125857 -157641 -164228 -211303 -174847 -105429
9908 -105429 -88361 -167658 -129633 -183623 -165156 -172492 -197816 -185990 -174098 -120426 -149572 -184700
9896 -184700 -64556 -58069 -110074 -154197 -129401 -74977 -64547 -120584 -137338 -112677 -97339 -122457
9884 -122457 -184795 -200283 -202715 -141056 -175271 -218508 -243372 -145895 -76301 -31288 -109198 -107882
9872 -107882 -158946 -199334 -172445 -150758 -173126 -171369 -169237 -177322 -115346 -89061 -160575 -171006
9860 -171006 -209214 -175782 -166542 -170060 -153761 -139201 -123126 -116204 -102883 -86083 -130681 -135416
9848 -135416 -141051 -171359 -107393 -75763 -99690 -117018 -141268 -138063 -125079 -195257 -179011 -157327
9836 -157327 -56471 -131635 -149911 -155672 -206806 -138381 -134495 -173254 -149763 -88757 -122988 -143728
9824 -143728 -188361 -168941 -111886 -119404 -58970 -138241 -148032 -116941 -136131 -160485 -109864 -108951
9812 -108951 -170924 -128729 -171514 -85242 -140876 -165212 -125899 -133041 -68203 -62218 -62585 -73593
9800 -73593 -98811 -169020 -182950 -187284 -91672 -84065 -162642 -206534 -169638 -148655 -192809 -133944
9788 -133944 -144132 -147863 -140836 -142356 -181854 -163840 -123575 -145595 -119518 -112515 -164553 -154832 -169520
9775 -169520 -135368 -119087 -163041 -194497 -183732 -154163 -122991 -81189 -145317 -121220 -92892 -122444
9763 -122444 -112293 -115565 -145907 -107949 -120220 -233569 -219183 -169174 -190030 -180815 -178815 -182662
9751 -182662 -214999 -179813 -138941 -157546 -176512 -155950 -154522 -106918 -120442 -149835 -107095 -114952
9739 -114952 -95427 -153236 -225368 -203386 -149665 -163126 -152671 -99059 -115828 -93162 -82210 -161650
9727 -161650 -162789 -117070 -197916 -227157 -126926 -92210 -201073 -189545 -143111 -142653 -159170 -161944
9715 -161944 -163514 -162732 -165915 -119781 -113317 -183409 -149982 -126972 -189379 -145388 -130438 -233204
9703 -233204 -216011 -157638 -114034 -151026 -98150 -94393 -124039 -69115 -43466 -57201 -96558 -74811
9691 -74811 -114665 -151755 -92411 -82435 -87286 -92051 -119492 -165096 -169472 -155897 -78527 -121184 -144370
9678 -144370 -106529 -176127 -183757 -95682 -122942 -136420 -124105 -125075 -98606 -103923 -100528 -209961
9666 -209961 -166738 -154226 -164458 -171765 -202218 -192450 -203942 -186277 -166495 -148147 -168445 -107524
9654 -107524 -106709 -94709 -107387 -111501 -94667 -134655 -120963 -84483 -78607 -142304 -136384 -102820 -146235
9641 -146235 -154256 -130119 -151502 -117603 -91846 -63277 -5474 -118087 -165391 -128072 -147093 -138236
9629 -138236 -125224 -129187 -158334 -155197 -176299 -170087 -180483 -132677 -162495 -162441 -114192 -114263 -138743
9616 -138743 -77806 -72455 -122457 -108500 -95831 3989 -16109 -77553 -134991 -108657 -11447 -39204
9604 -39204 -77770 -77824 -128525 -80149 -142871 -151476 -102768 -18227 -50995 -46411 -2733 2578 31868
9591 31868 64211 87029 198976 234923 278999 282193 241417 215369 158932 144099 61422 104224
9579 104224 9533 -9849 -35035 -25856 -18435 -94472 -104478 -34518 -8695 -32930 -15591 -27202
9567 -27202 -61114 40831 21013 -63444 -87784 -52266 -58789 -63065 -90006 -108297 -128041 -135743
9555 -135743 -112535 -38200 -36424 -72341 -73531 -72766 -129531 -138136 -92177 -31899 5795 14961 57133
9542 57133 -12050 -9873 -11186 -29846 -83884 -94328 -93292 -48531 -41260 -81214 -36795 18242 -48858
9529 -48858 -31595 -13955 -20309 -58967 18584 35832 -40248 -76581 -17310 -48979 -3453 -44810
9517 -44810 -60602 -68583 -22731 57495 32005 34127 78890 253734 400464 571996 831633
9506 831633 1146457 1355875 1360961 1218947 1100135 917220 767108 573406 450437 348151
9496 348151 276887 203186 206792 204790 169667 149833 119407 111784 63991 65199 35200 -25208
9484 -25208 28193 -43504 -3808 55583 38004 -17521 -16011 -43774 51773 57503 32031 11119
9472 11119 18915 -4887 3633 -33030 -72196 -60333 -77493 -35163 -62821 -77462 -51855 -25041
9460 -25041 -63178 913 -71403 -84912 -81292 -105538 -90161 -87025 -124667 -34987 -45085 -38364
9448 -38364 5100 -15880 -92141 -71083 -77950 -74027 -48358 -77328 -67773 -27552 -51109 -101855
9436 -101855 -135497 -82444 -110915 -134566 -139859 -155977 -72802 -78704 -59994 -59966 -76699 -106755 -123304
9423 -123304 -162138 -120927 -52735 -105418 -164177 -165905 -176012 -111907 -73284 -114585 -142578 -99367
9411 -99367 -116310 -103815 -63586 -90558 -71067 -94362 -161309 -175216 -134889 -84444 -111050 -135980
9399 -135980 -126419 -64579 -49110 -106821 -145761 -168989 -120890 -108851 -115941 -107278 -149901 -139264
9387 -139264 -153485 -187111 -122840 -104991 -170353 -164529 -147946 -156229 -103202 -120169 -109312 -121986
9375 -121986 -174925 -118320 -69396 -99113 -85411 -9541 -69423 -98010 -181975 -180805 -89687 -92027
9363 -92027 -78159 -71789 -94977 -56611 -84737 -125588 -76382 -149583 -179448 -182617 -170261 -179866
9351 -179866 -153259 -199688 -138149 -92881 -80754 -60432 -160686 -174419 -118974 -52979 -33638
9340 -33638 -38502 -85202 -64525 -111795 -221383 -195883 -160447 -141441 -155607 -113895 -69961 -65779
9328 -65779 -118923 -163200 -121074 -58950 -82367 -99090 -105922 -128027 -135691 -184979 -151987 -152288 -196375
9315 -196375 -126377 -137049 -98531 -90680 -80627 -97446 -140461 -113953 -93183 -119927 -161259 -159359
9303 -159359 -111282 -38169 -60105 -85590 -90829 -96801 -110353 -114829 -152739 -159874 -155095 -97353 -106712
9290 -106712 -107861 -121249 -156679 -180544 -158652 -89216 -98029 -183017 -172399 -123141 -157092 -191630
9278 -191630 -125448 -50980 -93449 -136685 -181730 -222375 -185821 -188076 -166971 -158837 -196847 -205012
9266 -205012 -153882 -113964 -93519 -115868 -146240 -88489 -47364 -36287 -30843 -61380 -84662 -97336
9254 -97336 -112365 -105767 -78543 -155943 -122069 -52857 -45248 -53600 -127243 -131955 -103156 -109985 -95960
9241 -95960 -120763 -143099 -118172 -132414 -112098 -90592 -171642 -136852 -111120 -98027 -90272 -82592
9229 -82592 -24526 -87730 -97355 -82145 -91682 -90855 -76361 -60334 -124096 -133143 -160732 -186397 -111118
9216 -111118 -101078 -135133 -141672 -176539 -129406 -91117 -87816 -77652 -50174 -90573 -138352 -119746
9204 -119746 -91780 -120005 -99574 -106058 -155860 -157233 -174857 -76680 -90708 -115223 -117384 -82171
9192 -82171 -83164 -75621 -52803 -50017 -88106 -41043 -38725 -46003 -45363 -133678 -109969 -157201 -153075 -157726
9178 -157726 -143284 -81922 -125641 -130471 -126639 -115510 -125876 -145230 -168437 -149264 -98023 -131881
9166 -131881 -142216 -43261 -144500 -172953 -121503 -30164 -41587 -94980 -129656 -156748 -111090
9155 -111090 -50324 -102810 -62902 -45860 -72374 -29494 -34156 -92600 -115229 -116859 -88711 -97070
9143 -97070 -162731 -134425 -109357 -85752 -125817 -165548 -147098 -150069 -122926 -88832 -93453 -79494
9131 -79494 -133029 -145111 -108401 -145870 -142391 -98889 -92370 -150597 -114859 -59627 -138318 -145710
9119 -145710 -99779 -94227 -64178 -112273 -148577 -121656 -85488 -86668 -114963 -119455 -123710 -171338
9107 -171338 -153135 -157785 -152039 -151113 -144163 -109134 -122488 -145391 -104479 -53391 -103531 -42041 -58549
9094 -58549 -148426 -91990 -88920 -85089 -46623 -149507 -156254 -118415 -90687 -134111 -65354 -136277
9082 -136277 -147848 -81089 -95553 -80325 -52473 -24139 -19593 -72032 -51005 10870 20346 -66002
9070 -66002 -96677 -105897 -68104 -110528 -121943 -136290 -68777 -184418 -108566 -31259 -51739 -42511
9058 -42511 -6832 -71402 -108888 -55844 -86447 -92565 -93680 -58733 -75455 -103183 -89045 12659
9046 12659 14960 -36346 -75452 -106516 -115058 11558 69442 -32689 -107006 -70199 -3249 16746
9034 16746 -68988 -91416 -35264 -77681 -101787 -91013 -77578 -82260 -85935 -30827 -28228 -66942
9022 -66942 -17950 -59411 -55512 42808 55486 52424 27394 49189 -7888 10353 -72311 -62367
9010 -62367 -105060 -39490 -12400 -22017 -53333 -95882 -85462 -69194 -109791 -52348 -31429 -30386
8998 -30386 -528 13405 -35986 -31998 -27493 -63087 -38451 7279 75925 79656 47011 28073
8986 28073 4823 -34262 -39065 -9458 36823 27032 -9448 -68630 -68138 -50813 -55642 -30825 -77629
8973 -77629 -114558 -57773 -87175 -148016 -45968 -88960 -46501 -29053 -15455 -26377 -1914 -49473
8961 -49473 -98670 -27039 -35744 -9845 -45904 -11603 18408 32172 34337 77706 54240 -42168
8949 -42168 -130296 -70788 -34149 -4801 -59518 -8497 6886 -22501 41247 50221 94697 114752
8937 114752 72671 66381 94571 97307 115072 85047 61240 68284 66436 79362 74784 117404 140045
8924 140045 92729 139027 119850 72579 128763 183782 166387 146579 188774 174432 136722 126569
8912 126569 157916 145955 160203 142965 158568 146080 104775 53168 173178 164509 107670 159784
8900 159784 115735 111562 100042 115787 39823 76983 131195 176515 129204 168849 157956 135090
8888 135090 130146 129180 187588 160907 149021 145051 190271 186698 213286 217568 241781 217483 271365
8875 271365 290908 275535 277064 262184 210660 223131 210013 239141 209957 280720 285637 330321
8863 330321 309343 284697 323561 282611 241161 317633 318687 333697 304591 296536 326615 225618
8851 225618 223074 203186 240800 302283 347957 383600 370066 281994 310510 336145 392325 396474
8839 396474 402906 444426 456326 409839 447598 489680 490810 496528 465162 492019 522538 487304
8827 487304 454949 456283 519973 560676 557443 550070 588504 558036 598708 648640 654457 620541
8815 620541 605788 638968 699246 679205 608227 577673 721796 771602 691319 714789 784721
8804 784721 721667 774463 819885 870787 899064 907714 901239 890517 949648 969412 1031073 1058876
8792 1058876 1070922 1090210 1131980 1220079 1193486 1146449 1193514 1222414 1289214 1338357 1346864 1374024
8780 1374024 1405863 1438483 1488485 1580176 1619891 1661087 1692560 1718884 1838576 1856549 1851118
8769 1851118 1931014 2005411 2082093 2145448 2165742 2290386 2356602 2441047 2517940 2585127 2633814
8758 2633814 2843346 2889010 2955639 3093185 3144570 3297354 3375976 3480191 3612399 3776881
8748 3776881 3893079 4039247 4172738 4363803 4594468 4771859 4984706 5186633 5416862 5545279
8738 5545279 5810748 6090562 6306671 6589061 6915012 7328523 7692269 8023676 8349687 8735902
8728 8735902 9226012 9693616 10144800 10686041 11230584 11787499 12382041 12975368 13650459 14361739
8718 14361739 15102055 15825251 16494656 17164129 17874018 18473884 19062947 19639202 20137949
8709 20137949 20577931 20855954 21075216 21245139 21313910 21292765 21148470 20895696 20558121 20147072
8699 20147072 19627804 19045992 18426974 17788175 17265270 16644540 15949501 15264602 14693965
8690 14693965 14128701 13515297 12932229 12351365 11893039 11387838 10864930 10369421 9945126
8681 9945126 9558985 9175948 8803093 8378998 8020111 7726625 7466481 7096874 6825477 6594835
8671 6594835 6422394 6199527 5913827 5770786 5551085 5352247 5222673 5046354 4914712 4736029
8661 4736029 4639511 4525982 4379296 4201649 4118501 3996228 3875191 3791518 3693168 3615877
8651 3615877 3520994 3376742 3317886 3311254 3191594 3089220 2980652 2915397 2840736 2716605 2649364
8640 2649364 2637023 2566585 2492775 2518032 2514282 2320665 2266135 2275696 2184286 2151341 2141940 1998248
8628 1998248 1962900 1963817 1968355 1922900 1866378 1851297 1840526 1818783 1754551 1720420 1620753 1640670
8616 1640670 1667797 1603633 1516973 1456051 1512102 1476830 1391540 1368207 1400526 1339384 1310471
8605 1310471 1273300 1302141 1367519 1280004 1188023 1120085 1115846 1117308 1114148 1167533 1123778 1085247
8593 1085247 1011083 1091431 1089164 1027630 964394 963028 962333 923986 902480 951943 895228 887536
8581 887536 848857 719273 698633 741642 961120 1021412 887615 846111 801680 740562 799692
8570 799692 764405 729975 768834 803935 800081 785649 795228 758452 683420 683679 742038 756292
8558 756292 720532 741172 715859 703245 666512 690276 761866 780227 771691 802396 807641 848844
8546 848844 838652 894407 895653 947339 984592 1116910 1221279 1438225 1894229 2450835 3290066
8535 3290066 4066080 4658100 4833779 4662269 4367193 3907428 3354107 2767433 2313264 1976055
8525 1976055 1726600 1602518 1389952 1173463 1060208 932252 926059 815765 786404 776368
8515 776368 785450 739398 698584 714071 656303 610628 565286 535447 575931 567369 587142 575123
8503 575123 508655 500306 447940 457873 469067 399656 455662 489068 445366 440886 442651 420856
8491 420856 433309 422629 376149 376688 349964 335887 297991 315905 378611 364066 324947 360586
8479 360586 364983 361709 323805 358701 306424 261561 269068 276574 170375 233578 289788 274054
8467 274054 284928 243164 209233 233878 284197 284086 298754 326285 267426 256924 174344 176467
8455 176467 173858 171453 180381 149738 109452 109410 171335 146954 183095 150795 135469 138425 142996
8442 142996 113244 129503 114522 83309 131445 145957 150819 178749 142907 135928 91711 143478
8430 143478 209095 149972 95833 112959 131020 118640 140403 54741 38962 71680 77770 127949
8418 127949 96044 135732 153440 147388 112367 7619 14472 41108 101308 125185 123968 100231
8406 100231 166931 136080 137093 134573 32213 51802 64457 82220 104714 49499 29086 80097
8394 80097 147656 152006 196378 215914 116711 92170 64942 16917 -10010 1226 114761 98785
8382 98785 52255 56193 102208 96682 24135 10622 53232 81937 -34606 -33950 -7570 -13991 5818
8369 5818 -17500 24855 -5597 20564 61712 100370 57023 71249 146191 46028 3834 -28083
8357 -28083 -58237 -18304 -3354 17674 -9243 -8491 -10380 -48995 -6950 -14944 -23977 -11412 35728
8344 35728 13639 11014 -12901 36181 22839 12120 46839 55418 -16357 -24985 -31690 16983 -30701
8331 -30701 -81120 -40717 -33312 -24632 -29304 57220 46701 -28916 7166 4305 -58087 -84910 -59665
8318 -59665 16353 81460 78470 24265 59134 111874 29423 22650 -39654 -35774 -10384 63933
8306 63933 96719 -30241 26535 16125 -99328 -80786 -19217 -13983 -17028 -58558 -53056 -45949
8294 -45949 11636 11469 -26573 -59619 -74681 -15185 -10998 -37694 -49173 -98881 -163856 -128939
8282 -128939 -101355 -186503 -148260 -99372 -14023 26106 7137 -15989 9697 19845 -16904 3334
8270 3334 -52533 -76061 -120502 -79331 -53637 -4290 12139 4255 -32427 -43402 -37478 -32323 13457
8257 13457 -69016 -7199 -20628 -51466 -1159 685 -2297 -73591 -109477 -75767 -103317 -77072
8245 -77072 -71776 -116707 -134248 -89877 -91095 -40110 7564 -17709 -57338 -92437 -70061 -83002
8233 -83002 -106525 -42794 -102376 -110412 -88521 -107201 -93892 -80118 -80756 -65717 -22196 -27125 -16066
8220 -16066 28047 -34196 -69391 -33776 -30145 -50181 -59647 -112403 -123387 -132952 -119434 -113979 -111409
8207 -111409 -69278 -20893 -44448 9773 25811 -50753 -104077 -127831 -132371 -96977 -86920 -61470
8195 -61470 -139270 -190599 -806085 -1312993 -237793 -13404 -17872 -1630 2178 -15054 -106909
8184 -106909 -71596 -75721 -39269 -103154 -77461 -52975 -26877 -33555 -79679 -136757 -111278 -101241
8172 -101241 1845 -22977 -114856 -118615 -170138 -139927 -41495 -65813 -33844 -51284 -35192 -124815
8160 -124815 -148412 -125233 -96316 -80982 -19659 -62555 -104761 -31448 -24425 -31085 -78092 -152521
8148 -152521 -129092 -85008 -77455 -47660 -6953 -33204 -3748 -49146 -75913 -100516 -114787 -84361
8136 -84361 -42271 -116187 -103661 -75982 -102691 -112830 -78322 -82478 -81593 -24834 -91519 -77911
8124 -77911 -54538 -64974 -23154 -74967 -79889 -149886 -130069 -93034 -54182 -58762 -96290 -52229
8112 -52229 -54283 -42953 -85757 -86306 -74565 9267 -43037 -93114 -130012 -62460 -80662 -118003
8100 -118003 -129138 -98250 -149070 -70596 -96496 -170779 -80974 -34515 -7707 -23875 -43642 -60750
8088 -60750 -84751 -25369 -47473 -58280 -65421 -54495 -31229 -83021 -72034 -40323 -13164 7134
8076 7134 -52293 -60506 -25615 21889 69498 37651 -35719 -47567 -52456 -23466 -43977 -109664
8064 -109664 -89422 -21032 -34403 -19632 -28754 -84584 -61017 -17532 -18435 -12257 -53171 -28187
8052 -28187 58887 -39872 -71512 -111839 -71867 -92706 -146167 -169428 -164653 -91071 -82098 -167782
8040 -167782 -146908 -130757 -83971 -40682 -118513 -81193 -16148 -78586 -112186 -64907 -45826 -19283
8028 -19283 -33882 -51307 -75808 -88643 -48132 -71117 -107083 -111419 -69805 -99435 -93972 -52373
8016 -52373 -75372 -85041 -58841 -90970 -74545 -87152 -91197 -89500 -143666 -136261 -90137 -127995 -112594
8003 -112594 -102045 -36732 -85733 -44795 16822 8155 -25852 -8292 16513 -102481 -66965 -46236
7991 -46236 -68798 -70447 -72428 -95415 -67389 -114522 -67807 -37293 -38362 -42598 -117401 -89988 -58138
7978 -58138 -53622 -61937 -74832 -73041 -99818 -58181 -66259 -65761 -89695 -58516 -37473 -50541 -95691
7965 -95691 -114069 -103110 -136555 -64219 9614 -42377 -32980 -6822 -22893 -37199 -28651 -34500
7953 -34500 -41909 -2619 29230 22955 -12669 -11547 -13502 -17799 -66767 -71396 -94439 -95887 -35093
7940 -35093 -45880 -43183 -24964 -36141 -57676 -127182 -127096 -116758 -128230 -163912 -94606 -74747 -116052
7927 -116052 -100767 -6273 29607 -34960 -52465 -85944 -127614 -149246 -108191 -82739 -118611 -110007
7915 -110007 -126067 -142622 -131115 -118980 -86802 -70253 -78056 -104374 -121523 -54598 -38758 -129030
7903 -129030 -201614 -179703 -145127 -144510 -94805 -58762 -44485 -33381 -43394 -112163 -142255 -83831
7891 -83831 -155165 -230811 -142853 -98788 -84847 -71376 -43619 3424 -16327 -88606 -88878 -125024
7879 -125024 -103895 -70730 -75880 -84984 -16459 -79169 -95008 -63100 -140559 -141921 -133520 -92494
7867 -92494 -62916 -39297 -81396 -132891 -119849 -164389 -137587 -95670 -122738 -97731 -111256 -90290
7855 -90290 -59911 -71703 -86769 -9049 -53519 -130288 -110184 -107133 -69581 -52357 -56555 -82133
7843 -82133 -87448 -84815 -119911 -65300 -80870 -76634 -124578 -161161 -121491 -153217 -172685 -153271
7831 -153271 -125172 -116918 -110371 -123009 -110840 -89072 -120531 -69221 -118321 -121688 -74486 -69696
7819 -69696 -51609 -113145 -83929 -63177 -85456 -176686 -133859 -144589 -135976 -85553 3333 2838
7807 2838 156861 -42584 -225020 -54255 -81357 -72943 -116646 -104451 -23130 -28582 -20114 -16912
7795 -16912 -12482 -37542 -60086 -113630 -147762 -98491 -145927 -166672 -126034 -81305 -64328 -74569
7783 -74569 -80820 -92709 -84256 -95158 -62286 -36004 -91980 -51875 -29799 -86670 -118902 -102669
7771 -102669 -84812 -71363 -40168 -36842 -9030 52440 67243 45060 53904 -5999 -28950 34273
7759 34273 13285 -12386 -64566 -112380 -126032 -83849 -108850 -115025 -125525 -133060 -101954 -29385
7747 -29385 2110 -5592 -17217 -20920 80419 192412 156195 185267 201469 217460 251340 328036
7735 328036 402410 410696 380501 374156 323095 262642 202181 112715 146825 68274 64227 49308
7723 49308 -11579 27381 16360 15291 -19667 -28117 -23704 -27766 -24431 37535 79848 105843 53701
7710 53701 61873 119611 137961 218393 251302 306170 386770 415018 390422 321345 343669 280807
7698 280807 255920 184006 117086 7606 -29301 29173 13619 -33348 -52797 -26546 -14331
7687 -14331 12631 -55729 -50983 -29449 -7315 14684 -32627 -4205 33923 71967 121317 107128
7675 107128 136433 136000 131941 70320 67845 106618 28426 28161 32262 21021 -24021 -25085 -29181
7662 -29181 -74079 -62880 -105168 -97120 -63527 -32846 -58965 -48963 -9881 -24819 -41985 -22615
7650 -22615 -97613 -55251 -100416 -142530 -71850 -13731 -65043 -71604 -103786 -105180 -72351 -41666
7638 -41666 -12367 -48935 -32395 -60154 -119853 -100298 -102183 -60003 -28182 -63267 -83928 -79901
7626 -79901 -98543 -117974 -139188 -151431 -124563 -51950 -86301 -121143 -94264 -63060 -157079 -192892
7614 -192892 -118129 -86279 -79671 -100536 -128034 -137049 -188869 -178610 -141010 -152320 -52617 -23363
7602 -23363 -63751 -82976 -89193 -87726 -83876 -59338 -116828 -138438 -134643 -68906 -73264 -130627 -162790
7589 -162790 -183167 -134135 -93443 -144441 -193569 -114437 -45980 -82516 -143103 -98973 -93020 -70364
7577 -70364 -75091 -88509 -99128 -122326 -159595 -141460 -115324 -153240 -126654 -61570 -94594 -126925
7565 -126925 -198606 -149451 -168045 -120009 -85833 -121986 -85900 -78911 -37017 -49638 -149376 -95508
7553 -95508 -79833 -94148 -98918 -131560 -126825 -105997 -90360 -54709 -83050 -60566 -64410 -97063
7541 -97063 -129948 -99222 -115632 -137190 -181661 -196346 -135594 -157072 -179059 -132860 -104917 -80773
7529 -80773 -134792 -119542 -80726 -89792 -134880 -171892 -116832 -93103 -141720 -198375 -193103 -188823
7517 -188823 -175002 -131201 -120183 -108236 -54015 -79520 -100030 -30795 -95419 -116519 -112109 -154374
7505 -154374 -149960 -69245 -78172 -105257 -122141 -212942 -150666 -115811 -67351 -125790 -86504 -159356
7493 -159356 -197676 -136579 -91849 -141274 -161038 -145953 -134560 -138127 -161357 -152366 -199654 -138566
7481 -138566 -119512 -91514 -92099 -173332 -155139 -149034 -105947 -114910 -143186 -85583 -62155 -93223
7469 -93223 -49313 -69167 -92900 -56119 -8338 -2680 -42564 -86591 -128079 -122481 -95618 -138956
7457 -138956 -135644 -128890 -78474 -69498 -126987 -94625 -142113 -158608 -136911 -112773 -95836 -130956
7445 -130956 -119264 -167281 -119860 -91736 -106005 -87708 -97675 -149940 -178794 -133384 -95369 -71654
7433 -71654 -69021 -62991 -45648 -49894 -85651 -78099 -104511 -158275 -94862 -46752 -84117 -100716 -119234
7420 -119234 -136058 -139965 -176554 -178409 -152641 -89264 -35516 -49747 -55018 -108416 -114872 -98252
7408 -98252 -63804 -107547 -111361 -117204 -133753 -74674 -72760 -99743 -84992 -100712 -70282 -111943
7396 -111943 -147431 -124753 -115486 -120853 -189205 -159882 -108884 -42254 -65266 -134278 -110414 -100897
7384 -100897 -135245 -133348 -108144 -149511 -154889 -75940 -74813 -33817 -57205 -102275 -150024 -113641
7372 -113641 -55316 -119831 -186490 -178867 -136061 -133379 -94683 -79286 -75118 -85708 -74966 -99826
7360 -99826 -100791 -136934 -186845 -156940 -125529 -125512 -94637 -129898 -113251 -46908 -51027 -78391 -74300
7347 -74300 -45717 -116403 -174910 -128100 -132225 -80710 -43839 -79273 -102922 -100851 -90785 -103771
7335 -103771 -48830 -43035 -68146 -103582 -84003 -58545 -97055 -127422 -137759 -123484 -215494 -171740
7323 -171740 -122193 -143904 -49383 -92943 -157005 -100132 -130644 -158330 -78507 -40182 -129050 -127872
7311 -127872 -108835 -124209 -173288 -180645 -183990 -111861 -45123 -52030 -51315 -83133 -60309 -40127 -31362
7298 -31362 -58913 -80446 15338 -16235 -71006 -72367 -44271 13698 16489 -25566 -112793 -112481 -34388
7285 -34388 -48763 -37110 -81112 -95094 -71830 -112162 -70534 -93245 -95363 -75013 -14924 4292
7273 4292 -26822 -64213 -92136 -85018 -146678 -150333 -108650 -79444 -56289 -84106 -49895 -92365
7261 -92365 -79914 -109436 -128831 -167800 -194601 -247860 -214557 -161648 -129796 -95603 -57584 -59419
7249 -59419 -90686 -85265 -60745 -78205 -72598 -134479 -72705 -100542 -117503 -131926 -185784 -119002
7237 -119002 -119197 -109292 -119646 -85256 -57896 -117930 -151877 -70048 -49044 -117746 -142806 -104136
7225 -104136 -85030 -42407 1626 -568 -71590 -33218 18521 29514 -8701 -54139 -84861 -15866
7213 -15866 -104211 -113768 -75579 -63415 -132765 -135200 -107839 -112192 -84351 -55875 -113534 -127506
7201 -127506 -140296 -134567 -141003 -162333 -118889 -85236 -37970 -74073 -60616 -101670 -95839 -85775
7189 -85775 -160102 -184049 -185111 -124165 -147456 -140750 -86359 -129697 -147063 -153231 -145652 -182007 -145873
7176 -145873 -146551 -197319 -135385 -70772 -26223 -38805 -163100 -176298 -113469 -14554 -117205 -125713
7164 -125713 -89308 -89405 -176743 -68868 -95729 -110183 -150281 -241655 -187192 -113783 -121336 -103173
7152 -103173 -83983 -149350 -114941 -81966 -69152 -109668 -147524 -162828 -152113 -153779 -184562 -213256
7140 -213256 -143477 -81816 -72454 -131977 -145631 -79124 -87813 -157939 -141942 -97287 -90421 -92951
7128 -92951 -51162 -56795 -100104 -94437 -111997 -133934 -119751 -133585 -135858 -218017 -176332 -134500
7116 -134500 -126974 -127939 -122833 -118435 -107536 -121304 -114243 -142924 -55731 -121278 -123856 -166458 -178257
7103 -178257 -192325 -188991 -173899 -168638 -132093 -130071 -99103 -60332 -60974 -63275 -39608 -131501 -152226
7090 -152226 -145186 -84092 -124295 -111402 -55483 -38107 -77276 -70706 -108495 -120237 -101406 -127169
7078 -127169 -109234 -161996 -109451 -80829 -103296 -162572 -102036 -97188 -114751 -151230 -167449 -179857
7066 -179857 -141845 -140119 -139122 -33774 -42457 -98545 -113100 -110470 -128756 -149273 -186958 -156025
7054 -156025 -182641 -98921 -72982 -78289 -115962 -142720 -153205 -213575 -173464 -145793 -184184 -190135
7042 -190135 -222699 -126234 -123350 -128585 -139210 -68442 -123145 -156316 -184625 -172122 -110552 -115549
7030 -115549 -104451 -116019 -102743 -96111 -97943 -108103 -139129 -50127 -18021 -129401 -171577 -204480
7018 -204480 -211182 -186688 -229998 -230490 -118402 -62157 -113465 -145852 -80629 -102025 -128655 -121604
7006 -121604 -71894 -59167 -85529 -117318 -103669 -28622 -63966 -43768 243 -75548 -77302 -145149
6994 -145149 -163801 -124582 -168574 -260139 -239299 -215066 -148776 -134761 -175243 -139707 -108442 -54855
6982 -54855 -22365 -56221 -113525 -110954 -157598 -111230 -107887 -123061 -161947 -152494 -81485 -142281
6970 -142281 -143677 -75040 -59669 -119893 -125642 -121104 -80334 -47654 -102311 -105231 -149921 -160698
6958 -160698 -134554 -57457 -77823 -195492 -169940 -119234 -159689 -152395 -146049 -141220 -145147 -192263
6946 -192263 -151945 -172805 -133497 -140568 -137413 -103799 -71605 -24594 -95605 -121796 -137834 -207879
6934 -207879 -209155 -167217 -137356 -99742 -22921 -30621 -88933 -121154 -107406 -101540 -121142 -140901
6922 -140901 -163574 -169270 -183505 -182529 -196152 -177266 -143382 -134810 -23759 -864 -98813 -149808
6910 -149808 -137342 -185274 -150106 -143855 -104665 -46933 -119259 -84049 -65573 -83542 -83068 -77852
6898 -77852 -113299 -145009 -118081 -124163 -159011 -169396 -124777 -101966 -67164 -115923 -169655 -147590
6886 -147590 -91008 -40633 -61577 -89044 -124722 -114421 -152120 -133501 -82041 -93036 -80127 -80996
6874 -80996 -123030 -63809 -126230 -190585 -204684 -210601 -139506 -102209 -142314 -187129 -151751 -116818
6862 -116818 -70636 -107802 -69859 -88678 -125612 -151679 -149525 -139973 -187828 -208339 -163918 -146715
6850 -146715 -169303 -142266 -132054 -98915 -117804 -159470 -173085 -200483 -107296 -136075 -158004 -107412
6838 -107412 -89323 -97568 -133247 -165919 -143225 -108478 -105047 -112529 -145721 -59552 -79719 -152957
6826 -152957 -104461 -82730 -62393 -59851 -135596 -154666 -101005 -125388 -148296 -133961 -196619 -133760
6814 -133760 -165751 -171237 -155173 -163625 -139742 -98638 -90366 -105408 -148449 -131543 -58632 -75788
6802 -75788 -93972 -90878 -116197 -136722 -115964 -60662 -62280 -99569 -107814 -85390 -87467 -112808 -62333
6789 -62333 -22731 5370 -22367 -134413 -117262 -94570 -45735 -43167 -28654 13945 -50937 -66999
6777 -66999 -69593 -132716 -128019 -103099 -95514 -115453 -101884 -107608 -150823 -109523 -45862 -77195 -108107
6764 -108107 -133129 -132480 -161840 -142253 -103872 -64538 -131248 -154347 -81127 -26064 -60775 -123784
6752 -123784 -58580 -90644 -48438 -88028 -105697 -82470 -114676 -88832 -110505 -95640 -85449 -118865
6740 -118865 -78768 -97604 -130455 -38671 -56393 -42144 -92519 -136526 -120514 -104096 -83018 -149405
6728 -149405 -138608 -114450 -83913 -109810 -105574 -61290 -111234 -141460 -75817 -113069 -174138 -138932
6716 -138932 -75350 -109498 -120896 -105632 -80963 -133817 -63153 -41591 -31631 -130631 -91675 -57061
6704 -57061 -46503 -59509 -36710 -45915 -76780 -114069 -107015 -108773 -61034 -37647 -92698 -178349
6692 -178349 -158881 -107074 -119297 -176586 -223661 -106477 -110424 -73976 -119016 -124624 -125918 -128217
6680 -128217 -76726 -106188 -148191 -65887 -26480 -32476 -46459 -16261 -39433 -22978 9889 -138711
6668 -138711 -163888 -161090 -168794 -175164 -158438 -167979 -168365 -198158 -168140 -126961 -142436 -209823 -205265
6655 -205265 -103073 -98568 -129043 -192212 -143290 -110431 -98239 -99544 -86932 -78712 -79187 -136051
6643 -136051 -97935 -42696 -9878 -89172 -88025 -71009 -6730 -76152 -80080 -136787 -158469 -99923
6631 -99923 -155760 -167514 -150169 -146717 -138970 -171637 -161297 -54644 -79419 -110406 -127653 -104064
6619 -104064 -105820 -88618 -117187 -67004 -47243 -120815 -113811 -121692 -81854 -90581 -147242 -79388
6607 -79388 -72106 -88183 -46630 -69213 -61616 -93859 -98177 -146595 -101498 -77901 -97968 -74334
6595 -74334 -61460 -83577 -97623 -100582 -142217 -209675 -183569 -177286 -138030 -100553 -86999 -53917
6583 -53917 -84118 -63159 -61132 -135423 -126475 -69149 -79664 -75251 -11971 8754 51309 53058 -68976
6570 -68976 -82868 -69068 -77729 -48781 -102761 -119853 -23409 -58037 -120979 -135225 -107969 -116655
6558 -116655 -114192 -109752 -91320 -98921 -114932 -78979 -73677 -115767 -126985 -151433 -140009 -134323 -103008
6545 -103008 -103138 -76093 -65010 -57789 -32101 -135951 -147839 -122348 -116022 -35887 -63162 -64321
6533 -64321 -44467 -113261 -56922 -75026 -159615 -160248 -207446 -51738 -54038 -97614 -95315 -130561
6521 -130561 -121726 -126344 -126533 -91968 -103410 -79784 -52395 -142895 -160760 -182542 -220604 -207556
6509 -207556 -203909 -165487 -185917 -117604 -85948 -46881 -11632 -21177 -36075 -73656 -129386 -126913
6497 -126913 -125054 -121924 -119228 -73977 -105578 -124114 -108495 -84717 -80249 -45488 -22210 -67438
6485 -67438 -55582 -37690 -46258 -35491 -30745 -82206 -89740 -76283 -109014 -116830 -175844 -166423 -116756
6472 -116756 -150880 -104526 -110088 -98454 -126347 -201550 -173385 -136458 -198583 -165662 -147080 -144800
6460 -144800 -279002 -172142 -150433 -168672 -159481 -144133 -208558 -253856 -188547 -209002 -149296
6449 -149296 -133930 -73827 -69658 -113819 -119590 -115965 -68715 -80828 -101679 -89490 -47159 -116948
6437 -116948 -112542 -92187 -100332 -103981 -119914 -147391 -89821 -108312 -99264 -125268 -94907 -131706
6425 -131706 -177562 -116876 -84064 -101426 -121828 -126245 -169903 -102008 -105133 -100740 -14780 -38976
6413 -38976 -72314 -99670 -100282 -88755 -62453 -35376 -40774 -92086 9561 16664 -40763 -24058
6401 -24058 -42018 -25862 -51930 -61648 -130631 -60665 -31374 -90031 -81541 -71950 -109341 -140920
6389 -140920 -141514 -99605 -119072 -109818 -151654 -103397 -104371 -15159 -28657 -92730 -22370 12487 -19264
6376 -19264 -91084 -95006 -98090 -92405 -66722 -49158 -35852 20411 -29564 -72342 19918 31452
6364 31452 100 -24417 4480 18200 56524 23777 -51645 -31792 30666 9300 30126 5094
6352 5094 23797 16486 -30462 -196 -2037 -17719 -38938 -44983 14702 3969 44912 67808 55317
6339 55317 38007 32348 34949 57144 188052 161169 117336 149753 77255 -10586 19333 70787
6327 70787 73873 47698 98181 111538 118291 67333 195584 202802 153616 266453 259086 184104
6315 184104 234294 289482 318402 325645 379756 521100 611200 736355 847430 1101422 1389684
6304 1389684 1668498 1918887 2064499 2193531 2143417 2043237 1885295 1728848 1653793 1419033
6294 1419033 1184838 1043459 969669 853880 783918 766426 758469 828898 807156 856354 844589
6283 844589 928183 1050258 1107396 1158008 1339376 1500295 1670096 1979941 2428537 3023235
6273 3023235 3748398 4732150 5659123 6409089 6719517 6628615 6247286 5627672 4999720 4361774
6263 4361774 3724022 3291091 2765391 2417112 2121148 1921412 1834193 1656361 1617389 1572551
6253 1572551 1484434 1427741 1380447 1403613 1443431 1560206 1682386 1784987 1943329 2194167
6243 2194167 2605161 3098768 3842184 4807953 5749322 6520568 6877482 6837787 6569214 6030289
6233 6030289 5400052 4720368 4052593 3473593 3049059 2563953 2251888 2039795 1830763 1645569
6223 1645569 1508288 1424872 1404870 1310886 1212432 1205513 1113185 1065413 1053878 1059556 1095280 1223529
6211 1223529 1339585 1477111 1707945 1934785 2269449 2508005 2663267 2677211 2583175 2456735
6201 2456735 2229267 1970255 1711112 1490952 1331201 1143771 1051390 964392 876318 872570
6191 872570 872777 841079 725324 704889 714746 643171 587740 650680 663639 623725 677770 783731
6179 783731 946749 1052802 1202447 1485939 1694188 1798493 1819222 1756959 1623100 1489696
6169 1489696 1318796 1179747 1096814 962284 761582 690589 644182 582085 600923 544714 437403
6158 437403 442464 403632 326958 327140 366230 382535 390220 365517 310491 302810 355712 345658 354995
6145 354995 301645 358031 418375 441479 511863 478999 475045 498089 565221 608600 603941 524070
6133 524070 459187 433019 410122 383709 300652 353549 384259 329722 335571 300459 273231 308974
6121 308974 319182 294764 321380 323041 327900 366231 424975 442217 459531 455013 479654 515298
6109 515298 647372 781867 806045 899234 848678 950798 931715 779609 716206 686801 535231
6098 535231 426603 435611 363301 325138 324859 310706 227744 138825 151195 211244 246283 233055
6086 233055 188515 250287 333680 307505 342258 349134 323535 307812 353040 497354 582666 810073
6074 810073 857649 961961 958783 933165 936085 873213 774253 752088 684270 638659 587701 573315
6062 573315 570135 599449 580037 507150 447612 485183 437954 444504 433475 422515 468794 348848
6050 348848 380586 410647 450795 387758 347578 380165 426505 486720 527827 473446 419108 412384
6038 412384 475146 455975 463051 423569 313248 229449 124685 71798 66833 79515 135520 71378
6026 71378 136186 182067 209934 218956 251636 234901 268331 271357 240620 225601 304525 317515
6014 317515 314145 361297 416401 489044 521550 549435 529140 555844 547427 550988 565471 558012
6002 558012 668928 759272 842834 990861 1083906 1171212 1264149 1363432 1323189 1204295 1196810
5991 1196810 1123003 1046687 946120 815583 705313 658949 621865 599925 595898 603597 566567
5980 566567 554271 624419 640353 688788 758342 867131 861798 934943 922305 921910 975024 1110143
5968 1110143 1062425 1050171 1073861 1089724 1158947 1160590 1182589 1218404 1159670 1210476 1258426 1295050
5956 1295050 1197284 1106180 1037133 980580 1008543 1138201 1107583 1076364 1085179 1089774 1119027 1114160
5944 1114160 1150766 1175388 1226096 1188711 1189459 1178980 1137982 1141035 1174447 1154725 1109844 1107138
5932 1107138 1066248 1022080 1035092 1040266 1078156 1151012 1222894 1232861 1270369 1347627 1463041 1499620
5920 1499620 1567793 1653722 1791498 1854463 1833503 1875151 2012432 2070825 2219405 2413364 2545806
5909 2545806 2653474 2779414 2930742 3095980 3243511 3317761 3467517 3633097 3660397 3690128
5899 3690128 3725778 3756697 3767414 3863030 3976956 4033856 4123442 4268052 4400045 4517759 4655944
5888 4655944 4801929 4957405 5031006 5172130 5410632 5710604 5977544 6267998 6521043 6805559
5878 6805559 7059887 7356139 7660020 8095716 8411537 8808573 9118000 9399539 9800501 10189656
5868 10189656 10505352 10905633 11228800 11626232 12268986 12977172 13912878 15034026 16435127
5859 16435127 18093542 19932026 21978512 24258226 26619079 29281398 32274357 35976453
5851 35976453 40574862 46659155 54682411 65944671 82077797 105979055 138917385 180349815
5843 180349815 223262214 257821254 274347539 271841694 256548267 232107165 201837353
5836 201837353 171093591 143867937 120405718 100996586 85335131 73019064 62848916
5829 62848916 54508090 47528120 41706415 36939497 33121195 29917438 27331833 25141655
5821 25141655 23363243 21885961 20627987 19510142 18420934 17384898 16464073 15567183
5813 15567183 14767511 13990221 13298777 12619744 12002343 11460018 10974266 10590188 10233208
5804 10233208 9897415 9592117 9328001 9193046 9088877 8928708 8715946 8614431 8510418
5795 8510418 8395617 8258826 8130966 8171666 8164579 7960576 7895204 7740188 7564749 7310111
5785 7310111 7025670 6780663 6445869 6219901 5968475 5767725 5506650 5327542 5190230 5115139
5775 5115139 5021158 4984794 5017963 5053791 5156561 5172229 5154219 5119300 5080842 5069768 4964153
5764 4964153 4908766 4969083 4985297 5020229 5029662 5142883 5197823 5366202 5398358 5512562 5670869
5753 5670869 5911047 6324243 6790924 7440466 8519870 10308710 12866257 15967835 18873425
5744 18873425 20723225 20907230 20045162 18532539 16494650 14220440 12296981 10677495
5736 10677495 9387820 8318043 7564026 6936884 6439215 6068788 5713403 5452765 5270276
5727 5270276 5008470 4811681 4683716 4564038 4410160 4379054 4285274 4203369 4161039 4173991
5717 4173991 4127181 4083108 4068173 4063281 4070705 4016441 4059873 4219517 4316572 4356154 4390046 4420006
5705 4420006 4555254 4711544 4851558 4938783 5183100 5295437 5374888 5528875 5723059 5783700
5695 5783700 5847691 5928322 6065860 6179140 6273359 6352489 6523014 6795241 7098456 7533278
5685 7533278 8054810 8734873 9514369 10369587 11221249 12248127 13327937 14532959 16065698
5676 16065698 17883858 20399882 23736091 28340347 34896345 44695413 58564243 76460753
5668 76460753 95699134 112157367 121009338 120842747 114605396 104202203 91008129 77282336
5660 77282336 64980372 54383484 45684070 38556835 32928656 28436429 24686872 21661937
5652 21661937 19041515 16876575 15132753 13702067 12519710 11555540 10788456 10077090 9550111
5643 9550111 9032383 8582414 8101924 7683891 7299208 6945840 6606285 6272341 6011865 5733772
5633 5733772 5413529 5181224 5002138 4751475 4587018 4527266 4362082 4235632 4087383 3991499
5623 3991499 3967074 3908610 3851790 3774597 3794361 3652462 3541988 3470064 3504704 3471917 3339437
5612 3339437 3200569 3173567 3109733 2991337 2848555 2782924 2714737 2581186 2475566 2380446
5602 2380446 2377094 2241381 2172215 2149627 2163851 2156916 2113875 2165339 2123679 2077642 2089659 2090588
5590 2090588 2097992 2029412 2042435 1940891 1890374 1906319 1876480 1910287 1825272 1781427 1811085
5579 1811085 1802882 1834475 1752219 1718507 1723553 1679457 1529998 1480782 1484839 1471712 1431373 1324284
5567 1324284 1304811 1333396 1310314 1266274 1277594 1240547 1246993 1214722 1200037 1229017 1229375 1229929
5555 1229929 1108802 1150009 1193532 1117820 1097556 1034511 1018527 951818 929871 887578 830246
5544 830246 822687 831653 828304 824331 823589 853262 785687 783767 719310 754036 774516 858379 878920
5531 878920 837651 888454 918544 910565 932655 943735 903938 899227 892509 931189 895230 851143
5519 851143 819081 833277 814159 780811 735959 749657 775434 778263 816478 917399 996319 1200663
5507 1200663 1377295 1532742 1802301 1891727 1893038 1868915 1782955 1651424 1550883 1427483
5497 1427483 1231080 1150057 1130449 1039304 953928 867306 845605 858900 827881 787372 721446
5486 721446 709210 731615 705182 684666 643009 571822 589779 573617 586083 631664 698934 644128
5474 644128 603645 586208 599413 709652 643370 575899 576297 595015 574653 468309 491414 531151
5462 531151 529894 491219 407859 389736 378219 348070 420866 440833 359468 355109 340391 340772
5450 340772 350034 428922 397052 370020 297713 318530 417587 389739 332480 342981 353548 327655
5438 327655 299983 359181 402867 344404 332676 395972 459811 463150 462228 447622 440881 438247 501094
5425 501094 496937 481295 465611 525100 570482 551833 553150 510748 455407 414862 371931 391570
5413 391570 479344 476203 419714 417587 430075 574787 576892 530273 555512 527025 454923 403273
5401 403273 444697 441609 379111 380463 424421 359606 367182 361044 402236 417436 447230 461871
5389 461871 413982 421818 410359 424154 409104 431126 460136 495855 470264 466046 413734 397616
5377 397616 438605 430450 357547 371538 423545 457463 395913 313561 378559 447303 448061 393622
5365 393622 408926 458360 401268 405743 432766 434038 429274 436876 476061 505076 475523 493684
5353 493684 459211 521615 552045 524721 480270 463646 481753 462075 452885 457060 530699 532296
5341 532296 601372 591001 604668 609413 668533 785505 916424 1012271 1067230 1050793 1000004
5330 1000004 937138 945031 863243 787979 803793 780059 715253 667771 629977 625973 581152 581852
5318 581852 555607 526759 473362 420376 512018 477503 500803 474546 477910 515465 543991 570477
5306 570477 439307 489981 524744 570231 620009 571851 595131 579006 547090 538735 527810 592291
5294 592291 617166 588719 627837 618433 578624 532053 526928 574564 640356 535801 507905 531517
5282 531517 529320 547748 563626 668952 608473 618474 625041 538907 577974 599189 620540 646933
5270 646933 658145 657850 680865 721689 725251 703504 708789 798978 846107 808976 829562 850107
5258 850107 826081 837998 830548 842884 839479 847979 813060 765727 883109 929302 867414 923230
5246 923230 896634 931914 998400 943298 925022 953266 948731 1020152 1005480 1014778 993781 1040665
5234 1040665 1103882 1131228 1127869 1159488 1157704 1150483 1185738 1167452 1184162 1191161 1240623 1200966
5222 1200966 1227289 1278968 1295094 1289134 1321380 1350860 1363187 1418650 1477667 1508571 1519962 1475434
5210 1475434 1517551 1539399 1532513 1544940 1544241 1597723 1639534 1714715 1776615 1894622 2014109 1985944
5198 1985944 2017475 2121619 2254290 2283265 2299617 2223354 2271244 2286464 2266912 2308059 2320271
5187 2320271 2332611 2337374 2394903 2426832 2419565 2424785 2443037 2551536 2582875 2718706 2792552 2813050
5175 2813050 2884707 3045593 3190922 3343173 3501262 3595023 3765112 3973658 4222920 4445768
5165 4445768 4619340 4839352 5001402 5012640 5068069 5049337 5012691 5045833 4997267 5037343 5187457
5154 5187457 5263875 5365170 5404571 5460510 5566514 5714869 5919914 6046086 6210632 6397377
5144 6397377 6621563 6761511 7039827 7368774 7620752 7908466 8232380 8657807 9110161 9501096
5134 9501096 9958224 10601356 11181482 11648643 12106955 12557130 12895490 13262600 13717956 14260931
5124 14260931 14773507 15311102 15980031 16748026 17609000 18501825 19498462 20565424 21725570
5115 21725570 22961871 24251968 25606048 27097634 28685933 30288415 32027478 33861711
5107 33861711 35764069 37633458 39455226 41201744 42798958 44124355 45283270 46180825
5099 46180825 46821930 47095204 47068061 46501613 45707330 44622409 43308624 41858503 40266026
5090 40266026 38514248 36727187 35006768 33238180 31490048 29829186 28323807 26854082
5082 26854082 25421689 23979466 22719777 21588654 20479748 19449649 18406448 17540632
5074 17540632 16781769 16017746 15261219 14541786 13883246 13328947 12757195 12197756 11703084
5065 11703084 11251266 10851459 10464684 10077868 9787391 9465783 9097489 8850199 8612852
5056 8612852 8327324 8104250 7868124 7615284 7403101 7283959 7123596 6946774 6684567 6538790
5046 6538790 6372675 6179165 6028563 5829371 5752654 5666089 5570278 5410760 5283654 5134413
5036 5134413 5006380 4909432 4817185 4701244 4648290 4514084 4396559 4289513 4233161 4126599
5026 4126599 4016314 3956873 3974922 3874122 3741826 3659366 3648533 3594329 3506483 3547845 3521168
5015 3521168 3417912 3309859 3244181 3254606 3224053 3180311 3154070 3063377 2974431 2962086 2927423
5004 2927423 2845060 2787547 2788319 2755314 2738846 2712100 2699299 2653687 2625108 2601105 2707656 2714269
4992 2714269 2678120 2697378 2734674 2779364 2781450 2801606 2693794 2614228 2547389 2418617 2367983
4981 2367983 2306819 2275829 2239261 2208198 2171617 2204897 2114657 2099406 2078745 2078087 2156590 2148964
4969 2148964 2137501 2086483 2093403 2098960 2048563 2053382 2030812 2001263 2060985 2045643 2031999 1961415
4957 1961415 1953400 1971921 1968761 1959357 1908556 1861219 1831171 1841203 1910595 1947094 1937623 1909476
4945 1909476 1926660 1929926 1898571 1881422 1917429 1976563 1973788 1883126 1829302 1876722 1876124 1851101
4933 1851101 1921250 1930370 1940376 1925163 1949224 1941625 1950484 1963457 2040620 2110222 2050691 1989383
4921 1989383 2064846 2130294 2127908 2136014 2163412 2175253 2231469 2243934 2231611 2225476 2191144 2163123
4909 2163123 2165267 2246773 2331738 2356628 2344510 2420075 2446557 2410312 2460651 2481677 2547614 2641589
4897 2641589 2685047 2712400 2756022 2729631 2708262 2751684 2858142 2924429 2963391 2946921 3023285
4886 3023285 3128118 3226548 3295038 3273252 3406050 3480581 3536490 3627198 3724857 3830404 3884864
4875 3884864 3994408 4130111 4213513 4275758 4411298 4515916 4641009 4881462 4988457 5099881
4865 5099881 5243928 5400249 5646657 5885226 6084302 6336018 6575807 6913057 7188426 7528538
4855 7528538 7929486 8390054 8910727 9321104 9774928 10280964 10762446 11301319 11849066 12517612
4845 12517612 13222150 14012969 14889974 15825217 16867815 17889214 18977619 20101491 21211495
4836 21211495 22297357 23481458 24573127 25754041 26886710 27958467 29073839 30140209
4828 30140209 31272331 32283940 33251484 34181022 35079784 36102687 37296254 39053675 41363618
4819 41363618 44310569 47403384 50374736 52495900 53728235 54681503 55262643 55598463 55966223
4810 55966223 56530573 57284759 58072409 58966989 59977509 60931324 61947739 62697445 63179822
4801 63179822 63353898 63305157 63171168 62846555 62392043 61821537 61154183 60464836 59708205 58996692
4791 58996692 58273911 57621582 57187552 56999367 57020704 57087487 57197251 57472187 57831195 58315521
4781 58315521 58849078 59406567 59961721 60422349 60846496 61060147 61077125 60946732 60545821 60205844
4771 60205844 59828495 59445036 58949712 58500392 58109653 57798519 57519548 57276345 57139499
4762 57139499 57204355 57434557 57881899 58503745 59211858 59958870 60732519 61512452 62282672 63092870
4752 63092870 63940788 64743723 65315663 65595906 65600181 65282851 64719447 63860073 62775755 61509862
4742 61509862 60084093 58481535 56705527 54776736 52734905 50785712 48899316 47135047
4734 47135047 45547167 44204913 43070755 42137355 41339767 40615093 40013964 39564282 39110140
4725 39110140 38635450 38133099 37472081 36719134 35957500 35097391 34220183 33326793 32365958
4716 32365958 31360012 30366410 29279381 28254883 27215125 26213783 25335749 24616924 23901946
4707 23901946 23244565 22736106 22270383 21946321 21640816 21290877 21137900 21068619 21018829 21045092
4697 21045092 21121681 21118805 21143729 20979900 20891372 20775720 20491072 20268450 20011536 19851543
4687 19851543 19722988 19654780 19702903 19924638 20240519 20678374 21265846 21903876 22531046 23284487
4677 23284487 23934835 24431240 25049768 25619972 26270090 26819727 27287152 27645015 27944954
4668 27944954 27997238 27824944 27622750 27209065 26714190 26216367 25668017 25066632 24499004 24001931
4658 24001931 23451700 22845738 22301333 21795188 21399560 21070300 20756764 20545150 20314830
4649 20314830 20090967 19866923 19640811 19334791 18983422 18578376 18107366 17539601 16789508
4640 16789508 16115121 15442331 14659846 13948991 13242572 12600769 12045835 11517040 11081511
4631 11081511 10630591 10304159 10180444 10179464 10282559 10507745 10572986 10416626 10090125 9698865
4621 9698865 9221334 8687826 8266742 7975185 7735118 7499407 7305487 7222926 7157162 7245776
4611 7245776 7362922 7538936 7728687 7935029 8194001 8321299 8398009 8584920 8825458 9170783
4601 9170783 9567277 9936113 10305989 10536343 10637670 10792348 10943679 11120348 11453088 11812617
4591 11812617 12096035 12201495 12074897 11921875 11655716 11367962 11246357 11187507 11125232 11034178
4581 11034178 10812625 10477089 10128621 9833402 9526762 9294921 9151483 9004652 8809205
4572 8809205 8723873 8516201 8316557 8314206 8220413 8181202 8308705 8435332 8641385 8870185
4562 8870185 9150414 9544337 10063293 10527162 11077347 11672169 12306419 13005158 13560961 14060375
4552 14060375 14578449 15048424 15470519 15843229 16037204 16331031 16540609 16696113 16897325
4543 16897325 17123825 17362193 17736913 18091585 18613733 19180978 19758451 20180371 20674499
4534 20674499 21151004 21666286 22311425 22919525 23514471 24041217 24480534 24755462 24815593 24655323
4524 24655323 24388797 24058282 23653567 23085233 22397883 21723371 20922230 20118328 19308708
4515 19308708 18479340 17719018 17014321 16468629 15975067 15664675 15441759 15320881 15223122 15157859
4505 15157859 15174065 15111224 15036122 14885042 14631167 14348600 14016983 13611986 13187548 12708670
4495 12708670 12253669 11763078 11258575 10766791 10209923 9666217 9133326 8504785 7857556
4486 7857556 7392017 6937992 6526268 6180895 5781322 5447075 5188032 4873324 4676069 4449325
4476 4449325 4195262 4068440 3885421 3750063 3692071 3582397 3448214 3419513 3345215 3185153
4466 3185153 3052339 2994624 2932524 2820886 2732870 2615725 2628780 2673761 2597462 2535738 2491365
4455 2491365 2440244 2374275 2243110 2198503 2223755 2247700 2163072 2135260 2052555 2043611 2003767
4444 2003767 1951916 1866611 1803723 1838968 1779548 1688002 1671230 1684519 1677736 1664513 1616601 1607086
4432 1607086 1636178 1584363 1586577 1571701 1508776 1417484 1309750 1358042 1349008 1302284 1306070 1326508
4420 1326508 1260667 1262636 1237828 1193917 1217109 1202551 1156930 1116791 1125487 1114104 1093692 1122664
4408 1122664 1102881 1033075 1010733 1032517 1025217 1024918 962966 939812 959840 918301 858124 836305
4396 836305 816182 840126 883665 861814 821820 777800 766892 786012 772229 786778 774883 840394
4384 840394 869480 858523 835022 767595 710190 712126 758553 693000 701665 701710 702435 703993 687939
4371 687939 745022 724078 753413 732289 705394 682613 705061 664291 576473 586307 559158 672339
4359 672339 736068 697601 721733 720232 672317 678883 700514 722402 679459 654184 693504 675053
4347 675053 701293 696239 674117 675448 716784 714132 709162 708989 688914 673744 670089 632624 645670
4334 645670 666322 738422 760745 711772 678548 653012 654059 637700 586790 571444 582618 593569
4322 593569 546612 600515 627452 571919 675252 670723 680534 643226 722627 681292 570808 583387
4310 583387 700376 699133 695448 695908 675777 735390 726423 742993 700371 658689 674831 757964
4298 757964 770313 754686 764091 795805 782567 768406 793510 814804 792739 764024 733923 747799
4286 747799 808422 786296 841290 841556 901037 923896 905996 867384 897617 899366 931410 896405
4274 896405 867203 866020 873872 897648 913875 983628 1008977 1003278 960211 985823 1009881 971956
4262 971956 943104 895017 990840 971577 936430 977129 982955 998679 1049557 1138167 1086687 973103
4250 973103 936759 1004044 960779 1002249 1011717 999743 1024340 1039508 1065173 1078039 1089038 1096963
4238 1096963 1036595 1049221 1077607 1068980 1025299 999808 1088541 1105851 1072063 1051644 1035425 1120972
4226 1120972 1086977 1051360 1096977 1100849 1136093 1146402 1079986 1036911 1045164 1024333 1037654 1052540
4214 1052540 983386 955018 929514 954958 918982 856614 948788 936531 904090 951349 964391
4203 964391 939376 878967 893062 952660 986756 955876 974112 1012113 1037954 932435 917324
4192 917324 970037 996878 977442 948875 895242 924683 890557 875639 902744 918784 925494 878318
4180 878318 840904 923048 947725 953846 948079 878277 927727 892766 915970 889626 875933 893385
4168 893385 905707 918595 942010 884629 900741 927091 904319 912928 909225 943079 938328 949871
4156 949871 944375 915452 988691 1011038 995694 963066 860669 828392 892956 951568 992547 990431
4144 990431 958366 1020227 1011008 953794 935273 973955 990368 1038253 1021402 976638 995711 1022523
4132 1022523 1014385 988342 1097585 1087602 1109909 1038913 1066061 1151615 1162181 1196249 1246045 1201927
4120 1201927 1208793 1203462 1185062 1253377 1222899 1237392 1296523 1289206 1286815 1355289 1389899 1440263
4108 1440263 1482692 1429511 1442785 1454111 1446993 1456032 1556569 1581300 1631232 1651010 1598632 1639348
4096 1639348 1601754 1585384 1707588 1784652 1765358 1761844 1791542 1860054 1882869 1879369 1989168
4085 1989168 2026894 2005335 2049595 2096818 2076448 2119717 2111153 2085741 2090040 2195726 2258583 2187455
4073 2187455 2222492 2289151 2374656 2480429 2543958 2565312 2585725 2601430 2659509 2726889 2775149
4062 2775149 2817310 2828115 2925421 3028629 2997560 2990071 3135293 3218343 3317370 3394096 3561854
4051 3561854 3784606 3938549 4141550 4256757 4417864 4437512 4462740 4429759 4426394 4448157 4576092
4040 4576092 4677180 4755842 4847181 5033296 5186378 5382387 5574629 5748757 6010307 6378887
4030 6378887 6609667 6867278 7165277 7516620 7860844 8179293 8490576 8890206 9248030 9527870
4020 9527870 9929262 10291815 10636935 10990995 11371865 11759306 12137459 12553693 13012324 13352180
4010 13352180 13783233 14185123 14677739 15079679 15352245 15653703 15958407 16266854 16499015
4001 16499015 16788877 17226695 17667338 18142464 18769709 19394147 20097247 20876434 21760301
3992 21760301 22735739 23626173 24697384 25801475 27011958 28328022 29830647 31528681
3984 31528681 33318829 35127388 37016467 38903655 40567239 42173154 43732795 45189636
3976 45189636 46559833 47942860 49382378 50827910 52277882 53841901 55583029 57440217
3968 57440217 59623657 62196225 65225943 68596354 72166329 75869195 79439720 82541568
3960 82541568 85060637 87092585 88660842 90050140 91388039 92848731 94354092 95823672
3952 95823672 97484447 99146481 100610299 101947111 103030422 103932877 104573395 105093384 105319437
3943 105319437 105223910 104595115 103418189 102006344 100470978 98919551 97607895 96571595
3935 96571595 95627900 94798422 93678818 92119591 90047331 87424132 84394622 81254503
3927 81254503 78181357 75271894 72622547 70299654 68193201 66586609 65212664 64023067
3919 64023067 63007239 62161353 61373393 60626880 59850599 59103889 58337807 57474781 56567023
3910 56567023 55351668 53898698 52390269 50914750 49447293 48177746 46996501 45953403
3902 45953403 45138547 44454032 43878757 43451056 43295659 43323873 43554993 44049683 44813706 45761608
3892 45761608 46734458 47787783 48779318 49517122 49939983 50098499 50067498 49776971 49359105
3883 49359105 48826151 48267315 47851900 47416952 46990647 46622155 46342166 46004928 45586212
3874 45586212 45188149 44760366 44271617 43808013 43366376 43049876 42841157 42747197 42731618 42647219
3864 42647219 42483236 42253634 41662489 40695573 39546960 38262094 36712553 35130439 33466549
3855 33466549 31865247 30391968 28958578 27683042 26544502 25572004 24660799 23830011 23094346
3846 23094346 22488565 21952832 21442142 20995960 20564956 20112254 19806757 19483316 19131764
3837 19131764 18772630 18402972 17974744 17506748 16973898 16400394 15892947 15374942 14885252
3828 14885252 14492644 14080694 13649442 13222300 12751877 12345155 11994516 11549524 11179693
3819 11179693 10788392 10405291 10163871 9866712 9666831 9393844 9175734 9036640 8933599
3810 8933599 8797911 8611204 8480088 8324077 8150524 7890853 7689571 7522963 7252538 7037508
3800 7037508 6897719 6756987 6538649 6381322 6165890 5894913 5743185 5645563 5520092 5379111
3790 5379111 5257363 5126258 5025844 4863722 4698909 4556710 4345757 4211091 4147456 3922846
3780 3922846 3796499 3775763 3667563 3486147 3413004 3326516 3253405 3232587 3180252 3072282 3032890
3769 3032890 2988521 2938665 2869309 2860961 2815408 2635472 2626363 2568192 2522882 2514276 2467832 2435060
3757 2435060 2399062 2353206 2280827 2306908 2254594 2189853 2141463 2058700 2060914 2024473 2018164 1971532
3745 1971532 2010103 1964251 1893000 1909328 1819943 1796882 1782219 1747305 1718884 1721457 1710731 1671239
3733 1671239 1655685 1604541 1588459 1620907 1575756 1555006 1574400 1496542 1457136 1471854 1489243
3722 1489243 1500295 1484092 1441632 1325655 1289142 1373601 1396316 1433322 1443656 1327494 1264238
3711 1264238 1227929 1232200 1265034 1295592 1295104 1321064 1280102 1252191 1221363 1224502 1302836 1329057
3699 1329057 1357069 1323878 1304660 1337962 1367092 1355276 1346996 1350353 1402762 1336282 1299439 1321032
3687 1321032 1328714 1266409 1235927 1251514 1210200 1191361 1195271 1202306 1180083 1147349 1183245 1185856
3675 1185856 1269303 1240703 1147859 1139796 1189087 1261195 1246666 1224250 1202387 1146972 1133251 1153204
3663 1153204 1153164 1222834 1222525 1167848 1173866 1141293 1175295 1242011 1246822 1258276 1221649 1212975 1203363
3650 1203363 1236880 1278780 1354566 1366983 1380649 1355065 1298409 1319078 1260362 1276031 1283733 1301559
3638 1301559 1336952 1306411 1395755 1415041 1414201 1477885 1519977 1618528 1638886 1604942 1707728 1850991
3626 1850991 1916591 2005166 2085716 2216907 2395768 2576407 2906477 3352933 3854590 4640878
3616 4640878 5696515 6724028 7476674 7879868 7942333 7622248 7076307 6382318 5718738
3607 5718738 5111124 4570504 4041081 3659771 3380142 3133081 2959481 2852234 2792430 2775897
3597 2775897 2752077 2791088 2824892 2862368 2927354 3115252 3323696 3537917 3860825 4365921
3587 4365921 5124029 6157129 7613928 9500860 11591161 13441281 14513837 14646901 13975904
3578 13975904 12871310 11524166 10035530 8662378 7388599 6338733 5530774 4921654
3570 4921654 4358250 3895822 3559971 3329240 3148450 3071409 2942516 2723478 2638702 2672020
3560 2672020 2656611 2678184 2765070 2955904 3140866 3379403 3811064 4481570 5230296 6084593
3550 6084593 6967611 7530007 7692652 7474367 7000042 6350463 5700264 5016532 4350675 3867210
3540 3867210 3529456 3208430 2958195 2855137 2714360 2670272 2720801 2686726 2648835 2647918 2600663
3529 2600663 2470660 2397849 2255039 2160703 2094297 1953774 1866995 1826886 1831701 1737096 1711549
3518 1711549 1746917 1838161 1987028 2043758 2160107 2337742 2553505 2782891 2962683 3030613
3508 3030613 3037789 3087983 3007736 2956324 2998321 3119566 3277514 3418980 3457075 3469352 3350724
3497 3350724 3168807 3022467 2809169 2672421 2566325 2428911 2330683 2241194 2185755 2214374
3487 2214374 2221484 2262960 2393351 2444522 2604138 2896715 3137546 3529104 3967675 4401813
3477 4401813 4693094 4848060 4890687 4703989 4503231 4340896 4201152 4123820 4080763 4026291
3467 4026291 4031434 3970730 3947377 3882269 3800240 3737314 3586912 3544434 3492054 3426072 3283893
3456 3283893 3162345 3117218 3055709 3014805 2970559 2936993 2952535 3109349 3130878 3151818 3339068
3445 3339068 3478498 3574799 3538537 3470523 3342647 3191965 2959854 2725109 2477125 2269576
3435 2269576 2053713 1873918 1749787 1625314 1475015 1385137 1283136 1194414 1150034 1111596
3425 1111596 1085901 999568 920304 933801 854745 871504 848593 796966 773135 658985 615527
3414 615527 698522 719263 648964 626906 622997 661537 685898 620191 628806 587232 546783 549676
3402 549676 555597 560293 549318 470246 366144 423284 479447 471151 473062 419150 372805 442028
3390 442028 423671 426401 472042 480257 409472 349776 419838 451964 455164 450289 403826 407585 298286
3377 298286 303581 321806 332861 373700 352547 316842 334228 314058 317578 337392 347635 318118
3365 318118 264456 323763 371528 351795 366696 372913 358548 363725 301692 258585 332796 333330
3353 333330 331839 298934 277768 246411 260199 269217 287495 314501 345213 275293 254942 284761
3341 284761 283039 309012 322272 257810 270328 263469 243209 283750 254273 259745 239748 286208
3329 286208 372542 452262 449975 432457 365669 362817 334377 324609 290469 242748 323260 276729
3317 276729 279422 242762 239615 240481 261508 229867 152087 186582 230456 210063 202340 215522 142915
3304 142915 176427 215632 256515 290718 243657 206589 263282 276548 278039 334830 303061 240817
3292 240817 317182 340058 299452 255450 218156 171291 140121 133477 105418 92319 72870 54135
3280 54135 100955 138315 207528 172182 169180 173568 166354 133791 145038 87674 72935 78536 71063
3267 71063 50082 79673 135566 192822 200332 132433 220976 196540 119533 143438 162412 87426
3255 87426 96174 130327 130673 113540 135858 175093 169966 112448 112072 114157 82623 122996 77449
3242 77449 123319 166178 138496 111467 46604 44872 135917 135125 89045 108633 70847 94733
3230 94733 95824 93452 73958 49574 124320 163114 82292 69256 90974 71394 134525 162297
3218 162297 166481 162112 117467 136337 162744 120968 132641 240142 224891 196877 186888 182523
3206 182523 175075 227620 225056 179941 221620 162664 152229 241597 212777 168733 208713 250983
3194 250983 225190 199828 186304 205991 281352 235919 164322 173999 158458 160003 174169 136382
3182 136382 148922 136441 147437 250976 217643 189513 203813 218588 186979 178456 245378 258831
3170 258831 295290 222389 273938 298047 299754 311995 335736 309994 317466 307330 316212 410450
3158 410450 445522 449047 444155 494507 548780 646140 662703 713179 687881 717821 740969 777801
3146 777801 842782 869261 878090 877143 879815 877911 923730 892866 934327 918762 885699 890720 856959
3133 856959 912419 889596 894298 915231 914723 899942 973763 989590 1034860 1074822 1175190 1303321
3121 1303321 1409964 1604129 1799597 1889159 1831087 1679879 1594252 1522213 1381342 1309922
3111 1309922 1231243 1152265 1044157 942943 878051 870305 824183 792950 731838 728854 711760
3100 711760 646617 624142 643236 670964 661376 730191 749150 705780 765559 841166 899327 868628
3088 868628 877681 923691 851637 824400 756961 746694 740466 739510 674046 612908 544190 519395
3076 519395 491072 437375 387165 402430 457052 392056 461642 438983 429591 397191 323666 273147
3064 273147 378188 259182 220703 283668 296076 252643 196372 224287 266712 289499 211359
3053 211359 194175 156533 148639 205842 207124 196488 245826 181059 143472 123096 140401 123502
3041 123502 163486 166692 95332 75175 104535 120122 156718 160445 108118 132627 102228 65409
3029 65409 130859 133979 73291 20343 102843 159043 122316 100159 53232 75160 116045 114081
3017 114081 25870 47216 112839 107033 38109 -4838 72411 66142 -3739 25967 72967 106677
3005 106677 41688 5191 55114 26243 -22927 -5267 17368 97221 110945 73491 67906 58852
2993 58852 38421 99971 102610 111195 137532 122514 101645 46281 66974 25570 1452 20582
2981 20582 3394 45242 64319 12183 30270 113562 42969 23078 37477 32411 67463 28177
2969 28177 75222 43974 -6695 -15367 31258 74145 33576 -650 32770 8094 12923 24813
2957 24813 16555 54267 7419 12851 -52977 -67504 26836 69668 11595 -8263 53369 23577
2945 23577 -38084 -29437 -32412 -26139 12140 20023 28196 -59346 -55450 -170 68874 75846 10887
2932 10887 -2519 82240 -4841 10632 27834 -1013 67027 85276 77799 15896 52729 86593
2920 86593 41409 14283 48678 39272 32596 -41567 -87854 -9593 3300 24201 55105 56250
2908 56250 -24344 -21618 -9114 -32376 21515 26905 -12265 68907 48479 3786 10330 20397
2896 20397 4200 -11625 -6695 -61404 15339 26142 19827 -23471 -21221 -1465 -5471 83488 48496
2883 48496 -12163 -11839 -9515 43121 9814 12712 -5931 -50929 -45414 -26421 45695 33774 -19809
2870 -19809 -20310 -40093 -62063 -1597 -44156 -61221 -25117 -25035 -25638 -49513 -21987 -22209 -7453 36842
2856 36842 44395 54046 45338 51160 2458 -23132 -57988 -58060 53468 50980 51754 29164 -2518 -35643
2842 -35643 -53197 -23187 -14415 6725 55664 75630 122718 22847 51647 68140 47572 48859
2830 48859 -73634 -64288 -15778 21146 -5801 -27457 -16178 -57904 3174 31663 32638 35473
2818 35473 24014 59023 14906 -1230 44826 96093 60816 50837 41666 37569 24776 27827 5552
2805 5552 1802 8784 -26715 28850 7409 27415 10239 -5737 28685 74291 38569 -868
2793 -868 32557 31326 9881 62339 94014 52681 -3132 34797 22487 -15026 46204 59779
2781 59779 21825 63777 73664 -17019 3220 20666 -9589 -10665 -46379 -5331 7949 -35038
2769 -35038 50549 97770 49418 73365 34065 10020 -27426 -23333 -22078 -30034 -25895 -46858 16502
2756 16502 -12199 46222 61311 81004 75263 28478 -18775 -28360 -94905 -57306 -20954 -31898
2744 -31898 -53239 -55787 -982 -73090 -6108 -11842 -70750 -56073 2193 -16337 -56789 -92606
2732 -92606 -107740 47556 71976 96402 46748 29757 67313 96944 79287 124617 7522
2721 7522 -62407 -23158 -24816 -62485 -52923 -27623 18870 65731 -2821 6354 -45397 -87556 -65233
2708 -65233 -15608 72191 72437 7886 -23738 -37158 -26210 -37422 -27971 -17645 1578 -535 -11017
2695 -11017 4545 -60005 -93231 -105498 12042 -56121 -18459 30039 -34956 -14884 -57374 -24938
2683 -24938 32319 -10454 -78020 -47786 -60273 -7933 34994 38543 43221 -28320 -29315 36223 16213
2670 16213 102241 58990 30777 42036 21480 60223 94483 109136 114924 18980 -10807 -3623
2658 -3623 -5354 -9058 -19441 -15114 5556 -43280 -23957 13960 16943 9278 17057 -32445 43123
2645 43123 60124 42804 8869 60132 62519 2036 47813 52952 49856 52185 20010 -7632 41331
2632 41331 35112 62040 66375 14051 24403 69842 55627 83213 7101 -46311 -37467 -29645 -87048
2619 -87048 -78885 -3434 -23563 13229 22821 8861 51073 26040 -41569 8620 27035 19719
2607 19719 37848 41482 17564 14633 8547 42020 51147 13630 38646 -4190 -43150 54023 106930
2594 106930 108355 122458 41289 53111 82646 175059 197300 158043 194599 231459 203820 282150
2582 282150 379512 352024 299311 278947 237355 223168 228737 163163 63355 21808 60394 61979
2570 61979 35612 70518 43122 46529 45750 43617 76279 31278 22890 15014 -29344 33669 7800
2557 7800 29341 18541 5558 -25325 13442 32422 42800 63391 44226 57719 49405 20321
2545 20321 71697 69261 -6324 27375 70567 74911 64060 80519 67352 92584 52356 53405
2533 53405 53745 80669 60017 93699 149006 49574 48742 39804 33700 -11098 -10002 6536 41084
2520 41084 65901 9067 20716 37865 86601 10841 -7041 10213 57295 27097 68905 60791
2508 60791 56314 -8286 60098 60435 61994 120961 58366 -58641 -17658 79641 56794 65979 71643
2495 71643 -8273 4382 88518 153516 103762 72869 74114 60567 65164 26921 76249 125171
2483 125171 105961 71633 126588 88104 47222 78741 178393 204342 183193 202944 221315 219783
2471 219783 198316 153731 139641 96515 132580 167039 51780 89446 199377 155547 170476
2460 170476 155631 137608 123226 183926 140987 148950 138850 68899 101170 104591 103259 111145
2448 111145 158407 160368 162780 190850 221737 227130 144271 187820 287753 299087 187680 174227
2436 174227 263435 238812 176724 224353 260389 235925 218389 212217 210816 201826 200730 157176
2424 157176 229171 236338 209693 165547 192006 265571 265203 293965 227853 234768 223143 242318
2412 242318 251791 185941 205422 240213 245944 233371 213942 241970 228456 305532 313176 282773
2400 282773 256930 355252 351281 342588 426029 411912 332223 362040 412856 433717 359475 290284
2388 290284 351481 361008 410281 459583 479510 593486 614328 616802 654846 643023 712508 722868
2376 722868 783216 816604 791045 695065 687335 777233 814992 809854 878475 979767 1013547 974483
2364 974483 917656 915358 1060540 1170828 1228580 1234044 1254443 1295845 1354448 1379336 1362729 1371835
2352 1371835 1450968 1616010 1704021 1775156 1903156 1993579 2106686 2151194 2206571 2252553 2342828
2341 2342828 2404171 2443821 2537027 2640818 2838314 3157253 3562600 4053410 4716578 5360658
2331 5360658 5948051 6499258 6904596 7298207 7667979 8152016 8773846 9877723 11359231
2322 11359231 13575159 16974574 22478496 30383250 40993660 52005964 60716646 63758089
2314 63758089 61722567 57196369 50736788 42921848 35353046 29142726 23871909 19651666
2306 19651666 16360687 13962149 12042858 10650143 9553861 8715244 7955406 7187385 6449579
2297 6449579 5915403 5248103 4829810 4453315 4123792 3752231 3494905 3276894 3023934 2839565
2287 2839565 2718375 2496245 2394299 2262265 2173982 2025836 1872082 1826178 1771672 1718620
2277 1718620 1713140 1660916 1558999 1463048 1476796 1476461 1423607 1431257 1455279 1425543 1465817 1351162
2265 1351162 1327134 1321749 1318894 1314237 1260450 1208867 1127920 947255 926771 912524 827161 742837
2253 742837 689928 727070 748248 695875 756113 745570 702370 718825 764465 687553 650178 673266
2241 673266 662534 627109 631275 679820 606260 593411 570243 553930 553176 541122 524165 572888
2229 572888 558769 570935 561421 555345 560454 554227 493576 503937 543340 512294 512138 544351 455006
2216 455006 438793 432719 400060 355080 368731 382394 347344 349142 416257 371926 298079 204222
2204 204222 278626 242310 238288 258892 283840 317718 297371 235323 152014 85811 140578 153844
2192 153844 173400 145377 177528 228635 158186 131111 123968 83265 111152 146621 176203 156401
2180 156401 146055 186261 206453 221203 180673 207258 189281 137325 215663 215504 134092 83567
2168 83567 91462 144634 114465 115571 76712 44884 48861 26014 71465 72309 82786 70365 17935
2155 17935 143060 176058 73935 26281 -11074 13884 15295 44593 76249 67492 114593 117654
2143 117654 88844 -7973 46667 81053 71441 77819 94238 113112 122082 55090 89895 109232
2131 109232 -25850 12472 10084 45543 76957 53407 33138 87841 83791 6781 80527 129138
2119 129138 118705 127383 94115 94757 80653 50511 27205 -37021 -9897 24963 -4339 18819
2107 18819 14984 -14757 28054 58937 19663 43060 70066 3741 6323 37540 -22822 -34457
2095 -34457 -33251 -21280 48114 20683 10299 -19113 -24566 5242 -76804 -57984 -42496 -64618
2083 -64618 -40715 -26948 59601 29522 31945 32897 -22960 12501 -10435 -15258 -10571 22398 88353
2070 88353 129503 58414 41455 73280 35549 42886 -9376 24736 -17577 -1233 -30926 -7776
2058 -7776 -9168 1040 26065 15788 28837 80285 113312 88251 99501 160702 221109 278094
2046 278094 335027 276271 270147 209281 149016 109742 37254 111351 74980 38012 -15303 -1002
2034 -1002 22870 86391 32244 -27650 -3801 38441 -29878 -25363 -34403 -34982 -67550 -95456 -18898
2021 -18898 -72111 30450 44729 -63667 -86449 8669 33385 -15657 -13298 -73926 -20517 -52154
2009 -52154 -97942 -28359 -70240 -86823 -146062 -108858 -59609 -64625 -111126 -94160 -6716 1375
1997 1375 -58118 567 -33086 -21263 12424 -30182 -42567 -84394 -59388 -91422 -76051 -51356
1985 -51356 -157548 -142769 -200025 -136545 -82583 -152163 -100168 469 -6126 12502 11863 9070
1973 9070 -19522 -49438 -36965 -88239 -72282 -2938 16801 -2762 -25833 -63160 -65022 -47448
1961 -47448 -61608 -65098 -93075 -50228 -34842 -58275 -28983 -10968 -12483 -44822 -141981 -43334
1949 -43334 -71783 -100791 -52870 -57780 -74550 -59027 -88827 -135088 -117425 -100080 -143142 -86693
1937 -86693 -104492 -131344 -41827 -30243 -45523 19901 20077 -58576 -54567 -51405 -65073 -45160 -1433
1924 -1433 -57287 -124915 -89818 -83453 -93471 -48610 -34211 -68185 -48135 -38235 -112184 -121711 -97032
1911 -97032 -151237 -177101 -110201 -81524 -88795 -49202 -129593 -121283 -45884 -98676 -115749 -73121
1899 -73121 -63617 -101733 -120805 -81066 -36942 -65178 -101502 -87753 -76645 -106357 -39888 -56884
1887 -56884 -32108 -60870 -56479 -93627 -74200 -102612 -144357 -175761 -126445 -71673 -56663 -73948
1875 -73948 -40493 -85881 -130665 -68686 -27101 -55680 -13368 -24779 -45967 -95422 -137861 -87255
1863 -87255 -45570 -9423 -17265 -52205 -62656 -105837 -123231 -117936 -39167 14298 -39692 -98282
1851 -98282 -108591 -144674 -71507 -54698 -43998 -35082 -44526 -21119 -45184 -63181 -85304 -82095
1839 -82095 -82411 -55571 -44430 -60462 -12422 -39070 -70627 -94503 -132365 -35984 -32573 -69390
1827 -69390 -68080 -80378 -81635 -70698 -100755 -84968 -45194 -43687 -24434 -20130 387 -36584 -68526
1814 -68526 -2274 3314 14843 -20540 6946 -37470 -30096 -25440 -13666 -98118 -31799 -76998
1802 -76998 -78725 -165 -37283 -87460 -86827 -115726 -99768 -96241 -67579 -103999 -134240 -169379 -154977
1789 -154977 -45315 -63065 -85136 -155475 -66011 -63622 -101421 -118329 -88352 -33592 -17690 -12283
1777 -12283 -67967 -13150 4584 -44532 -64875 -145183 -130465 -84734 -48270 -25509 -38801 -72943
1765 -72943 -80692 -70395 -91588 -96346 -76005 -61350 -42475 9304 -47565 -72632 -44574 -52162
1753 -52162 -84846 -120011 -68513 -81521 -97059 -101005 -36321 -14321 -72924 -64609 -68147 -110506
1741 -110506 -94116 -114829 -92370 -65771 -22238 47979 -16263 -67681 -10836 58779 60085 40000
1729 40000 -19370 -31793 32609 58260 228 -45568 -14672 -2593 -7371 -17272 -48883 -27645
1717 -27645 -30013 8147 29422 -11874 -47969 -121788 -134563 -104292 -120342 -55211 -87264 -116341
1705 -116341 -106721 -112754 -18242 -55261 -68504 -115430 -170590 -90842 -112683 -79981 -55977 -77569
1693 -77569 -144996 -159779 -84117 616 -15526 -4921 -4311 -73847 -106305 -63191 -71867 -132693
1681 -132693 -110367 -77160 -139722 -158987 -115540 -96307 -104307 -94852 -98178 -86636 -1025 -30651
1669 -30651 -63502 -73061 -93775 -97088 -56712 -105034 -116496 -97851 -64536 -101376 -72575 -109752
1657 -109752 -117898 -54585 12257 -33862 -68509 -16856 38409 41686 -10521 -52346 -84627 -7534
1645 -7534 11169 -43385 -51340 -57341 -61453 -34723 -51281 -43054 -97277 -50339 -9755 -49580 -47132
1632 -47132 -124161 -86483 -98163 -128139 -119639 -94191 -125930 -170644 -167210 -86309 -72649 -93456
1620 -93456 -70249 -54405 10914 -8236 -55467 -119781 -153239 -174035 -141740 -146620 -110925 -90414
1608 -90414 -54684 -72319 -154356 -136706 -55035 -19995 -41264 -36384 -49172 -11516 -107453 -131259
1596 -131259 -16295 8474 -64816 -155977 -163782 -94524 -25734 -2705 -36447 -63844 -48915 -54483
1584 -54483 -108394 -127187 -169157 -79803 -56100 -69248 -22035 -30861 -116769 -73355 -26188 -101559
1572 -101559 -68398 -15319 -47590 -76960 -79091 -86352 -38103 -87407 -93744 -104217 -77851 -112382
1560 -112382 -85254 -12878 -30585 -24708 -72464 -136066 -71857 -8018 -67714 -118301 -117688 -83347
1548 -83347 -48624 -35223 -6377 -25469 -24423 -64237 -121565 -142178 -82787 -42942 -50278 -82295
1536 -82295 -53970 -17085 -5480 -28124 -34557 -30499 -34099 -24430 -59990 -39303 -32045 -54111 -60415
1523 -60415 -85580 -109455 -70105 -8044 -18603 -29617 -4946 58219 23491 -25350 -73917 -58593
1511 -58593 -66140 -98015 -134391 -44727 -19370 -71605 -55281 -95318 -121833 -112107 -106693 -18299
1499 -18299 -4751 -55574 -113537 -130132 -101628 -63078 -48948 -70871 -79155 -74147 -44360 -80815
1487 -80815 -95802 13911 -4471 -28987 -7569 -91851 -70558 -134002 -133862 -106660 -93463 -76282
1475 -76282 -119824 -78646 -10375 -34278 -79112 -90804 -68945 -140202 -110525 -100032 -84819 -67514
1463 -67514 -51200 -20498 2514 -43725 -16584 -20643 -85937 -109290 -80183 -44938 -30438 -32527
1451 -32527 -74928 -36269 22544 -44382 -136705 -113395 -130216 -131027 -151525 -131505 -134537 -161588
1439 -161588 -17042 -26631 -31334 -59425 -61365 -58757 -65523 -56705 -23384 -48023 -99009 -52732 -36228
1426 -36228 -22424 -43238 -20470 701 -41877 -69520 -68702 -1885 24465 -48129 -105959 -97666
1414 -97666 -71979 -49439 -33810 -2525 -31195 -97090 -92893 -63932 7864 -10688 -99020 -75180
1402 -75180 18946 -35550 -145500 -52916 -57586 -112203 -67138 -42615 -14528 13310 -34390 -53634
1390 -53634 -75164 -122367 -62851 -80258 -109911 -68892 9326 29180 36164 9001 -80809 -79903
1378 -79903 -63522 -71325 -90867 -71843 -46281 -73608 -48032 -39469 21288 -40436 -67848 -98273
1366 -98273 -134600 -83311 -10690 -49205 -122528 -72986 -76108 -40238 -95973 -123017 -55247 -65039
1354 -65039 -38653 -48315 -12991 -37964 -93146 -64387 -28502 -25022 23588 -23685 -31351 9639
1342 9639 -44980 -23672 -22805 -83813 -143250 -133065 -112581 -121224 -114278 -122144 -108934 -134141 -72856
1329 -72856 -39106 -39544 -87374 -72140 -68824 -28817 2862 -74026 -105326 -110442 -91749 -103149 -112353
1316 -112353 -97645 -108111 -90841 -138025 -144553 -160964 -100130 -18727 -6264 -14232 -61420 -66112
1304 -66112 -69145 -20567 -65322 -100070 -75019 -40938 -38499 -34084 -25841 -19249 -51271 -59369 -58857
1291 -58857 -77076 -63150 -81499 -66737 -72050 -99668 -127000 -102607 -107833 -134269 -121318 -104155
1279 -104155 -84548 -95218 -87958 -77195 -82777 -147406 -91130 -80632 -148113 -171628 -95189 -78618
1267 -78618 -8298 -3044 -32308 -41612 -10090 -459 -35014 -109820 -113596 -67046 -38109 -24351 9234
1254 9234 -44322 -111323 -101755 -51865 -120485 -140628 -63786 -12200 -31871 -3844 -52567 -48456
1242 -48456 -80340 -108631 -64553 -80875 -61886 -49699 28758 28613 34917 -59960 -100167 -71632
1230 -71632 -59855 -51334 -53497 -21370 -27164 -19998 -26395 15124 8296 -34237 -63929 -40462 -20033
1217 -20033 -28729 -79817 -131090 -122309 -94774 -108708 -46101 -51605 -66821 -79379 -61403 -45267
1205 -45267 -183119 -147617 -102219 -36670 -79531 -99457 -84380 -53896 -69831 -44484 -105422 -112355
1193 -112355 -59692 -73886 -125291 -86108 -141837 -155373 -173759 -185280 -174792 -129478 -90948 -80864
1181 -80864 -21780 -13701 -87544 -116261 -108224 -25427 5759 -20314 -38955 -69573 -158417 -114399
1169 -114399 -99846 -61799 -367 -135652 -190844 -142560 -158298 -146471 -94614 -38076 -37786 -79359
1157 -79359 -100327 -73405 -61161 -49080 -25938 -39013 -87110 -42851 10180 -69153 -90627 -127371
1145 -127371 -78340 -13895 20737 -15050 -82466 -18418 -59680 -127673 -82834 -111478 -106843 -57548
1133 -57548 21218 -8592 -6940 -44900 -41744 -39276 -81481 -57407 8571 44852 68180 37688
1121 37688 -16567 -35903 -9311 -106001 -72326 -41442 -8777 29091 39041 -18924 -65918 -82517
1109 -82517 -89443 -68107 -12103 -12011 -70138 -26664 -50901 -29024 -8544 -89819 -59870 -11481 -82055
1096 -82055 -124401 -87655 -94450 -86148 -65185 -27055 -26353 -30682 14446 32179 -67732 -125817 -83219
1083 -83219 -94771 -128831 -91053 -64659 -65403 -47800 -23007 -51714 -31968 56224 -38263 -109180
1071 -109180 -75290 -49492 -88937 -79684 -22497 -52468 -49522 -88244 -17525 -59497 -116393 -63558
1059 -63558 -16382 -13097 -45208 -44525 -53609 -100882 -136520 -57882 -55602 -44815 -65916 -76171 -68644
1046 -68644 -60902 -100846 -84893 -114110 -96337 -103397 -105950 -111020 -120693 -63514 -85919 -56756 -81725
1033 -81725 -139463 -106346 -75546 -36773 -34236 -12711 -85979 -141134 -103543 -61478 -67390 -109106
1021 -109106 -93709 -69299 -79712 -81277 -129648 -66680 -98541 -130332 -101774 -106060 -114199 -100286
1009 -100286 -92922 -91455 -108138 -90475 -26712 -81501 -121605 -98422 -94471 -22436 -105999 -111635
997 -111635 -65540 -98399 -89431 -94978 -96211 -167731 -74777 -39432 -60865 -70624 -54704 -16722 -78444
984 -78444 -108552 -91545 -119210 -152314 -178279 -191934 -148574 -163485 -144418 -114662 -84903 -53172
972 -53172 -71946 -115329 -141860 -100280 -7573 2683 -13191 -63954 -150062 -134608 -132651 -158467
960 -158467 -154283 -84568 -54336 -36803 -61831 -102594 3579 3181 -25554 -46854 -72560 -89515
948 -89515 -75088 -39766 -87291 -87672 -49146 -39718 -29177 -43965 -43906 -25800 -50650 6534 -32943
935 -32943 -48332 -57380 -54887 -39343 -49673 -97259 -97945 -108042 -80876 -63220 -95977 -106114 -63146
922 -63146 -118073 -91560 -52787 -64198 -77099 -33940 -3404 -77604 -124106 -141759 -136305 -76133
910 -76133 -102001 -172670 -119191 -17157 -23120 -18259 -25606 -69946 -98869 -142719 -131494 -145973
898 -145973 -236068 -161466 -145893 -139261 -150127 -144136 -63707 -55531 -139898 -172560 -96506 -13053
886 -13053 34052 10883 -26526 -74372 -42426 -81629 -181356 -154968 -132328 -112263 -52639 -12259
874 -12259 8891 3321 -8913 -72358 -67067 -71016 -90018 -87326 -72000 -46854 -47209 -26466 10089
861 10089 -42400 -54347 -14459 5843 -27562 -7993 -66844 -33076 -13879 -10312 -8955 -13303 -29307
848 -29307 -36079 -105463 -115228 -106696 -118918 -99472 -99822 -17935 31300 -14000 8334 -48317 -46105
835 -46105 -66100 -58529 -69111 -118570 -76517 -42796 -33434 -53186 -88341 -112344 -122616 -36245
823 -36245 -37767 -17775 17266 -70073 -67773 -83396 -71219 -118436 -107744 -37211 -134444 -151437
811 -151437 -127549 -51639 -46583 -51712 -42468 -87655 -31034 -3422 18343 -18924 -53492 -75497
799 -75497 10942 -64413 -75423 -43782 -71388 -30706 -3790 -47524 -80484 -71212 -66550 -131416
787 -131416 -68469 -62156 -7388 -1272 -49809 -37403 -70842 -71008 -84213 -85128 -102367 -29657 -75069
774 -75069 -99765 -47426 -116759 -66162 -22006 -11612 -59208 -64031 1509 -30703 -102163 -90520
762 -90520 -78795 -41625 -83406 -130942 -95099 -100238 -59939 -114552 -60312 -25489 -38609 -67623
750 -67623 -148091 -160049 -119379 -112810 -107588 -147079 -100303 -50100 -32693 -27827 -109525 -90065 -125194
737 -125194 -133991 -106557 -75031 -72028 -60790 -30673 -72741 -47637 -10680 -18924 -48881 -11594
725 -11594 -31812 -149867 -159324 -109666 -44997 -27207 -30757 -40182 -45200 -71119 -114426 -104793 -69905
712 -69905 -69117 -66510 -59313 -94597 -68399 -52681 -104518 -76513 -131479 -169706 -159884 -119881 -52881
699 -52881 -117989 -98178 -100641 -23643 -29081 -28858 -54760 -74487 -34476 -60485 -94166 -115080 -118479
686 -118479 -48537 -4705 -91526 -101444 -70223 -89624 -32086 24390 -74403 -148379 -122697 -181842
674 -181842 -181805 -128780 -153459 -127582 -120999 -102179 -72722 -93924 -113348 -80608 -107987 -69521 13607
661 13607 -29391 -95092 -95606 -176141 -121881 -66991 -124063 -182064 -90461 24477 -11365 -44507
649 -44507 -41813 -37245 -54890 -49510 22007 70491 22223 -15731 -46004 -42826 8311 -6715 -94891
636 -94891 -135319 -138252 -126346 -108072 -78252 -62814 -89214 -43380 11703 -37300 -104887 -103402
624 -103402 -81178 -66839 -22786 -30971 3293 -6016 -51105 -124413 -113185 -95926 -86911 -37115
612 -37115 -18887 -53935 -87892 -99230 -148858 -78033 -44297 -92545 -126773 -95108 -92095 -110881
600 -110881 -102625 -111514 -90709 -103342 -72819 -34674 -95603 -115415 -125992 -110679 -59499 -31576
588 -31576 -53103 -112291 -120663 -88707 -94677 -25577 3486 -54883 -88606 -44442 -7211 -22956
576 -22956 -80739 -91425 -49536 -52355 -86170 -88634 -100335 -18256 35158 -39341 -36277 -91262 -149066
563 -149066 -90721 -30911 -13263 -51470 -100442 -130333 -157927 -86354 -99603 -102348 -128527 -125486
551 -125486 -134232 -157294 -114176 -82586 27337 -23112 -32765 -44122 -36500 -12037 -80538 -48938
539 -48938 -73604 -36761 -71683 -47456 -21383 -97213 -70849 -39090 -62400 -52799 -66391 -98100
527 -98100 -136503 -96646 -69024 -68098 -85000 -74163 -109648 -165887 -138047 -116127 -63821 -102518
515 -102518 -83971 -126218 -72582 -132546 -95119 -63860 -184364 -125391 -89959 -93266 -112733 -138001
503 -138001 -83480 -71761 -126546 -79600 -116766 -116361 -114399 -113866 -125947 -75469 -83388 -116128 -99559
490 -99559 -41473 -18549 -87651 -115301 -125672 -34529 -99410 -92444 -45403 -3670 -10299 -75310
$$ [...]
##END NTUPLES=NMR SPECTRUM
##END=
