##TITLE=1H_DE-80H_X3
 200.13MHz, d2o
 8 sc
 
 19ns.26.2.2025
##JCAMPDX= 6.0         $$ Bruker NMR JCAMP-DX V2.0
##DATA TYPE= NMR SPECTRUM
##DATA CLASS= NTUPLES
##ORIGIN= UXNMR, Bruker Analytische Messtechnik GmbH
##OWNER= pz
$$ XWIN-NMR		Version 3.5
$$ Fri Jul 24 13:13:55 2026 Russian Standard Time (UT+4h)  Yarkov@DPX200
##.OBSERVE FREQUENCY= 200.1313
##.OBSERVE NUCLEUS= ^1H
##.ACQUISITION MODE= SIMULTANEOUS
##.ACQUISITION SCHEME= undefined
##.AVERAGES= 8
##.DIGITISER RES= 18
##SPECTROMETER/DATA SYSTEM= spect
##.PULSE SEQUENCE= zg30
##.SOLVENT NAME= DMSO
##.SHIFT REFERENCE= (INTERNAL, DMSO, 0, 15.4968)
##AUDIT TRAIL= $$ (NUMBER, WHEN, WHO, WHERE, WHAT)
$$ ##TITLE= Audit trail, XWIN-NMR		Version 3.5
$$ ##JCAMPDX= 5.01
$$ ##ORIGIN= Bruker BioSpin GmbH
$$ ##OWNER= Yarkov
$$ C:/Bruker/XWIN-NMR/data/yarkov2/nmr/H-C/1/pdata/1/auditp.txt
$$ ##AUDIT TRAIL=  $$ (NUMBER, WHEN, WHO, WHERE, WHAT)
(   1,<2026-07-24 13:12:57.67 +0400>,<Yarkov>,<DPX200>,
      <created by zg, POWCHK disabled, PULCHK disabled
       configuration hash MD5:
       00 E9 B6 7A A2 85 ED C7 34 08 36 98 17 FE 4E 26
       data hash MD5: 16K
       30 75 0D 07 FC 0F 65 60 66 C0 3D 53 8E 54 4B BB>)
(   2,<2026-07-24 13:13:11.65 +0400>,<Yarkov>,<DPX200>,
      <Start of raw data processing
       efp BC_mod = 2 LB = 0.25 FT_mod = 6 PKNL = 1 PHC0 = -7256.183 PHC1 = 2.82197 SI = 16K 
       data hash MD5: 16K
       A8 77 CE AC C7 EA 8C 9F 29 6E A4 F9 78 11 E4 10>)
(   3,<2026-07-24 13:13:18.31 +0400>,<Yarkov>,<DPX200>,
      <abs ABSG = 5 
       data hash MD5: 16K
       7A 43 30 F6 18 B0 76 9C 0E C7 D1 77 14 46 0B 3F>)
$$ ##END=
$$ 
$$ hash MD5
$$ 47 66 CE FE 9F 9A CA 52 41 9C 61 BE 3A 55 EA 6E
##$RELAX= 
##$RELAX= 
##$RELAX= 
##$RELAX= 
##$RELAX= 
##$RELAX= 
$$ Bruker specific parameters
$$ --------------------------
##$DU= <C:/Bruker/XWIN-NMR>
##$EXPNO= 1
##$NAME= <H-C>
##$PROCNO= 1
##$TYPE= <nmr>
##$USER= <yarkov2>
##$AMP= (0..31)
100 100 100 100 100 100 100 100 100 100 100 100 100 100 100 100 100 100 
100 100 100 100 100 100 100 100 100 100 100 100 100 100 
##$AQSEQ= 0
##$AQ_mod= 1
##$AUNM= <au_zg>
##$AUTOPOS= <>
##$BF1= 200.13
##$BF2= 200.13
##$BF3= 200.13
##$BF4= 200.13
##$BF5= 200.13
##$BF6= 200.13
##$BF7= 200.13
##$BF8= 200.13
##$BYTORDA= 1
##$CFDGTYP= 0
##$CFRGTYP= 5
##$CHEMSTR= <none>
##$CNST= (0..31)
1 1 145 1 1 1 1 1 1 1 1 1 1 1 1 1 1 1 1 1 1 1 1 1 1 1 1 1 1 1 1 1 
##$CPDPRG= <>
##$CPDPRG1= <>
##$CPDPRG2= <>
##$CPDPRG3= <>
##$CPDPRG4= <mlev>
##$CPDPRG5= <mlev>
##$CPDPRG6= <mlev>
##$CPDPRG7= <mlev>
##$CPDPRG8= <mlev>
##$CPDPRGB= <>
##$CPDPRGT= <>
##$D= (0..31)
0 0.7 0 0 0 0 0 0 0 0 0 0.03 0 0 0 0 0 0 0 0 0 0 0 0 0 0 0 0 0 0 0 0 
##$DATE= 1784884377
##$DBL= (0..7)
120 120 120 120 120 120 120 120 
##$DBP= (0..7)
150 150 150 150 150 150 150 150 
##$DBP07= 0
##$DBPNAM0= <>
##$DBPNAM1= <>
##$DBPNAM2= <>
##$DBPNAM3= <>
##$DBPNAM4= <>
##$DBPNAM5= <>
##$DBPNAM6= <>
##$DBPNAM7= <>
##$DBPOAL= (0..7)
0.5 0.5 0.5 0.5 0.5 0.5 0.5 0.5 
##$DBPOFFS= (0..7)
0 0 0 0 0 0 0 0 
##$DE= 6
$$ [...]
##$SUBNAM3= <"">
##$SUBNAM4= <"">
##$SUBNAM5= <"">
##$SUBNAM6= <"">
##$SUBNAM7= <"">
##$SUBNAM8= <"">
##$SUBNAM9= <"">
##$SW= 18.0517328524113
##$SWIBOX= (0..15)
0 0 2 0 0 0 0 0 0 0 0 0 0 0 0 0 
##$SW_h= 3612.71676300578
##$TD= 16384
##$TD0= 1
##$TE= 0
##$TE2= 300
##$TE3= 300
##$TEG= 300
##$TL= (0..7)
0 120 120 120 120 120 120 120 
##$TP= (0..7)
150 150 150 150 150 150 150 150 
##$TP07= 0
##$TPNAME0= <>
##$TPNAME1= <>
##$TPNAME2= <>
##$TPNAME3= <>
##$TPNAME4= <>
##$TPNAME5= <>
##$TPNAME6= <>
##$TPNAME7= <>
##$TPOAL= (0..7)
0.5 0.5 0.5 0.5 0.5 0.5 0.5 0.5 
##$TPOFFS= (0..7)
0 0 0 0 0 0 0 0 
##$TUNHIN= 0
##$TUNHOUT= 0
##$TUNXOUT= 0
##$USERA1= <user>
##$USERA2= <user>
##$USERA3= <user>
##$USERA4= <user>
##$USERA5= <user>
##$V9= 5
##$VALIST= <valist>
##$VCLIST= <CCCCCCCCCCCCCCC>
##$VD= 0
##$VDLIST= <DDDDDDDDDDDDDDD>
##$VPLIST= <PPPPPPPPPPPPPPP>
##$VTLIST= <TTTTTTTTTTTTTTT>
##$WBST= 1024
##$WBSW= 4
##$XGAIN= (0..3)
0 0 0 0 
##$XL= 0
##$YL= 0
##$YMAX_a= 138845
##$YMIN_a= -207263
##$ZGOPTNS= <>
##$ZL1= 120
##$ZL2= 120
##$ZL3= 120
##$ZL4= 120
##$ABSF1= 15.48356
##$ABSF2= -2.56829
##$ABSG= 5
##$ABSL= 3
##$ALPHA= 0
##$AQORDER= 0
##$ASSFAC= 0
##$ASSFACI= 0
##$ASSFACX= 0
##$ASSWID= 0
##$AUNMP= <proc_1d>
##$AZFE= 0.1
##$AZFW= 0.1
##$BCFW= 0
##$BC_mod= 2
##$BYTORDP= 0
##$COROFFS= 0
##$CY= -3
##$DATMOD= 1
##$DC= 0
##$DFILT= <>
##$DTYPP= 0
##$F1P= 0
##$F2P= 0
##$FCOR= 1
##$FTSIZE= 16384
##$FT_mod= 6
##$GAMMA= 0
##$GB= 0
##$INTBC= 1
##$INTSCL= 3.241238e-09
##$ISEN= 128
##$LB= 0.25
##$LEV0= 0
##$LPBIN= 0
##$MAXI= 10000
##$MC2= 0
##$MEAN= 0
##$ME_mod= 0
##$MI= 1.114404
##$NCOEF= 0
##$NC_proc= -7
##$NLEV= 6
##$NOISF1= 3.799351
##$NOISF2= 2.8
##$NSP= 0
##$NTH_PI= 0
##$NZP= 0
##$OFFSET= 15.49678
##$PC= 1
##$PHC0= -7256.183
##$PHC1= 2.82197
##$PH_mod= 1
##$PKNL= yes
##$PPARMOD= 0
##$PSCAL= 0
##$PSIGN= 0
##$REVERSE= no
##$SF= 200.130004987751
##$SI= 16384
##$SIGF1= 3
##$SIGF2= 2
##$SINO= 0.751879
##$SIOLD= 32768
##$SREGLST= <19F.Aceton>
##$SSB= 0
##$STSI= 16384
##$STSR= 0
##$SW_p= 3612.71676300578
##$SYMM= 0
##$S_DEV= 0
##$TDeff= 16384
##$TDoff= 0
##$TI= <>
##$TILT= no
##$TM1= 0
##$TM2= 0
##$TOPLEV= 0
##$USERP1= <user>
##$USERP2= <user>
##$USERP3= <user>
##$USERP4= <user>
##$USERP5= <user>
##$WDW= 1
##$XDIM= 16384
##$YMAX_p= 500107047
##$YMIN_p= -967220
$$ End of Bruker specific parameters
$$ ---------------------------------
##NTUPLES= NMR SPECTRUM
##VAR_NAME=  FREQUENCY,     SPECTRUM/REAL,   SPECTRUM/IMAG
##SYMBOL=    X,             R,               I
##VAR_TYPE=  INDEPENDENT,   DEPENDENT,       DEPENDENT
##VAR_FORM=  AFFN,          ASDF,            ASDF
##VAR_DIM=   16384,         16384,           16384
##UNITS=     HZ,            ARBITRARY UNITS, ARBITRARY UNITS
##FACTOR=    0.220516191357247, 1,           1
##FIRST=     3101.37073784706, 0,            0
##LAST=      -511.34602515872, 0,            0
##MIN=       -511.34602515872, -967220,      0
##MAX=       3101.37073784706, 500107047,    0
$$ Real data points
##PAGE= N=1
##DATA TABLE= (X++(R..R)), XYDATA
$$ [...]
8964H50035k06815k13385J1581j813L8412K17311M6656O1084Q65R4630J80317
8953A078878j25923q6931j25625N310n0829Q4390P5517o8367j0201L4981l144
8942H08056J5249j5941o2731K5971K16708k6242K6518P3069J6554k18703r4642
8931G63866J09955m4872m0120J4450M3991J20835K34094j00894l3611P1096o6454
8920A072336M2707l1908K9964J63762j45304k4611Q323m5788m4327k60851J42122
8909I06425L22245k7293L9058J37264J53205j04036j0122j22069q9665J46643
8899A351655J24010p1276j0006q8622j32670l754J17840j42932J29800R075L5387
8888A318507K08673R1551K51J26807j37044j73347K0047Q051O755M3436O6877
$$ y = [850035, 643220, 429835, 441416, 439603, 478015, 695326, 741982, 803066, 803931, 898561, 1078878, 952955, 866024, 740399, 745709, 694880, 779270, 854787, 786420, 776219, 811200, 808056, 823305, 807364, 744633, 770604, 987312, 961070, 987588, 1060657, 1077211, 858508, 763866, 873821, 828949, 788829, 803279, 847270, 968105, 1202199, 1101305, 1067694, 1138790, 1072336, 1115043, 1083135, 1113099, 1276861, 1131557, 1106946, 1115269, 1069481, 1025154, 764303, 906425, 1228670, 1201377, 1240435, 1377699, 1530904, 1426868, 1416746, 1294677, 1205012, 1351655, 1475665, 1404389, 1394383, 1305761, 1173091, 1169337, 1287177, 1144245, 1274045, 1283120, 1318507, 1527180, 1618731, 1618982, 1745789, 1608745, 1435398, 1455445, 1463496, 1470251, 1513687, 1580564]
8877A580564m9755J36342j28623j00522J1717p4278R230P7122N3606K93894J17417
8866A926714J05225r5705k1286N1132q6065R5341R5852j748q0322n6220K03488
8855B136406M7032j70070m4930l2633j11925J06702J68829Q5649K00195K5242
8845B410497l8403M1122R5341p5889n286q8885J4137k1252J1296R8545o129n1420
8833B383674K5035Q5432q6638O5448J32149J61615L7105J0769K35157J60167k9661
8822C180252o6259p1968q7799J77820J25106J5714r617M9874J32173p4396K5274
8811C396174J58403J24164P6191J7223R928J22638J88221N6649O561j9159n5903
8800D081090j7401J11268J05476N0928N9247O3494J48282J36883j0369l5054K18295
$$ y = [1580564, 1530809, 1667151, 1538528, 1438006, 1449723, 1375445, 1384675, 1461797, 1515403, 1809297, 1926714, 2031939, 1936234, 1914948, 1966080, 1880015, 1975356, 2071208, 2069460, 1989138, 1932918, 2136406, 2183438, 2013368, 1968438, 1935805, 1823880, 1930582, 2099411, 2185060, 2385255, 2410497, 2372094, 2413216, 2508557, 2432668, 2427382, 2338497, 2352634, 2331382, 2342678, 2441223, 2435094, 2383674, 2408709, 2494141, 2407503, 2472951, 2605100, 2766715, 2803820, 2814589, 3049746, 3209913, 3180252, 3113993, 3042025, 2954226, 3132046, 3257152, 3272866, 3263249, 3313123, 3445296, 3370900, 3396174, 3554577, 3678741, 3754932, 3772155, 3782083, 3904721, 4092942, 4149591, 4156152, 4136993, 4081090, 4063689, 4174957, 4280433, 4331361, 4390608, 4454102, 4602384, 4739267, 4728898, 4693844, 4912139]
8789D912139L64854K70969Q3893O3189o8990R2598r5548J50930O7097N8773R7975
8778E997879J59879M1873O3605J48425J11814K83621K30401K42953P0341Q9775
8768G440566O8587O474R3736K18408M3206J83804J37805K7791J56246K88551K43753
8757H908927K20655J07747K39091K29149J55646J52502J15090K74920K82971J7781
8747A0704479J44478K83105J09489K67682J43691k5068J54519L82089J01901L06927
8737A2573292L95175L02867L63850J42545J35760J53133J38964K52884J34071
8728A4592541L97809L35158J58211k1399R1139Q79N9536L39749L46659J39649
8718A6439931k236J73531R8843P247K19054J07972j9872P3556Q440m4906l9989
$$ y = [4912139, 5276993, 5547962, 5631855, 5695044, 5626054, 5718652, 5623104, 5774034, 5841131, 5899904, 5997879, 6157758, 6199631, 6263236, 6411661, 6523475, 6807096, 7037497, 7280450, 7350791, 7440566, 7509153, 7515627, 7609363, 7827771, 7870977, 8054781, 8192586, 8220377, 8376623, 8665174, 8908927, 9129582, 9237329, 9476420, 9705569, 9861215, 10013717, 10128807, 10403727, 10686698, 10704479, 10848957, 11132062, 11241551, 11509233, 11652924, 11627856, 11782375, 12164464, 12266365, 12573292, 12968467, 13271334, 13635184, 13777729, 13913489, 14066622, 14205586, 14458470, 14592541, 14990350, 15325508, 15483719, 15462320, 15553459, 15554338, 15613874, 15953623, 16300282, 16439931, 16437695, 16611226, 16710069, 16717316, 16936370, 17044342, 17024470, 17098026, 17106466, 17061560, 17021571]
8707A7021571j05061J8425J62212o8316k09685j49396P8933j30633j46815l1171
8697A6440064j78427l244j54119k15500m7280k02418j80027j57004j69079k73965
8687A4859001k2259j71915j70808j97965k38869l62767j61133k32693j12689k34645
8677A2953258k66092j43290l22652j89078j21123k45842k32651j41357q2280j87916
8667A1020977k36286k65955l56377j66439j74604k00113m4199j92593r5541J617
8657I290487j24122q6930l22423j95946j22636m12120k24848j69067R759o9584
8647G572570j17787j11509j02974k30954q7649j44931l5803p0896r5582J21942
8637F696427k40130j58903j45597j93041j44607j03965k07837p6773J5430j40330
$$ y = [17021571, 16916510, 16934935, 17097147, 17028831, 16819146, 16669750, 16748683, 16618050, 16471235, 16440064, 16261637, 16258393, 16104274, 15888774, 15841494, 15639076, 15459049, 15302045, 15132966, 14859001, 14836742, 14664827, 14494019, 14296054, 14057185, 13694418, 13533285, 13300592, 13187903, 12953258, 12687166, 12543876, 12221224, 12032146, 11911023, 11665181, 11432530, 11291173, 11208893, 11020977, 10784691, 10518736, 10162359, 9995920, 9821316, 9621203, 9577004, 9384411, 9288870, 9290487, 9166365, 9079435, 8757012, 8561066, 8438430, 8026310, 7801462, 7632395, 7642154, 7572570, 7454783, 7343274, 7240300, 7009346, 6921697, 6776766, 6740963, 6670067, 6574485, 6696427, 6456297, 6297394, 6151797, 5958756, 5814149, 5710184, 5502347, 5425574, 5441004, 5300674]
8627E300674r6798j14813j41434J48761j83621j55160L6333K5723k1860j76521
8617D621284Q654j03032j87991p1098l8619j79883k74856J26985p1945Q7311k5788
8606C891022j42342j9270k51218L5702R6380J39042j12597j67221R036j42025
8596C336509o4498p3110p3567j98579O9642m6925j12032O9669m8108p2475n4068
8585B732458J1161P2250j67366N92289K26312o75579J04496p9109j52952j3310
8575B650650q0402j05886r215n6340j00905p520N3683j4360p1437Q6010O5615
8564B409893J4190j9226j848M1353q4546j08019l7930K19762K15066p4483N4340
8553B628552N0252m1152Q9598K65124J67272M14753O60789P53041J476839J703889
$$ y = [5300674, 5203876, 5089063, 4947629, 5096390, 4912769, 4757609, 4793942, 4819665, 4797805, 4621284, 4629938, 4526906, 4338915, 4267817, 4229198, 4049315, 3774459, 3901444, 3829499, 3916810, 3891022, 3748680, 3729410, 3478192, 3513894, 3610274, 3749316, 3636719, 3469498, 3478534, 3336509, 3272011, 3198901, 3125334, 2926755, 2996397, 2949472, 2837440, 2907109, 2859001, 2786526, 2732458, 2743619, 2815869, 2648503, 3240792, 3467104, 2791525, 2896021, 2816912, 2663960, 2650650, 2570248, 2464362, 2455147, 2398807, 2297902, 2290382, 2344065, 2329705, 2258268, 2344278, 2409893, 2424083, 2404857, 2403009, 2444362, 2359816, 2251797, 2213867, 2433629, 2648695, 2574212, 2628552, 2678804, 2637652, 2727250, 2992374, 3159646, 3574399, 4235188, 4988229, 6465068, 8168957]
8543H168957Q75554J31726K600j41739k63357k67895q31140j189315j196027p20602
8533D568762o57479m42662l83057l11967r6872m0777j90322l4621n6493k15993
8523B138519j23853j08750k13046k00020j27022P5294k0425N4268J12897j46647
8513A441215N6027K9035l43761R8910K22931j84766J07404n8747p1647M609j42997
8502A158213j39526J11379j32610j14710O4301Q6583O1804R120M0113j42143j27465
8491H75059K0168J43741J35351L3585j29963m9324P4414j04793r3385p1332P9279
8480I12800l3291q3183J38404O0788k38359O5850j19980o7587J50641L3131k9159
8469G90055J20607j37691M2380Q6621K5182j17522j23330j27845j37115R5388
$$ y = [8168957, 9044511, 9176237, 9178837, 9037098, 8773741, 8505846, 7674706, 6485391, 5289364, 4568762, 3911283, 3468621, 3085564, 2773597, 2676725, 2635948, 2445626, 2411005, 2354512, 2138519, 2014666, 1905916, 1692870, 1492850, 1365828, 1441122, 1420697, 1474965, 1587862, 1441215, 1497242, 1526277, 1182516, 1281426, 1504357, 1319591, 1426995, 1368248, 1296601, 1301210, 1158213, 1018687, 1130066, 997456, 882746, 947047, 1033630, 1095434, 1104554, 1144667, 1002524, 875059, 895227, 1038968, 1174319, 1207904, 1077941, 1028617, 1103031, 998238, 904853, 833521, 912800, 879509, 796326, 934730, 995518, 757159, 823009, 703029, 635442, 786083, 819214, 790055, 910662, 772971, 815351, 901972, 927154, 809632, 686302, 558457, 421342, 516730]
8459E16730P9587M4657L905j7213l687J81615o1742j9990r2774o308J174K1762
8447F47716k8747n0697m8082o1334K42423j65631o6488K0277L4701L1793J92373
8436G48304P3673k06075j13247p5583j5923n6425p2484J99401R5489n1260j34739
8425C91131k0067q8205p3764K04153J54328j36984j4654n3928J58939P0627j75717
8414D15859o0169l1913n5964N4515p1959o2621N3705j52209O6859M530K0907L5937
8402B17477K3700n0906N6711J4035P6871k3081J04817j18646n1470M730J03730
8391C57968K8785M0357j2841m9320j05813O0190j67083R6852j63512o9979J01729
8380A17333M9516P3342L7908p6152N8288J4780j14293j07135k3193L7623p2332
$$ y = [516730, 596317, 640974, 644879, 627666, 623979, 805594, 743852, 723862, 631088, 624780, 625954, 647716, 618969, 568272, 520190, 458856, 701279, 535648, 469160, 489437, 524138, 555931, 748304, 821977, 615902, 502655, 427072, 411149, 354724, 282240, 481641, 577130, 525870, 391131, 371064, 282859, 209095, 413248, 567576, 430592, 415938, 362010, 520949, 591576, 415859, 355690, 323777, 267813, 322328, 250369, 187748, 241453, 89244, 156103, 160633, 181540, 217477, 241177, 190271, 246982, 261017, 337888, 314807, 419624, 300978, 249508, 254238, 357968, 386753, 427110, 414269, 364949, 259136, 319326, 152243, 249095, 85583, 15604, 117333, 166849, 240191, 278099, 201947, 260235, 275015, 160722, 53587, 30394, 68017, -4315]
8369d315q9165Q6845P1984J83247M9263r7804k7936l6510K2176j16785J01290
8358A42290j5725J45836n2593r71q4674P8744o2525r3981N6696J99346j39653
8347A72790Q0Q9818m5036o489j35782n5111m4729R9993o031Q6319P3029p0039
8335A58812m911j4769Q6391j15240j9120m7540l1819K3044kp902j05234O630Q2111
8322A0451Q94N8859M8237o8861P3255K5888m5757N2989j23520K7234R4494m9784
8310A04379N8623j3982j2124J01277p6276o3502L9962o4903O3667K6066q9008
8299G4179j19471J9942L7576M3923J0182j6829n364J37819J08159q8571j20626
8288H0919r1393m2741J31383K2783r2934J8916k7851o0947o1091J77157k9155
$$ y = [-4315, -93480, -6635, 65349, 248596, 297859, 200055, 172119, 135609, 157785, 41000, 142290, 126565, 272401, 219808, 218837, 134163, 212907, 150382, 56401, 113097, 312443, 172790, 172870, 262688, 217652, 211163, 75381, 20270, -24459, 75534, 69503, 155822, 228851, 158812, 153901, 139132, 225523, 110283, 91163, 43623, 11804, 34848, 34846, 26944, -78290, -71660, 10451, 11345, 70204, 118441, 49580, 122835, 148723, 102966, 155955, 32435, 59669, 154163, 104379, 163002, 149020, 136896, 238173, 161897, 98395, 138357, 73454, 137121, 163187, 74179, -45292, -25350, 12226, 56149, 66331, 49502, 44138, 181957, 290116, 201545, 80919, -10474, -53215, 78168, 100951, 8017, 26933, -918, -61865, -122956, 54201, 25046]
8277B5046K2463O4936j9995P5938J4182n2053l8283P6613j26223q8989M8975J3692
8265A6302j14067O3726O3059R0144l0722r9396n487L3899N5730j08569L1823m6304
8253d9862j5955o3272k7267J51742j9580J74901n1572n9065J42483M084m8429
8242A38208n981j49359j42245J08985O1523R5728p0685M1335j04723N2098o2682
8231c7798j14401P4719k877J45244L9058j68662m8646l702J6440K32951j8106
8220A14220J51066r8060j94518P8416k3152n2981J7370J276n1896L0868p6045
8209a03436j65237J32925l2846N212J29354J71549l7684p3814L2876j28403J1348
8198e8156M5525J612l1010J65122J2048j21077r81284J84631N50381O8423p988
$$ y = [25046, 47509, 112445, 92450, 168388, 182570, 130517, 92234, 168847, 42624, -46365, 2610, 16302, -97765, -34039, 29020, 119164, 88442, -10954, -16441, 17458, 73188, -35381, -3558, -49862, -65817, -129089, -156356, -4614, -24194, 150707, 99135, 40070, 182553, 186637, 138208, 132227, -17132, -159377, -50392, 11131, 106859, 36174, 77509, -27214, 24884, -37798, -152199, -77480, -80357, 64887, 103945, -64717, -113363, -117065, -100625, 132326, 114220, 265286, 167226, -27292, 51124, 27972, -25009, -7639, -6363, -58259, -27391, -103436, -268673, -135748, -168594, -163382, -34028, 137521, 99837, 26023, 58899, -69504, -58156, -12631, -11019, -42029, 123093, 135141, 14064, -967220, -782589, -232208, -163785, -171773]
8187a71773K7799K31910M3602n4745j41199N0469m4406M5671J0698R9665p3313
8176B4378N4036j07578r5607R1006j6510j01241N2131p109M5910p4947P2847j05454
8164a68138p301J43203j99119N9544J10946l1773K6087j8322j42564J36777P1183
8153a9477K8612p3517j494J88070n101k4701N1748j4691j26494P690n9290k5809
8141g4454n6152j3413k8239L0151k4366N1988r434R2868O328j68123L41660L5994
8129A84808j70099p0785j32024L7581Q9895j73826N1180N600j07442k1913Q2031
8118b24994N0678P5454p8955Q7581O1901r2216J35600j00082L5401L7562m9839
8107f1909J37663q7943j50258j19751J31234N4889j12228O0110j7223J40516K01050
$$ y = [-171773, -143974, 87936, 131538, 76793, -64406, -13937, -58343, -12672, -1974, 97691, 24378, 78414, -29164, -124771, -33765, -50275, -151516, -99385, -106494, -60584, -135531, -62684, -168138, -175439, -32236, -231355, -171811, -60865, -92638, -66551, -84873, -227437, -90660, -19477, 9135, -64382, -65876, 122194, 117093, 92392, 144140, 129449, 2955, 10645, -48645, -74454, -130606, -144019, -172258, -142107, -166473, -114485, -123919, -31051, -24723, -192846, 148814, 184808, 14709, -56076, -188100, -150519, -60624, -234450, -183270, -177670, -285112, -307025, -224994, -174316, -98862, -177817, -90236, -28335, -120551, 15049, -85033, -49632, -12070, -61909, 75754, -12189, -162447, -282198, -150964, -96075, -208303, -148193, -165416, -24900, 176150]
8096A76150m6712r0813j01219l0158L4189Q3155o245n1877J14403K285j35097
8085e1939J2309Q5170k5017j75763j04030K4069J13512J15750q4084L0561L8496
8074b0966j53885j1044J36772K0168O9182k8296m6459r5790N0090Q4513j03703
8063i9418j11697n3482m5680R0807K49734L678N9000j7016k44478L9710r3218
8052b22060p4998J46473O8228m3654J2938k7952N4654M6799J24656L282j79899
8041i1533n8096j16793P0460J46935o0112Q0070p4506j7672L0343k9881J8802
8030a01983L7273q4407N0621n2636K1728j22308K2166L6443M6274J05492j21998
8019a63335J51472R4986P2955O3862m4749j28561j22167n5922O96j8353j4151
$$ y = [176150, 129438, 38625, -62594, -92752, -58563, 24592, 18347, -33530, 80873, 83158, -51939, -39630, 45540, 20523, -155240, -259270, -235201, -121689, -5939, -90023, -59462, -20966, -174851, -185895, -49123, -28955, 40227, 11931, -34528, -130318, -80228, 4285, -99418, -211115, -264597, -310277, -219470, 30264, 33942, 92942, 75926, -168552, -128842, -222060, -297058, -150585, -82357, -126011, -113073, -141025, -86371, -39572, 85084, 88366, -91533, -149629, -266422, -195962, -49027, -109139, -29069, -103575, -121247, -90904, -120785, -101983, -64710, -149117, -98496, -151132, -129404, -251712, -229546, -193103, -146829, -41337, -163335, -11863, 83123, 156078, 219940, 175191, 46630, -75537, -131459, -130763, -149116, -163267]
8008a63267M8114R4159n0880j46926P1390J61191k1822J89780J08066j27237k5658
7997A36910J35839L9237j50957j07705j14073p7339q9844j3325J71917K3653P5443
7986B9756k8045q8999m8880O5706n8927K3321k7275J12680O6076m2786K721J17639
7974A22987j64754j85613K9888J0067j54791K11696J42003q690K26142P321k32680
7963C576j61871l1530O4007J55689O021J54526R0550o8837L0976k35089q1096
7952g3078k7259j06494M9010J45281j5632J9716J08351N3668j57055k32095l111
7941b38698M2746r5834J59551N4505J28043q141j01717L0332k72487N5399J43161
7930a03140P1026K09923J67821K7716q192j79436j87840n0297j18194l5842Q064
$$ y = [-163267, -115153, -20994, -71874, -218800, -147410, 13781, -8041, 181739, 289805, 162568, 136910, 272749, 311986, 161029, 53324, -60749, -138088, -227932, -241257, -69340, -45687, 29756, 1711, -87288, -136168, -70462, -129389, -106068, -133343, -20663, 45413, 2627, 5348, 122987, -41767, -227380, -197492, -187425, -342216, -130520, 11483, 2793, 228935, 236256, 3576, -158295, -189825, -125818, 29871, 35892, 190418, 280968, 212131, 243107, 8018, -73078, -100337, -206831, -157821, -12540, -28172, -8456, 99895, 153563, -3492, -235587, -238698, -195952, -291786, -132235, -77730, 50313, 42172, -59545, -29213, -301700, -246301, -103140, -32114, 177809, 345630, 373346, 365154, 185718, -2122, -52419, -170613, -206455, -198391]
7919a98391M6426J32801l2133j5706L7979q1687q7487n2075J4716K06328J27941
7908I8712J56035n6196k8324j64392k36321N2426P4813j51285J52465k3771k5386
7897a51224J28404J11838j55644j5064J9360j09613n2923N9452J64399J14010
7887A12995q4779K6434p2672j00645p7783O9787r6399L1168J19617K6788q425
7876e3914p5302J30891J7509q0888j06178m1436J21816L6370Q7332J51775j55301
7865C2674m1839m2119r2468l7016p6097L2974L2360O1167J50352K6801N51j34849
7853h7509j63896M8266K13807l6624M0700o9285L0736Q0302J0466p5577o1719
7842g0333j82116l8126J25834j09157K00556J0224J04211J8965n96n3611r2517
$$ y = [-198391, -151965, -19164, -51297, -67003, -29024, -110711, -198198, -250273, -235557, -29229, 98712, 254747, 198551, 170227, 5835, -230486, -178060, -103247, -254532, -102067, -125838, -151224, -22820, 89018, -66626, -81690, -62330, -171943, -224866, -165414, -1015, 112995, 28216, 54650, -18022, -118667, -196450, -126663, -223062, -191894, -72277, -45489, -53914, -129216, 1675, 19184, -61704, -167882, -209318, -87502, -51132, 36200, 187975, 32674, -9165, -51284, -143752, -180768, -256865, -223891, -191531, -130364, 19988, 46789, 47340, -87509, -251405, -203139, 10668, -25956, 14744, -54541, -23805, 56497, 66963, -8614, -70333, -252449, -290575, -164741, -273898, -73342, -63118, 41093, 60058, 59462, 5851, -86666]
7831h6666j50023Q9577N9056j8473J80507O5985N6037P6985l10748j42610l3527
7820b13900P1730J61467m4318k8069N9632J16824r8334K4940m9086n0061k04461
7809b53636K64551N8602l6708o0538j13939K175o8157J03043N2469j2N9809J11709
7797A19368J6391K3551p076q8676j29775N5637r1263j24103J45823j5405r479
7786a05007j3172M5261j20504J0055J19656k9070n1648J41636M4453L07014M8058
7775C96732j38635k0916p1421l1665Q3765j6769J86P0319l3551l3286M5014o2935
7763A86838n1436m608Q6166p3393k2826M6108n4034J55143O1829j40312j51322
7752C8153J06510L3725k7698K4630M1221N440N9875N4193p0444J74700J58503
$$ y = [-86666, -236689, -147112, -88056, -106529, 73978, 139963, 196000, 272985, -37763, -180373, -213900, -142170, 19297, -25021, -53090, 6542, 123366, 25032, 49972, 886, -49175, -253636, 10915, 69517, 32809, -27729, -141668, -139493, -207650, -104607, -52138, -52150, 7659, 119368, 135759, 159310, 152234, 63558, -66217, -10580, -101843, -225946, -80123, -95528, -105007, -118179, -72918, -193422, -183367, -63711, -92781, -144429, -2793, 41660, 348674, 396732, 258097, 237181, 165760, 134095, 217860, 201091, 201277, 271596, 238045, 204759, 249773, 186838, 135402, 130794, 216960, 143567, 120741, 166849, 112815, 267958, 329787, 189475, 38153, 144663, 178388, 150690, 175320, 216541, 221981, 281856, 336049, 265605, 440305, 598808]
7741E98808O5631Q8393O6627L7084K11726M5446k05412j45543j55773j99575M4923
7730D52335k48681j01014k8085q6425Q9208R411J12464q1019j56135K5458J19194
7719A06711K6597O7797O5743J15455J375N3668J42201O3954o0170Q4350k7096
7708F40585J14179R5261P5563j03094J12816l7815l42546k19814j28614m3987
7698A62534J0744l3398P0060o6526O2858k4758j00240k9442j41817J48820O1031
7687A19866l3590P7959j13200J19264l2867l7370o9878M4298Q7710K45618M428
7676D12238k6185o9043M194J45808k07143j88243j13744k5000O8958P3126Q7238
7665A62204k7713N941N9704m1160j40842q0431j9194Q9135J55019o767L217K6394
$$ y = [598808, 664439, 752832, 819459, 856543, 1068269, 1113715, 908303, 762760, 606987, 407412, 452335, 203654, 102640, 74555, -11870, 77338, 86749, 199213, 118194, -37941, -12483, 106711, 133308, 201105, 266848, 382303, 383678, 437346, 579547, 643501, 583331, 667681, 640585, 754764, 850025, 925588, 822494, 935310, 897495, 554949, 335135, 206521, 162534, 173278, 139880, 209940, 143414, 206272, 181514, 81274, 51832, -89985, 58835, 119866, 86276, 164235, 51035, 170299, 137432, 100062, 30184, 74482, 162192, 407810, 412238, 386053, 317010, 321204, 467012, 259869, 71626, -42118, -67118, 1840, 74966, 162204, 134491, 140432, 200136, 158976, 18134, -62297, -81491, 7644, 162663, 155896, 159113, 185507]
7653A85507j01487k30388j1741o4429R4596M5929J57646R001O510J6438n9359
7642D8223j38495k8360l4948o6111J54288O8631J16185K2035j47243j20613o2831
7631a89239k6915n273L6908J04707J47900O4012k6674j42304J8513N4242n5586
7620a9709j18855N3451J48063K2583j6040J04o4298j70324j33466l8571j04703
7609d41765Q5348J66618K5121J15483J67873k9824K4756M8473Q590j68306p1099
7598f8732P9521m9361R0545J48748P4607j66342l51995N5499K7846o5269N1661
7587a73272N9510J63220J65711j58476q4654J33448k01754j76023K21624q0229
7577a30895K4201J15418Q0667K7072k42018J1870j7055p393j27614o0137K06328
$$ y = [185507, 84020, -146368, -158109, -222538, -127942, -82013, 75633, 84634, 91144, 107582, 48223, -90272, -118632, -153580, -219691, -65403, 3228, 119413, 141448, -5795, -126408, -189239, -216154, -221427, -184519, -79812, 68088, 132100, 105426, -36878, -18365, 35877, -19709, -138564, -85113, 62950, 85533, 69493, 69597, 5299, -165025, -298491, -337062, -441765, -356417, -189799, -164678, -49195, 118678, 88854, 113610, 162083, 170673, 2367, -68732, 10789, -38572, 51973, 200721, 275328, 108986, -243009, -187510, -159664, -224933, -173272, -113762, 49458, 215169, 56693, -27961, 105487, -96267, -272290, -50666, -130895, -106694, 8724, 89391, 116463, -125555, -113685, -130740, -138133, -265747, -325884, -119556]
7566a19556J87611J02090j69402J8542k0432k47154q9308n6935J8388J20360J28814
7555a26982J38991N6889j2379k03497o801J29402j21289J44424R4585N4875J82986
7544C31204j8378j90925j12978j98867j80587L0970N0278K5862K6933J38525J47206
7533D9243q2300j9839n2748j2251J30771J7979j04033J55387K5337K0797j47439
7522a9096j78357m2500K3947P960J6698J65663N5974R8275n8195k6079L2849k7318
7510D9821o5672l1319l443K6647O5092M2018k0351o5396k28854r0609O8311j3858
7498b67613J15909l9927Q9372J94401O2834o1317P962K5011j84652M4150J68433
7487A54563R9897o1058r0032j3506j22962o7990p9062j24225l3732K39026K3642
$$ y = [-119556, 68055, 170145, 743, 19285, -1147, -248301, -337609, -394544, -376156, -255796, -126982, 12009, 68898, 56519, -146978, -153779, -24377, -145666, -1242, 93343, 148218, 331204, 312826, 121901, 8923, -189944, -370531, -339561, -289283, -263421, -236488, -97963, 49243, -33057, -52896, -105644, -117895, 12876, 30855, -73178, 82209, 107546, 128343, -19096, -197453, -239953, -216006, -208046, -191348, -25685, 30289, 128564, 70369, 44290, 77139, 49821, -15851, -47170, -50613, -23966, 41126, 83144, 62793, -2603, -231457, -322066, -253755, -267613, -151704, -191631, -102259, 92142, 154976, 93659, 101621, 126632, -58020, -13870, 154563, 254460, 193402, 103370, 89864, -33098, -101088, -180150, -304375, -338107, -99081, -75439]
7476g5439K6368J04834Q2013O7244p3519l7557j64897j9016J6209Q6760O4731
7465G7731k78545L8542k4661m4408Q6161j13370k9551J78027K70524n080j3742
7454A41628L4014k9463l2568o5070j87364K5826P330j10889O9531M9899P2610
7443b4516L4182p370R3398j52711K9274K9771R0312L9100R1536N1721n7385j76391
7431D0921j98209j80451p9249J38019J32074J53375k0726n461l5903l4202L8408
7420e1404r80J5401P4682j1671J83791k3396j39249j76097P7490n9213j91794
7409c02440N5238N1355L5287J82961J57968N561k1382r9517J7454k1935O3648
7398A24198J26531o1114O6171J3333j26883j46908k06250p7749n7730M1075J45408
$$ y = [-75439, -49071, 55763, 137776, 205020, 131501, 93944, -70953, -89969, -73760, 13000, 77731, -200814, -162272, -186933, -231341, -145180, -258550, -288101, -110074, 160450, 155370, 141628, 175642, 146179, 113611, 48541, -138823, -112997, -105667, -216556, -147025, -97126, -24516, 9666, 2296, 95694, -57017, -27743, 2028, 92340, 131440, 222976, 274697, 217312, 40921, -157288, -337739, -416988, -278969, -146895, 6480, -14246, -19707, -55610, -89812, -51404, -52384, -36983, 37699, 26028, 209819, 186423, 47174, -128923, -51433, -110646, -302440, -247202, -195847, -160560, 22401, 180369, 185930, 164548, 65031, 82485, 60550, 124198, 250729, 189615, 255786, 269119, 142236, -4672, -210922, -288671, -346401, -305326, -159918]
7387a59918J66242J57345K2025Q8382N5101j79583j50892K8650K27551P26m6439
7376B09190Q9264j28419j13574j46263r2598J7775J2916M0247J35825N3468p942
7365F9889O550P257r9690r2924J30025m9248Q446l21M6206J49191j19049k61873
7353b05541Q437Q2637j62224L8342J16883O1341R6573M4987O0584L5569j08161
7342F9427m514j9205o5172M3765O1575J5332n4979K7880J6683k06204j08729R0096
7330a34045J16147K22526p7092r9930J24832J8902k6812P7250q1212k60856j8470
7319a38760P256m0432j13716K6518J30019l4779M8816O3376L0320j0514J24837
7308I2941J64060N6014J0275L7547J4429P1132o3262j07998o288q0841j06387
$$ y = [-159918, 6324, 163669, 185694, 274076, 329177, 149594, -1298, 27352, 254903, 255629, 209190, 298454, 170035, 56461, -89802, -182400, -164625, -151709, -111462, 24363, 77831, 69889, 76439, 83696, -15994, -108918, 21107, -28141, -19695, -20016, 26190, 175381, 56332, -205541, -197104, -114467, -276691, -238349, -121466, -60125, 36448, 81435, 142019, 177588, 69427, 64913, 45708, -19464, 24301, 85876, 101208, 46229, 74109, 90792, -115412, -224141, -134045, -17898, 204628, 127536, 27606, 152438, 171340, 144528, 221778, 140566, -120290, -138760, -131504, -171936, -285652, -259134, -129115, -163894, -115078, -51702, -21382, -31896, 92941, 257001, 313015, 323290, 360837, 375266, 446398, 383136, 275138, 268850, 188009, 81622]
7297H1622K8966M0031j156l550K8408P9132m7330k9965M0603j40321N8752j12308
7285B2884l3397J07121n059M1095r4331j68232L7281J4730o3906M1175J72775
7274G2136o4425O3155J04861n632J06240l3948M086M367j34116l04649j0886O2119
7262a36692p603l7463k3517J1003k7326J60203J12460P7102M6230n8500K7677
7251A43574j09375r5378J86997Q1910j28295m9076q4948L3336o5352l4738L7612
7240h3733J6448K4162J46637J71644j21455p2654j6985J6924O9352p4339m3177
7229C2824r4174J35600J29436K5968j33304j88578l9603R1331j05513Q4805J12040
7218E0832k0208K33845N8333k01919m9239j9885P3829r2053j30215J20581j18443
$$ y = [81622, 110588, 150619, 149463, 145913, 174321, 253453, 206123, 176158, 216761, 76440, 135192, 22884, -10513, 96608, 91549, 132644, 38313, -129919, -92638, -77908, -141814, -100639, 72136, 7711, 70866, 175727, 170095, 276335, 242387, 246473, 250840, 116724, -187925, -198811, -136692, -144295, -181758, -205275, -194272, -221598, -61395, 51065, 128167, 174397, 115897, 143574, 34199, -61179, 125818, 207728, 79433, 30357, -54591, -21255, -86607, -121345, -83733, -67285, -43123, 103514, 275158, 153703, 81049, 64064, 80988, 150340, 76001, 32824, -61350, 74250, 203686, 229654, 96350, -92228, -131831, -40500, -146013, -61208, 50832, 30624, 264469, 322802, 120883, 71644, 51759, 125588, 33535, -96680, 23901, -94542]
7207i4542J4182O3301j02375p2866M6789J87510K7733j25945J16125J22269k1672
7196A60509n0456N4619k0977j39371p9606j46866J07390J27382o7666m678k114
7185f1834Q6518J4887n8965J3311l1976N7152J61150L2561K652Q475n4103P324
7173A77152r2586k18597j9807J62038J44195j15558k1473O2488j12510Q0419J97742
7162B43503j15361Q2134O0901m980J55528j69363o7100o2391j07011p5560R2442
7151C2742j6130p6974j6060k8001J68764K4137n3203o9458J23356O513N4222q5776
7139F4132k75300K29950O1912r6827J25635p7063p6885P2855j58301q7767L23662
7128A06003L1308o2443J24477q2554m9447M5257k4884p0710m2242P5890O5477
$$ y = [-94542, -80360, -17059, -119434, -192300, -145511, 41999, 69732, -56213, 59912, 182181, 160509, 110053, 164672, 143695, 4324, -75282, -222148, -114758, 12624, -55042, -59720, -61834, 24684, 39571, -19394, -6083, -38059, 19093, 180243, 212804, 215456, 223931, 169828, 177152, 84566, -134031, -153838, 8200, 152395, 36837, 15364, 77852, -34658, 45761, 243503, 128142, 210276, 271177, 266197, 421725, 252362, 185262, 122871, 15860, -59700, 32742, 16612, -60362, -76422, -104423, 64341, 88478, 35275, -34183, 89173, 95686, 149908, 64132, -211168, 18782, 80694, -16133, 109502, 32439, -44446, 28409, -129892, -217659, 106003, 137311, 74868, 199345, 116791, 67344, 112601, 87717, 17007, -25235, 50655, 116132]
7117A16132m1006M423j51562P8605J16458m8969n5047j65191L3367J46921J70102
7106B04233k4342P9549M33j90238n8692J7468q1467J1350N6498R0517N095p5797
7094C4607J8665p2185j6568L3282m845J94048J310j55277M4135K65436j39300
7083B03308j92903j3408o9173j2303P9881K79574j1830j82399q7205J3428m2553
7072c5583q8333o918J82905K06033P1068P9347q0244j55778K1052j27196m2166
7061B4187J9694L4121P998j21701n8636J37281L0657Q3668j24238k142P8594Q848
7049A18331J94759j35771p847J69296j1858p4055j54801K7464L1050l2728k3962
7038I9878j1530L1923m7901O3658m1181N5548p3117r931J12081J01113P7406j82989
$$ y = [116132, 75126, 79549, -72013, 6592, 123050, 74081, 19034, -146157, -112790, 34131, 204233, 179891, 259440, 259873, 69635, 10943, 28411, -53056, -41706, 14792, 105309, 110404, 34607, 53272, -18913, -35481, -2199, -7044, 187004, 188314, 33037, 77172, 342608, 203308, 10405, -3003, -72176, -84479, -4598, 274976, 263146, 80747, -6458, 6970, -35583, -123916, -130834, 52071, 258104, 329172, 408519, 328275, 172497, 193549, 66353, 24187, 43881, 78002, 86000, -35701, -94337, 42944, 73601, 157269, 33031, 30889, 109483, 118331, 313090, 177319, 169472, 338768, 326910, 252855, 98054, 125518, 156568, 123840, 99878, 88348, 120271, 72370, 136028, 94847, 150395, 77278, 67347, 179428, 280541, 357947, 174958]
7026A74958j2970M1883j88924l7712O8906q1917P705J40255L1303j07160r5312
7015e8985K13491m0250o6762J1785m9189M7147J56136K5028R013p6792j08434
7004F2188J84863K738j37114r1149l846n7667O6255L1912L4379O7348o5377R0235
6992A84765J11834j26489n1454l0861j21896O7674j0147N5112P067j0792j22336
6981d7523J0834P1811o3721K03277N4509k3082J23957p0766p0043m1290j21904
6970B6059j74545K967K11561n4970J42070O3489O7237j39154q986P701N9390P833
6958B10652j69580J32327J39520m6457j02005r3852m3059n8066O3724L9406p464
6947F5146R3260N2209j21023L3007M6699q1542l9116J26193j0132p2521J30396
$$ y = [174958, 161988, 203871, 14947, -22765, 46141, -35776, -28071, 112184, 143487, 36327, -58985, 154506, 114256, 47494, 59279, 10090, 57237, 213373, 238401, 247414, 170622, 62188, 247051, 249789, 112675, 21526, 17680, -39987, 26268, 58180, 92559, 159907, 94530, 184765, 296599, 170110, 118656, 87795, -34101, 33573, 23426, 78538, 85605, 74813, -47523, -36689, 35122, -28599, 174678, 229187, 206105, 330062, 259296, 189253, 147963, 26059, -148486, -145519, 66042, 11072, 153142, 216631, 283868, 144714, 135728, 143429, 202819, 210652, 41072, 173399, 312919, 266462, 164457, 70605, 27546, -30520, 33204, 72610, 65146, 158406, 210615, 89592, 122599, 169298, 87756, 48640, 174833, 164701, 92180, 222576]
6936B22576l4271j24587M6520N6275n6697N6682j27157o9440J61648k2998J25575
6925B34126L8944j2143r9746P8084j04316k2818P5666r9303M8995J02879j05751
6914A34617m8179N3655K412N7153k74703J23658J89840K102N8574j02737p2828
6903A23564j50315P8852K67521Q2844j35591j18317J6438L0638k03046m1494L24175
6892B75269J42601k3106l8186P0625q8612P8636q2446p189m4669p5232k4523j6071
6880A67097j55370J17213M6469j29072O0616M5022M8028J5948j06321o881P6104
6869A78853M4983q2440K0165l4749J2533N4891j20869l2621J06041P4829K7050
6858B48666j29347J0442N4744J70541j25763M4800p7691P8106k8143k6549j73660
$$ y = [222576, 188305, 63718, 110238, 166513, 109816, 166498, 39341, -30099, 131549, 108551, 234126, 273070, 260927, 161181, 239265, 134949, 112131, 187797, 88494, 137489, 240368, 134617, 86438, 140093, 142505, 199658, -75045, 48613, 238453, 240555, 299129, 196392, 123564, -26751, 52101, 319622, 402466, 266875, 148558, 164996, 195634, -7412, -48906, 275269, 417870, 394764, 356578, 427203, 338591, 417227, 334781, 327592, 282923, 207691, 183168, 167097, 11727, 128940, 175409, 46337, 106953, 151975, 200003, 215951, 109630, 102749, 178853, 223836, 141396, 161561, 126812, 139345, 194236, 73367, 40746, 146787, 221616, 248666, 119319, 129761, 184505, 355046, 229283, 274083, 196392, 274498, 246355, 219806, 46146]
6847D6146l8290Q8534O7551J16004j17343p7932m4135p118m5478O550J7877J9817
6835C2183L0601J83699N8179j35345j5231Q6560l3936q1182o7935J79852q021
6824B29424J29568R3109j29116j47438N9080j9112O4546q0666J34361J2605q0457
6813B65904Q4047l2858j31826q6629o3996M7349M6251R4994L6912Q2672N5353
6802C98173o8200l1303j02639j8787J05122J1794P8461q3348r7956P535M0699
6791B39551j51805j1196M0224M5211p0404J82261L7289q593J73937j0534j02354
6780C63587K7479o4772j32337J31536R3391q8224j21545P9558j6452o4504p4879
6769A32838m2252J3227J719R6701k0036m24K8287J21219P9334j09884P3443j26256
$$ y = [46146, 7856, 96390, 163941, 279945, 162602, 84670, 40535, 33417, -12061, -5511, 12366, 32183, 62784, 246483, 304662, 169317, 154086, 240646, 206710, 125528, 57593, 237445, 229424, 358992, 452101, 322985, 175547, 234627, 215515, 280061, 199395, 333756, 346361, 265904, 349951, 317093, 185267, 98638, 34642, 81991, 128242, 223236, 260148, 342820, 398173, 329973, 298670, 196031, 177244, 282366, 294160, 372621, 289273, 191317, 198852, 239551, 87746, 76550, 116774, 161985, 91581, 273842, 311131, 302538, 476475, 465941, 363587, 391066, 326294, 193957, 325493, 418884, 330660, 209115, 288673, 272221, 207717, 132838, 90586, 103813, 105532, 202233, 182197, 181773, 210060, 331279, 410613, 300729, 374172, 247916]
6757B47916L7405j6544M7318P915j15177Q513k14722q0767J20836R1995J66895
6746C01583M8441M2738j10190J7749L41761o3232n8763m8071o2078r5265k002
6735C12671p648M9774n2771P659l9502j11775P8092j8320J42045O7516J3235J09595
6723E50571l6166j05322j50378P9755P360j17939r9227p1202J35733J49266J17388
6712D59839K5294j25395j79089J0619J31706J86295j06845J74939K37423q7881
6702G26905j90566j02738o2985j69452O6304O3118j2246J89082l4274k7832k5876
6691D19440m8814m3657q591M2659J33351R812R6455M521j3971k15326n7833j05245
6679B12801m0973q0364Q2921p265J24818O111m00J76474k2713p7751M4713J23244
$$ y = [247916, 285321, 268777, 316095, 324010, 208833, 217346, 2624, -78143, 42693, 134688, 301583, 350024, 392762, 282572, 300321, 642082, 578850, 520087, 472016, 409938, 314673, 312671, 305023, 354797, 302026, 309685, 270183, 158408, 236500, 218180, 360225, 427741, 440976, 550571, 514405, 409083, 258705, 338460, 345820, 227881, 128654, 57452, 193185, 342451, 459839, 485133, 359738, 180649, 191268, 322974, 509269, 402424, 577363, 814786, 726905, 536339, 433601, 370616, 201164, 267468, 330586, 318340, 507422, 473148, 445316, 419440, 370626, 326969, 318378, 361037, 494388, 504200, 600655, 605176, 591205, 375879, 318046, 212801, 171828, 91464, 174385, 167120, 291938, 298049, 297649, 474123, 451410, 373659, 418372, 541616]
6667E41616j9898Q7080r2026M9831l3924k31357p8541q772q4979M9870J64767
6656C43667Q0459R3848L4125K9854J02478J351j74976q5723l5891N9354j4454
6645D34092n2075o0658j11132L2143n3417l1711J56776J56198P6489O0050O0095
6634F66850j0975j78015M0954P0926j76398j91509P1323l1707K15297Q4511j29104
6623D32153o7813M5594k6481j33881o7695J37498P0870L9572l8255J22395R32
6612E14889r3989q5727N6217P6372j10986J76004J79178j02126j17027N7202l3139
6601E16868j59676P9125R630k5911J02855l69j34308J05498m8524j06165m7820
6590B91203p8901K0716K3936R1299J40362o295p3098R9293n1059j42527j12042
$$ y = [541616, 521718, 608798, 516772, 566603, 532679, 301322, 222781, 214009, 129030, 178900, 343667, 424126, 517974, 552099, 581953, 684431, 685782, 510806, 425083, 389192, 448546, 434092, 382017, 321359, 210227, 242370, 188953, 157242, 314018, 470216, 546705, 606755, 666850, 655875, 477860, 518814, 589740, 413342, 221833, 293156, 261449, 476746, 561257, 432153, 364340, 409934, 383453, 249572, 181877, 319375, 390245, 429817, 391562, 513957, 514889, 420900, 335173, 391390, 467762, 356776, 532780, 711958, 609832, 492805, 550007, 516868, 357192, 436317, 445947, 420036, 522891, 522522, 388214, 493712, 445188, 339023, 291203, 212302, 233018, 256954, 348253, 488615, 482320, 409222, 508515, 457456, 314929, 202887]
6579B02887N2795K16947O6665R7365j6081r9087r4192N0055M3712k67103j81344
6568G2619K51539M784J94218K7685m3481M7560m8230j8071j44391J72739J6126
6557E33097j6000J09750J10904j41617k01495j73q8969J00058J07634k4476q2082
6546D06631L819L1017o8053J40792n9977J42938j55228n7784L44107O7717j54822
6535F41157P851n0649q6112j54825o9873M3197M1483k8526J50980J21936J68766
6524G85385N723j10117p2949P5663j0936R7678L1535q4042L221L9173l0510k05391
6512E24433P580j37867J0844J17992J29472n832P1339k6151j18807j04672n3197
6501D15134L2974J04950J06065N7159J03820J5906j63363j99674O94Q3786j45989
$$ y = [202887, 255682, 472629, 539294, 636659, 620578, 521491, 427299, 477354, 521066, 253963, 72619, 324158, 328942, 523160, 550845, 507364, 554924, 506694, 488623, 344232, 516971, 533097, 517097, 626847, 737751, 596134, 394639, 394466, 305497, 405555, 513189, 488713, 406631, 410450, 441467, 373414, 514206, 454229, 597167, 441939, 384155, 728262, 795979, 641157, 649008, 598359, 512247, 357422, 287549, 330746, 372229, 343703, 494683, 616619, 785385, 791108, 680991, 608042, 683705, 672769, 770447, 801982, 717940, 721161, 760334, 729824, 524433, 532013, 394146, 404990, 522982, 652454, 646622, 717961, 691810, 573003, 468331, 415134, 448108, 553058, 659123, 716282, 820102, 836008, 672645, 472971, 473665, 557451, 411462]
6490D11462q491J27734l5254L9793r1140j9393N1641q0999j49257m9185J63182
6479C60093R932J14276J35305j18655k5384J18303n9328m5494m6430J1361K85710
6468G39689R1646p9166K3704l8316r2640q1295q9212L0053m8639o313k3868n751
6456D19892M353j0888m7475J49860J69566k4273K7684P4224p9749M8282j37061
6445E94415n451J4682k7463n276r6280L7237N8883j2641J5142Q078j5630P9371
6433F45067l8883k7999q9407o1686J18754J24981l8943L8435o3559M4155J33002
6422G83917o6530J7418J60671j42073R9647p6264p7705L3140J7496j997j16266
6411F31454J01675R4193j66486n597L7196j1508J17027k6337O1832m9640l7217
$$ y = [411462, 402971, 530705, 495451, 535244, 444104, 424711, 476352, 395353, 246096, 196911, 360093, 370025, 484301, 619606, 500951, 475567, 593870, 534542, 489048, 442618, 453979, 739689, 831335, 752169, 775873, 737557, 644917, 563622, 474410, 504463, 455824, 449511, 425643, 419892, 424245, 413357, 365882, 515742, 685308, 661035, 688719, 762943, 683194, 731476, 594415, 588964, 603646, 576183, 570907, 474627, 511864, 570747, 558106, 573248, 581326, 565696, 645067, 606184, 578185, 488778, 427092, 545846, 670827, 631884, 670319, 606760, 650915, 783917, 717387, 734805, 895476, 753403, 853050, 776786, 699081, 732221, 749717, 747720, 631454, 733129, 827322, 660836, 655239, 692435, 680927, 797954, 771617, 833449, 783809, 746592]
6400G46592J725J877m8103K5296k3191j05441J77667p1332N3901J83722K4498
6389I67211p5603J07468j5098m8216l5233r4812R835n7775M0150K9373J01625
6378I28925j47120j7941J84120M2748n8466n5645P360l4554J89464l3117j31140
6367H74634p9415K8803J47701L1378r1214j5624M3637K0694k925L8938j25981
6356H70626N2308j6233l5913J36944M8753J01892O0997n639J9425J50154L3532
6345A416846r6705j34646o1679J65666J11559p0371P3143R2549L8026m7342j04806
6334A382240j90568J34128J30743L7015Q2100K0850j35518P8512J8837j0409K0168
6323A568098J12250O2865N7842K06264R2615j19564L3395J21226J89793K47564
$$ y = [746592, 748317, 750194, 702091, 727387, 704196, 598755, 776422, 705090, 758991, 942713, 967211, 891608, 999076, 983978, 935762, 900529, 805717, 815552, 757777, 797927, 827300, 928925, 781805, 763864, 947984, 990732, 932266, 876621, 883981, 849427, 1038891, 1005774, 874634, 795219, 824022, 971723, 1003101, 911887, 896263, 939900, 960594, 957669, 996607, 870626, 922934, 906701, 870788, 1007732, 1056485, 1158377, 1219374, 1213735, 1233160, 1383314, 1416846, 1320141, 1185495, 1123816, 1289482, 1401041, 1330670, 1403813, 1496362, 1534388, 1487046, 1382240, 1191672, 1325800, 1456543, 1493558, 1575658, 1596508, 1460990, 1539502, 1558339, 1547930, 1568098, 1680348, 1743213, 1801055, 2007319, 2099934, 1980370, 2013765, 2134991, 2324784, 2572348]
6313B572348N4562L03023L04437K00097O39157L70142L52364K15895J34987K12303
6303E359315j06394k05564k3028k80241m87249l68751l71812k34250j49637J894
6293C134283j6744k8291r7692P0783R5689K3712l5279L7758J71960R1275L44813
6282C792267O63728L61109N43699Q03862J158879J672646J660335J653271J147201
6273A3456997K63548m3629j01541o07177p84572j280370j561922j216232q97457
6264G227645q11893o96605l88229m44371l35469k42483m5195r8490M9180k1128
6254D192962l3648J79711J45542M1647K38823L64625O37223O84770R79768J473640
6244H905063J699353J746137J157513L92330L0659k07044l25100q15844j247411
$$ y = [2572348, 2626910, 2929933, 3234370, 3434467, 4073624, 4443766, 4796130, 5012025, 5147012, 5359315, 5252921, 5047357, 5024329, 4744088, 4256839, 3888088, 3516276, 3282026, 3132389, 3134283, 3117539, 3089248, 2991556, 3062339, 3158028, 3181740, 3146461, 3184219, 3356179, 3447454, 3792267, 4455995, 4817104, 5360803, 6164665, 7323544, 8996190, 10656525, 12309796, 13456997, 13720545, 13676916, 13575375, 12968198, 12183626, 10903256, 9341334, 8125102, 7227645, 6415752, 5719147, 5330918, 4886547, 4551078, 4308595, 4263400, 4164910, 4214090, 4192962, 4159314, 4339025, 4484567, 4526214, 4765037, 5129662, 5766885, 6451655, 7431423, 8905063, 10604416, 12350553, 13508066, 13900396, 13931055, 13724011, 13398911, 12583067, 11335656]
6235A1335656j624458j391400j042471q89637p08827p32146l35523l28617k03967
6226D078610n9412k23185k18311j39475k43966q3988J32543J55387Q1025J03883
6216C583111J94370n086J53351M71186L59745M71308L92454J82721k2546Q1751
6206E862365q3751k02207l71828n20452m00607l91594j99717k06391j62069k40222
6196C083527j52421j50954m552j35028j17500j06248J07592J03082j13239J54516
6186B668775P6700P1120J94425J65220L94242M21663Q6118J72780J39699k1310
6176D369432J1764j32697l80469k35350j87636l17531k08677k03639j57523j44940
6166B412734j08038r2422o8194p0789l8902j02949q2999j02324r7563J16668j8038
$$ y = [11335656, 9711198, 8319798, 7277327, 6387690, 5678863, 4946717, 4611194, 4282577, 4078610, 4019198, 3796013, 3577702, 3438227, 3194261, 3110273, 3242816, 3398203, 3479228, 3583111, 3777481, 3772395, 3925746, 4396932, 4756677, 5227985, 5620439, 5803160, 5780614, 5862365, 5778614, 5576407, 5204579, 4684127, 4283520, 3891926, 3692209, 3485818, 3323749, 3083527, 2931106, 2780152, 2775600, 2640572, 2523072, 2416824, 2524416, 2627498, 2514259, 2668775, 2745475, 2816595, 3011020, 3176240, 3570482, 3992145, 4078263, 4251043, 4390742, 4369432, 4381196, 4248499, 3868030, 3632680, 3445044, 3127513, 2918836, 2715197, 2557674, 2412734, 2304696, 2212274, 2144080, 2073291, 2034389, 1931440, 1848441, 1746117, 1648554, 1765222, 1747184]
6155A747184J31397j3685r1697J2424j5100K49767J49946k01083k2594L6755N694
6144A989008o6022J2401J15804J79964p8340k1981J49407n7618j85291M4217M8881
6133B130430R5340j93144K4406j8467q7631J79259M9184j22243k4159o0504j9755
6122A952716p7608o5990Q3719R1897N0409P8401j8182P5907R3444K54674N04910
6111C024297K61763R6660J71554j08356j40941J10820j43435j75329k86038k74279
6101B536716j77119j26996m9131o9096k7953Q1621n8140m491J13350j77178L010
6090B044593J86440n9269M5442o4112n7325J15301M7807k65961M5582J54735L66655
6079B559888L58622K00090J32307O5704o3646K122j06725J1335j53881k40960
$$ y = [1747184, 1878581, 1864896, 1773199, 1785623, 1770523, 2020290, 2170236, 1969153, 1946559, 1983314, 1989008, 1922986, 1935387, 2051191, 2231155, 2152815, 2130834, 2280241, 2222623, 2037332, 2081549, 2130430, 2225770, 2032626, 2057032, 2038565, 1950934, 2130193, 2179377, 2057134, 2032975, 1972471, 1952716, 1875108, 1809118, 1892837, 1984734, 2035143, 2113544, 2095362, 2171269, 2264713, 2519387, 3024297, 3286060, 3382720, 3554274, 3445918, 3304977, 3415797, 3272362, 3097033, 2810995, 2536716, 2359597, 2232601, 2183470, 2114374, 2086421, 2168042, 2109902, 2105411, 2218761, 2041583, 2044593, 2231033, 2171764, 2217206, 2153094, 2095769, 2211070, 2258877, 1992916, 2038498, 2193233, 2559888, 2918510, 3118600, 3250907, 3316611, 3252965, 3255087, 3148362, 3159697, 3005816, 2764856]
6069B764856j30734L1106J5793k15891j43634m7088k64477p8830l5278j88543
6059A707280J40707K35617j2373J58553j9014k40259j54888k3908K7123J59992
6049A978830P308J17367K480K9103J09444P351M2819r3716L7826J78131k4763
6038B392180P4348L2145j79252l4288Q5051J49699N8608r8523q5873O1459R2120
6027B547674N7792k1792j55452J4777O9628M1677M6246k8095J34092K0642o692
6016B720497R4732J8090q8353N8842R4412J09846L4454k7702o5454M9038M732
6005C003134J05872J20486J94692K12729K26509J15070J57113J81558K84028P447
5995D608638L3596n9240n4735j76579k39340j90726R0227p3369J7799J85704n8864
$$ y = [2764856, 2634122, 2665228, 2681021, 2465130, 2321496, 2274408, 2009931, 1931101, 1895823, 1707280, 1847987, 2083604, 2071231, 2229784, 2210770, 1970511, 1815623, 1791715, 1818838, 1978830, 1986138, 2103505, 2105985, 2135088, 2244532, 2251883, 2294702, 2200986, 2238812, 2416943, 2392180, 2466528, 2498673, 2319421, 2285133, 2370184, 2519883, 2578491, 2479968, 2394095, 2455554, 2547674, 2605466, 2583674, 2428222, 2442999, 2512627, 2554304, 2600550, 2572455, 2706547, 2727189, 2720497, 2815229, 2833319, 2744966, 2803808, 2898220, 3008066, 3042520, 3014818, 2949364, 2998402, 3003134, 3109006, 3229492, 3424184, 3636913, 3863422, 3978492, 4135605, 4317163, 4601191, 4608638, 4642234, 4582994, 4528259, 4351680, 4112340, 3921614, 4011841, 3938472, 3956271, 4141975, 4083111]
5984D083111Q2139J76506K4171N6004q388M084k10202o2714k409l17R3610j36549
5972D099046j19401N4674O7416k3243J9310Q1693o0346J24916O2286n616m9609
5961D251126Q0531J89893q7583J61018K10037L3754J62804P3609k3844J50628
5951E201973o3955n3327L1969O2729J23647P954L762m4057P1221L7928J33404
5940E513248O6961K24048P9034O498R6615o2604P0193o9683j76193L7046J92598
5929E977761m9907J49303J35565J00703L58795J25763R0755K95972J20088L59708
5919G664506K17718J62416J75555L53906K48138K83941J38086L39737L53077J46171
5909A0083251r7826M05998J92682J87710J60684J55844K65085M03020M61336L26401
$$ y = [4083111, 4165250, 4341756, 4365927, 4421931, 4413543, 4417627, 4207425, 4144711, 4142302, 4141985, 4235595, 4099046, 3979645, 4034319, 4101735, 4078492, 4097802, 4179495, 4119149, 4244065, 4306351, 4300735, 4251126, 4331657, 4521550, 4433967, 4594985, 4805022, 4838776, 5001580, 5075189, 5051345, 5201973, 5138018, 5084691, 5116660, 5179389, 5303036, 5310990, 5314752, 5270695, 5341916, 5379844, 5513248, 5580209, 5804257, 5883291, 5889789, 5986404, 5923800, 5993993, 5924310, 5748117, 5785163, 5977761, 5927854, 6077157, 6212722, 6313425, 6672220, 6797983, 6888738, 7184710, 7304798, 7664506, 7882224, 8044640, 8220195, 8574101, 8822239, 9106180, 9244266, 9584003, 9937080, 10083251, 9985425, 10391423, 10584105, 10771815, 10932499, 11088343, 11353428, 11756448, 12217784, 12544185]
5899A2544185M72084M59665J60206K62738J28069R9100K11533J74345K81765M09963
5889A5203653K92013M92189L66891M13448L93336L34279M53700K87748N75740
5880A8812997N74664M74088O00569N62692N17150P41185Q03210J116518J250591
5871B5453664J229889J287888J243273J557498J809895K040822K265868K736400
5863C9625197K990096L113085L677213M205588N013635O017426P234476Q746694
5855H0623410J0628941J3074506J6698788K2145376L1024154M5330608O5158194
5848B84683977Q0684050P4555107M4121613J5877721J84579r709340j8412670
5841D71985037l4209160n4936485o3468258n6041747m5067245l6840491k9162116
$$ y = [12544185, 13016269, 13475934, 13636140, 13898878, 14026947, 14126047, 14337580, 14511925, 14793690, 15203653, 15495666, 15987855, 16354746, 16768194, 17161530, 17495809, 17949509, 18237257, 18812997, 19387661, 19861749, 20462318, 21025010, 21542160, 22283345, 23086555, 24203073, 25453664, 26683553, 27971441, 29214714, 30772212, 32582107, 34622929, 36888797, 39625197, 42615293, 45728378, 49405591, 53611179, 58624814, 64642240, 71876716, 80623410, 91252351, 104326857, 121025645, 143171021, 174195175, 219525783, 284683977, 365368027, 439923134, 484044747, 499922468, 500107047, 490397707, 471985037, 437775877, 382839392, 319371134, 263329387, 218262142, 181421651, 152259535]
5834A52259535k1798833j6668967j3503687j1262188r749231q334755p338228
5827F3603646o342412n683743m774790l888306l413637k628943k163868k068154
5819C2639793j820370j549820j472411j382641j163314j148330j255581j108369
5811B1738957r96243j016500p62924n23135m90459p09814o57545m54736m30634
5802A5696967p06012o18815k77219n48423l03961l02617m51115l68453l83377
5793A1736975m38556n06247k34916L8307j70267l21224j41719J71947N6702J2898
5783A0203900j62669j06529j70378k27139k6380J08268k8867l9096j09280R5341
5773I537171J08676j28161Q0173p2360m2225J78572m8312J67299l1948n5273M9335
$$ y = [152259535, 130460702, 113791735, 100288048, 89025860, 79276629, 70941874, 63603646, 57261234, 51577491, 46802701, 42914395, 39500758, 36871815, 34707947, 32639793, 30819423, 29269603, 27797192, 26414551, 25251237, 24102907, 22847326, 21738957, 20742714, 19726214, 18963290, 18440155, 17949696, 17239882, 16582337, 16127601, 15696967, 14990955, 14372140, 14094921, 13546498, 13242537, 12939920, 12488805, 12120352, 11736975, 11298419, 10792172, 10557256, 10595563, 10425296, 10104072, 9962353, 10134300, 10191002, 10203900, 10041231, 9934702, 9764324, 9537185, 9510805, 9619073, 9590206, 9551110, 9441830, 9537171, 9645847, 9517686, 9597859, 9525499, 9483274, 9661846, 9613534, 9780833, 9748885, 9693612, 9742947]
5762I742947O9864J04269L15216J69589L87949N17485M30881Q54959J096290J627955
5752A5317404K722253M510840N992927N548947K500200K45369k73859m98180q53107
5743C5212794k129658m168656m627891l479607k623036k230813j707545j262112
5735A2983476r67528o70787l18774m32276l15781l83254l61375j16695k68699
5726I148307J9448j3073l9220k41462J8811O0933R0910j48956k9969j7554K552
5715H850727P3900n9488o8021Q1295J2082P0865J9340m2731K26154N3249J84872
5704I402244J67357J63010L14247K65526J87330K19080L59703L30694N72236M50486
5694A2431913N55157O37200O65592P97949Q34796J040648J128068J126045J257187
$$ y = [9742947, 9812811, 9917080, 10232296, 10401885, 10789834, 11307319, 11738200, 12593159, 13689449, 15317404, 18039657, 22550497, 28543424, 34092371, 36592571, 36837940, 36564081, 36065901, 35212794, 33083136, 28914480, 24286589, 20806982, 18183946, 15953133, 14245588, 12983476, 12015948, 11345161, 11026387, 10594111, 10278330, 9895076, 9533701, 9417006, 9148307, 9167755, 9154682, 9115462, 8874000, 8892811, 8953744, 9044654, 8895698, 8865729, 8848175, 8850727, 8924627, 8865139, 8797118, 8878413, 8890495, 8961360, 8980700, 8937969, 9164123, 9217372, 9402244, 9569601, 9732611, 10046858, 10312384, 10499714, 10718794, 11078497, 11409191, 11981427, 12431913, 12987070, 13624270, 14289862, 15087811, 15922607, 16963255, 18091323, 19217368, 20474555]
5685B0474555J520128J877971K178234K592617L108948M032119M815096O042069
5677D6641737P685096J0439601J5097719K2579083L1138970L4981185K7097305
5670A95660696J2429749L136566j950883n410798j0038329j8689125k6063370
5663A49074506k6098254k1731043j7209814j4133363j0757865p977858o315157
5656D4851152n282641m317279l823801l185709k990119k458488k233384j801725
5648A8758006j403619j233485j000626q94566r05821o35687m64635n76405n62193
5639A1080969m81271m20315m22917n12017m07328m35667l85899l75913k92142
5630G347500k10913j81734k73505m17866k70386k87378k05042k10846k5531j34752
$$ y = [20474555, 21994683, 23872654, 26050888, 28643505, 31752453, 35784572, 40599668, 46641737, 54326833, 64766434, 79864153, 102443236, 133582206, 168563391, 195660696, 208090445, 211227011, 209276128, 203865330, 193827001, 175137876, 149074506, 122976252, 101245209, 84035395, 69902032, 59144167, 51166309, 44851152, 39568511, 35251232, 31427431, 28241722, 25251603, 22793115, 20559731, 18758006, 17354387, 16120902, 15120276, 14225710, 13319889, 12684202, 12219567, 11643162, 11080969, 10599698, 10179383, 9756466, 9244449, 8837121, 8401454, 8015555, 7639642, 7347500, 7136587, 6954853, 6681348, 6263482, 5993096, 5705718, 5500676, 5289830, 5264299, 5129547]
5620E129547j73557j34966k48642k66094p5836k08673j36163P392o1866L134r8141
5609C736135K9958O2861j58717j86517j58548j01276o8170n9665m0045r7660j30217
5598B828139p8365q7711p465j45508N0118L8752K4418o8582P4380j02124j91192
5587B334860J44967j39678n8617p6647o6546m8035j25501o0075r3205j5953q6203
5576A709367k153r169j4382p9998n1783K0746k7270Q3559J10850j52589p3601
5565A513577j46278o3081o3082l986p7100K8995p3821O0155O5368j07866m22q1394
5553A051065j40896J28892J29887K11515P2954j14169J8486j7020J8895o9627
5543A289982j28547l3732N4125n8896P9847J11654k83242m4870o3566m6672j803
$$ y = [5129547, 4955990, 4821024, 4572382, 4306288, 4230452, 4021779, 3885616, 3893008, 3831142, 3834276, 3736135, 3766093, 3828954, 3670237, 3483720, 3325172, 3223896, 3155726, 3096061, 3056016, 2958356, 2828139, 2749774, 2662063, 2654598, 2509090, 2559208, 2597960, 2622378, 2553796, 2628176, 2526052, 2334860, 2479827, 2340149, 2281532, 2204885, 2138339, 2090304, 1964803, 1904728, 1811523, 1795570, 1709367, 1707214, 1698045, 1683663, 1603665, 1551882, 1572628, 1545358, 1628917, 1739767, 1587178, 1513577, 1367299, 1304218, 1241136, 1237150, 1160050, 1189045, 1115224, 1175379, 1240747, 1132881, 1132459, 1051065, 910169, 1039061, 1168948, 1380463, 1453417, 1339248, 1357734, 1340714, 1359609, 1289982, 1161435, 1127703, 1181828, 1122932, 1202779, 1314433, 1031191, 986321, 922755, 876083, 874280]
5532H74280J03328L4907N4859R7962R12j9153j1735p8421p0059l4889O2157L5841
5520A049989J07379J52465J75578o7796J03731O4167M9120K90108K73992L19873
5510B518606L86424L64633J62913k90r3811r6010j21805j85346m63776j97208
5500B274330l51687K2683j25707j38590j59466j59347J8456J3969l7598j57855
5490A199188j21072J62611K944o8426n7297K9388j33135M2184j54256J03100J23388
5479A128617J30347M3457j34693l22748q535M1336o5511J7803J09462J98849J257
5468A139641j10813j70201P6161N3937p4572L544n722j6330J56424J26982m8549
5457A130502k5943m1492j74352O7881M8245l4881J78660J53466L1309J5840j73709
$$ y = [874280, 977608, 1012515, 1067374, 1165336, 1166248, 1147095, 1135360, 1056939, 986880, 951991, 1014148, 1049989, 1157368, 1309833, 1485411, 1417615, 1521346, 1585513, 1634633, 1924741, 2198733, 2518606, 2905030, 3269663, 3432576, 3432286, 3338475, 3242465, 3120660, 2935314, 2471538, 2274330, 1922643, 1945326, 1819619, 1681029, 1521563, 1362216, 1380672, 1394641, 1357043, 1199188, 1078116, 1240727, 1243671, 1175245, 1117948, 1147336, 1014201, 1056385, 902129, 1005229, 1128617, 1258964, 1302421, 1167728, 844980, 836445, 877781, 812270, 830073, 939535, 1138384, 1139641, 1028828, 858627, 934788, 988725, 914153, 917697, 911975, 895645, 1052069, 1179051, 1130502, 1104559, 1063067, 888715, 956596, 1004841, 969960, 1148620, 1302086, 1333395, 1349235, 1175526]
5446A175526r9953M2475J6495J02741K419o3156q52J08633O6349j47241j41890
5435A061546j32219J0795P1701L4795r9054J44363M4813K8563M5554j92895n3193
5424I64769K4142j36119J17166J78941q7897o7598P8644M8644l5908L3804M8048
5413A166636n8286p5508N5429R7608Q869P6535j08785n9567r4146l3816L1970
5402A006939j18692J01328J57968J95531J38610j39068l8372j45108k49935N2190
5392I61391m4949M4966J41089j9920J49614P7750l8596k51318r7194n1824M4084
5381I15093K38950O0513r3935M2839k9545r048k5467q7840l7325l6732J91816
5370A129319J10294J38757J28041n5371j20040n7055p7523K6009P2745Q5967q5904
$$ y = [1175526, 1075573, 1118048, 1134543, 1237284, 1239703, 1176547, 1175695, 1284328, 1350677, 1203436, 1061546, 929327, 940122, 1011823, 1046618, 947564, 1091927, 1136740, 1165303, 1210857, 1017962, 964769, 988911, 852792, 969958, 1148899, 1061002, 993404, 1072048, 1120692, 1084784, 1118588, 1166636, 1108350, 1032842, 1088271, 1185879, 1194748, 1271283, 1162498, 1102931, 1008785, 974969, 1006939, 888247, 989575, 1147543, 1343074, 1481684, 1342616, 1304244, 1159136, 909201, 961391, 916442, 961408, 1102497, 1082577, 1232191, 1309941, 1271345, 1020027, 922833, 871009, 915093, 1154043, 1214556, 1120621, 1163460, 1133915, 1124867, 1099400, 1011560, 974235, 937503, 1129319, 1239613, 1378370, 1506411, 1451040, 1331000, 1273945, 1196422, 1222431, 1295176, 1381143, 1295239]
5359A295239l0309M28127k8024j75993j40515K176J38171J61000M5512K07590
5349A902974O5684M5660l0847p6930k16626L0043K5148Q6896L10526L22349K48046
5338B712923K5215N5938k42237j74274N724L3746K6103p9168r483M90j77412O7938
5326B245503j47864l10824j374o3943k9724J86437J13408P6377n8562n5650O910
5315A960694q3513p7013k1578l8647J81594J45145J00829P9811l2790j39514r1019
5304A983999l4305r8812K0088K75687K17109J44868k1622j47850k01887m6269
5294B091006p5797J95417J66725J4814K7508K02009j54804j33266K7844J6645
5284B378101p9643J9764m970P3165J29939L07129L5809k47004k03798q9853j5730
$$ y = [1295239, 1264930, 1693057, 1665033, 1489040, 1348525, 1350701, 1488872, 1649872, 1695384, 1902974, 1968658, 2014318, 1983471, 1906541, 1689915, 1719958, 1745106, 1832002, 2142528, 2464877, 2712923, 2738138, 2794076, 2551839, 2377565, 2383289, 2417035, 2443138, 2363970, 2354487, 2354977, 2177565, 2245503, 2097639, 1786815, 1785441, 1721498, 1691774, 1878211, 1991619, 2067996, 2009434, 1953784, 1960694, 1877181, 1800168, 1778590, 1739943, 1921537, 2066682, 2167511, 2247322, 2214532, 2075018, 1983999, 1949694, 1850882, 1870970, 2146657, 2363766, 2508634, 2487012, 2339162, 2137275, 2091006, 2015209, 2210626, 2377351, 2392165, 2419673, 2621682, 2466878, 2333612, 2361456, 2378101, 2298458, 2318222, 2313252, 2386417, 2516356, 2823485, 2859294, 2612290, 2408492, 2318639, 2302909]
5273B302909p3824J22366J88397K93160R0534P3027j7162j54141q3722j54107
5263B587437j46913Q4381L09733J42147R514M1818o4375m0752j28063l3569J08872
5252B870230N3987J31446Q5243J46766O2303o6219O1024l6966j78437o7607K87637
5241C349407K7160J07058J14030O194o4107N253P9288r6810P5845O4718o8890
5230C599146K93133J34919J4728J03793j63661m4012n5908m840J19480P2666L0711
5219D100155K3271O02K9187P3870J03969l2358O9410M0462J03221L22674K33761
5208E068224M8721r678K3297j10760O3146R4543Q5747J93623K70919J79438M754
5197E911974n2174m9626q5361O2498j54187Q0919N3896K86746J51079P3490j27320
$$ y = [2302909, 2229085, 2351451, 2539848, 2833008, 2923542, 2996569, 2979407, 2825266, 2741544, 2587437, 2440524, 2524905, 2834638, 2976785, 2986299, 3028117, 2963742, 2922990, 2794927, 2761358, 2870230, 2924217, 3055663, 3140906, 3287672, 3349975, 3283756, 3344780, 3307814, 3129377, 3061770, 3349407, 3376567, 3483625, 3597655, 3603849, 3539742, 3544995, 3624283, 3527473, 3603318, 3668036, 3599146, 3892279, 4027198, 4041926, 4145719, 3982058, 3938046, 3882138, 3877298, 3996778, 4069444, 4100155, 4123426, 4124028, 4153215, 4227085, 4331054, 4298696, 4368106, 4408568, 4511789, 4834463, 5068224, 5116945, 5107267, 5130564, 5019804, 5082950, 5177493, 5263240, 5456863, 5727782, 5907220, 5911974, 5859800, 5810174, 5724813, 5787311, 5633124, 5714043, 5767939, 6054685, 6205764, 6279254, 6151934]
5186F151934j64433k21070J25842K90749K00035J12497J51743L06866J76882J64566
5176G295611Q0414J36156J54299M35774L85455K76138L73884K55448J68125Q2001
5166I643305l9558l03362o8527p1016j26609N2958J27435N8214k13484l8507o4486
5155H956363j56078R7289J72713N1942J79237J36142J40992N0664l3850J2631
5145I608045K45728K48731L00453K29555L71947L38324L49031M00875M53945J85799
5135A2732433J34830J64557J9448N4649m1439j10144k13131k70907k12829j32518
5125A2124949k11917j0104J50129k2483M4556R8878J86330k2352l8817j7244j23878
5114A2158047J50796P8805N0197J74536J84367P1045J48795j23624O4701K49439
$$ y = [6151934, 5987501, 5766431, 5892273, 6183022, 6383057, 6495554, 6647297, 6954163, 7131045, 7295611, 7376025, 7512181, 7666480, 8102254, 8487709, 8763847, 9137731, 9393179, 9561304, 9643305, 9603747, 9300385, 9231858, 9160842, 9034233, 9087191, 9214626, 9272840, 9059356, 9020849, 8956363, 8800285, 8897574, 9070287, 9122229, 9301466, 9437608, 9578600, 9629264, 9595414, 9608045, 9853773, 10102504, 10402957, 10632512, 11004459, 11342783, 11691814, 12092689, 12546634, 12732433, 12867263, 13031820, 13051268, 13105917, 13064478, 12954334, 12741203, 12470296, 12257467, 12124949, 11913032, 11902928, 12053057, 12030574, 12075130, 12174008, 12360338, 12337986, 12299169, 12281925, 12158047, 12308843, 12387648, 12437845, 12612381, 12796748, 12867793, 13016588, 12892964, 12957665, 13207104]
5104A3207104Q25K28581L1233N5518L2599J04983j16774j71877l45754p6568K8446
5093A2978316k9752k72087J05744j98054k84941n3738j03160j54576j40654j2440
5083A1834658r7722p454J35045j3707l8639L9388j83765k46787j89006j18107
5073A1113904n9226n7556o9968o0832k36814J3022k76646j40638p0491N0908J19223
5062A0324886P698q7410r8873p7241j33246k56501p0368j84109k20811j9127r703
5051I175195j49341M3783Q923q9145q1884j26332q6965r044j6341r6085N2483
5040H625247j78422p0510o8382k40295k34501j67164r9728O5966J17118j71203
5030G578126n2916j31413O9255r7863j9407k30969j35978J831N4722J07600k01713
$$ y = [13207104, 13207929, 13436510, 13467743, 13523261, 13555860, 13660843, 13544069, 13372192, 13026438, 12949870, 12978316, 12948564, 12676477, 12782221, 12584167, 12299226, 12245488, 12142328, 11987752, 11847098, 11834658, 11736936, 11729482, 11864527, 11850820, 11812181, 11851569, 11667804, 11421017, 11232011, 11113904, 11054678, 10997122, 10927154, 10866322, 10629508, 10642530, 10365884, 10225246, 10154755, 10205663, 10324886, 10332584, 10245174, 10146301, 10069060, 9935814, 9679313, 9608945, 9424836, 9204025, 9184898, 9175195, 9025854, 9069637, 9078560, 8989415, 8907531, 8781199, 8694234, 8685190, 8668849, 8572764, 8625247, 8446825, 8376315, 8307933, 8067638, 7833137, 7665973, 7566245, 7632211, 7749329, 7578126, 7525210, 7393797, 7463052, 7365189, 7345782, 7114813, 6978835, 6980666, 7035388, 7142988, 6941275]
5019F941275k08029j11308j24971j45155l7501p8554q1646J78475k132j42528
5009F187926L0127p3716m960J05026q3697j08109O3419m9227k7568J23033k3501
4998F138753r0268m1363j38786Q8672K14466R4280R2062M4608J07033k5746o5620
4987F418091j85014j50533j16594j7423k1976j53173L9243L9253j56212j02210
4977E593452L146j16638K2802P8257J24843m6072m0584J13993J55925P0106m8021
4966E911209j4071q745p9801J14225p1709j15930j7259M0979j23512L973P5546
4955E714905Q0623M8283m0327k3488K0370K3907K26638L0532j13287J45794k1172
4944F092778L2943k0360p9220Q3822q2592Q734M6136P9331J6531M538Q1780L4606
$$ y = [6941275, 6733246, 6621938, 6496967, 6351812, 6314311, 6235757, 6154111, 6332586, 6330454, 6187926, 6218053, 6144337, 6139377, 6244403, 6160706, 6052597, 6116016, 6066789, 6039221, 6162254, 6138753, 6048485, 6007122, 5868336, 5957008, 6171474, 6265754, 6357816, 6402424, 6509457, 6483711, 6418091, 6233077, 6082544, 5965950, 5948527, 5926551, 5773378, 5812621, 5851874, 5695662, 5593452, 5596598, 5479960, 5502762, 5581019, 5705862, 5659790, 5619206, 5733199, 5889124, 5959230, 5911209, 5897138, 5888393, 5808592, 5922817, 5851108, 5735178, 5717919, 5758898, 5635386, 5639359, 5714905, 5795528, 5843811, 5803484, 5779996, 5800366, 5824273, 6050911, 6081443, 5968156, 6113950, 6092778, 6125721, 6105361, 6026141, 6109963, 6027371, 6036105, 6082241, 6161572, 6178103, 6182641, 6264421, 6299027]
4932F299027J12985J04432j8458J84635q3868J15234R8270n5771M8347n072o0474
4921F739287q1444J43765n2357k7149K30984Q8251K87361R5646N348L0210J79313
4910G639215J94633j97553J89159R2646p4332J48323K21833N4211Q7602K3783
4900H379520j4338Q1808K02261K20114J62252L01295K83781M1166O8320J75895
4890I902074J17501R3547N7782Q8841K58636K54559K08587R7401Q8954K51040
4880A1418922K52384L30726J38527J28369M32784K96478K62569M51220L00035
4871A4012014K07044M20786L27777M06926L68251L69914M27236O15824M99056
4862A7654828O57064O86682P64571Q19885R85524Q82327Q65223J148772J210884
$$ y = [6299027, 6412012, 6516444, 6497986, 6682621, 6598753, 6713987, 6812257, 6756486, 6804833, 6799761, 6739287, 6657843, 6801608, 6749251, 6722102, 6953086, 7041337, 7328698, 7424344, 7429692, 7459902, 7639215, 7833848, 7636295, 7825454, 7918100, 7843768, 7992091, 8213924, 8268135, 8355737, 8379520, 8365182, 8446990, 8649251, 8869365, 9031617, 9332912, 9616693, 9657859, 9726179, 9902074, 10019575, 10113122, 10170904, 10259745, 10518381, 10772940, 10981527, 11078928, 11167882, 11418922, 11671306, 12002032, 12140559, 12268928, 12701712, 12998190, 13260759, 13711979, 14012014, 14219058, 14639844, 14967621, 15374547, 15742798, 16112712, 16539948, 17155772, 17654828, 18311892, 18998574, 19763145, 20583030, 21568554, 22450881, 23316104, 24464876, 25675760]
4853B5675760J093807J176287J182548J278513J492132J706888J818962J906162
4845C7331059J850181J973954K348794K365236K332644K280119K066619K415146
4837E4963752K310006K357119K286451K218434K329226K143317J902444K008102
4829G2518851K129936J955067K341445K782981L655790M884848O073862N379467
4821A01722247L437350K948246K910443K777496K803897J669704M46402M50172
4813A19165957J223757J483727J913023J943522J837031J721310J180385Q49347
4805A31318059K83579O0583l34534o08587r00621j392975j635452j418270j310426
4796A24061356j370943j241996j142495r61952o46299k86178k26862L27835M24181
$$ y = [25675760, 26769567, 27945854, 29128402, 30406915, 31899047, 33605935, 35424897, 37331059, 39181240, 41155194, 43503988, 45869224, 48201868, 50481987, 52548606, 54963752, 57273758, 59630877, 61917328, 64135762, 66464988, 68608305, 70510749, 72518851, 74648787, 76603854, 78945299, 81728280, 85384070, 90268918, 96342780, 101722247, 105159597, 108107843, 111018286, 113795782, 116599679, 118269383, 118715785, 119165957, 120389714, 121873441, 123786464, 125729986, 127567017, 129288327, 130468712, 131318059, 131601638, 131662221, 131327687, 130719100, 129818479, 128425504, 126790052, 125371782, 124061356, 122690413, 121448417, 120305922, 119343970, 118697671, 118411493, 118184631, 118512466, 118936647]
4787A18936647O61658Q54032J018768R29953R78510Q06686O25037J94709k08913
4778A24797087l36073l52297o82632p35123r92304j060176j073058q22684q25310
4769A17917430p11526n81502j26294K33421N16722P60427P94892J325764J151138
4760A21280472J413201J488106J657351J658201J572225J256551P97905L71956
4752A31495968k14420n23783j035702j662088k292925k456465l027577l519439
4744A16763569l571604l862315l930215l740976l729052l582471l183109k880473
4736H8283354k501034k159838j766602j558871j424153j281504j043204j084460
4728G5463688j110966j268181j296772j439864j762220j706992j910838k000487
$$ y = [118936647, 119598305, 120452337, 121471105, 122401058, 123379568, 124186254, 124811291, 125006000, 124797087, 124461014, 124108717, 123426085, 122690962, 121698658, 120638482, 119565424, 118742740, 117917430, 117205904, 116624402, 116498108, 116731529, 117248251, 118008678, 118803570, 120129334, 121280472, 122693673, 124181779, 125839130, 127497331, 129069556, 130326107, 131124012, 131495968, 131281548, 130757765, 129722063, 128059975, 125767050, 123310585, 120283008, 116763569, 113191965, 109329650, 105399435, 101658459, 97929407, 94346936, 91163827, 88283354, 85782320, 83622482, 81855880, 80297009, 78872856, 77591352, 76548148, 75463688, 74352722, 73084541, 71787769, 70347905, 68585685, 66878693, 64967855, 62967368]
4720F2967368j973953k201850k209235k123315k059401k059731j767551j706531
4712D6865801j488095j458765j214410r55526p40739o36039m61132k90145l96977
4703C9223973k18923k1213Q061M2784j38157j26252j36229k58433l93047n00157
4693C7482407l62681k84062k51239j25906J04090N37907O33795O10058R60518
4684C9304887J142182J192120J286047J242663J267656J064076J153823J012661
4676D8666115J100619R33256O43483M16308N7014k15754l03576m05401q12749
4667E0079315p93131j069404j031099j124833j164351j223963j203912j012921
4659D1455701r84916q85894n76297o48959o65339m68383n32375m62100m33209
$$ y = [62967368, 60993415, 58791565, 56582330, 54459015, 52399614, 50339883, 48572332, 46865801, 45377706, 43918941, 42704531, 41749005, 41008266, 40372227, 39911095, 39620950, 39223973, 39005050, 38983837, 38991898, 39034682, 38896525, 38770273, 38634044, 38375611, 37982564, 37482407, 37119726, 36835664, 36584425, 36458519, 36562609, 37100516, 37734311, 38344369, 39304887, 40447069, 41639189, 42925236, 44167899, 45435555, 46499631, 47653454, 48666115, 49766734, 50699990, 51343473, 51759781, 51816795, 51601041, 51297465, 50892064, 50079315, 49286184, 48216780, 47185681, 46060848, 44896497, 43672534, 42468622, 41455701, 40470785, 39584891, 39008594, 38359635, 37694296, 37225913, 36693538, 36231438, 35798229]
4650C5798229m75712o29736q68454r38738q64970j153476j442930j528516j300503
4641B6595194j425389j343814j364029j256405j054802r90821r47687o49580p98617
4632A6764050o44907l18731m02023J97849N82390M92178J41402p1665l30054n29324
4622A5881165m25033n01931o57604p97779q04454n65273k59859j42142l7298J05266
4612A1795058K54472M45187L57312M84036M14558L16866K29712M99850N94665
4603A5391716O31946Q11071N62908O18573M54592L81967N39950M71781N41848
4594B0406352N91433P56175L45457K03695m0605p4097L269k5324k86680l25119
4584B1554556k94554n94629n03553k46112m96975l77951l51570l68571k90091
$$ y = [35798229, 35322517, 34692781, 33824327, 32885589, 32020619, 30867143, 29424213, 27895697, 26595194, 25169805, 23825991, 22461962, 21205557, 20150755, 19159934, 18212247, 17562667, 16764050, 16119143, 15800412, 15398389, 15596238, 16178628, 16670806, 16812208, 16740543, 16410489, 15881165, 15456132, 14954201, 14296597, 13498818, 12694364, 12129091, 11869232, 11727090, 11689792, 11795058, 12049530, 12494717, 12852029, 13336065, 13750623, 14067489, 14297201, 14797051, 15391716, 16023662, 16834733, 17397641, 18016214, 18470806, 18852773, 19392723, 19864504, 20406352, 20997785, 21753960, 22099417, 22303112, 22262507, 22188410, 22191679, 22166355, 21879675, 21554556, 21260002, 20665373, 20161820, 19915708, 19418733, 19040782, 18689212, 18320641, 18030550]
4575A8030550k60489k24538j60995k79435k5516j8620K05385K00120J91609J87633
4565A7845704N42414P95630P80001Q85731R97979R12783J084320J255673R80554
4556B6080789J045958J166026P87724O13047N80483N13798N84853M38535L23103
4547C2134316L70905N21139N81949P10455P83935P45377Q41092J030006J031266
4538C8750440J047098J029370J207895J059104J309323Q50750N10838M76151J60062
4529D6401031J30509k53486n53339q19398j088135j195289j334987j623447j661703
4520C8001756j484511j507552j409411j237083j198549r94491n20573p64791n65359
4511B8319436m95995k24741o0685o710r1511k58458o23568m54156n99844p21367
$$ y = [18030550, 17770061, 17545523, 17384528, 17105093, 17079577, 17060957, 17266342, 17466462, 17658071, 17845704, 18388118, 19183748, 19963749, 20849480, 21847459, 22760242, 23844562, 25100235, 26080789, 27126747, 28292773, 29080497, 29693544, 30274027, 30787825, 31372678, 31811213, 32134316, 32505221, 33026360, 33608309, 34318764, 35102699, 35848076, 36689168, 37719174, 38750440, 39797538, 40826908, 42034803, 43093907, 44403230, 45253980, 45764818, 46240969, 46401031, 46531540, 46278054, 45724715, 44905317, 43817182, 42621893, 41286906, 39663459, 38001756, 36517245, 35009693, 33600282, 32363199, 31164650, 30170159, 29649586, 28884795, 28319436, 27823441, 27598700, 27538015, 27531305, 27439794, 27181336, 26557768, 26103612, 25503768, 24782401]
4501B4782401p44022j008091j080973p71453r53172q24992j102952j142938j061916
4492A6091892j087711j138535j073788r70377r00497q32691o44436o44194o80861
4483H118802n33597m52228l89675l53587l63025k26609l69930j63322k85461j55523
4473D825845j01349k56695r1928l04338k24298p72N8973l11122m00599j2082L9306
4462C220941j30687N1016l2916J0722j69456Q0897j01174P9032k0653k27580k43836
4451B516306p0711k33529j64055l0681j5127M8432Q7754j41998n6518J4961R156
4440A963990j76493J6509N8649j00329L9368P2299j85344p2059K7233k4996n2235
4429A566592o4804j18523O8018J39838m0578j00906j63201p6436L4910r1453R0785
$$ y = [24782401, 24038379, 23030288, 21949315, 21177862, 20224690, 19399698, 18296746, 17153808, 16091892, 15004181, 13865646, 12791858, 11821481, 10920984, 10088293, 9443857, 8799663, 8118802, 7585205, 7132977, 6743302, 6389715, 6026690, 5800081, 5430151, 5266829, 4981368, 4825845, 4724496, 4467801, 4375873, 4071535, 3847237, 3846465, 3905438, 3594316, 3193717, 3181635, 3220941, 3090254, 3141270, 3108354, 3119076, 2949620, 3030517, 2929343, 3008375, 2987722, 2760142, 2516306, 2445595, 2212066, 2048011, 2017330, 2002203, 2050635, 2138389, 1996391, 1939873, 1954834, 1963990, 1787497, 1804006, 1862655, 1762326, 1801694, 1873993, 1688649, 1616590, 1643823, 1618827, 1566592, 1501788, 1383265, 1451283, 1591121, 1550543, 1449637, 1286436, 1210000, 1244910, 1153457, 1244242]
4418A244242p2534J1672M7275O498P5012m5507M4886j58389k11159L4041n2823
4407I23214r77J04437q3821Q061p5200Q5160p2373j21699n5254J45161J5200n0652
4395H21257O9725J0090L5585j19503j92567o8449J26144J58325J43309k19193
4385G64723k1157K37086K6909k4656K8931j89504k5024J0446m1534J13410M6298
4374I25928p1493k9364N0752l3442p2626J02985N3210P644L4728q4783p3333k1480
4362G88726p4018J16820J5271N6950j4139Q6487M2450k9311k717q7264Q1812k05289
4350G75778j10886n947J18081J55891r7885j7553N0921K205K41019J65821j51214
4339A126231o5034R365N1109N8563J5611j12776j63409P4742k7913O4326p0843
$$ y = [1244242, 1171708, 1183380, 1230655, 1237153, 1312165, 1266658, 1311544, 1153155, 941996, 976037, 923214, 922237, 1026674, 942853, 950914, 875714, 960874, 888501, 766802, 711548, 856709, 871909, 821257, 890982, 901072, 936657, 817154, 624587, 556138, 682282, 840607, 983916, 764723, 743566, 980652, 1007561, 982905, 1011836, 822332, 797308, 807754, 766220, 879630, 925928, 854435, 825071, 875823, 842381, 769755, 872740, 925950, 933594, 968322, 883539, 810206, 788726, 714708, 831528, 846799, 903749, 889610, 976097, 1018547, 989236, 986519, 899255, 981067, 775778, 664892, 658945, 777026, 932917, 835032, 817479, 868400, 870605, 1111624, 1277445, 1126231, 1061197, 1070562, 1121671, 1180234, 1195845, 1083069, 919660, 994402, 966489, 1030815, 959972]
4328I59972K07677o4483J19314J225j64756j20908J51170j26851K789L5329J09890
4317A110368j4748o4809L2806Q2722Q6524m3507j11302O6006J83579j6701O4793
4306A375731o303O135R9454N8290j05899m2792J7584j08363L4018M5785J06675
4295A480315J79738M8714j67427o2439O8733k9039o4113Q7461J14920L6301J18222
4284A811386p2630Q6782L9686l3824j29887N936J06175l1504J06081J64065K0882
4273B073148r1314j6125M4501j04728J6051J44653R156j51755J38212J25796K4451
4262B212046j37097j33417K186J55762j9477K5627J198j11666J43470J13598J48687
4251B400917o6463j63775M7290j5916O5946K3991J35925Q464N7166j0196l8467
$$ y = [959972, 1167649, 1103166, 1222480, 1223705, 1058949, 938041, 1089211, 962360, 965149, 1000478, 1110368, 1095620, 1030811, 1063617, 1146339, 1232863, 1189356, 1078054, 1144060, 1327639, 1310938, 1375731, 1369428, 1375563, 1475017, 1533307, 1427408, 1384616, 1402200, 1293837, 1327855, 1373640, 1480315, 1660053, 1708767, 1541340, 1478901, 1547634, 1518595, 1454482, 1541943, 1656863, 1693164, 1811386, 1738756, 1825538, 1865224, 1831400, 1701513, 1707449, 1813624, 1782120, 1888201, 2052266, 2073148, 1981834, 1965709, 2010210, 1905482, 1921533, 2066186, 2075342, 1923587, 2061799, 2187595, 2212046, 2074949, 1941532, 1943718, 2099480, 2080003, 2105630, 2106828, 1995162, 2138632, 2252230, 2400917, 2334454, 2170679, 2217969, 2202053, 2267999, 2291990, 2427915, 2436379, 2493545, 2483349, 2444882]
4240B444882J49433N5870l7386J19017J14959j06898m1603J37557L1680j05960
4230B761551k9675p066J30258J54372j7879k650q5156k8126J36007l8327l01913
4219B671396j08392l0957J30155M854J33864j2279k3175m8089K4872j9280J36057
4208B859026j2707q1390K2579m1566k6683P5933j48630n3111J3438j82179M5435
4197B470145J45106M2340J05270R3384j20922m5875j03179l4900o3217l9504J25710
4186B574358Q4146N0686j21545q0437M3874j42511J30074n988k0547l3765r8766
4175B379579J08126K04483k26055R2815J62303r0811l3825K0893K11752J04863
4165B934123o3240l9460J1937M7198j91277n2233N3914j6187L5497R5310O3434
$$ y = [2444882, 2594315, 2650185, 2612799, 2731816, 2846775, 2739877, 2698274, 2835831, 2867511, 2761551, 2731876, 2724810, 2855068, 3009440, 2991561, 2988911, 2903755, 2875629, 3011636, 2973309, 2671396, 2563004, 2532047, 2662202, 2667056, 2800920, 2788641, 2765466, 2717377, 2742249, 2722969, 2859026, 2846319, 2764929, 2787508, 2745942, 2719259, 2795192, 2646562, 2593451, 2606889, 2424710, 2470145, 2615251, 2657591, 2762861, 2856245, 2735323, 2689448, 2586269, 2551369, 2488152, 2448648, 2574358, 2658504, 2709190, 2587645, 2507208, 2551082, 2408571, 2538645, 2532657, 2512110, 2478345, 2379579, 2487705, 2692188, 2466133, 2558948, 2721251, 2630440, 2596615, 2617508, 2829260, 2934123, 2870883, 2831423, 2843360, 2890558, 2699281, 2647048, 2700962, 2684775, 2720272, 2815582, 2879016]
4154B879016m5799J90028J33139j02081K5991J8216R7601r4379l1553K04253J5834
4143C290266N257K4174p6582k9328N1670J35383L4376J29753m8638j3467m4733
4132C458131j1129Q4740O9328k3616j7798k6167J63826J33202K59668N860l1003
4121D065042K6975j699J2540K79918J45489j8754m6940O9151N7870l5838O6274
4110D620028J79187M0315P4638P1765n9135K8391N4927O3661R0517Q7720Q671
4099E260685P2694O7970Q8808J26174J30675J1375O8955J59863J8849n288J0391
4088F011151M7821J11129J41078P2769r966J02941j7852K55367k5251J8942J40865
4077F848994J48769L4752J52573O3262J81449J2429J22645J23882m3543P7048
$$ y = [2879016, 2833217, 3023245, 3156384, 3054303, 3080294, 3098510, 3196111, 3101732, 3070179, 3274432, 3290266, 3295523, 3319697, 3243115, 3213787, 3265457, 3400840, 3435216, 3564969, 3516331, 3502864, 3458131, 3447002, 3531742, 3601070, 3577454, 3559656, 3533489, 3697315, 3830517, 4090185, 4096045, 4065042, 4092017, 4090318, 4102858, 4382776, 4528265, 4509511, 4462571, 4531722, 4589592, 4553754, 4620028, 4799215, 4839530, 4914168, 4985933, 4926798, 4955189, 5010116, 5073777, 5164294, 5252014, 5260685, 5333379, 5401349, 5490157, 5616331, 5747006, 5758381, 5827336, 5987199, 6006048, 6000760, 6011151, 6058972, 6170101, 6311179, 6383948, 6373982, 6476923, 6459071, 6714438, 6689187, 6708129, 6848994, 6997763, 7032515, 7185088, 7248350, 7429799, 7442228, 7564873, 7688755, 7645212, 7722260]
4067G722260J27241J98248K81813J39309K02364P4370P5445J10449J61486K33285
4057I326270L20462K06511M05298N25103L41017L40622K48636J04173K02938K58508
4047A2279538J30143J54864J61996J19934J92567J59654L96865K94169K12299
4038A4102029M76179N12133N45050N22234O18667R19004Q03804N12323N74921
4029A9586344O73818P09497O93531P87197J007777Q02183P25135P80314O70190
4020B6435986Q37392R36285P55526P92967P90187R90546J019138P74167Q22029
4011C4154223O65062P60964P19529N77625N13013O92895Q74345R20742R65966
4002D0844364Q19793J174253J276119J468861J648890J707850J728552K086994
$$ y = [7722260, 7849501, 8047749, 8329562, 8468871, 8671235, 8745605, 8821050, 8931499, 9092985, 9326270, 9646732, 9853243, 10258541, 10783644, 11124661, 11465283, 11713919, 11818092, 12021030, 12279538, 12409681, 12564545, 12726541, 12846475, 13039042, 13198696, 13595561, 13889730, 14102029, 14578208, 15090341, 15635391, 16157625, 16776292, 17695296, 18499100, 19011423, 19586344, 20260162, 20969659, 21663190, 22450387, 23458164, 24260347, 24985482, 25765796, 26435986, 27273378, 28209663, 28965189, 29758156, 30548343, 31538889, 32558027, 33332194, 34154223, 34819285, 35580249, 36299778, 36877403, 37390416, 38083311, 38957656, 39878398, 40844364, 41664157, 42838410, 44114529, 45583390, 47232280, 48940130, 50668682, 52755676]
3994E2755676K327265K256074K533757K812921L171247L272228L479253L556242
3986G6164663L611885L595451L265433L345133L297755L043754K983267K764323
3978A02071664K731175L049703K906172L132268L676339L942203M609764N224757
3970A31344045N888961O372750O825423O761083O678583N773045N052935M299432
3962A78996257L798198L300332L028338K699997K665738K591579K892202K888587
3954B02861228K705258K713336K200325J551994J328962O80874K64785o06250
3946B13700512j595643k268178k504288k884478k761753k588160k572579k410891
3938A94114542k648810l015661l546721m249916n005914n487363n840012n970690
$$ y = [52755676, 55082941, 57339015, 59872772, 62685693, 65856940, 69129168, 72608421, 76164663, 79776548, 83371999, 86637432, 89982565, 93280320, 96324074, 99307341, 102071664, 104802839, 107852542, 110758714, 113890982, 117567321, 121509524, 126119288, 131344045, 137233006, 143605756, 150431179, 157192262, 163870845, 169643890, 174696825, 178996257, 182794455, 186094787, 189123125, 191823122, 194488860, 197080439, 199972641, 202861228, 205566486, 208279822, 210480147, 212032141, 213361103, 214041977, 214306762, 213700512, 212104869, 209836691, 207332403, 204447925, 201686172, 199098012, 196525433, 194114542, 191465732, 188450071, 184903350, 180653434, 175647520, 170160157, 164320145, 158349455]
3930A58349455o049343n860901n120259m365544l755740l201574k515830k211893
3922A25268371k000726j735146k048884j762642j636800j627723j853388k370719
3914A10232343k788475k713431k772350k947525k772255k707598k594157k166974
3906H8769578j892337j370922j125320q08589o86168k26014L38899P37678J106803
3897H4843608J603839J600789J770052J832501J245301J038957M42770j82766
3889I4195051l39438q16475r18615q56931j075156j022280p02875p33717p00628
3880H7028936r82186q70174q12827r85408j040849o64986o23668o86415o00318
3871G9762105l90905l23711m11851m97765p44221j268452j660599k113654k214297
$$ y = [158349455, 152300112, 146439211, 141318952, 136953408, 133197668, 129996094, 127480264, 125268371, 123267645, 121532499, 119483615, 117720973, 116084173, 114456450, 112603062, 110232343, 107443868, 104730437, 101958087, 99010562, 96238307, 93530709, 90936552, 88769578, 86877241, 85506319, 84380999, 83572410, 82886242, 82660228, 82999127, 83736805, 84843608, 86447447, 88048236, 89818288, 91650789, 92896090, 93935047, 94377817, 94195051, 93855613, 93039138, 92120523, 91263592, 90188436, 89166156, 88463281, 87729564, 87028936, 86046750, 85176576, 84363749, 83378341, 82337492, 81672506, 81048838, 80362423, 79762105, 79371200, 79047489, 78635638, 78137873, 77393652, 76125200, 74464601, 72350947, 70136650]
3862G0136650k654790l159073k999442k957080l266501k780798k576348k408588
3854D7334030j981333j762694j558542j522918j535762j076745q83576r60146
3846C6052314q15951q81787p98553p77904p94440p30574p19145p67317r51719
3837B8814924r32762r27058r46020r45455p82202r13648r27695q88415j009430
3828B0542239o45009q44886p85103q09213o73664p77259n03190n31721n90484
3819A4381710m57506k52415l14395k83183k02675m12016l12377j50909l84805
3810A1611429n65993k16250l38495l12624l27813l62643l15363m34682l70167
3801H367399m81076l25782j54192l02976k45010k43640l03895j62433k15642k29412
$$ y = [70136650, 67481860, 64322787, 61323345, 58366265, 55099764, 52318966, 49742618, 47334030, 45352697, 43590003, 42031461, 40508543, 38972781, 37896036, 37012460, 36052314, 35236363, 34354576, 33556023, 32778119, 31983679, 31253105, 30533960, 29766643, 28814924, 27882162, 26955104, 26009084, 25063629, 24281427, 23367779, 22440084, 21551669, 20542239, 19897230, 19052344, 18267241, 17458028, 16784364, 16007105, 15503915, 14972194, 14381710, 13924204, 13671789, 13357394, 13074211, 12871536, 12459520, 12147143, 11996234, 11611429, 11045436, 10829186, 10490691, 10178067, 9850254, 9487611, 9172248, 8737566, 8367399, 7886323, 7560541, 7406349, 7103373, 6858363, 6614723, 6310828, 6148395, 5932753, 5703341]
3791E703341l79649j39389m61828j76047j68908j55270j54625k95558k68311k19991
3781C283765j39139j96256k33790r2629k5386j6408j8795o7197j63014j17212
3771B213939j49683k40937j69318J15066l4226o3534j24920M5141j36191j10220
3761A345117n7674j69835J00490N5547j43520K27042J65244j50672m1641j71228
3751A158870k41918k3691L8667P6184P672Q2257M3717K6944n3482j26412p246
3740I81562j38190q7736j73314J38830K0251J18064q3928l1190J854j88717j12116
3729D45370l1515p7064K61684J21970j60599J93299J9841k19278o9997m6610O532
3718D43633R7016N48k8957O8184j75645r1505M6166k7636l05834N180K53314P8317
$$ y = [5703341, 5323692, 5184303, 4722475, 4546428, 4377520, 4222250, 4067625, 3772067, 3503756, 3283765, 3144626, 2948370, 2714580, 2621951, 2596565, 2580157, 2561362, 2494165, 2331151, 2213939, 2064256, 1823319, 1654001, 1769067, 1734841, 1671307, 1546387, 1591528, 1455337, 1345117, 1287443, 1117608, 1218098, 1273645, 1130125, 1357167, 1522411, 1371739, 1330098, 1158870, 916952, 893261, 931928, 1008112, 1015784, 1098041, 1141758, 1168702, 1115220, 988808, 981562, 843372, 755636, 582322, 721152, 741403, 859467, 775539, 744349, 746203, 557486, 445370, 413855, 336791, 598475, 720445, 559846, 753145, 772986, 553708, 483711, 437101, 443633, 540649, 541197, 512240, 580424, 404779, 313274, 359440, 331804, 25970, 31150, 284464, 362781]
3706C62781n7763K07148J6198n9890m0969j31598J3516j6496L866J62004J09490
3695E68287J22723r4565r8850j10636j00551l6152K09098m1216O4718K83435j51781
3684F14510N1970O2327k01481k1976j27488P8008l2210p4680K55860K4406j03888
3673E25358m5496j29759J66364J0844o5171K08164J37513L0109J96902k7297j11891
3662H95640j75312m2374P3077p4987j467J07198J62761R8091n6133j12983j14558
3651G58953o664J84778J51463R2092R6265J16692J5898J43751n9852N997j13023
3640A386350j9831K19483O2032O6178K13109K8321J8738R8847j845J16784R6872
3629B285038K25371L95411L61118M02405M33316P06768P53246J054389J419069
$$ y = [362781, 305018, 512166, 528364, 468474, 427505, 295907, 309423, 292927, 296793, 458797, 568287, 691010, 596445, 497595, 386959, 286408, 250256, 459354, 418138, 482856, 766291, 614510, 666480, 728807, 527326, 505350, 377862, 455870, 423660, 348980, 604840, 629246, 525358, 479862, 350103, 516467, 527311, 462140, 670304, 807817, 837926, 1034828, 1007531, 895640, 720328, 677954, 751031, 676044, 674577, 781775, 944536, 1042627, 986494, 873511, 758953, 752289, 937067, 1088530, 1180622, 1276887, 1393579, 1409477, 1553228, 1493376, 1499373, 1386350, 1366519, 1586002, 1648034, 1714212, 1927321, 1955642, 1974380, 2073227, 2071382, 2188166, 2285038, 2510409, 2905820, 3266938, 3669343, 4102659, 4809427, 5562673, 6617062, 8036131]
3620H036131J860828J774083J181503O25520K32846q2772m95116j003039j237831
3611A0892153j470677j185277j109880o19462n75109m69257l37448k42732m76201
3602D406110k23470j06609l8227J36263L21082K86215L86074M61512N28567N98862
3592F756379J026195J488415K046961K969889L892972L759467K579534J369877
3584B5889689J35470n83678q58466j570375k607031l006934k775824k184031j845869
3575A0592951j565028j265912q71638m75574o68983m00514k09056m95304j36266
3566D504676p5944l22343j66365J50603j04321K56413N74137P66790R46131J128085
3556G657862J637164J737419J464434Q27901k199j45985m08825o86228r77020
$$ y = [8036131, 9896959, 11671042, 12852545, 13478065, 13710911, 13628139, 13133023, 12129984, 10892153, 9421476, 8236199, 7126319, 6506857, 5931748, 5462491, 5125043, 4882311, 4406110, 4182640, 4076031, 4037804, 4174067, 4495149, 4781364, 5167438, 5628950, 6157517, 6756379, 7782574, 9270989, 11317950, 14287839, 18180811, 21940278, 24519812, 25889689, 26025159, 25441481, 24583015, 23012640, 20405609, 17398675, 14622851, 12438820, 10592951, 9027923, 7762011, 6890373, 6414799, 5745816, 5345302, 5136246, 4640942, 4504676, 4428732, 4106389, 3940024, 4090627, 3986306, 4242719, 4816856, 5583646, 6529777, 7657862, 9295026, 11032445, 12496879, 13324780, 13322581, 13176596, 12767771, 12081543, 11104523]
3547A1104523j423979j457015j232446j048541o86960p05499m10338j92025J38465
3538D086185K66149J66545j9310o94j82995l34877k06024j61493j85582M3921
3528C471825N2324K87066M01263L88094K84794J32634j54203l1591R9162K0133
3518D951501j98035m01254l68390m29416l93123p3315j69281O8313M610J5517
3508C007127L83921L50050M69314N58879L04989L7073o4953l9789J63502q6928
3498E083185j37013k390j02922K03332N10251P33817P97005P21260N06680N3667
3488H366872q7955k43866l63959n35144p44813r04553n86658m34548n48749k43892
3478C672735r8781p8361m046L6301P3261J69822J2361j786l7098j28546O9544
$$ y = [11104523, 9680544, 8223529, 6991083, 5942542, 5255582, 4550083, 4139745, 3947720, 4086185, 4352334, 4518879, 4499569, 4498875, 4315880, 3981003, 3774979, 3613486, 3427904, 3471825, 3524149, 3811215, 4212478, 4600572, 4885366, 5018000, 4863797, 4832206, 4931368, 4951501, 4753466, 4352212, 3983822, 3554406, 3161283, 3087968, 2918687, 2987000, 2991610, 3007127, 3391048, 3741098, 4210412, 4769291, 5074280, 5111353, 5046400, 5006611, 5170113, 5083185, 4946172, 4943782, 4840860, 5044192, 5554443, 6288260, 7085265, 7806525, 8313205, 8366872, 8278917, 8035051, 7671092, 7135948, 6391135, 5486582, 4899924, 4465376, 3916627, 3672735, 3573954, 3495593, 3491547, 3527848, 3601109, 3770931, 3783292, 3781506, 3744408, 3615862, 3685406]
3467C685406j5450P4427p8429j61072O3863Q6677J75353M27541N29758L39377
3457E127451L33443R6105k29539l8480j00718k17874m00350k69543l36536k14643
3447C749316r1893j50152q5178r9696j65072k55002j52347j60743j16820k25878
3437B246535k60724k39622j97764k37979l80038j35577j38303q8245q6620K3379
3427E05042j97444l3479j763R7921n9562J9016j3801j2368k3733Q5234j97240
3416A67823j1148l8508k50984n9153j7626r9151M9305J2080n4498K13337J00549
3405A2026J3828J1355j42237q8045q421p9437O9036n3762N5330j16596j62662
3394d89585j07641J79874m3270k8967M9631K801L1003O9742Q0224j42569J08384
$$ y = [3685406, 3669956, 3744383, 3665954, 3504882, 3568745, 3655422, 3830775, 4258316, 4788074, 5127451, 5460894, 5556999, 5327460, 5288980, 5188262, 4970388, 4570038, 4300495, 3963959, 3749316, 3657423, 3507271, 3422093, 3322397, 3157325, 2902323, 2749976, 2589233, 2472413, 2246535, 1985811, 1746189, 1548425, 1310446, 930408, 794831, 656528, 568283, 481663, 505042, 307598, 274119, 272356, 370277, 310715, 329731, 315930, 303562, 279829, 365063, 167823, 156675, 118167, -132817, -191970, -209596, -308747, -259442, -247362, -301860, -88523, 12026, 25854, 37209, -105028, -193073, -201494, -280931, -211895, -265657, -210327, -326923, -489585, -597226, -417352, -460622, -489589, -439958, -437157, -406154, -336412, -256188, -398757, -290373]
3383b90373Q2353J05771N09q8807n2339R0458j20136k16929N5289q259j00558
3372e43021j6647K11765p5660J17705q1452M4803O9538j7822N0263j04369O4768
3361b80129L3949K4439J98440k79331p4831j38182j57531J12259j8916J29153
3351d50680M7983j01770J90974R8017k47465L3126O5712l8386Q9185j02919p9956
3340d96179N3592r8101j8433O7196r3457J2322K09573O0539J40055R6671K1499
3329d4723l4637n0337J48929l0681q2804p3353j19254n8397k722l7028L5687K5673
3317c23647j53620o9475j35648J10045R5833L1987J24361m7918q0951M7836n1456
3306d52653m5054L17844k9887n9312J28891j79624j59729M2437K762p4550j5775
$$ y = [-290373, -208020, -102249, -101740, -190547, -242886, -152428, -272564, -489493, -434204, -442463, -543021, -559668, -347903, -423563, -305858, -387310, -342507, -272969, -290791, -240528, -344897, -280129, -246180, -221741, -23301, -302632, -377463, -515645, -673176, -560917, -579833, -450680, -402697, -504467, -313493, -215476, -462941, -429815, -364103, -402489, -313304, -416223, -496179, -442587, -540688, -559121, -491925, -585382, -573060, -363487, -302948, -162893, -66222, -44723, -79360, -129697, 19232, -11449, -94253, -167606, -286860, -345257, -347979, -385007, -349320, -323647, -477267, -546742, -682390, -572345, -476512, -444525, -320164, -368082, -449033, -401197, -452653, -497707, -179863, -209750, -269062, -140171, -319795, -479524, -437087, -434325, -508875, -524650]
3295e24650O7823J8111Q2781Q3694q9991K03950k3988j49897Q8395r5198j68435
3284e07405j9289M4952L0450K5842o8719M4499m6694j22152l5081o3586K70556
3273d46627J69621j07942N4368K0212j35533k18121k3812Q3874J5513k2758K700
3262f08505J1444K2008J26607q9246j3695k9005j65840K24069Q4105k5692Q7536
3251c76214J50312r2168O9545j336m6832k60468k01289Q762l6744J46062R5844
3240e44526p1522K7444j6979l8165O8862k5173P1878n825J90644K01062r8791
3229b41091m9456j67941n6859N4228k62325K2797J31310J1429K6728J52607l1461
3218d10034j43901L653l877p9303J35133J57696j6429l9852J76283l1138q1629
$$ y = [-524650, -456827, -438716, -355935, -272241, -362232, -158282, -182270, -332167, -243772, -338970, -507405, -526694, -481742, -451292, -425450, -494169, -449670, -496364, -618516, -653597, -717183, -446627, -277006, -384948, -330580, -310368, -445901, -664022, -687834, -603960, -588447, -611205, -608505, -597061, -575053, -448446, -537692, -551387, -580392, -746232, -522163, -438058, -463750, -376214, -225902, -318070, -248525, -249861, -296693, -557161, -758450, -749688, -786432, -640370, -544526, -616048, -588604, -605583, -643748, -574886, -600059, -528181, -534006, -343362, -142300, -241091, -290547, -458488, -515347, -461119, -723444, -700647, -569337, -557908, -531180, -378573, -410034, -553935, -550282, -554159, -633462, -498329, -340633, -357062, -396914, -220631, -251769, -333398]
3207c33398j39213j87332O947N9642N3493O8R2458N0997K6762L7303l2397J10991
3195b53679q2657j48226N3812J26641j1251j19046P6005l3477k11952p6663O0836
3184f19657J54015P5010J72612j19761k426O0894j8789r9046J4518N592L8937
3173c38101J41179J60585j14023m7987j00076j20030n061k09868j65276Q3175
3163g15483K66841L13800J7858J25341L9228o8334K07842J0836o9012Q1362j3667
3152A96612j22425L7660j08558j57927o942M2080o7839J8200o2935L9285K83891
3141I1102K07933j15219J19110P7172m1885j78857k08701j04289R366N8030N9581
3130b6657J94163K9325n7772M2169j4792P2705K440J51977J77273L9561N7654
$$ y = [-333398, -472611, -659943, -652996, -593354, -539861, -539793, -447335, -396338, -369576, -332273, -364670, -253679, -336336, -484562, -430750, -304109, -315360, -434406, -358401, -391878, -603830, -680493, -619657, -465642, -390632, -218020, -337781, -340207, -279313, -298102, -397148, -382630, -377038, -338101, -196922, -36337, -150360, -198347, -298423, -418453, -423514, -633382, -798658, -715483, -448642, -134842, -116984, 8357, 47585, -20749, 187093, 197929, 128917, 210279, 196612, 74187, 111847, 3289, -154638, -161580, -119500, -187339, -169139, -232074, -192789, 91102, 299035, 183816, 302926, 380098, 338213, 159356, -49345, -153634, -144268, -86238, -26657, 167506, 196831, 139059, 181228, 166436, 239141, 241581, 393558, 570831, 610392, 668046]
3119F68046k6742k24960K5928k2067l92051m3530J97013j39243Q2518p695n3186
3108F4031l4893j49736j90804R9434Q4788K02985J21536J72953K6915j83425O1320
3097B75104j6319q2285k8435k05264k7246J55471J35940R389K7251l7667k2254
3086A83685p6014j4947l3105K8781N7627n822p3353n1517j75416k0184R2298p7966
3074a65933o1048k1152J02464J68139p5675R6460M1618j79151L4233j87055J7852
3063b29248J63676m5722L9433K7146j50836P6475k86725k9607l9087n0136J17434
3052d07197K0076m696Q3694j6699J96324q189p1619j22472q3962L4145J93335
3041a87260M7967N9213j02642p2436j2847j75680k46997M8510l7201J62399K03126
$$ y = [668046, 641304, 416344, 442272, 420205, 28154, -15376, 181637, 42394, 124912, 117217, 64031, 29138, -120598, -311402, -211968, -127180, 75805, 197341, 370294, 397209, 213784, 275104, 258785, 176500, 148065, -57199, -84445, 71026, 206966, 216355, 243606, 205939, 183685, 107671, 92724, 59619, 88400, 146027, 140205, 66852, 15335, -160081, -180265, -87967, -165933, -226981, -248133, -145669, 22470, -53205, 43255, 84873, -94278, -60045, -247100, -229248, -65572, -111294, -71861, -44715, -195551, -119076, -405801, -435408, -474495, -524631, -407197, -387121, -391817, -308123, -324822, -128498, -136687, -208306, -330778, -414740, -380595, -187260, -139293, -80080, -182722, -255158, -268005, -443685, -690682, -642172, -679373, -516974, -313848]
3030c13848j59063J50076o3571j3011O3171r1168m5668O295J85096J03737n6459
3019b34413j20042j80153j25576M8498j86356q2552L72962M3399K4097R0041R0061
3008b60034l2880m2206j31974n948M9646j05723K49499p8808J4677J58180j91865
2997c77436q7298J4534q5784J8531O4944J415J7207J15508J08570o0046n9992
2986c29847j88118n356R3846N3284J48785J11956j4178j17383l48k01584m7094
2975d96037o2701j3340J77149J75693L2107O5685n729j9132K7883j40097k2662
2964b81181j26493j31564k3757L6177l8101J19915K320k819j77951k5575p649
2953f56678J53917L14017L2256J19727l0400j42369j19170O0400j65661k12993
$$ y = [-313848, -472911, -322835, -386406, -399417, -336246, -427414, -473082, -466787, -281691, -177954, -234413, -354455, -534608, -660184, -611686, -798042, -880594, -507632, -464233, -440136, -350095, -260034, -292914, -335120, -467094, -473042, -423396, -529119, -279620, -358428, -343751, -185571, -377436, -464734, -450200, -535984, -517453, -452509, -451094, -433887, -318379, -209809, -269855, -329847, -517965, -523321, -429475, -376191, -227406, -115450, -129628, -247011, -247359, -448943, -496037, -558738, -572078, -394929, -219236, -187129, -121444, -127173, -146305, -118422, -258519, -281181, -407674, -539238, -562995, -526818, -564919, -445004, -442684, -445503, -623454, -649029, -656678, -502761, -188744, -156488, -36761, -67161, -209530, -328700, -268300, -433961, -646954]
$$ [...]
##END NTUPLES=NMR SPECTRUM
##END=
