##TITLE=1H_DE-80H_X3
 200.13MHz, d2o
 8 sc
 
 19ns.26.2.2025
##JCAMPDX= 6.0         $$ Bruker NMR JCAMP-DX V2.0
##DATA TYPE= NMR SPECTRUM
##DATA CLASS= NTUPLES
##ORIGIN= UXNMR, Bruker Analytische Messtechnik GmbH
##OWNER= pz
$$ XWIN-NMR		Version 3.5
$$ Fri Jul 24 13:06:30 2026 Russian Standard Time (UT+4h)  Yarkov@DPX200
##.OBSERVE FREQUENCY= 200.1313
##.OBSERVE NUCLEUS= ^1H
##.ACQUISITION MODE= SIMULTANEOUS
##.ACQUISITION SCHEME= undefined
##.AVERAGES= 8
##.DIGITISER RES= 18
##SPECTROMETER/DATA SYSTEM= spect
##.PULSE SEQUENCE= zg30
##.SOLVENT NAME= CDCl3
##.SHIFT REFERENCE= (INTERNAL, CDCl3, 0, 15.4836)
##AUDIT TRAIL= $$ (NUMBER, WHEN, WHO, WHERE, WHAT)
$$ ##TITLE= Audit trail, XWIN-NMR		Version 3.5
$$ ##JCAMPDX= 5.01
$$ ##ORIGIN= Bruker BioSpin GmbH
$$ ##OWNER= Yarkov
$$ C:/Bruker/XWIN-NMR/data/yarkov2/nmr/H-C/1/pdata/1/auditp.txt
$$ ##AUDIT TRAIL=  $$ (NUMBER, WHEN, WHO, WHERE, WHAT)
(   1,<2026-07-24 13:05:33.12 +0400>,<Yarkov>,<DPX200>,
      <created by zg, POWCHK disabled, PULCHK disabled
       configuration hash MD5:
       00 E9 B6 7A A2 85 ED C7 34 08 36 98 17 FE 4E 26
       data hash MD5: 16K
       F3 29 CD 58 0E 28 B6 72 4F 82 6B D7 D7 C0 AC F5>)
(   2,<2026-07-24 13:05:40.81 +0400>,<Yarkov>,<DPX200>,
      <Start of raw data processing
       efp BC_mod = 2 LB = 0.25 FT_mod = 6 PKNL = 1 PHC0 = -7256.183 PHC1 = 2.82197 SI = 16K 
       data hash MD5: 16K
       AE E3 8A 46 34 00 D9 9B 0F BF AA 9F B3 3A 82 32>)
$$ ##END=
$$ 
$$ hash MD5
$$ 6F A6 38 AD 04 0E FF 2A 30 5F 0D C8 52 CF 3D 72
##$RELAX= 
##$RELAX= 
##$RELAX= 
##$RELAX= 
##$RELAX= 
##$RELAX= 
$$ Bruker specific parameters
$$ --------------------------
##$DU= <C:/Bruker/XWIN-NMR>
##$EXPNO= 1
##$NAME= <H-C>
##$PROCNO= 1
##$TYPE= <nmr>
##$USER= <yarkov2>
##$AMP= (0..31)
100 100 100 100 100 100 100 100 100 100 100 100 100 100 100 100 100 100 
100 100 100 100 100 100 100 100 100 100 100 100 100 100 
##$AQSEQ= 0
##$AQ_mod= 1
##$AUNM= <au_zg>
##$AUTOPOS= <>
##$BF1= 200.13
##$BF2= 200.13
##$BF3= 200.13
##$BF4= 200.13
##$BF5= 200.13
##$BF6= 200.13
##$BF7= 200.13
##$BF8= 200.13
##$BYTORDA= 1
##$CFDGTYP= 0
##$CFRGTYP= 5
##$CHEMSTR= <none>
##$CNST= (0..31)
1 1 145 1 1 1 1 1 1 1 1 1 1 1 1 1 1 1 1 1 1 1 1 1 1 1 1 1 1 1 1 1 
##$CPDPRG= <>
##$CPDPRG1= <>
##$CPDPRG2= <>
##$CPDPRG3= <>
##$CPDPRG4= <mlev>
##$CPDPRG5= <mlev>
##$CPDPRG6= <mlev>
##$CPDPRG7= <mlev>
##$CPDPRG8= <mlev>
##$CPDPRGB= <>
##$CPDPRGT= <>
##$D= (0..31)
0 0.7 0 0 0 0 0 0 0 0 0 0.03 0 0 0 0 0 0 0 0 0 0 0 0 0 0 0 0 0 0 0 0 
##$DATE= 1784883932
##$DBL= (0..7)
120 120 120 120 120 120 120 120 
##$DBP= (0..7)
150 150 150 150 150 150 150 150 
##$DBP07= 0
##$DBPNAM0= <>
##$DBPNAM1= <>
##$DBPNAM2= <>
##$DBPNAM3= <>
##$DBPNAM4= <>
##$DBPNAM5= <>
##$DBPNAM6= <>
##$DBPNAM7= <>
##$DBPOAL= (0..7)
0.5 0.5 0.5 0.5 0.5 0.5 0.5 0.5 
##$DBPOFFS= (0..7)
0 0 0 0 0 0 0 0 
##$DE= 6
##$DECBNUC= <off>
##$DECIM= 32
##$DECNUC= <off>
##$DECSTAT= 4
##$DIGMOD= 1
##$DIGTYP= 9
##$DL= (0..7)
0 120 120 120 120 120 120 120 
##$DP= (0..7)
$$ [...]
##$SUBNAM2= <"">
##$SUBNAM3= <"">
##$SUBNAM4= <"">
##$SUBNAM5= <"">
##$SUBNAM6= <"">
##$SUBNAM7= <"">
##$SUBNAM8= <"">
##$SUBNAM9= <"">
##$SW= 18.0517328524113
##$SWIBOX= (0..15)
0 0 2 0 0 0 0 0 0 0 0 0 0 0 0 0 
##$SW_h= 3612.71676300578
##$TD= 16384
##$TD0= 1
##$TE= 0
##$TE2= 300
##$TE3= 300
##$TEG= 300
##$TL= (0..7)
0 120 120 120 120 120 120 120 
##$TP= (0..7)
150 150 150 150 150 150 150 150 
##$TP07= 0
##$TPNAME0= <>
##$TPNAME1= <>
##$TPNAME2= <>
##$TPNAME3= <>
##$TPNAME4= <>
##$TPNAME5= <>
##$TPNAME6= <>
##$TPNAME7= <>
##$TPOAL= (0..7)
0.5 0.5 0.5 0.5 0.5 0.5 0.5 0.5 
##$TPOFFS= (0..7)
0 0 0 0 0 0 0 0 
##$TUNHIN= 0
##$TUNHOUT= 0
##$TUNXOUT= 0
##$USERA1= <user>
##$USERA2= <user>
##$USERA3= <user>
##$USERA4= <user>
##$USERA5= <user>
##$V9= 5
##$VALIST= <valist>
##$VCLIST= <CCCCCCCCCCCCCCC>
##$VD= 0
##$VDLIST= <DDDDDDDDDDDDDDD>
##$VPLIST= <PPPPPPPPPPPPPPP>
##$VTLIST= <TTTTTTTTTTTTTTT>
##$WBST= 1024
##$WBSW= 4
##$XGAIN= (0..3)
0 0 0 0 
##$XL= 0
##$YL= 0
##$YMAX_a= 48485
##$YMIN_a= -75456
##$ZGOPTNS= <>
##$ZL1= 120
##$ZL2= 120
##$ZL3= 120
##$ZL4= 120
##$ABSF1= 0
##$ABSF2= 0
##$ABSG= 0
##$ABSL= 0
##$ALPHA= 0
##$AQORDER= 0
##$ASSFAC= 0
##$ASSFACI= 0
##$ASSFACX= 0
##$ASSWID= 0
##$AUNMP= <proc_1d>
##$AZFE= 0.1
##$AZFW= 0.1
##$BCFW= 0
##$BC_mod= 2
##$BYTORDP= 0
##$COROFFS= 0
##$CY= -3
##$DATMOD= 1
##$DC= 0
##$DFILT= <>
##$DTYPP= 0
##$F1P= 0
##$F2P= 0
##$FCOR= 1
##$FTSIZE= 16384
##$FT_mod= 6
##$GAMMA= 0
##$GB= 0
##$INTBC= 1
##$INTSCL= 3.241238e-09
##$ISEN= 128
##$LB= 0.25
##$LEV0= 0
##$LPBIN= 0
##$MAXI= 10000
##$MC2= 0
##$MEAN= 0
##$ME_mod= 0
##$MI= 1.114404
##$NCOEF= 0
##$NC_proc= -9
##$NLEV= 6
##$NOISF1= 3.799351
##$NOISF2= 2.8
##$NSP= 0
##$NTH_PI= 0
##$NZP= 0
##$OFFSET= 15.48356
##$PC= 1
##$PHC0= -7256.183
##$PHC1= 2.82197
##$PH_mod= 1
##$PKNL= yes
##$PPARMOD= 0
##$PSCAL= 0
##$PSIGN= 0
##$REVERSE= no
##$SF= 200.130007633776
##$SI= 16384
##$SIGF1= 3
##$SIGF2= 2
##$SINO= 0.751879
##$SIOLD= 32768
##$SREGLST= <19F.Aceton>
##$SSB= 0
##$STSI= 16384
##$STSR= 0
##$SW_p= 3612.71676300578
##$SYMM= 0
##$S_DEV= 0
##$TDeff= 16384
##$TDoff= 0
##$TI= <>
##$TILT= no
##$TM1= 0
##$TM2= 0
##$TOPLEV= 0
##$USERP1= <user>
##$USERP2= <user>
##$USERP3= <user>
##$USERP4= <user>
##$USERP5= <user>
##$WDW= 1
##$XDIM= 16384
##$YMAX_p= 361306392
##$YMIN_p= -2567758
$$ End of Bruker specific parameters
$$ ---------------------------------
##NTUPLES= NMR SPECTRUM
##VAR_NAME=  FREQUENCY,     SPECTRUM/REAL,   SPECTRUM/IMAG
##SYMBOL=    X,             R,               I
##VAR_TYPE=  INDEPENDENT,   DEPENDENT,       DEPENDENT
##VAR_FORM=  AFFN,          ASDF,            ASDF
##VAR_DIM=   16384,         16384,           16384
##UNITS=     HZ,            ARBITRARY UNITS, ARBITRARY UNITS
##FACTOR=    0.220516191357247, 1,           1
##FIRST=     3098.72490263902, 0,            0
##LAST=      -513.99186036676, 0,            0
##MIN=       -513.99186036676, -2567758,     0
##MAX=       3098.72490263902, 361306392,    0
$$ Real data points
##PAGE= N=1
##DATA TABLE= (X++(R..R)), XYDATA
$$ [...]
5056A6276196N33383Q21951q4299n6359K64700L91339K90157p7258L07592N2854
5046A8720256J77064j57971l42766j300598p99090q68417l34370J55613o13834
5037A4635887m90819m34376k00839O35230j9313J81136k30139j62169k13025O65573
5027A4367146O56229J37518k81248O64972L39663R22214N56514P8693K34490M16372
5017A8092563K56981l88389L94477k09873k27319K97307l13646p2396o11419j75803
5007A7042483j1294k95120m66760j03893l17246o32747M77515L08406k14705o24557
4997A5162082O89674J02557L14335M75032J57174M11311R56196J162071P29452
4988B0159884j84988P67678K57205M1872l29778k89184p8448k61676p23863J47302
$$ y = [16276196, 16809579, 17631530, 17547231, 17490872, 17755572, 18146911, 18437068, 18359810, 18667402, 18720256, 18897320, 18739349, 18396583, 17095985, 16296895, 15428478, 15094108, 15249721, 14635887, 14145068, 13710692, 13509853, 14145083, 14125770, 14306906, 14076767, 13914598, 13701573, 14367146, 15023375, 15160893, 14879645, 15544617, 15884280, 16806494, 17363008, 17441701, 17676191, 18092563, 18349544, 17961155, 18355632, 18145759, 17918440, 18215747, 17902101, 17829705, 17218286, 17042483, 17031189, 16736069, 16269309, 16165416, 15848170, 15215423, 15692938, 16001344, 15786639, 15162082, 15851756, 15954313, 16268648, 16743680, 16900854, 17312165, 18268361, 19430432, 20159884, 19974896, 20742574, 20999779, 21041651, 20711873, 20422689, 20344241, 20082565, 19358702, 19506004]
4978A9506004L53861n01604p16808o1855L38134j115520J86095l50217o60763
4969A6977327M31523j95701n49565J44194l56554J9794K37975K06166N92831Q1886
4959A7589876j6207O44690J101145P97695P48052n29515j8962N43878J90346n85089
4949B0465909j39620N4953m52897R8595l71317q57007j59451m53188q67500L92346
4939A7710823R7028k23044k73531K50816K71946l77420l7989l57140N89467J042161
4929A8693117k8563o08890N31588O93432K46420k9155j00049N60253L22697q9745
4919B0191105J79113P4955K62706k15055o04371l1092J75308N45294j02018K24439
4909B0700384k57968Q5733l31941K19865L36166P86150L98588K86725J89322Q70573
$$ y = [19506004, 19859865, 19358261, 18641453, 18579598, 18917732, 17802212, 17988307, 17638090, 16977327, 17408850, 17213149, 16663584, 16807778, 16451224, 16471018, 16708993, 16915159, 17507990, 17589876, 17573669, 18218359, 19319504, 20117199, 20865251, 20335736, 20316774, 20860652, 21050998, 20465909, 20326289, 20381242, 19928345, 20026940, 19655623, 18798616, 18639165, 18185977, 17318477, 17710823, 17807851, 17584807, 17311276, 17562092, 17834038, 17456618, 17418629, 17061489, 17650956, 18693117, 18664554, 18055664, 18587252, 19280684, 19527104, 19497949, 19397900, 19958153, 20280850, 20191105, 20370218, 20445173, 20707879, 20492824, 19888453, 19857361, 20032669, 20577963, 20475945, 20700384, 20442416, 20528149, 20196208, 20416073, 20752239, 21538389, 21936977, 22223702, 22413024, 23283597]
4899B3283597P66450N59343L84877L3373q14308R3745q1788o68479n43702q54038
4889B2159070K78109l3354j37338k79525o39022O4282J73611k16493L68047R12284
4879B2649671J09318L5348N22697K08470M44575O46249Q54336P88642K49279J074435
4869B7583020P26711P8046R71675J167584O58764o0944J24480o84573m04191l75641
4859B9784931j231850j335044n29343m61277o32505L97594K37847l53787l96821
4850B5479745m68965p8545J23582K31356r7904P9844M83993m2083k11105l0119
4840B5469799K49505K19156N32278J024604P20965J58436Q05799O05647j70784
4831B9615405J078842K53765N9987m09159k2524l69381m45818l2177N05460J53470
$$ y = [23283597, 24050047, 24609390, 24994267, 25027640, 24213332, 24307077, 24225289, 23556810, 23013108, 22159070, 22437179, 22403825, 22266487, 21986962, 21347940, 21412222, 21585833, 21369340, 21737387, 22649671, 22758989, 22794337, 23317034, 23525504, 23970079, 24616328, 25470664, 26259306, 26508585, 27583020, 28309731, 28387777, 29359452, 30527036, 31185800, 31124856, 31249336, 30564763, 30160572, 29784931, 28553081, 27218037, 26688694, 26227417, 25594912, 25992506, 26230353, 25876566, 25479745, 25010780, 24932235, 25055817, 25287173, 25189269, 25269113, 25753106, 25711023, 25499918, 25469799, 25719304, 25938460, 26470738, 27495342, 28216307, 28374743, 29180542, 29786189, 29615405, 30694247, 30948012, 31007999, 30598840, 30576316, 30206935, 29761117, 29728940, 30234400, 30387870]
4821C0387870l45629J85873J51931r8685N5845J12174L79687J94398l26830l52744
4811C0343890K26963M75983Q29005l04181o39392K41213O64612K38413L49528
4802C2426034j35824Q0396O84482P5194o9248M01236k4681l87121j70913J73646
4792C3053201J78881L28206K18041p8749J76096k66529M16678L12253o9825N20410
4782C4788663N49325k53704l358N83770P89248J1721j85348Q19348M76612L8012
4772C7614289K32671L09186R60493J65820K25110Q62877P27058M18433M42221
4763D1958158M25407N24945J098858P02593Q04264K91686L26855Q54906L35623
4754D7323295N09746P60465L99739J40303L96386m9969O2776P02453P09523L5161
$$ y = [30387870, 30042241, 30228114, 30380045, 30281360, 30337205, 30449379, 30829066, 31023464, 30696634, 30343890, 30570853, 31046836, 31875841, 31571660, 30932268, 31173481, 31838093, 32076506, 32426034, 32290210, 32370606, 33055088, 33130282, 33061034, 33462270, 33437589, 33050468, 32879555, 33053201, 33232082, 33560288, 33778329, 33699580, 33875676, 33609147, 34025825, 34338078, 34268253, 34788663, 35337988, 35084284, 35080926, 35664696, 36453944, 36465665, 36280317, 37099665, 37576277, 37614289, 37846960, 38156146, 39116639, 39282459, 39507569, 40370446, 41097504, 41515937, 41958158, 42383565, 42908510, 44007368, 44709961, 45514225, 45805911, 46132766, 46987672, 47323295, 47833041, 48593506, 48993245, 49133548, 49529934, 49479965, 49542741, 50245194, 50954717, 50989878]
4744E0989878K54257l4025L64267N61154J37649L92113J97682l95409Q5246j49386
4734E2403426j25136L00918L22822L4499l60375L17592R03798L57817O1186j87964
4724E4028583N77408M42146O24488N89576O04883L12029n3437M21616J17514o36752
4714E7028054K49041M27853r74771K60156N99994O93959J206964J310977J884299
4705F2686526N93970p41752n74915j185422l008430k669064j627760j076551j468927
4696E0927675j056949q55570m66839o44278q29146q61890r22457m93121j045954
4687D3751471j096232j197600o44691p51591j18607o61513q36315l16985k54095
4678C7873842j171026o17639K22265q00882l55531K84661m60681m16309l10095
$$ y = [50989878, 51244135, 51210110, 51574377, 52135531, 52273180, 52665293, 52862975, 52467566, 52552812, 52403426, 52278290, 52579208, 52902030, 52936529, 52576154, 52893746, 53797544, 54155361, 54216547, 54028583, 54605991, 55048137, 55672625, 56262201, 56867084, 57179113, 57125676, 57547292, 57664806, 57028054, 57277095, 57704948, 56730177, 56990333, 57590327, 58284286, 59491250, 60802227, 62686526, 63280496, 62538744, 61963829, 60778407, 57769977, 55100913, 53473153, 52396602, 50927675, 49870726, 49015156, 48548317, 47904039, 47074893, 46213003, 45290546, 44797425, 43751471, 42655239, 41457639, 40812948, 40061357, 39942750, 39281237, 38444922, 38127937, 37873842, 36702816, 36085177, 36307442, 35506560, 35151029, 35435690, 34975009, 34558700, 34248605]
4669C4248605o56206j4513j242109j735449k02416l17739o13351r20817k76405
4660B8269600l09278k73220r36960q96725o55044l35514m03528k81087m38910
4651B3739334k53325m36459o70107j14768r1564m88774l30592n65262n07376K61342
4641B0542449p81630j68434k31979j29417q47171o23074n43218j45535p868o76866
4631A6387257m12399L5942l58898j43629l60527m32610K38235j60380j011111
4622A3781880l21948N35397n11785R0940L53089j60263l61618p835j84475n7267
4612A3156115k77912j87780l00652n34103K04717K53276n23607m16373q4801K6362
4602A1315242O8260q646K06390m06861n03281L64822R2088m33073j89051K15741
$$ y = [34248605, 33592399, 33577886, 32335777, 30600328, 30397912, 30080173, 29466822, 28546005, 28269600, 27960322, 27687102, 26750142, 25853417, 25198373, 24862859, 24459331, 24178244, 23739334, 23486009, 23049550, 22379443, 22264675, 22173111, 21684337, 21353745, 20788483, 20281107, 20542449, 19760819, 19592385, 19360406, 19230989, 18383818, 17760744, 17217526, 17071991, 17064123, 16387257, 15974858, 16010800, 15651902, 15508273, 15147746, 14715136, 14953371, 14792991, 13781880, 13459932, 13995329, 13483544, 13574484, 13927573, 13767310, 13405692, 13397857, 13213382, 13156115, 12878203, 12690423, 12389771, 11855668, 12060385, 12313661, 11790054, 11373681, 11288880, 11315242, 11383502, 11374856, 11581246, 11174385, 10671104, 11035926, 11128014, 10694941, 10505890, 10721631]
4592A0721631l04199r40906K14842M07705j00790j20341P1093K28766j81666J02100
4582A0098235j72797q6140j08053m1754L10963n26905l75408M74904Q02106p4301
4572A0300850p30686J1263K23607m10386M437j0321m95942J1792N2353L8018J77913
4561I172898K43105M47409n39970J35474L38289k45243m78078k4508R6012n99783
4551H545605j6231k29622L42651N6916L50871m02784j98153M16807o76112j70744
4541H019204j17581O638J47348J33589J04671l37252m1756k95346N41462K14797
4531H375774l21116r6753k91469o4219k87880L76260M50588m0740l22845k95397
4521G482203N11163J43741l87719L12863p48727J1872K05560m00805L37298L14279
$$ y = [10721631, 10417432, 9476526, 9691368, 10099073, 9998283, 9877942, 9949035, 10177801, 9996135, 10098235, 9925438, 9839298, 9731245, 9689491, 10000454, 9473549, 9098141, 9573045, 10375151, 10300850, 9570164, 9581427, 9805034, 9394648, 9399085, 9388764, 8892822, 8904614, 8956967, 8994985, 9172898, 9416003, 9863412, 9323442, 9458916, 9797205, 9551962, 9073884, 9049376, 9145388, 8545605, 8529374, 8299752, 8642403, 8699319, 9050190, 8647406, 8449253, 8866060, 8189948, 8019204, 7901623, 7908261, 8055609, 8189198, 8293869, 7956617, 7914861, 7619515, 8160977, 8375774, 8054658, 7957905, 7666436, 7602217, 7314337, 7690597, 8141185, 8100445, 7777600, 7482203, 7993366, 8137107, 7749388, 8062251, 7313524, 7325396, 7530956, 7130151, 7467449, 7781728]
4511G781728j42878l23021Q5381k6832j67966K32841N58838p6060l82160k40757
4501G299114j77846K68725P16417J48546n01348j42769l87882J16249M28678j95228
4491G572656m13658M6298K47124J37320k03092q2802K97564O26015l76816j90361
4481G660248L35700l04773K51806o92540k75472P40894k23974J442N50077P5428
4471H118836J84615n20880K46056k63540K46970L27411L96083J78964j02546m32653
4461H379316k5578M07616L33598k72471j92090M10470m24796J031660o47412m49522
4451H550791M73832q7280o4853l05563O29096K50392o40490K60744L90014M87304
4441I943987m77912j52655m09832n40820L42524N97012J32099k1210m45846M53356
$$ y = [7781728, 7638850, 7315829, 7401210, 7374378, 7206412, 7439253, 7998091, 7922031, 7539871, 7299114, 7121268, 7389993, 8106410, 8254956, 7753608, 7610839, 7222957, 7339206, 7767884, 7572656, 7158998, 7205296, 7452420, 7589740, 7386648, 7303846, 7601410, 8227425, 7850609, 7660248, 7995948, 7691175, 7942981, 7250441, 6974969, 7715863, 7491889, 7493331, 8043408, 8118836, 8303451, 7782571, 8028627, 7765087, 8012057, 8339468, 8735551, 8914515, 8811969, 8379316, 8353738, 8761354, 9094952, 8822481, 8630391, 9040861, 8616065, 9647725, 9000313, 8550791, 9024623, 8937343, 8872490, 8566927, 9196023, 9446415, 8805925, 9066669, 9456683, 9943987, 9466075, 9313420, 8903588, 8362768, 8705292, 9302304, 9434403, 9413193, 8967347, 9420703]
4431I420703K78856k82652N03964k42005k25589K55679M47935O5337p4670o5206
4421A0082352K75355l80225j51228K97833J74076l31719O64304K05652m15346
4412A0421054J1386l21287j57146p3934K60138l05367M8372M45228J57315K16722
4402A0702481k05166m989K37311J24383M6597m55484L85031Q83109O9353p40276
4392A1042350O18542M18998M07471N644K13844j67839O9678K49482n14740l9074
4382A2304356K0209o57045L68249k39467j47743L76832J8371l24289J87931J85038
4372A2092442m73443O12249j36458m57718K70195M71190N13988J27764P1524l67273
4362A2724460P3195J108411L80575q9780j58050M80522j85018l08700J5636l2467
$$ y = [9420703, 9699559, 9416907, 9920871, 9678866, 9453277, 9708956, 10156891, 10222228, 10147558, 10082352, 10357707, 9977482, 9826254, 10124087, 10298163, 9966444, 10630748, 10836400, 10421054, 10432440, 10111153, 9954007, 9880073, 10140211, 9834844, 9883216, 10328444, 10485759, 10702481, 10497315, 10492326, 10729637, 10854020, 10900617, 10445133, 10830164, 11713273, 11782626, 11042350, 11660892, 12079890, 12487361, 12493005, 12706849, 12539010, 12608688, 12858170, 12343430, 12304356, 12324565, 11667520, 12035769, 11796302, 11648559, 12025391, 12043762, 11719473, 11907404, 12092442, 11618999, 12231248, 12094790, 11637072, 11907267, 12378457, 12892445, 13020209, 13091733, 12724460, 12797655, 13906066, 14286641, 14196861, 14038811, 14519333, 14334315, 14025615, 14041251, 14008784]
4352A4008784j24001L19667J22266O33039P2409N33575j9081K25139M01067l4296
4342A6138568m10928O82982P12182l45145M10135Q02488Q873L20012M2619P18011
4332A9079797M73914l59471K62522O22385N50539l03953N02594L87669L23620
4323B1539616O66784J35949L50790L84787K41025O86239K98719P91117Q79517
4314B5974543j9628M17541M98157J003096Q06809J049697M81280O14612O64104
4305C1490211M98540N31273M0705J500647O70180J08738M21524R14785P12278
4296C6888881N92343N76280Q3272R81671R21006L31314M92036Q82187L74037O54243
4286D2777270L16068Q36193O88805M47779O74377P92839Q05444n7356K57276O17485
$$ y = [14008784, 13884783, 14204450, 14326716, 14959755, 15032164, 15565739, 15546658, 15771797, 16172864, 16138568, 15727640, 16410622, 17122804, 16777659, 17187794, 17990282, 17999155, 18319167, 18361786, 19079797, 19553711, 19194240, 19456762, 20079147, 20629686, 20325733, 20828327, 21215996, 21539616, 22206400, 22342349, 22693139, 23077926, 23318951, 24005190, 24303909, 25095026, 25974543, 25954915, 26372456, 26870613, 27873709, 28680518, 29730215, 30211495, 30826107, 31490211, 31988751, 32520024, 32560729, 34061376, 34731556, 34840294, 35261818, 36176603, 36888881, 37481224, 38057504, 38140776, 39122447, 40043453, 40374767, 40866803, 41748990, 42123027, 42777270, 43093338, 43929531, 44618336, 45066115, 45740492, 46533331, 47338775, 47281419, 47538695, 48156180]
4276D8156180J28299P4892L58288M90948M52406k00264N36103L36294o0446j55412
4266E0117288K56157N16465K1274L39147l41968o38315j48716m2464j52081j17639
4256D9809148l19689k10707l81853K10277k30142o71345L00431m52136m65l10956
4246D7742563M148p98600k14051J04753n31409l48446L34716j090K89105M6729
4236D6628418l40067j4446r8433m05003P4880l8273l56203J26298k17993L67760
4226D5726938J7747L155N85792j90815k35461M40136J75757L06914l448K04686
4216D7031401M31686l26639M4532L56691M57220l38285J24183J61176Q50720N6674
4206D8849359K83982O88595L05033N59803J95777M79915n2719r3341m36720K82995
$$ y = [48156180, 48284479, 48359371, 48717659, 49208607, 49661013, 49460749, 49996852, 50333146, 50272700, 50117288, 50373445, 50889910, 50911184, 51250331, 50908363, 50270048, 50121332, 50078868, 49926787, 49809148, 49489459, 49278752, 48896899, 49107176, 48877034, 48205689, 48506120, 48053984, 48053519, 47742563, 47746711, 46948111, 46734060, 46838813, 46307404, 45958958, 46293674, 46292584, 46581689, 46628418, 46288351, 46273905, 46175472, 45770469, 45845349, 45807076, 45450873, 45577171, 45359178, 45726938, 45744685, 45747840, 46333632, 46142817, 45907356, 46347492, 46523249, 46830163, 46826715, 47031401, 47463087, 47136448, 47180980, 47537671, 47994891, 47656606, 47780789, 47941965, 48792685, 48849359, 49133341, 49821936, 50126969, 50686772, 50882549, 51362464, 51309745, 51216404, 50779684, 51062679]
4196E1062679O72012J87684K80608J00575Q29700M18003J38446j31400K98080
4187E3856387M26847l28180P5480K93299J62934P39416M38817m42649J24854L79577
4177E5726782P02372l05225J55870Q55138k22289N97235O40047j27163J7056O64176
4167E8703999M45916J30778K75976J81887N9644P80132J34199l39840l10247n01505
4157E9560939l13154q6712L91729r3563l24435m22200J05809r8565J42219j42531
4147E8719536l81192n88631m33945j3456k06402m28618K8254o49259l35906K34615
4137E5944996l48903k75896j25002j51084j48831m85415J37800o14723k50156
4128E3682786J00767j88472l90197j52421j009157l78725M9208o25336J27730
$$ y = [51062679, 51734691, 51922375, 52202983, 52303558, 53133258, 53551261, 53689707, 53558307, 53856387, 54283234, 53955054, 54030534, 54323833, 54486767, 55226183, 55665000, 55222351, 55347205, 55726782, 56429154, 56123929, 56279799, 57134937, 56912648, 57509883, 58149930, 58022767, 58039823, 58703999, 59149915, 59280693, 59556669, 59738556, 59798200, 60578332, 60712531, 60372691, 60062444, 59560939, 59247785, 59161073, 59552802, 59459239, 59134804, 58712604, 58818413, 58719848, 58862067, 58719536, 58338344, 57749713, 57315768, 57302312, 57095910, 56667292, 56695546, 56046287, 55710381, 55944996, 55596093, 55320197, 55195195, 55044111, 54895280, 54409865, 54547665, 53932942, 53682786, 53783553, 53595081, 53204884, 53052463, 52043306, 51664581, 51713789, 51088453, 51216183]
4119E1216183k46485l59509q82512K39468R254j7945k70177K94754M72646l42597
4109E0113080R7481K4782O54685j10325k10433l7941N16380P49125P60265O79317
4099E3236416O62723M24538Q99661n6122O59292O49001R48021O36949O75515Q09997
4089E9545991J040602J168388Q81792K94501M54073J029225Q82511O75948J282547
4080F7255578J488058p4901K85133J546501R32839Q10138j34218J19757J68881
4071G2397766k8184N66772J15847K76308Q4187j20233j17134j16659K17460L61841
4061G3637971k30518K31217l14375m53644K64607O30874L11064K90943n02732
4052G3865407P45167L53557P15510Q80319J131680R38629O81768O66339J684062
$$ y = [51216183, 50969698, 50610189, 49727677, 49967145, 49976399, 49958454, 49688277, 49983031, 50455677, 50113080, 50210561, 50235343, 50890028, 50779703, 50569270, 50531329, 51047709, 51796834, 52557099, 53236416, 53899139, 54323677, 55223338, 55167216, 55826508, 56475509, 57423530, 58060479, 58735994, 59545991, 60586593, 61754981, 62636773, 62931274, 63385347, 64414572, 65297083, 65973031, 67255578, 68743636, 68668735, 68953868, 70500369, 71433208, 72243346, 72109128, 72228885, 72397766, 72369582, 72936354, 73052201, 73328509, 73412696, 73292463, 73175329, 73058670, 73276130, 73637971, 73407453, 73638670, 73324295, 72870651, 73135258, 73766132, 74077196, 74368139, 73865407, 74610574, 74964131, 75679641, 76559960, 77691640, 78630269, 79312037, 79978376, 81662438]
4043H1662438R03767J638177J177912P87752J701990J284975J103870J026186
4035I1287067J204355J051715R08962O23517N53147O62881P27344O10176L78722
4026I8007886L14376J66404n1856m10326n8461L8575l29014n49859o41433p85582
4016I5700710k92937l79876q40983l89990p96768o51172n23832j189441p67093
4007H9868618p26253q68598J87390L76902q87303j153802m84629j1163l6207q88758
3997H5376197n41711P8216j96863L66105o55728P11890J029875l03577K07817
3988H6072221N71909j66221k35666L21616n5487p277l71299k80705l02500n91430
3978H4955161j98101l89940q90351m40497j93946n92389p74832o82628o80397
$$ y = [81662438, 82566205, 84204382, 85382294, 86170046, 87872036, 89157011, 90260881, 91287067, 92491422, 93543137, 94452099, 95075616, 95628763, 96291644, 97018988, 97629164, 98007886, 98322262, 98488666, 98436810, 98026484, 97968023, 98006598, 97677584, 97127725, 96486292, 95700710, 95407773, 95027897, 94186914, 93796924, 93000156, 92348984, 91825152, 90635711, 89868618, 89142365, 88273767, 88461157, 88838059, 87950756, 86796954, 86312325, 86301162, 86264955, 85376197, 84834486, 84912702, 84715839, 85081944, 84426216, 85138106, 86167981, 85864404, 86072221, 86644130, 86477909, 86242243, 86563859, 86508372, 86501095, 86129796, 85849091, 85546591, 84955161, 84757060, 84367120, 83476769, 83036272, 82842326, 82249937, 81475105, 80792477, 80112080]
3969H0112080o31082n98391j003770j308040j050407m55771j203734j330889j320632
3960G1209364r21523n10621j277366j113038o04456o76641j013580r53509l63290
3951F3775340j3307l87060l21284q16667j62998p89l6850o37106l13631r59555
3941F0126093p0449K37925m9851j59458j22631K92544o82272l92431J054634L10231
3931F0544335M37729N04199l66833n95412o13455r64033p19984q10028r84093
3922E6432425j170599q82786r37941r52467q89136o69102r54817k17755L07774
3913E0065596l54902o54401r9626O76889m42088L78620M36188J36432P20553K30493
3903E1093754R53165J218753q1997L80982J351717J035140L22823J02343J03478
$$ y = [80112080, 79480998, 78882607, 77878837, 76570797, 75520390, 75064619, 73860885, 72529996, 71209364, 70287841, 69777220, 68499854, 67386816, 66782360, 66105719, 65092139, 64138630, 63775340, 63762033, 63374973, 63053689, 62237022, 62074024, 62073235, 62036385, 61399279, 61085648, 60126093, 60055644, 60293569, 60243718, 60084260, 59961629, 60254173, 59571901, 59179470, 60234104, 60544335, 60982064, 61486263, 61119430, 60524018, 59910563, 58946530, 58226546, 57416518, 56432425, 55261826, 54379040, 53441099, 52488632, 51599496, 50930394, 49975577, 49757822, 50065596, 49710694, 49056293, 48956667, 49633556, 49191468, 49570088, 50006276, 50142708, 50863261, 51093754, 52046919, 53265672, 53183675, 53564657, 54916374, 55951514, 56274337, 56376680, 56480158]
3894E6480158N07865L41263p03491M61942J527827J934181J029091P20333J234106
3885F3533275J113827J678325K101791K206397K623224J529686J768258K524099
3877G9078882J812728J580850J342396J304937J047006O40324P97473P47951J189140
3868H9541687O58545N15599P00918O75314N84072j68202J68870j25264J72717
3859I2724256R7428k42393N08439j04609o20999j6814L7324j30975m3297R58251
3849I3166611L94126Q26009Q51509O82942J225145K023461J086993J316176J823974
3840A03396946K328922J635692J519821J622918J052461J098278J528229J509675
3832A15692942R88972J727775J388627J298483P70279J113078J218263P90414
$$ y = [56480158, 56988023, 57329286, 56625795, 57087737, 58615564, 60549745, 61578836, 62299169, 63533275, 64647102, 66325427, 68427218, 70633615, 73256839, 74786525, 76554783, 79078882, 80891610, 82472460, 83814856, 85119793, 86166799, 86807123, 87604596, 88352547, 89541687, 90200232, 90715831, 91416749, 92092063, 92676135, 92507933, 92676803, 92551539, 92724256, 92821684, 92579291, 93087730, 92983121, 92362122, 92345308, 92382632, 92251657, 92208360, 93166611, 93560737, 94386746, 95238255, 95921197, 97146342, 99169803, 100256796, 101572972, 103396946, 105725868, 107361560, 108881381, 110504299, 111556760, 112655038, 114183267, 115692942, 116681914, 118409689, 119798316, 121096799, 121867078, 122980156, 124198419, 124988833]
3824A24988833Q93964O21997L47643l84790p36613j104336j299022j250419m94875
3815A21582382r82968j102152j162712r70050j687304j353511q48347j711097
3807A11764241j615251j641388j103620k272145k276201j416357k200968j869394
3799I7368917j856296j449963j255359j941208j737398r43151r29228j693858
3791H5562456p53352n93788r83559m76877q25387n16701k02554l48832j21741
3782H0739665M7944j20072k51229L65727k951J77558L45897O35161O83821J48225
3772H2769746N86745L54106N55853M17343N15251N31886o2442L38962M09920K66634
3762H6684004j93185K74800R2736k69706Q6639p77200m48198j6741m4675k76241
$$ y = [124988833, 125882797, 126504794, 126852437, 126467647, 125731034, 124626698, 123327676, 122077257, 121582382, 120599414, 119497262, 118334550, 117364500, 115677196, 114323685, 113475338, 111764241, 110148990, 108507602, 107403982, 105131837, 102855636, 101439279, 99238311, 97368917, 95512621, 94062658, 92807299, 90866091, 89128693, 88185542, 87256314, 85562456, 84809104, 84215316, 83231757, 82754880, 81929493, 81412792, 81210238, 80861406, 80739665, 80787609, 80667537, 80416308, 80782035, 80779084, 80956642, 81302539, 81937700, 82621521, 82769746, 83356491, 83710597, 84266450, 84683793, 85199044, 85730930, 85668488, 86007450, 86417370, 86684004, 86490819, 86765619, 86858355, 86588649, 86675288, 85898088, 85449890, 85433149, 85388474, 85112233]
3752H5112233j285722r20731l81347j320024j416635r37373j097892j062676j612050
3743G5077783j061280k160797k032184k92745j264569j620063j287830j120172
3735F4238143j764107j512123j357187j026753j044157j248317j312555j314262
3727E3658682j729084j600831r13819j053774j099029j171076j158177n54771
3719D4378121o45795p06232k05582o60951m73258m90402l26878p28815m71356
3710C9668852o74278l26480m09353n80324m3689j55063k97441r7338M2298J73029
3700C7300213n09648R0149l8429J56942J56442o43945m9982M0747J8653J4658
3690C6535800l62686m81142m01118n11730M04273q22888l10485k39809n48903
$$ y = [85112233, 83826511, 82905780, 82524433, 81204409, 79787774, 78850401, 77752509, 76689833, 75077783, 74016503, 71855706, 69823522, 69530777, 68266208, 66646145, 65358315, 64238143, 62474036, 60961913, 59604726, 58577973, 57533816, 56285499, 54972944, 53658682, 51929598, 50328767, 49414948, 48361174, 47262145, 46091069, 44932892, 44378121, 43732326, 43026094, 42820512, 42159561, 41686303, 41195901, 40869023, 40140208, 39668852, 38994574, 38668094, 38258741, 37678417, 37634728, 37479665, 37182224, 37084886, 37127184, 37300213, 36790565, 36880714, 36842285, 36999227, 37155669, 36511724, 36461742, 36502489, 36521142, 36535800, 36173114, 35691972, 35290854, 34779124, 35183397, 34360509, 34050024, 33810215, 33261312]
3681C3261312k7197R7215l58057R014l97389m17451J054167l84972N99905N17626
3671C3954173j89151N7665m13724p86432r32765n67807r75347r49117p1647r29326
3661B8196522j45218M26996J49657J17984j91003o03079J36422l71934q38057
3652B6878290r01944q01920r92652r26115R2477n64451p34538o12474l13438k08723
3642B0914512l96238j19388n51964q05559R3432K35305J10119q0843J89699m8173
3632A9540902k25248L08026N18457M99008P5185l57885J78999j18810N44129O37745
3622B1600508M83529Q84393Q76162J37694M46846K19730P22587P12382M83845
3613B6567676J535284N53208J260052O51851M67973M37739j7731J438117O38550
$$ y = [33261312, 33234115, 33331330, 32973273, 32982287, 32584898, 32167447, 33221614, 32836642, 33436547, 33954173, 33765022, 33822687, 33408963, 32622531, 31689766, 31121959, 30146612, 29197495, 29125848, 28196522, 28051304, 28478300, 28627957, 28745941, 28554938, 27951859, 28088281, 27716347, 26878290, 25976346, 25174426, 24181774, 23255659, 23348136, 22783685, 22049147, 21436673, 21123235, 20914512, 20518274, 20398886, 19846922, 19041363, 19134795, 19370100, 19480219, 19399376, 19589075, 19540902, 19315654, 19623680, 20142137, 20641145, 20716330, 20358445, 20537444, 20418634, 20962763, 21600508, 22084037, 22968430, 23844592, 23982286, 24429132, 24648862, 25371449, 26083831, 26567676, 28102960, 28656168, 29916220, 30568071, 31036044, 31473783, 31456052, 32894169, 33532719]
3604C3532719N62012O27155N17971J282137N62347M60408m61994j02848l25469
3595C6654438o7391Q2619m74194o11974m83423q73280j543639l57084q50611q06166
3585C0669295j077688o46184j048488o22236j050930q92187n84747j152060j082946
3576B2511829j029096l70253o62168m77310q80070p16060p43312j90375k52462
3567A7190723n96387j23293k25990j29049K51780k13677m77134K58701K93967
3558A6229641j66777n07846L12737r0955J37711L37790N85056N81902k48144j28748
3548A7042367J48427j08233M20869M97434n40504L73575P80567L51699N18253
3539A9484454J57781j88333M61139P05799K89441P67021r4629J35013N46823M91881
$$ y = [33532719, 34094731, 34721886, 35239857, 36521994, 37084341, 37544749, 37082755, 36979907, 36654438, 36587047, 36669666, 36195472, 35583498, 35100075, 34226795, 32683156, 32326072, 31475461, 30669295, 29591607, 28945423, 27896935, 27274699, 26223769, 25331582, 24746835, 23594775, 22511829, 21482733, 21112480, 20450312, 19973002, 19092932, 18376872, 17633560, 17443185, 17190723, 16594336, 16471043, 16245053, 16116004, 16367784, 16154107, 15676973, 15935674, 16229641, 16062864, 15555018, 15867755, 15776800, 15914511, 16252301, 16837357, 17419259, 17171115, 17042367, 17190794, 17082561, 17503430, 18000864, 17460360, 17833935, 18614502, 18966201, 19484454, 19642235, 19453902, 19915041, 20620840, 20910281, 21677302, 21582673, 21717686, 22264509, 22756390]
3529B2756390P20702Q1927k89128m67914n3403o49115r25196k99121o90422K1490
3519B0206210M305p55440p06582m7788n0953J43818r30580R1504Q91548k17648
3509A8628394N12645m874J54956k10220N08604L95326n2846J14693M93362R34603
3499B1474643J253145R51809R64607J174972R40144M95443N38865O36981J36921
3490B8567530m45158l49428J61181q11356q22466n3420k30958K24723Q88060Q03398
3480B7932106J51638N53806J227337K285519K196517J882938K628496K790636
3472D1648993K568832K361920K872813K494086R72523r99694n99268r48161j273142
3463D9098902j497331k069424j199627j468546j516090j687745k115508j663227
$$ y = [22756390, 23477092, 23559019, 23269891, 22801977, 22748574, 22099459, 21174263, 20875142, 20184720, 20206210, 20210515, 19455075, 18748493, 18700705, 18649752, 18793570, 17862990, 17954494, 18846042, 18628394, 19141039, 19136165, 19291121, 19080901, 19589505, 19984831, 19931985, 20046678, 20540040, 21474643, 22727788, 23679597, 24644204, 25819176, 26759320, 27254763, 27793628, 28430609, 28567530, 28122372, 27772944, 27934125, 27122769, 26300303, 26246883, 26015925, 26240648, 27128708, 27932106, 28083744, 28637550, 29864887, 32150406, 34346923, 36229861, 38858357, 41648993, 44217825, 46579745, 49452558, 51946644, 52919167, 51919473, 51320205, 50372044, 49098902, 47601571, 45532147, 44332520, 42863974, 41347884, 39660139, 37544631, 35881404]
3455C5881404j593742j636166k473453j341248n41245p95891o5397k40837K30368
3446B7423793Q20008Q21552P73338J210149K632663K784590J734698K358730J064760
3437D1624281l47584j533201k070707k299637k875208k724500j311151j714853
3429B6747440j255607q99263m55195q76249r81588n23454j783439l24388l10614
3420A9337643l06823K23209m70254Q60970N91728L26411R25079R92811O32525
3411B3113299M97355O10568L37867J78966M42273j66422j31808n32503j146898
3402B3202697o86916o07089j341378j240414q35217m04677n58341j071287r55781
3393A5501597m60093J93708r37107j95675k28245L3854L22601J62211N45173M32122
$$ y = [35881404, 34287662, 32651496, 30178043, 28836795, 28295550, 27499659, 27434262, 27193425, 27423793, 28243801, 29065353, 29838691, 31048840, 33681503, 36466093, 38200791, 40559521, 41624281, 41276697, 39743496, 37672789, 35373152, 32497944, 29773444, 28462293, 26747440, 25491833, 24592570, 24137375, 23261126, 22279538, 21756084, 19972645, 19648257, 19337643, 19030820, 19254029, 18783775, 19644745, 20236473, 20562884, 21487963, 22480774, 23113299, 23610654, 24221222, 24559089, 24738055, 25180328, 25013906, 24882098, 24349595, 23202697, 22515781, 21908692, 20567314, 19326900, 18491683, 18087006, 17528665, 16457378, 15501597, 15041504, 15235212, 14298105, 14102430, 13874185, 13908039, 14230640, 14392851, 14938024, 15370146]
3383A5370146R25751J424764M03025P857p05816p86870n89720m39403l79448r05684
3373A4324602q25201j211521Q311o16443n52218K17752J16858l28915j12532m90406
3363A0530287M2924R02837j72081O2835k88685L68356q57973n4850K93109M68692
3353A1295451j06893n51K49210K69677L28884K5233m52235Q6416q6814p43908
3343A0864470l49527K67235k37414k63660n44746j03528K37653J56756l00283
3334I726956n61287O35593l75437K18767K2060k46561L12193J02776L29036M38750
3324A0602846l21737r2364K30819j04678j11385j30034l40528J18575N83128N93678
3314A1028320L76241L90677P34485J319207O70679M5684J718363J802735J183501
$$ y = [15370146, 16295897, 17720661, 18123686, 18131543, 17425727, 16638857, 16049137, 15609734, 15230286, 14324602, 13499401, 12287880, 12296191, 11679748, 11127530, 11345282, 11462140, 11133225, 11020693, 10530287, 10573211, 11476048, 11303967, 11366802, 11078117, 11446473, 10588500, 10533650, 10826759, 11295451, 11188558, 11188007, 11437217, 11706894, 12035778, 12061011, 11608776, 11695192, 11608378, 10864470, 10514943, 10782178, 10544764, 10281104, 9736358, 9632830, 9870483, 10027239, 9726956, 9165669, 9801262, 9425825, 9644592, 9666652, 9420091, 9732284, 9835060, 10164096, 10602846, 10281109, 10188745, 10419564, 10314886, 10203501, 10073467, 9732939, 9851514, 10434642, 11028320, 11404561, 11795238, 12529723, 13848930, 14519609, 14565293, 16283656, 18086391, 19269892]
3305A9269892K597182K474203K273129J930848J242755P37193l76762j757706
3297B8390734k206911j456876j291063k442758j899518n62330j266398j209033
3289A6055847o51537q16914l8509J74351j25797L86302J94972L33991J482707
3280A6995413N87048M58389J226916J100437J625199K615260L338411M412986
3272C2360059M560453M987251M672586L705872J642797n85958k739897m327581
3264D4275582l918766m839212m480003l574108l546979k988106k491199j377362
3256A7059847r22682j781977n04375m62428o55926o7787k32317J24278j2534M25129
3246A2969228J82609L28682M52401J039339J594989J032249J471062J534361J980886
$$ y = [19269892, 21867074, 24341277, 26614406, 28545254, 29788009, 30525202, 30148440, 28390734, 26183823, 24726947, 23435884, 20993126, 19093608, 18531278, 17264880, 16055847, 15404310, 14587396, 14548887, 14723238, 14597441, 14983743, 15178715, 15512706, 16995413, 17582461, 18040850, 19267766, 20368203, 21993402, 24608662, 27947073, 32360059, 36920512, 41907763, 46580349, 50286221, 51929018, 51343060, 48603163, 44275582, 40356816, 35517604, 31037601, 27463493, 23916514, 20928408, 18437209, 17059847, 16137165, 14355188, 13850813, 13388385, 12732459, 12664672, 12432355, 12556633, 12544099, 12969228, 13151837, 13480519, 13932920, 14972259, 16567248, 17599497, 19070559, 20604920, 22585806]
3237B2585806J306563J274505M39996j175274j757893k010138j749328j307294
3229A7606943j795540k426183j429575p83120q94306o86384j216357n13385m71342
3220G390751p69856j74777m11607K58949J98914l99503M07391r29254m66048N42856
3210E647816j49795L95658j40243o0592j36538Q0415K36396O0590l81472M16713
3200E968948L45017M10423n14744N92863N13199o00944p36429n78199L1363L6816
3190E468313j3656K75713N0676l81695l25227r458j8347K53200J81740o90055
3180D791204M4985M17299j3139Q0434K15777J00731p467J80473J14936O46507
3170F571740J153012R69569Q9631L50719Q30053J84116k18473j82606l58146k58512
$$ y = [22585806, 23892369, 25166874, 25606870, 24431596, 22673703, 20663565, 18914237, 17606943, 15811403, 13385220, 11955645, 11172525, 10278219, 9591835, 8375478, 7862093, 7390751, 6620895, 6446118, 6034511, 6293460, 6492374, 6092871, 6500262, 5571008, 5104960, 5647816, 5498021, 5893679, 5753436, 5692844, 5556306, 5636721, 5873117, 5933707, 5552235, 5968948, 6313965, 6724388, 6209644, 6802507, 7315706, 6714762, 5978333, 5400134, 5431497, 5468313, 5454657, 5730370, 5781046, 5399351, 5074124, 5064666, 5046319, 5299519, 5481259, 4791204, 4836189, 5253488, 5240349, 5320783, 5536560, 5637291, 5629824, 5810297, 5925233, 6571740, 7724752, 8694321, 8783952, 9134671, 9964724, 10148840, 9930367, 9747761, 9389615, 9131103]
3160I131103k89529n63458l27994m43093r94278o51658O14910k16171K62063k73960
3150F247935N59443L56917L70218P00906L27518M03330m86787m88927j76277k95907
3140G518369L99813k31881o14113o5382l56113L22876O32559P29621o3961k6245
3130H245543M37539j62811l33663j16706n54990p45597K05092n42170p8894n32406
3120E820937j05416p08751n97876L00122p0868K26835j61583L69249K93145J26312
3110E492106k20337n8903m72486K49160l27304j79557n6124m6271L23101J9394
3100D722779P1039l52897M9213J23548k65766M67477N4857o03203n91258j95680
3090C480109j40957q82369n40561l70956K70770L67870k07725q60331j54421K71744
$$ y = [9131103, 8841574, 8278116, 7950122, 7507029, 6512751, 5861093, 6476003, 6259832, 6521895, 6247935, 6807378, 7164295, 7534513, 8235419, 8562937, 8966267, 8479480, 7990553, 7814276, 7518369, 7918182, 7686301, 7072188, 7006806, 6650693, 6973569, 7606128, 8335749, 8271788, 8245543, 8683082, 8520271, 8186608, 8069902, 7514912, 6769315, 6974407, 6432237, 6353343, 5820937, 5715521, 5006770, 4408894, 4709016, 4638148, 4864983, 4703400, 5072649, 5365794, 5492106, 5271769, 5212866, 4740380, 4989540, 4662236, 4482679, 4426555, 4380284, 4703385, 4722779, 4793818, 4440921, 4490134, 4613682, 4347916, 4815393, 4870250, 4267047, 3675789, 3480109, 3339152, 2456783, 1916222, 1545266, 1816036, 2183906, 1976181, 1115850, 961429, 1233173]
3080A233173k83082K5112L61554j76178R1939r363j0851K04680n14866m86352
3070D35766K70717K18455k84618k38065Q2610J88519O5079m37233Q0470K3256
3060D04956l14136J27594N41888m84565J8251L77916m86025K37736J18894M5910
3050E88419k86533n83496m0284J88640k79657J46882K42663K65479k02872q53989
3040h14748L78200Q21954o48196j41756k09814j6966J03615k29446Q1333K93508
3030c82316l0959r9130l65739k54790L37462q87888L88961N23527k7744J25964
3020f72652k77218l01953O51843K64773L9671j75262j7215M47428o37112l61765
3010a039462K12549R0289L13673O5305n92093j07204Q8525j26808P1018O813J34651
$$ y = [1233173, 950091, 975203, 1336757, 1160579, 1252518, 1243155, 1232304, 1436984, 922118, 435766, 706483, 924938, 640320, 402255, 484865, 673384, 738463, 301230, 381700, 404956, 90820, 218414, 760302, 275737, 293988, 671904, 185879, 423615, 542509, 588419, 301886, -281610, -321894, -133254, -412911, -266029, -23366, 242113, 39241, -814748, -436548, 385406, -262790, -404546, -614360, -631326, -527711, -757157, -675824, -382316, -413275, -512405, -878144, -1132934, -795472, -1683360, -1294399, -770872, -798616, -672652, -949870, -1251823, -599980, -335207, -295536, -470798, -488013, -40585, -677697, -1039462, -826913, -736624, -422951, -357646, -949739, -1056943, -968418, -1095226, -1024208, -1017395, -882744]
2999h82744j15295k66390k35363L46737j85946r1722O41454k45124j78957o54294
2989a867644M50467N23494j95811K55284k9953k34838K63811o3947o9700p7501
2979a046338j96564n8412m0086K39793K25548J91136k17277j56809L14246j58764
2969i03527o50200J02021M77962J30814m36235j91766J82167M3546N76584k38572
2959i07206j0245L1131l10296J08889j51439k63390L93716q37118K66684R70706
2949g08568K7161p33329p387O94128J46676q8666r243k65510J83598l78224J03912
2938a035452k99235K55416k23135n28565K46828j58226N8165O2292R0625O8999
2928a462288j84213O2285K18576l27549K44890N1028M6785J28413K89802j79906
$$ y = [-882744, -998039, -1264429, -1499792, -1153055, -1339001, -1430723, -789269, -1034393, -1213350, -1867644, -1417177, -893683, -1089494, -834210, -864163, -1099001, -835190, -899137, -968837, -1046338, -1242902, -1301314, -1341400, -1101607, -876059, -684923, -902200, -1059009, -744763, -903527, -1553727, -1451706, -973744, -842930, -1279165, -1470931, -1288764, -1245218, -668634, -907206, -917451, -886320, -1196616, -1087727, -1239166, -1502556, -1108840, -1945958, -1679274, -708568, -681407, -1414736, -1422123, -727995, -581319, -669985, -679228, -944738, -761140, -1139364, -1035452, -1334687, -1079271, -1302406, -1830971, -1584143, -1742369, -1684204, -1621912, -1531287, -1462288, -1646501, -1584216, -1365640, -1693189, -1448299, -1397271, -1350486, -1222073, -932271, -1112177]
2918a112177m83542j95351M69059P71449l07211m78158K99270k707o49350M31698
2908a257020o3521K34184j76102n9990N20574J6242k12954m00425J14157k4527
2898a309382Q15695l12292M61503p20207m4721k20464l20943M37202O21687K07302
2888c84620n96361o00839P42415k46711m50510J12950J95186k09811l89239N00034
2878a327506j75525q5117K66115l1594Q47848k26448J60920q7941l84166J2298
2868a031116o17248J73531J89329L7394O99456p00080j53915M60136L22501p51669
2858a371681n5620N99118o6925K53462o8693K8641K55922L4l59975j97009K31205
2847g51521J80923N5581J03167K33857r4521l91204j90008K26921J2087k09404
$$ y = [-1112177, -1595719, -1791070, -1322011, -550562, -857773, -1335931, -1036661, -1039368, -1688718, -1257020, -1320541, -1086357, -1262459, -1322449, -801875, -785633, -998587, -1399012, -1284855, -1309382, -493687, -805979, -344476, -1064683, -1109404, -1329868, -1650811, -1213609, -591922, -384620, -980981, -1581820, -839405, -1086116, -1536626, -1423676, -1228490, -1438301, -1827540, -1327506, -1503031, -1588148, -1322033, -1353627, -505779, -732227, -571307, -659248, -1043414, -1031116, -1648364, -1474833, -1285504, -1248110, -548654, -1248734, -1402649, -942513, -620012, -1371681, -1427301, -828183, -895108, -641646, -710339, -681698, -425776, -425742, -785717, -982726, -751521, -570598, -515017, -411850, -177993, -272514, -663718, -853726, -626805, -614718, -824122]
2837h24122j33359j18404O0131p1951o3594k3867K29444k26773M87043n4610o2555
2826h02617n86193J5652k45876j17091O37466J5617m24301M64719L02102j35232
2816h75754k51672J03221m67280K4462M24050r441m22565P08231L64537n23574
2806i25785o40248K68059M3493n09839P43219K72613o1581L86835p3901O24947
2796A27812j35666k64831j043369L3226Q52984p25374m19793O3636K26089J14245
2786a171041k93795m2566P02757k47472k08965Q1267P10104N34649l98699j80759
2776e14520m5546l7594L19423q96546n64922K63943N86290K8476o63520M36317
2766a088199M52244l6388m91632M84059l16341q0295J1456m28802J07469l57K73206
$$ y = [-824122, -957481, -1075885, -1015754, -1087705, -1151299, -1175166, -945722, -1172495, -685452, -740062, -802617, -1388810, -1373158, -1619034, -1736125, -1098659, -1083042, -1507343, -1042624, -740522, -875754, -1127426, -1024205, -1491485, -1467023, -1042973, -1052414, -1474979, -766748, -402211, -925785, -1566033, -1297974, -1254481, -1764320, -1021101, -748488, -810069, -423234, -497135, 127812, -7854, -272685, -1316054, -1282828, -429844, -1155218, -1575011, -1511375, -1285286, -1171041, -1464836, -1507402, -804645, -1052117, -1261082, -1179815, -469711, 64938, -333761, -514520, -560066, -597660, -278237, -1174783, -1739705, -1475762, -889472, -860996, -1524516, -1088199, -635955, -672343, -1163975, -679916, -996257, -1076552, -1065096, -1493898, -1386429, -1386786, -1113580]
2755a113580j5852J18752K80846m17375p7624j57374K0597J20748L29643p9904
2745i91123o61428J52103K50996n3776J25300j66009j9386O07330l54238o86102
2735a796333J6568R33229N09133o32411o07243K11218n36677K85148M30740O41722
2725e44906J06697k17738l73466J19286L34490L36652j98655l38981p1497K81857
2715e66261K86918m13362n77817r0616l19487n78936N71040M52820K58025m90560
2705a468236k27360L33275N79634j12523k83004m6418l05580O34815j14794l1121
2695a041312p7895N38086l4325p07966j60664L11687j10664l00530L0983K56593
2685a296007K83619l11105L68379j32126l9616j25040j67175P79039n11547j56486
$$ y = [-1113580, -1129432, -1010680, -729834, -1147209, -1224833, -1382207, -1361610, -1240862, -911219, -991123, -1652551, -1500448, -1249452, -1303228, -1177928, -1343937, -1363323, -755993, -1110231, -1796333, -1779765, -846536, -337403, -969814, -1577057, -1365839, -1902516, -1617368, -1186628, -544906, -438209, -655947, -1029413, -910127, -575637, -238985, -437640, -776621, -848118, -566261, -279343, -692705, -1270522, -1361138, -1680625, -2259561, -1688521, -1235701, -977676, -1468236, -1695596, -1362321, -782687, -895210, -1178214, -1224632, -1530212, -895397, -1010191, -1041312, -1119207, -581121, -615446, -1323412, -1484076, -1172389, -1283053, -1583583, -1552600, -1296007, -1012388, -1323493, -955114, -1087240, -1126856, -1251896, -1419071, -640032, -1151579, -1308065]
2675a308065N91554R7537M9987m63610L29146N5950M22083l85027O8318l4902
2665e77029p35773M89793K75002n34170L75281M4624J76696l35018L43841J04248
2655c72505n24366P2707j73868J84070J11120M16152l07173K6931j73197J32651
2645f07478j23960j79378m31147K64378N29011M5693m25012k30416N22765j1057
2635f46601j53835j88735o3559N66975L298j98129P5246o04016K84463N83161
2625c41732k20943P6305L61056J90949n03984r27687n9943P78547j71388k47270
2615a066090P6564L10924O94882j1040k19912L35672j29573K6108L98800J53372
2605E69707o77165l75580K89341L87881K15382O25819J97828m3346J14170p7056
$$ y = [-1308065, -716511, -618974, -568987, -1032597, -703451, -647501, -225418, -610445, -542127, -577029, -1312802, -823009, -548007, -1082177, -706896, -662272, -485576, -820594, -476753, -372505, -896871, -824164, -998032, -813962, -702842, -286690, -593863, -566932, -740129, -607478, -731438, -910816, -1341963, -1077585, -548574, -502881, -927893, -1158309, -635544, -646601, -800436, -989171, -1052730, -485755, -482457, -680586, -605340, -1209356, -924893, -341732, -562675, -486370, -125314, 65635, -438349, -1366036, -1425979, -647432, -818820, -1066090, -989526, -678602, 16280, 5240, -214672, 121000, -8573, 17535, 416335, 569707, -107458, -483038, -193697, 194184, 409566, 1035385, 1233213, 1189867, 1304037, 1226981]
2595A226981n27163L54625J05711o87397k43539m46649N1591L34247L35971M571
2585E08949j98988q83459n63205M73618m6675J57416P24637j30894o58167O3846
2575e52922N67980p20746j02677K03215R7251k57504M89068O72146m382P9948
2565D71377n86973p2469j0932R3153m21945K37719P49735n8423m23862l04510
2555c27130K78608K12048l61186l12207K04748J43557N81607n51578j3087m93231
2545f37851m26925K67947R36488R24272k42369p76899K1356P6265R92650n18726
2535F16208o27213M81185k49182j30208k90060r6411j77356j5664K67853J24525
2525i6323M02433k63325R4112J7328m26496j56205K33903L86597M93677M8640
$$ y = [1226981, 699818, 1054443, 1160154, 472757, 229218, -217431, -165840, 168407, 504378, 508949, 309961, -573498, -1136703, -663085, -709760, -552344, 172293, 41399, -616768, -552922, 15058, -705688, -808365, -605150, -507899, -765403, -276335, 395811, 391429, 471377, -115596, -188065, -198997, -105844, -527789, -290070, 459665, 401242, -22620, -327130, -48522, 163526, -197660, -509867, -305119, -161562, 420045, -131533, -144620, -637851, -1064776, -796829, 139659, 1063931, 821562, 44663, 66019, 142284, 1134934, 616208, -11005, 470180, 220998, 90790, -199270, -295681, -473037, -488701, -220848, -96323, 306110, 42785, 136897, 154225, -272271, -428476, -194573, 192024, 685701, 734341]
2515G34341l31096p116K5536m175p1450N28092j21642m06482k68877n51721J1193
2504d63397L39206L03118r7233J65009l0150k17057M15835j49996J80046K31608
2494F76989k98952n27656N24444J68112J79911k16544o18262N50904j36668K57429
2484E59707L04427l2813K71456k94934k33499L7630J08295Q1606J74027J14471
2474A090373J03437j1449j12969m74359K85969k58626m8640K27410l997K58151
2464A055300J26344j47454j54641l13101J87840J81956l61867L90859N43283j03227
2454A405292m2994J29475P08206n59752L1479L38421l14994L67126j81224n93018
2444A288017J26217p1798L86259J32146j72458m94483j50702K54361L81184N90900
$$ y = [734341, 403245, 396129, 421665, 417490, 346040, 874132, 752490, 346008, 77131, -474590, -463397, -124191, 178927, 81694, 246703, 216553, -504, 415331, 265335, 445381, 676989, 378037, -149619, 374825, 542937, 722848, 506304, -111958, 438946, 302278, 559707, 864134, 831321, 1102777, 807843, 574344, 611974, 720269, 801875, 975902, 1090373, 1193810, 1182361, 1069392, 595033, 881002, 622376, 573736, 801146, 797149, 1055300, 1181644, 1034190, 879549, 566448, 754288, 936244, 574377, 965236, 1508519, 1405292, 1362298, 1491773, 2199979, 1640227, 1671706, 2010127, 1695133, 2062259, 1881035, 1288017, 1414234, 1342436, 1728695, 1860841, 1688383, 1193900, 1043198, 1297559, 1678743, 2269643]
2434B269643m5877j57310K8189J45043l41418K681P61906O5555K43730L44064
2424C316206o86720J11988m2265P05301J68663L0065K20165n18948L34601r1660
2414C547396L63793j5777n9822J83537p026o14701M51088J2181J91139K89997
2404D341805l0995L20051J71155J01392M84983m2336l58031N83160O2357j3834
2394E619707L41107k08034m73054k71206J53875K79367K58383J72568k39353O21438
2384F254798L28265L22201J14549M99884J28435J41496J92984J35844M27352k08097
2374H337711k98064J74252P06458P05272Q6346L81808K31351k5018L00139Q72521
2364A1472776M14552J009821P13812R06193P5914Q63831Q08790Q41500Q03965
$$ y = [2269643, 2223766, 2066456, 2094645, 2239688, 1898270, 1900951, 2662857, 2728412, 2972142, 3316206, 2629486, 2741474, 2699209, 3404510, 3573173, 3603238, 3823403, 3304455, 3639056, 3547396, 3911189, 3895412, 3835590, 4019127, 4012101, 3397400, 3848488, 3860669, 4051808, 4341805, 4310810, 4630861, 4802016, 4903408, 5388391, 5346055, 4988024, 5571184, 5633541, 5619707, 5960814, 5752780, 5279726, 5008520, 5162395, 5441762, 5700145, 5872713, 5633360, 6254798, 6583063, 6905264, 7019813, 7519697, 7648132, 7789628, 7982612, 8118456, 8545808, 8337711, 8039647, 8213899, 8920357, 9625629, 9711975, 10093783, 10325134, 10300116, 10600255, 11472776, 11887328, 12897149, 13610961, 14517154, 14593068, 15456899, 16265689, 17107189, 17911154]
2355A7911154P78269N95060R38507J352106J712349J754963L225636K946774L131180
2346C4345998L549961K853526K675263L259711L137030M022503N504856P058750
2338F6407598J0096724J4676657K1924179L5740417N0731202O2091642O3735633
2331C25404052L5750483J51857j6947497l1174143n3238309n2255557l9668325
2324A68022561l5264656l1719587k4160531j5664611j0683692n964038m151688
2317D0413758k647262l035204k927257k714337l017409k359467k218924k545155
2309A8948743k217413j257129q05176j128908j331608j80325q39315o72832o69043
2300I846994o29027m77537q95417r12024k40452l29884M12239l33565o44963l05199
$$ y = [17911154, 18689423, 19284483, 20222990, 21575096, 23287445, 25042408, 28268044, 31214818, 34345998, 37895959, 40749485, 43424748, 46684459, 49821489, 53843992, 59348848, 66407598, 76504322, 91180979, 113105158, 148845575, 199576777, 261668419, 325404052, 361154535, 361306392, 344358895, 313184752, 259946443, 207690886, 168022561, 132757905, 101038318, 76877787, 61213176, 50529484, 44565446, 40413758, 37766496, 34731292, 31804035, 29089698, 26072289, 23712822, 21493898, 18948743, 16731330, 15474201, 14669025, 13540117, 12208509, 12028184, 11188869, 10516037, 9846994, 9217967, 8740430, 7845013, 6932989, 6692537, 6362653, 6774892, 6441327, 5796364, 5491165]
2290E491165l32253L86084k2542l15036n17168j267806n18167K19533N5830m34273
2280B745367n13348L24385o02428l88483Q33227M8290r1657l58711l31148J83083
2270A848577M80131j50253n06499n36813J08707k35513k6817Q2366j25567Q2622
2260A020941j2956k29527k29248J54226m23290l33261J26471k09853r2960L26662
2250I7205l13684L6069n0684m48261k27816K03509L25000p359p86285K61127O41061
2239b70118r2829M6809k49887m54413L53110L95959k22981J89779J86868l61028
2229d78731k27611l11794L27343M9103j21789k36321n4179K34114q5035O0713
2219h44187L44472J90037l66312k51959o9812j6420J16976J6945L15115l03428
$$ y = [5491165, 5158912, 5544996, 5522454, 5207418, 4690250, 3422444, 2904277, 3123810, 3179640, 2745367, 2232019, 2556404, 1953976, 1565493, 2398720, 2447010, 2355353, 1996642, 1665494, 1848577, 2328708, 2178455, 1671956, 1135143, 1243850, 1008337, 981520, 1063886, 938319, 1020941, 1007985, 778458, 549210, 703436, 280146, -53115, 73356, -136497, -229457, 97205, -216479, -180410, -231094, -679355, -907171, -703662, -378662, -386021, -1172306, -911179, -270118, -362947, -316138, -566025, -1020438, -667328, -271369, -494350, -304571, -117703, -478731, -706342, -1018136, -690793, -641690, -763479, -999800, -1053979, -819865, -904900, -844187, -499715, -309678, -675990, -927949, -997761, -1014181, -897205, -880260, -565145, -868573]
2209h68573K303j8423p18793L60926n2441n52800Q490M42839K12910l33431j53710
2198a670703K92106o3324k92563J032j0050O90573j19529j55610m59844m7750
2188a835662K98929j13628J36555J13041L099l82884K33096P99672L71189q18074
2178a194667l79820M34201p84135l19635N37079P1436J26681J89655n21197J67818
2168a672584O54330K2860j60542n22509k94197O2328Q2623m0711M00065M8180
2158a420157j19437m50308O0824l25356L28358K71710p8303n35175J74561m2658
2148b135941M32886r687k10750L81329J64319j50901J29058o40987l88366M47079
2138a981961P46001k65768m45490O70684r8161k09416k19580k49112K04791K80192
$$ y = [-868573, -866270, -884693, -1603486, -1242560, -1295001, -1847801, -1839311, -1396472, -1183562, -1516993, -1670703, -1378597, -1441921, -1734484, -1733452, -1743502, -1052929, -1172458, -1328068, -1787912, -1835662, -1536733, -1650361, -1513806, -1400765, -1397666, -1780550, -1547454, -747782, -376593, -1194667, -1574487, -1140286, -1924421, -2244056, -1706977, -1635541, -1508860, -1319205, -1840402, -1672584, -1018254, -995394, -1155936, -1678445, -1972642, -1910314, -1827691, -1868402, -1468337, -1420157, -1539594, -1989902, -1929078, -2254434, -1926076, -1654366, -1732669, -2267844, -2093283, -2135941, -1703055, -1712742, -1923492, -1542163, -1377844, -1528745, -1399687, -2040674, -2429040, -1981961, -1235960, -1501728, -1947218, -1276534, -1374695, -1584111, -1803691, -2052803, -1848012, -1567820]
2128a567820J69230m43198p25970N27992J74045k29793J52835l1206N4307k47522
2118b167100J65287L51381Q6109p6519O6502J4949k34110M46475p1180J78654
2108a239552m82052N41796l3224K64628K0080k40369m51680O3735O12736P3629
2098h70273q02933L7971q8120K37853k64774q1998M61244P6012j58283j029188
2088b482489J14370K58961M88753k1882K11919J02454l18942j69565o5886P20397
2078a161910n18750M23185j65223p0397K4024l30331j29721L33083L47376l16008
2068a564672O52944J6695J82163L47174k39002M3472P22923M51556j95013j48471
2058B69769r3535K9897J03088r69059n71461N34362m44944o30429L75980R6649
$$ y = [-1567820, -1398590, -1841788, -2567758, -2039766, -1865721, -2095514, -1942679, -1973885, -1919578, -2167100, -2001813, -1650432, -1564323, -1640842, -1574340, -1559391, -1793501, -1347026, -1418206, -1239552, -1721604, -1179808, -1213032, -948404, -928324, -1168693, -1620373, -1556638, -943902, -870273, -1673206, -1635235, -1723355, -1485502, -1750276, -1832274, -1371030, -1295018, -1453301, -2482489, -2368119, -2109158, -1620405, -1642287, -1430368, -1327914, -1646856, -1816421, -1882307, -1161910, -1680660, -1257475, -1422698, -1493095, -1469071, -1799402, -1929123, -1596040, -1248664, -1564672, -911728, -895033, -712870, -365696, -604698, -561226, 161697, 613253, 418240, 269769, 176234, 206131, 309219, -659840, -1231301, -696939, -1141883, -1772312, -1396332, -1299683]
2048a299683k4788K1833n5822j3132l39103J36664J17856m91505J84564K94072
2038a469044k71274k40055N25304k9361p7831q3280M03968K6382n57162j81135
2028a953488P5316K88376j46600n39403O46290P10708q42299l30401N52226J51499
2018a387776L41509l84337l84145N8319J7330N114N22727L94976j3789j98287
2008a028359J21107j30780J05566j14148j41405k22798M3255m14002K85640L35960
1998a159964m40146M48206k20419j84120K9210o7799J45896n4425J87662k4809
1988a340708k93478p46144O13419R1506n73428O43764L08026K74595K83067k31088
1978i70469q37023K7988q6762M4882L73979l46573o67131J43944M50014L35277
$$ y = [-1299683, -1324471, -1302638, -1358460, -1371592, -1710695, -1574031, -1456175, -1947680, -1763116, -1469044, -1740318, -1980373, -1455069, -1484430, -1562261, -1645541, -1241573, -1215191, -1772353, -1953488, -1878172, -1589796, -1736396, -2275799, -1629509, -918801, -1761100, -2091501, -1539275, -1387776, -1046267, -1430604, -1814749, -1756430, -1739100, -1733986, -1211259, -816283, -830072, -1028359, -907252, -1038032, -932466, -1046614, -1188019, -1410817, -1367562, -1781564, -1495924, -1159964, -1600110, -1151904, -1372323, -1556443, -1527233, -1595032, -1449136, -1503561, -1315899, -1340708, -1634186, -2380330, -1766911, -1675405, -2248833, -1605069, -1297043, -1022448, -739381, -970469, -1807492, -1779504, -1866266, -1821384, -1447405, -1793978, -2461109, -2317165, -1867151, -1531874]
1968a531874J06985J19249l8812k07638J1410m0713j67512k43009M32534O68413
1958h90967o43154l04925M76169J8687j67M86439l50579m37901q4746J73363M61793
1947a095988k21181J19792r7713q47160k96711L36124J10614L23737J28583K43917
1937a295986K24401m30799j51170j65810L46140K0687L74645J16037j63955n84834
1927a710644j23491J86415j31966K63066N0129J74830j4888P8006K28243J70152
1917h30148m31475j82527k52894j37650L80820K91689P4472n37451M6270L05264
1907a273630Q7850o68868K95461k5721m06679L58615K65474M02063l51407l84390
1897a701232K32628O9386r0060M0534q8449n117l02702m2538j58261n4086J22444
$$ y = [-1531874, -1424889, -1305640, -1344452, -1552090, -1540680, -1581393, -1748905, -1991914, -1559380, -890967, -1534121, -1839046, -1362877, -1344190, -1344357, -857918, -1208497, -1646398, -1731144, -1557781, -1095988, -1317169, -1197377, -1295090, -2142250, -2438961, -2102837, -1992223, -1668486, -1539903, -1295986, -1071585, -1502384, -1653554, -1819364, -1473224, -1452537, -1077892, -961855, -1125810, -1710644, -1834135, -1647720, -1779686, -1516620, -1466491, -1291661, -1306549, -1228543, -1000300, -830148, -1261623, -1444150, -1697044, -1834694, -1453874, -1162185, -1087713, -1625164, -1578894, -1273630, -1185780, -1854648, -1559187, -1584908, -1991587, -1632972, -1367498, -965435, -1316842, -1701232, -1468604, -1399218, -1489278, -1448744, -1537193, -1542310, -1845012, -1887550, -2045811, -2099897, -1977453]
1886a977453q2962m6768M43278J34501J24762m8975k22269J25119M8406p44554
1876b246915P40968J80089r4087L68819O11O02737r2880J64799j40388n27227
1866a043474K12092J56055q2126j72445P4160m1059m58560M39227k47177P1931
1856a091376k1524r7823m30425J39339q4406n8682K6909N1156R8821j22407j78733
1845a769151J29397M91496J66131k30814L67403j58360K6673r9209k61782L0731
1835a307485m40372l96214J51859O15915l34308K68220l3137l64270P1617L99964
1825a368211J3981l18912J22417J95731p07003K12952J43568N52361M41770o33226
1815a344572m636N4035k38301k10559L12007Q6516l26714K82871N46853J21961
$$ y = [-1977453, -2060415, -2107183, -1663905, -1529404, -1404642, -1453617, -1675886, -1550767, -1502361, -2246915, -1505947, -1325858, -1419945, -1051126, -1050515, -447778, -540658, -375859, -516247, -1043474, -831382, -675327, -757453, -929898, -855738, -896797, -1355357, -916130, -1163307, -1091376, -1112900, -1210723, -1641148, -1501809, -1586215, -1644897, -1617988, -1566832, -1468011, -1590418, -1769151, -1639754, -1148258, -982127, -1212941, -845538, -1003898, -977225, -1076434, -1338216, -1307485, -1747857, -2144071, -1992212, -1376297, -1710605, -1442385, -1475522, -1839792, -1768175, -1368211, -1354230, -1673142, -1550725, -1354994, -2061997, -1849045, -1705477, -1153116, -711346, -1344572, -1349208, -1295173, -1533474, -1744033, -1432026, -1345510, -1672224, -1389353, -842500, -720539]
1805g20539k1565j28444K10315m81049k05429M1101j36747K2944N2551o9368r3158
1794a529388J102020m9466o66778m10488J46383R4534q0378P96658L2878m4652
1784f08677k95677m68484k19578J30105j01320p2570q5468N21097R17592o04986
1774h87966k98728n6749k19630k08649K66168m01226N85606L96024l48224l73110
1764a546484J76928P07360M6942M9245k51355J63003m4618n34192P89711k01459
1754f44919p69715l4300L02493N62413J07009o6445l95830l25624J85397l06044
1744a385565M19939j16773j04513o3818k28727j26953K7142P2711M18392N40708
1734e47457p41120l60585k70040J99664L91897J90693Q6473M69890J45569o83400
$$ y = [-720539, -742104, -870548, -660233, -1141282, -1346711, -1305610, -1442357, -1419413, -1366862, -1436230, -1529388, -427368, -476834, -1143612, -1554100, -1407717, -1313183, -1393561, -596903, -564025, -608677, -904354, -1372838, -1592416, -1462311, -1563631, -1636201, -1721669, -1200572, -282980, -887966, -1186694, -1243443, -1463073, -1671722, -1405554, -1806780, -1221174, -825150, -1173374, -1546484, -1369556, -662196, -615254, -566009, -817364, -654361, -698979, -1233171, -443460, -644919, -1414634, -1448934, -1146441, -584028, -477019, -543464, -939294, -1264918, -1079521, -1385565, -965626, -1082399, -1186912, -1250730, -1479457, -1606410, -1579268, -1506557, -1088165, -547457, -1288577, -1649162, -1919202, -1719538, -1327641, -1136948, -1050475, -580585, -435016, -1118416]
1724a118416j58917j02127l5224m63884M24114J18101j07631J58596l51997K62076
1714a375309Q4757n7393j16196O52330m55706J26713K56404R9857j06749j78855
1704a070147Q1537o1932r7318r9465k20615J89089k24229k15928L96206J08094
1694a214708l21068j48564O55716O0839J07193J40916j54991J53160j51290k67033
1684a139830k54815k20215O41695l47869n57645K83931K0853M73929O8517j70660
1674a202109j2158k11388K55852O95680m40813K79422n19152k89612o1443l25652
1664a831373K86084N8115n35416O67287L2719L27619J94131m16591m8659m99010
1654a765094J58787P09850k8240m46448k44532n1434K2013k54832O45168j54832
$$ y = [-1118416, -1277333, -1379460, -1414684, -1878568, -1454454, -1336353, -1443984, -1285388, -1637385, -1375309, -1290552, -1347945, -1464141, -811811, -1267517, -1140804, -884400, -784543, -891292, -1070147, -988610, -1050542, -1147860, -1247325, -1467940, -1278851, -1503080, -1719008, -1322802, -1214708, -1535776, -1684340, -1028624, -967785, -860592, -719676, -874667, -721507, -872797, -1139830, -1394645, -1614860, -973165, -1321034, -1878679, -1594748, -1573895, -1099966, -1031449, -1202109, -1214267, -1425655, -1169803, -474123, -914936, -635514, -1154666, -1444278, -1505721, -1831373, -1545289, -1487174, -2022590, -1355303, -1322584, -994965, -800834, -1217425, -1266084, -1765094, -1606307, -896457, -924697, -1371145, -1615677, -1667111, -1645098, -1899930, -1254762, -1409594]
1644a409594O02818j550q07977L93376O2179R8745o4093n73950L04460K70099
1634a125487L72506k14947L19456J42839k61740m7777k28796K69413J45125l08306
1624i37714p8115n42812k13692J49834j03157J74543M09341l09871n8775K02527
1614a307891k5000p0589N38081l79384j39237N5583q71700O99537Q69531j86166
1604h17235k76273l94831M05721N86519K81855l19752o66175O12849j02184l20863
1594a010369l34973m142j83209k50376k1804L75668J85519M70412N838Q5263n42978
1583a225151r315M25551j84023M27999n23075o9684k06186j19300L34147k53186
1573a402223K04552M71301m39369L62626m7252L72478k96772j56591J02401k44288
$$ y = [-1409594, -806776, -808326, -1616303, -1222927, -1160748, -1062003, -1126096, -1700046, -1395586, -1125487, -752981, -967928, -648472, -505633, -767373, -815150, -1043946, -774533, -629408, -937714, -1015829, -1558641, -1772333, -1622499, -1725656, -1551113, -1141772, -1451643, -1510418, -1307891, -1332891, -1403480, -865399, -1244783, -1384020, -1328437, -2200137, -1500600, -631069, -817235, -1093508, -1488339, -1082618, -496099, -214244, -533996, -1200171, -587322, -689506, -1010369, -1345342, -1349484, -1532693, -1783069, -1804873, -1429205, -1243686, -773274, -767436, -682173, -1225151, -1234466, -808915, -992938, -564939, -1088014, -1157698, -1363884, -1483184, -1149037, -1402223, -1197671, -726370, -1165739, -803113, -850365, -477887, -774659, -931250, -828849, -1073137]
1563a073137M15969P4219k83997n516J25024k14083k74785j21167K59644L4072
1553a063757N24755m7522m41437P7021l0171K27102Q311k43673j41252m79313
1543a609936K46330J72112J52863J56162J4104K97717m92194K0283J70339k35519
1533a107739l25261k41675n364L39081j86488j6105M44315k028o1032J1456l87688
1522a538528q0241N5066J62927K80854j28119m12836L15804N1597M1721K79777
1512i71978m16228q757J11097O1231K84731P2757k9780o9473j21262K12659k45443
1501a120446Q6654J28403j37687L1008r0692J92629m54112J53988J24758j58276
1491a243773l70438J05613P3971k6061L37249j34028L5994j01226J77122P4148
$$ y = [-1073137, -657168, -582949, -866946, -872462, -747438, -961521, -1236306, -1357473, -1097829, -1063757, -539002, -586524, -1027961, -950940, -981111, -754009, -745698, -989371, -1130623, -1609936, -1363606, -1191494, -1038631, -882469, -868365, -570648, -1062842, -1042559, -872220, -1107739, -1433000, -1674675, -1680039, -1340958, -1527446, -1543551, -1099236, -1101264, -1162296, -1150840, -1538528, -1618769, -1563703, -1400776, -1119922, -1248041, -1660877, -1345073, -1293476, -1251755, -971978, -1388206, -1396963, -1285866, -1224635, -939904, -867147, -896927, -966400, -1087662, -875003, -1120446, -1033792, -905389, -1043076, -1012068, -1102760, -910131, -1364243, -1210255, -1085497, -1243773, -1614211, -1508598, -1434627, -1460688, -1123439, -1257467, -1221473, -1322699, -1145577, -1071429]
1481a071429K13339J38351J79587o52744M2585p0140Q5639l56547j37637M2206
1471a586790K21530j83976P392k98752N91004O68638J08096J55326n57476J46440
1461g28568Q2651o37846j31325L64400K64795k77411Q5885N54526l86346J6456
1451g92783L11326p4666j90182J9700l04520k41113J7615l22741P0814J010012
1441d96538L57851J78455l00716n55552L64790R6275q09674n31381J04086j90140
1431a782544J81505R4180L94267j514L80706j55083p73852J24361J87878k68297
1421a618393K67131K09144j02951M90427l47056l68033O3304J52934p13975N31706
1411a435762N43618M7080k24480j69976K61203j8078j37262M51068l78758k36338
$$ y = [-1071429, -858090, -719739, -540152, -1192896, -1150311, -1220451, -1134812, -1491359, -1628996, -1586790, -1365260, -1549236, -1541844, -1840596, -1249592, -580954, -472858, -317532, -875008, -728568, -645917, -1283763, -1415088, -1050688, -785893, -1063304, -977419, -422893, -809239, -792783, -481457, -556123, -746305, -726605, -1031125, -1272238, -1254623, -1577364, -1506550, -496538, -138687, 39768, -260948, -816500, -451710, -355435, -1165109, -1696490, -1592404, -1782544, -1601039, -1506859, -1112592, -1114106, -733400, -888483, -1662335, -1537974, -1350096, -1618393, -1351262, -1142118, -1245069, -754642, -1101698, -1469731, -1406427, -1253493, -1967468, -1435762, -892144, -845064, -1069544, -1239520, -978317, -996395, -1133657, -682589, -1061347, -1297685]
1401a297685P0573l49978J51178K4252j93019M71758N93251k81490K01845k71380
1391h80695n25293M39510N93716q66413k0472M0878k03685O27693m0165M9223
1381g85703p5528k03249N6361J67885j35915r8093j34027m4949l03484L8019Q2245
1370a436438O87215J52295o02301n38231M13746Q5870O9031j75722j60126O07378
1360h97283J25116n61523R4588l6837N51686N01118n34448j21683l29374P18439
1350d90201J50261k45978l56498l00855M4580M85854L77842q58710L03409J35239
1340g55057k04375j67644k16932k70060O03543l0201m91157L03439J98009L12599
1330g17836J70302K06526k98238J521j82523p5793N45803j14837q00629R2117
$$ y = [-1297685, -1227112, -1577090, -1425912, -1401660, -1594679, -1122921, -529670, -811160, -609315, -880695, -1405988, -966478, -372762, -1239175, -1259647, -1218769, -1422454, -794761, -834926, -785703, -861231, -1064480, -1008119, -840234, -976149, -1074242, -1208269, -1253218, -1556702, -1518683, -1436438, -749223, -596928, -1199229, -1737460, -1323714, -1237844, -1168813, -1344535, -1504661, -897283, -772167, -1333690, -1239102, -1275939, -724253, -223135, -757583, -879266, -1208640, -490201, -339940, -585918, -942416, -1243271, -1198691, -712837, -334995, -1193705, -890296, -755057, -959432, -1127076, -1344008, -1614068, -1010525, -1040726, -1531883, -1228444, -1030435, -717836, -547534, -341008, -639246, -637725, -820248, -896041, -350238, -465075, -1265704, -1173587]
1320a173587j21966J93906M2075P52415r7543n96964j13082J60229k4506R4833
1310h84190M43895j36077j59290r6993K35387J80882o34016L251J39930k8233
1300i35454k57092J08274J34068J20695K76245K24470q01841n1606J39897L60627
1290f81717M12383m55521j45396M34668L2370k29268J91884l45592j02753n72202
1280a461144K32710j86138k49485M75366N79303m91881K25573P6620k03374n2170
1270a054620p1218n2378o23313L06758N35111p18212m66145O86719m602l50094
1260a811994N31310Q38414r6568p41546P987K08551N9097P6804k52407K368N800
1249a172184M28848K95062k6793L16534J5724n95683J384o55590J67442k62649
$$ y = [-1173587, -1295553, -1101647, -1059572, -307157, -404700, -1001664, -1114746, -954517, -979023, -884190, -440295, -576372, -735662, -832655, -597268, -416386, -1050402, -1047151, -907221, -935454, -1192546, -1084272, -950204, -829509, -553264, -328794, -1130635, -1182241, -1042344, -681717, -269334, -724855, -870251, -435583, -403213, -632481, -440597, -786189, -888942, -1461144, -1228434, -1414572, -1664057, -1188691, -609388, -1101269, -875696, -799076, -1002450, -1054620, -1125838, -1178216, -1801529, -1494771, -959660, -1677872, -2144017, -1457298, -1461900, -1811994, -1280684, -442270, -538838, -1280384, -1272397, -1063846, -1004749, -927945, -1180352, -1177984, -1172184, -743336, -448274, -475067, -158533, -142809, -738492, -737108, -1392698, -1225256, -1487905]
1239a487905L39801L29189l00186Q51076l59151o84906K33053m3931J51291L58856
1229f12813L9146j30689k63615l01654k30701R6210p2978J43648m70526N20512
1219a283460P4991K26071j12749N20282L216j98445l19608l12045Q42882j17781
1209f76646l80218K20444m3564J25554K6689K42451o7098k27948J76200l35006
1199i39142k35097j36510l21125M39568M20115m09775M9389O57589j57739L51397
1189b81330J6862n05330j79400j13796j21860J86489Q00461l37251k30255n08996
1179a274406L48039k03080n33348N7883M55505k51157L65728N52137K52589m18211
1169f48321n64005k66455K29621K70091P23111K43577r04996p8241J87989k97872
$$ y = [-1487905, -1148104, -818915, -1119101, -268025, -627176, -1312082, -1079029, -1122960, -971669, -612813, -573667, -704356, -967971, -1269625, -1500326, -1404116, -1477094, -1333446, -1803972, -1283460, -1208469, -982398, -1095147, -574865, -571649, -770094, -1089702, -1401747, -558865, -676646, -1056864, -836420, -879984, -754430, -727741, -485290, -552388, -780336, -604136, -939142, -1174239, -1310749, -1631874, -1192306, -772191, -1181966, -1132577, -474988, -632727, -281330, -264468, -769798, -949198, -1062994, -1184854, -998365, -197904, -535155, -765410, -1274406, -926367, -1129447, -1662795, -1604912, -1149407, -1400564, -1034836, -482699, -230110, -648321, -1212326, -1478781, -1249160, -979069, -255958, -12381, -917377, -995618, -807629, -1105501]
1159a105501Q6385Q6684J69217m10633p96887O12539M46722J61257r6487P9839
1149g66865k91219P1244m1873O743R4111M51755J09203q57539k80304k23501K21873
1138a506372P10911l67649N1697K92827k99389l88428J49807p181J73709l23242
1128a513310J75276K59373j73029k2053m8140J80921J90641O1323j31133l24924
1118a345055p8319P7983q2649M97024J74298J64694r6161j42536J35656O4609
1108f30456m24565L13365k04183m06073O8111n4427j32251J33450L46246J80521
1098h10262n08257M75405M26807k81868K73503j13015n6617m83248k58488K61516
1088a074524Q1501J33184n3659n7423j36083L50332K48818n163r8166l68662k7922
$$ y = [-1105501, -1019116, -932432, -763215, -1173848, -1970735, -1358196, -911474, -750217, -846704, -766865, -1058084, -986840, -1028713, -1021970, -927859, -476104, -366901, -1224440, -1504744, -1728245, -1506372, -795461, -1163110, -1111413, -818586, -1117975, -1506403, -1356596, -1363777, -1190068, -1513310, -1338034, -1078661, -1251690, -1273743, -1321883, -1140962, -950321, -888998, -1020131, -1345055, -1423374, -1345391, -1428040, -931016, -756718, -592024, -688185, -830721, -695065, -630456, -1055021, -741656, -945839, -1351912, -1283801, -1338228, -1470479, -1337029, -990783, -810262, -1318519, -843114, -416307, -698175, -424672, -537687, -594304, -1077552, -1336040, -1074524, -993023, -859839, -913498, -970921, -1107004, -756672, -507854, -513017, -611183, -979845, -1007767]
1077a007767j99548M62551k55036m97805k36815M8061L41049K70019J62344M397
1067i08550j71184l36160K06378K40554L75871j757j01488L81948l44145o78329
1057a336862j9982J23276L97217r7857Q38114J36637m60436J02498k20028N34477
1047b946m40523P563k4312j02852L9625k79983P0516K08074M36027K09799j76576
1036e5588l23775m26193m37112n4211L25308J05092l05008N61919K05092m71065
1026h75541k80628P3469K11520K80760k92509k12390M05372m34709k73701m0576
1016a438933K90251j48141p2444L1141K60432L02194k04138o2512l06411M68470
1006h80091M46765o55895j23988J26759K08057K91169j01680L91037o8693l65269
$$ y = [-1007767, -1207315, -744764, -999800, -1497605, -1734420, -1686359, -1345310, -1075291, -912947, -908550, -1079734, -1415894, -1209516, -968962, -593091, -594848, -696336, -314388, -658533, -1336862, -1356844, -1233568, -836351, -934208, -96094, 40543, -419893, -317395, -537423, -2946, -443469, -435906, -460218, -563070, -523445, -803428, -732912, -524838, -88811, 120988, -55588, -379363, -805556, -1242668, -1296879, -971571, -866479, -1171487, -609568, -404476, -875541, -1156169, -1082700, -871180, -590420, -882929, -1095319, -689947, -1124656, -1398357, -1438933, -1148682, -1296823, -1369267, -1338126, -1077694, -775500, -979638, -1042150, -1348561, -880091, -433326, -1089221, -1213209, -1086450, -878393, -587224, -688904, -297867, -366560, -731829]
996g31829n24726K33984K75026K97285m11912j25571j96776J1792K44854l33183
986a261056K42526l72250J27085J07978l2446O36068j64037l69620J28458l93405
976a350699M52287j94173K36981q4361m4476l4029Q980j55192l18873k11829O5279
965a630105l81691K38090P2298N69811L63718j07750K29395l58754L6593j03970
955a072365J92683r179N08408m31291J89890n83090j73769M26069K55490l26679
945a023833j38452P8417K59486K18281j16469j42906L99510J28704l19359L20234
935c36387J17737k43766o47039r50024K83592P67098K98716L17099l81977k26308
925a001259k3642l4359j50535O54931j98491m68351m98815n9696M44011j9892
$$ y = [-731829, -1256555, -1022571, -747545, -450260, -862172, -987743, -1184519, -1172727, -927873, -1261056, -1018530, -1390780, -1263695, -1155717, -1188163, -552095, -716132, -1085752, -957294, -1350699, -898412, -1092585, -855604, -939965, -984441, -1018470, -1009490, -1164682, -1483555, -1695384, -1630105, -2011796, -1773706, -1701408, -1131597, -767879, -875629, -646234, -1004988, -968395, -1072365, -879682, -888861, -380453, -811744, -621854, -1204944, -1378713, -952644, -697154, -1023833, -1162285, -1083868, -824382, -606101, -722570, -865476, -465966, -337262, -656621, -336387, -218650, -462416, -1109455, -2059479, -1775887, -1008789, -710073, -392974, -774951, -1001259, -1024901, -1059260, -1209795, -554864, -753355, -1221706, -1720521, -1780217, -1336206, -1356098]
915a356098o3180M15696j34506N01348j70417j05439k34386m9086L10248L24332
905e61488k33162j44592L14877o79642M70227l97896N49347J81440j89663J57658
895e32894J30754R1738j64780j22431L49589j66409M85881n61564k14186P54993
885E0691R9930r26835n1725K28795j51544K91331K50499n41987m20553M46779
875g24619l54610l3256J26492L10362K10239J10120q2307k51768k45244M67895
865d66696j31181k64013q10787K87845L47084l43177J17797P001J42663L23706
855g89758J51100j109031K44358K58469J6475k55528Q00629M65404m21963R7564
845e42281m54017j47505j58771J89837l37860M52449m6784N6318o6131K23889
$$ y = [-1356098, -1419278, -1003582, -1138088, -636740, -807157, -912596, -1146982, -1196068, -885820, -561488, -794650, -939242, -624365, -1304007, -833780, -1231676, -682329, -500889, -690552, -532894, -402140, -310402, -475182, -597613, -248024, -414433, 71448, -490116, -704302, 50691, 150621, -776214, -827939, -599144, -750688, -459357, -208858, -750845, -1171398, -724619, -1079229, -1112485, -985993, -675631, -465392, -355272, -437579, -689347, -934591, -466696, -597877, -861890, -1672677, -1384832, -1037748, -1380925, -1263128, -1256127, -1113464, -789758, -638658, -1747689, -1503331, -1244862, -1228387, -1483915, -683286, -217882, -639845, -542281, -996298, -1143803, -1302574, -1112737, -1450597, -998148, -1044932, -988614, -1054745, -830856]
835h30856j97413n12621L17685O20982Q7362K4219p16967J47838j15463J0402
825a164832M41203N47101l66550o19335K84897O51110n26009p88524K9939k55644
815a766644J80598O64252M6518K45439N9655o78298R1442K57677M7979k15610
805a066992L79719n03359p1300j88670J5898J84765R3552M56555J13323j41225
795g27734r7604k82384j23824k68841O78150M16128K58469m63422m86562k7622
785a125246j31272N30575N75560j903n39244j24721q2992l37569J01318K16769
775i18725m9441p3264j99730M42634j90258l19974J31374M84045K54111l71505
765h10733l9747l42096r2044K46288p1110o0911J87272j40128k32373m19303N23320
$$ y = [-830856, -1028269, -1540890, -1223205, -602223, -514861, -490642, -1207609, -1059771, -1175234, -1164832, -723629, -176528, -543078, -1162413, -877516, -226406, -752415, -1540939, -1511000, -1766644, -1586046, -921794, -875276, -629837, -570182, -1248480, -1157038, -899361, -851382, -1066992, -687273, -1190632, -1261932, -1450602, -1434704, -1249939, -1156387, -699832, -586509, -727734, -825338, -1107722, -1231546, -1500387, -822237, -406109, -147640, -611062, -1097624, -1125246, -1256518, -725943, -150383, -152286, -691530, -816251, -899243, -1236812, -1135494, -918725, -968166, -1041430, -1241160, -798526, -988784, -1308758, -1177384, -693339, -439228, -810733, -850480, -1192576, -1284620, -1038332, -1109442, -1170353, -983081, -1123209, -1355582, -1774885, -1251565]
754a251565L49219j73251O1859P01520n9637k68021n35809K88456M4551N13082
744c29596j52469o65799N24623J94343j89104J17913n20875M6822k33284k3473
734a230899N50171k62956J76609L8987n9627n40305N3671j23561J38114k84293
724a544089L20830K4760k4033l11287L37149K93631l97202L18065k09442l00255
714a491873J04446M89925K88411m23614K09053R3369k87908K37396m9553K69733
704e60615j93831j66081N07795j47349M63008l84433m2032n12127L5718O7986
694i31961n19388M21321M45512O04638o37114m58863K86335P9749n7794j53196
684i20761q13365J4092M70088j78927k01802J95788K67370j78777J94089L08759
$$ y = [-1251565, -902346, -1075597, -1013738, -312218, -371855, -639876, -1175685, -887229, -842678, -329596, -482065, -1147864, -623241, -428898, -618002, -500089, -1020964, -974142, -1207426, -1230899, -680728, -943684, -767075, -728088, -787715, -1328020, -1274349, -1397910, -1259796, -1544089, -1223259, -1198499, -1222532, -1533819, -1196670, -903039, -1300241, -982176, -1191618, -1491873, -1387427, -897502, -609091, -1032705, -823652, -730283, -1018191, -780795, -830348, -560615, -754446, -920527, -412732, -560081, -97073, -481506, -523538, -1035665, -999947, -931961, -1451349, -1030028, -584516, 20122, -616992, -1075855, -789520, -709771, -767565, -920761, -1734126, -1720034, -1249946, -1428873, -1630675, -1434887, -1167517, -1346294, -1152205, -843446]
674h43446k2692n03751k21318k7852J27616J72225K92844j6015N6419K00802J96432
663e88736k18389J54542K42695j38652m29007L1000J04848O94749m6965o17853
653h11768j33830O12222m79100j61457L54069k84653k22629p7086N86029L4252
643e83951m03699m40537J19198L38431k76727n88655K56778P73354N06866k49366
633e48308J961l49884N08116J31809j4409l34751L70855J15742m26079p28878
623a273826Q4105L28489J74745j68754j71278j41336J99597k72055J25191L34560
613g80562K63424j07666n27220M87317k73750j00660K33765N87478j22302n46177
603h86353N01273L40363n09400j36013J50116K75859k52958n52143k1262M37287
$$ y = [-843446, -866138, -1369889, -1591207, -1619059, -1491443, -1319218, -1026374, -1042389, -985970, -785168, -588736, -807125, -652583, -409888, -548540, -977547, -946547, -841699, -146950, -193915, -811768, -945598, -333376, -812476, -973933, -619864, -904517, -1127146, -1204232, -618203, -583951, -987650, -1428187, -1308989, -970558, -1247285, -1835940, -1579162, -805808, -298942, -548308, -546347, -896231, -388115, -256306, -270715, -605466, -234611, -118869, -544948, -1273826, -1189721, -861232, -686487, -855241, -1026519, -1167855, -968258, -1240313, -1115122, -780562, -517138, -624804, -1152024, -664707, -938457, -1039117, -805352, -217874, -340176, -886353, -385080, -44717, -554117, -690130, -540014, -264155, -517113, -1069256, -1090518, -653231]
593f53231m1142q18282K05780L57003K22018p6912k99318J07084J69402j17937
583i45535l29753K23303J96555j92260m1811J7840J36317K78863j3372j21978
573g91831M35363l13809o42577q3261M1010L02193M22659p3725l18521K16452
563h06047j90748K09041O5611L56343J05743o61759o4014M66845k50658j22132
553h91775l75118L45026M62973n99916k23796J27647P45377M3449k77332L56029
543b87436l05834m07081j13832j63916O21898K60782n63378K37482J08738J93239
533d19338m00347n2668L66307k37170R6786j57227m74115j26690l6613K90776
523a150299N11092l29901J26440l39098k52610k92982N64814J43948K42894k09163
$$ y = [-653231, -694373, -1512655, -1306875, -949872, -727854, -804766, -1104084, -997000, -827598, -945535, -1275288, -1051985, -855430, -1047690, -1089501, -1071661, -935344, -656481, -669853, -791831, -356468, -670277, -1312854, -1396115, -1355105, -1052912, -630253, -703978, -1022499, -806047, -996795, -787754, -722143, -365800, -260057, -921816, -985830, -518985, -769643, -891775, -1266893, -921867, -458894, -1058810, -1282606, -1154959, -409582, -366133, -643465, -287436, -593270, -1000351, -1114183, -1278099, -656201, -395419, -958797, -721315, -612577, -419338, -819685, -872353, -506046, -743216, -646430, -803657, -1277772, -1404462, -1441075, -1150299, -639207, -969108, -842668, -1181766, -1434376, -1727358, -1162544, -1018596, -775702, -984865]
513i84865n6992L7380m30742M86303O73342K69843q25491k65470L94750K88971
503d12971m7195l1468k2568n64526j54248N37362m16616M21676l8492j52938L28699
492e53285l37047m61727L58408L06859j30404o23901M96673m7639L05999J31240
482e54824l19298j91580J57408j82628Q3051j71628J59089K51356k20443J2853
472i76644j16066k71903N61183M59195l18268K60008o28401j79789k16556K09701
462a217540O82014q570l29899l39796J21624P35102P5475q8619k74582J4153j44006
451g74644k6868l16406K07812N72820o800q54450J71790j04501P8991K55944q2665
440h78977L3124K43563J35412m86178Q5225L631j75093r8629o5018J76355O3674
$$ y = [-984865, -1041857, -1004477, -1435219, -948916, -275574, -5731, -831222, -1096692, -701942, -412971, -460166, -491634, -514202, -1078728, -1232976, -695614, -1112230, -690554, -729046, -881984, -553285, -890332, -1352059, -993651, -686792, -817196, -1441097, -944424, -992063, -686064, -554824, -874122, -1065702, -908294, -1090922, -1007871, -1179499, -1020410, -769054, -989497, -976644, -1092710, -1364613, -803430, -344235, -662503, -402495, -1030896, -1210685, -1427241, -1217540, -535526, -544096, -873995, -1213791, -1092167, -357065, -281590, -370209, -644791, -630638, -774644, -801512, -1117918, -910106, -337286, -344086, -1198536, -1026746, -1131247, -1052256, -796312, -878977, -845853, -602290, -466878, -953056, -867831, -864200, -1039293, -1137922, -1202940, -1026585, -962911]
429i62911k26323J50218P27742k31888K23884L06154k56240o93835l32625N25020
419g70804j26218L64885k9767r15968M96841L40400Q6796M24288o572j00220m84584
408g20923j1946j89020K53398J46310J76830O14148n16427n96701R5963K19130
398e29238p7601j65292k13740J27854J39228P1746J65003p8139J25671J50387
388b84121m59137Q8594K65162n17649L64451R4831o1791r0925l0664l57737m07379
377a396365J81442j1231j7024m0840M36974J19181p7956l22157k22779j41703
367a492458L62253K22511l6647M79599o11561q06195L35491Q62620Q3713k01811
357h02485k35988M09035M87404l66675L0743N034J7213L40486p3011m54988m31641
$$ y = [-962911, -1189234, -1039016, -311274, -543162, -319278, -13124, -269364, -963199, -1295824, -770804, -897022, -532137, -561904, -1477872, -981031, -640631, -553835, -129547, -136119, -236339, -720923, -732869, -921889, -668491, -522181, -345351, 268797, -247630, -844331, -748368, -529238, -606839, -772131, -985871, -858017, -718789, -647043, -482040, -560179, -434508, -284121, -743258, -654664, -389502, -907151, -542700, -447869, -509660, -600585, -631249, -988986, -1396365, -1214923, -1226154, -1243178, -1284018, -847044, -727863, -805819, -1127976, -1350755, -1492458, -1130205, -907694, -944341, -464742, -1076303, -1882498, -1547007, -684387, -600674, -802485, -1038473, -629438, -142034, -508709, -477966, -472932, -455719, -115233, -188244, -643232, -1074873]
346a074873K04825M88767j44688p36999J43798O99899m44260l77241J09584j14136
336a245324J93792M39817L8331J21562L34765k31500k64598L43322J9362l23939
326e74410k47614l40316K17402K76834K45860k20047K04947L40917k52621o35977
316i85025L02750K65368l26389m79266J00019L90831K97040q7099j7351R4561
306d44561m72682K03798m0674p38874R32297K08294K08807k13536o45461K609
296i99983l2373J13609L06256L90070N497k7059q81175J13884L41230J85523n19442
285a003963o4803M85472J76258m28673j65460M66338k1353M6365J55617k28406
275e82608k10818M49209l46291M5271M48385n32643j01032n8054l00974K89192
$$ y = [-1074873, -870048, -381281, -525969, -1262968, -1119170, -419271, -863531, -1240772, -1131188, -1245324, -1051532, -611715, -573384, -451822, -117057, -348557, -613155, -269833, -250471, -574410, -822024, -1162340, -944938, -668104, -422244, -642291, -437344, -96427, -349048, -985025, -682275, -416907, -743296, -1222562, -1122543, -731712, -434672, -521771, -539122, -444561, -917243, -713445, -754119, -1492993, -560696, -352402, -143595, -357131, -1002592, -999983, -1032356, -918747, -612491, -222421, -216924, -243983, -1125158, -1011274, -670044, -484521, -1003963, -1068766, -583294, -407036, -835709, -1001169, -534831, -556184, -509819, -354202, -582608, -793426, -344217, -690508, -645237, -196852, -729495, -830527, -888581, -1189555, -900363]
265i00363J88508q3203M37786K16617k14332m01876J7687K71547J14959j45193
255d97863n27537k06742R3635L16705M03937l6837L3685j76011m00161K3949M70317
244e02923r3280n61755K39645L79300J81072J71230k70331k31013l19430J14065
234h93420J10499M9984l42593K11417r8584J21893l98808R0595J92425N78582
224c78010o23967j12775K83714n97811R7692R9349P08439K84908l24830k45754
214h09045K59543j15582p0847q0179K22844j48866p597k57262M19344L72542l26571
203e41676l84331K88127l31651j82000L22490P36720L51756l34993l84435m95300
193i55293j335M6963o13343L13852K97871p5812O45994m53819l86061J66153J80837
$$ y = [-900363, -711855, -795058, -357272, -140655, -354987, -756863, -739176, -467629, -352670, -497863, -1025400, -1232142, -1138507, -821802, -417865, -454702, -421017, -597028, -997189, -973240, -502923, -596203, -1157958, -918313, -539013, -357941, -186711, -457042, -688055, -1007485, -893420, -782921, -732937, -1075530, -864113, -962697, -840804, -1239612, -1149017, -956592, -378010, -1001977, -1114752, -831038, -1428849, -1331157, -1231808, -523369, -238461, -563291, -809045, -549502, -665084, -735931, -816110, -593266, -742132, -749729, -1006991, -587647, -215105, -541676, -926007, -637880, -969531, -1151531, -829041, -92321, 259435, -75558, -459993, -955293, -956628, -909665, -1523008, -1209156, -911285, -987097, -341103, -794922, -1180983, -1014830, -833993]
182h33993m2539L62852P6944q03495l7990P05241j3211r8210N00315j95404l26399
171g05889l84630l27820J42432L1428N08791l4568j66791M03658l86696l3839
161i53924j9906L38951l66121j57842K17058J23774J63046L95629O7141p03623
151h95817K87753Q9726m91987o130M01810k11069J18994l0993Q6199J69885k60438
140g42067l43709L66396l65919j23973J55152M55913L67198m05405K88764O0974
130b86676J76094n14836j84953K010M27203k35340j77942j08919M24383L71570
120a07406l69839q20229M99861L02590k37675r6252j45983K76110l73281J37825
110i34279J22165O00394l99701j58413k9528P88266Q1337p53096j11903J07589
$$ y = [-833993, -876532, -513680, -436736, -1240231, -1278221, -572980, -586191, -684401, -184086, -379490, -705889, -1090519, -1418339, -1275907, -1244479, -735688, -770256, -937047, -533389, -920085, -953924, -973830, -634879, -1001000, -1158842, -941784, -818010, -654964, -259335, -192194, -895817, -608064, -518338, -1010325, -1016455, -614645, -825714, -706720, -737713, -651514, -481629, -742067, -1085776, -719380, -1085299, -1209272, -1054120, -598207, -231009, -636414, -347650, -286676, -110582, -625418, -810371, -808361, -381158, -616498, -794440, -903359, -478976, -107406, -477245, -1297474, -797613, -495023, -732698, -828950, -974933, -698823, -1072104, -934279, -812114, -211720, -611421, -769834, -799362, -11096, 70241, -682855, -794758, -687169]
100f87169K94991j39316p84557P6743Q27923P9334q2430J30894k52544M52998
90h3133l95816j99036K48190k08922l73249M92655L16250j86827j85850o30577
80a206315L60730L6517r9834J87757l1856m07756K89400K95970l89341L8579j95197
69a121346O8614O09399j09630n06083j8475j88694r3451K24251N45256M52240
59a37919q45034j50138L46875K12127O9459l90229j82612J82918K25j41888K34222
48h01994M07390N1633k08959k8801n2113j4077J43389J08327L94558N8949n80468
37e22166l66642L00538r0292r8717Q2249L63092k82864p7990J08221M7326n5045
26e92290J28933K19952j07110j00324l49339j2309N3697K85933j59989j19833
$$ y = [-687169, -392178, -531494, -1316051, -1239308, -411385, -332051, -414481, -283587, -536131, -83133, -478949, -677985, -429795, -638717, -1011966, -519311, -203061, -389888, -575738, -1206315, -845585, -809068, -908902, -721145, -753001, -1160757, -871357, -575387, -964728, -926149, -1121346, -1052732, -443333, -552963, -1059046, -1077521, -1266215, -1359666, -1135415, -590159, -137919, -982953, -1133091, -786216, -574089, -504630, -894859, -1077471, -894553, -894328, -1036216, -801994, -394604, -342971, -551930, -580731, -632844, -646921, -503532, -395205, -647, 58302, -522166, -888808, -588270, -678562, -777279, -695030, -331938, -614802, -692792, -584571, -537245, -592290, -463357, -243405, -350515, -450839, -800178, -812487, -758790, -472857, -632846, -752679]
16g52679R5470O4850N48293l64370l67367J18930M08164k03961Q2263L20128k03034
5b53313m33354N3176L46806M86075p2662
0A26728
$$ y = [-752679, -657209, -592359, -44066, -408436, -775803, -656873, -248709, -452670, -370407, -50279, -253313, -686667, -633491, -286685, 199390, 126728]
$$ Imaginary data points
##PAGE= N=2
##DATA TABLE= (X++(I..I)), XYDATA
16383b533422o4254j64567L89345L35163j23568J55186L1885L47688Q4541m70840
16373b012843l05316j56352j4325M78812o5235L36680k4851k57434K08165K31775
16363a580924J64712k2524j77275K06902M7009j69839J7362K93773K0245j28271
16353a328830K23220q8126l04225K39840M31244l67416j47704L56845q4738k99498
16343a369388M7532l37009O56878M81659J21982l67166l12742K83347K79076m84352
16333a000183J10648J30173J75619J47868K3530l83879m45475J37121O65173J93207
16323b46198O2543r0487k50365J87855n3824k9710L83401J60017j95168J92552
16313A20616J63511j86575q6160K44688p2140k18920k13342M11671P13j71666
$$ y = [-2533422, -2597676, -2762243, -2372898, -2037735, -2161303, -2006117, -1974232, -1626544, -1542003, -2012843, -2318159, -2474511, -2488836, -2010024, -2075259, -1738579, -1763430, -2020864, -1812699, -1580924, -1416212, -1438736, -1616011, -1409109, -1362100, -1531939, -1514577, -1220804, -1200559, -1328830, -1105610, -1193736, -1497961, -1258121, -826877, -1194293, -1341997, -985152, -1069890, -1369388, -1321856, -1658865, -1001987, -520328, -398346, -765512, -1078254, -794907, -515831, -1000183, -889535, -759362, -583743, -435875, -412345, -796224, -1241699, -1104578, -439405, -246198, -183655, -274142, -524507, -336652, -390476, -420186, -36785, 123232, -71936, 120616, 284127, 97552, 11392, 256080, 183940, -34980, -248322, 163349, 164062, -7604]
16303g604O9261O4957k47230J95194K42088r319J16991r3932K6310j9315k92562
16292D4839j4407M96097J52358r6500J34840n382J60262j08516k8115M38136k10332
16281I63280P8124n3173j30195K0964K6201N4559L37191l1354j13241R9876k17509
16270A034723N30606Q3879k37103k48629j76213L30024P3003K04758j47013j31939
16260A316096J03743j20208n1157J22674j96995L0759m50974j24916N14159j2644
16250A130537K38011L13786j84442j07389O79771l9005K36640k28395m73586M44099
16240B010027Q7705l40584k97045J77414L16422j29518m41355L09223P18081L9593
16230B449963K23765J19756J5156k86866m141k16841k31918J61959m11873O2271
$$ y = [-7604, 61657, 126614, -120616, 74578, 316666, 307347, 424338, 330406, 356716, 337401, 44839, 30432, 526529, 678887, 582387, 717227, 711845, 872107, 763591, 735476, 1173612, 963280, 1041404, 988231, 858036, 879000, 905201, 959760, 1296951, 1265597, 1152356, 1252232, 1034723, 1565329, 1649208, 1412105, 1163476, 987263, 1317287, 1390290, 1595048, 1448035, 1316096, 1419839, 1299631, 1248474, 1371148, 1174153, 1204912, 753938, 629022, 1143181, 1130537, 1368548, 1682334, 1497892, 1390503, 2070274, 2031269, 2267909, 2039514, 1565928, 2010027, 2097732, 1757148, 1460103, 1637517, 1953939, 1824421, 1383066, 1692289, 2410370, 2449963, 2673728, 2793484, 2808640, 2521774, 2517633, 2300792, 2068874, 2230833, 1818960, 1881231]
16220A881231K46674J9719L66425M48674J99747l34233k55917M58259m21344m26084
16210B183151k82012P07033K90517j07668o36528K42863L4244M2469j14477j66473
16200B193119r9701k66420J42044k8021M44452j5613K02650m72428J14730J62176
16190B376988Q90062n08819n39301J69465J44250N36541J72089l90166n22827
16181B328282L70143M67605m72979J60732m6715K83801p6046K272n02967M8364
16171B562492R48423M4500k33514J35534p3976q91578k00906K9493M75267L0951
16161B826686j39739M85714J39075k25995J34080j63138l25992j35405k5904m27359
16151B142023M99608N29020n60881q9945J93930j36316j40229L45439J28727j76160
$$ y = [1881231, 2127905, 2147624, 2514049, 2962723, 3162470, 2828237, 2572320, 3030579, 2609235, 2183151, 1901139, 2608172, 2898689, 2791021, 2154493, 2397356, 2431600, 2474069, 2359592, 2193119, 2093418, 1826998, 1969042, 1941021, 2385473, 2369860, 2572510, 2100082, 2214812, 2376988, 3267050, 2758231, 2218930, 2388395, 2532645, 3069186, 3241275, 2851109, 2328282, 2698425, 3166030, 2693051, 2853783, 2807068, 3090869, 3014823, 3017095, 2514128, 2562492, 3510915, 3555415, 3321901, 3457435, 3383459, 2491881, 2290975, 2320468, 2795735, 2826686, 2686947, 3172661, 3311736, 3085741, 3219821, 3056683, 2730691, 2595286, 2569382, 2142023, 2641631, 3170651, 2609770, 2519825, 2713755, 2577439, 2437210, 2782649, 2911376, 2735216]
16141B735216k36651j16264N31463P7476M34052j75037k32425l98414j08999k166
16131B508251Q89618j18137j26275N81834j12505n36424k5798o2828k97129j47070
16121B553537k74731N81711J16085L32813j59172P9881J78494q8373p05688J82928
16111B797485P04445m24243L69312k12569o72296K08093k60100K35984M60796
16102C206907j19904m05275P63301K61246k10839l20376L28102K61281l10117
16093C454326p17531r9302j1327L23959K3912N4069L46313R3081l1999j10010
16083C325491J54776n85248M07682l2802M26671l84322j16221M55589j52945k90912
16073C207759R0039k76380j50667K12650O4702J83851J7245r6530j23221J10030
$$ y = [2735216, 2498565, 2382301, 2913764, 2991240, 3425292, 3250255, 3017830, 2619416, 2510417, 2508251, 3397869, 3279732, 3153457, 3735291, 3622786, 3086362, 3060564, 2997736, 2700607, 2553537, 2278806, 2860517, 2976602, 3309415, 3150243, 3230124, 3408618, 3320245, 2614557, 2797485, 3501930, 3077687, 3446999, 3234430, 2562134, 2770227, 2510127, 2746111, 3206907, 3087003, 2681728, 3445029, 3706275, 3495436, 3175060, 3503162, 3764443, 3454326, 2736795, 2637493, 2626166, 2950125, 2974037, 3028106, 3374419, 3467500, 3435501, 3325491, 3480267, 2895019, 3302701, 3269899, 3696570, 3312248, 3196027, 3651616, 3498671, 3207759, 3297798, 3021418, 2870751, 3083401, 3148103, 3331954, 3349199, 3252669, 3129448, 3239478]
16063C239478M8134l4628M0163r3142L13767m99982j19355R8864l23632K6309
16053B695976J77461K79350k7262k0424J16205m512l10577l02374k7634o585J10644
16042B680268k16886O15299M25694o95173M5247l66344N3115M29227k00596M39247
16032C209098R5071r4103J59073J9968n4989J20020J08815o45675k38285L40111
16022C019104L11894q572J63779L154m99379j27397P16419o3710K44231K9528
16012C789051k12050J3397K35670j42379O895J39766n19181K04231K09788P7787
16002C802975m85741N1862J09883r1947l6694m14283m47637P9898J71385L4881
15992B774582K88336J15343O01363l21825j75782L2811j57120m11501L02662J87287
$$ y = [3239478, 3287612, 3252984, 3293147, 3200005, 3513772, 3013790, 2894435, 2993299, 2669667, 2695976, 2873437, 3152787, 3125525, 3105101, 3221306, 3216794, 2906217, 2603843, 2576209, 2569624, 2680268, 2463382, 3078681, 3504375, 2809202, 2854449, 2488105, 2541220, 2970447, 2769851, 3209098, 3304169, 3210066, 3369139, 3389107, 3334118, 3454138, 3562953, 2917278, 2678993, 3019104, 3330998, 3322426, 3486205, 3489359, 2989980, 2862583, 3579002, 3515292, 3759523, 3789051, 3577001, 3590398, 3826068, 3683689, 3690584, 3830350, 3311169, 3515400, 3725188, 3802975, 3317234, 3369096, 3478979, 3387032, 3350338, 2936055, 2488418, 2568316, 2739701, 2774582, 3062918, 3178261, 3779624, 3457799, 3282017, 3314828, 3157708, 2746207, 3048869, 3236156]
15982C236156N34800K13215m89211k14678k12661J2693m57454P0454l6954k3795
15972B632565M34155J92257Q2289K159J46854j00156j54548Q1095j47229j65153
15962C004288L3813K92663M98748k81901p81386j49297l7186N32097K73034O3393
15952C448266k7640L30257m65311j91618k13452K2391M29975k39274j97699m2685
15942B853210K61808N9582K71060P3867M48271m76771M2958L10656r12140J18319
15932C050820M90553m68290k27977m13398p573Q50649M37975O1193R5340k88898
15922C580394J42925M71197k84038l10397j20100j85985k64622L1052K92185j18498
15912C234113L19722k65983j93572j61448n27087M51581N79472k1990l15236k24794
$$ y = [3236156, 3770956, 3984171, 3494960, 3280282, 3067621, 3080314, 2622860, 2693314, 2656360, 2632565, 3066720, 3258977, 3341266, 3343425, 3490279, 3390123, 3235575, 3316670, 3169441, 3004288, 3038101, 3330764, 3829512, 3547611, 2766225, 2616928, 2579742, 3111839, 3384873, 3448266, 3420626, 3750883, 3285572, 3093954, 2880502, 2902893, 3332868, 3093594, 2895895, 2853210, 3115018, 3174600, 3445660, 3519527, 3967798, 3491027, 3533985, 3844641, 2932501, 3050820, 3541373, 3073083, 2845106, 2431708, 2424135, 3274784, 3712759, 3773952, 3869292, 3580394, 3723319, 4194516, 3910478, 3600081, 3479981, 3293996, 3029374, 3060426, 3352611, 3234113, 3553835, 3287852, 3094280, 2932832, 2405745, 2857326, 3436798, 3414808, 3099572, 2874778]
15902B874778k95080O05577m0228J99997L2277J74149K76484n55925j73127k38843
$$ y = [2874778, 2579698, 3185275, 3145047, 3345044, 3377321, 3551470, 3827954, 3272029, 3098902, 2860059]
$$ [...]
##END NTUPLES=NMR SPECTRUM
##END=
