##TITLE=1H_DE-80H_X3
 200.13MHz, d2o
 8 sc
 
 19ns.26.2.2025
##JCAMPDX= 6.0         $$ Bruker NMR JCAMP-DX V2.0
##DATA TYPE= NMR SPECTRUM
##DATA CLASS= NTUPLES
##ORIGIN= UXNMR, Bruker Analytische Messtechnik GmbH
##OWNER= pz
$$ XWIN-NMR		Version 3.5
$$ Thu Jul 23 14:11:46 2026 Russian Standard Time (UT+4h)  Yarkov@DPX200
##.OBSERVE FREQUENCY= 200.1313
##.OBSERVE NUCLEUS= ^1H
##.ACQUISITION MODE= SIMULTANEOUS
##.ACQUISITION SCHEME= undefined
##.AVERAGES= 8
##.DIGITISER RES= 18
##SPECTROMETER/DATA SYSTEM= spect
##.PULSE SEQUENCE= zg30
##.SOLVENT NAME= CDCl3
##.SHIFT REFERENCE= (INTERNAL, CDCl3, 0, 15.4847)
##AUDIT TRAIL= $$ (NUMBER, WHEN, WHO, WHERE, WHAT)
$$ ##TITLE= Audit trail, XWIN-NMR		Version 3.5
$$ ##JCAMPDX= 5.01
$$ ##ORIGIN= Bruker BioSpin GmbH
$$ ##OWNER= Yarkov
$$ C:/Bruker/XWIN-NMR/data/yarkov2/nmr/H-C/1/pdata/1/auditp.txt
$$ ##AUDIT TRAIL=  $$ (NUMBER, WHEN, WHO, WHERE, WHAT)
(   1,<2026-07-23 14:11:07.57 +0400>,<Yarkov>,<DPX200>,
      <created by zg, POWCHK disabled, PULCHK disabled
       configuration hash MD5:
       00 E9 B6 7A A2 85 ED C7 34 08 36 98 17 FE 4E 26
       data hash MD5: 16K
       35 2A 07 E6 06 3A B5 A9 2A EF A1 01 60 28 DB B4>)
(   2,<2026-07-23 14:11:13.12 +0400>,<Yarkov>,<DPX200>,
      <Start of raw data processing
       efp BC_mod = 2 LB = 0.25 FT_mod = 6 PKNL = 1 PHC0 = -7254.183 PHC1 = 2.82197 SI = 16K 
       data hash MD5: 16K
       AB 2E 81 15 42 B3 AF F9 F9 0E 44 BA F5 93 E1 3B>)
$$ ##END=
$$ 
$$ hash MD5
$$ E3 23 50 83 B6 CE 03 D1 F0 BC 7B 24 F2 94 5A 3A
##$RELAX= 
##$RELAX= 
##$RELAX= 
##$RELAX= 
##$RELAX= 
##$RELAX= 
$$ Bruker specific parameters
$$ --------------------------
##$DU= <C:/Bruker/XWIN-NMR>
##$EXPNO= 1
##$NAME= <H-C>
##$PROCNO= 1
##$TYPE= <nmr>
##$USER= <yarkov2>
##$AMP= (0..31)
100 100 100 100 100 100 100 100 100 100 100 100 100 100 100 100 100 100 
100 100 100 100 100 100 100 100 100 100 100 100 100 100 
##$AQSEQ= 0
##$AQ_mod= 1
##$AUNM= <au_zg>
##$AUTOPOS= <>
##$BF1= 200.13
##$BF2= 200.13
##$BF3= 200.13
##$BF4= 200.13
##$BF5= 200.13
##$BF6= 200.13
##$BF7= 200.13
##$BF8= 200.13
##$BYTORDA= 1
##$CFDGTYP= 0
##$CFRGTYP= 5
##$CHEMSTR= <none>
##$CNST= (0..31)
1 1 145 1 1 1 1 1 1 1 1 1 1 1 1 1 1 1 1 1 1 1 1 1 1 1 1 1 1 1 1 1 
##$CPDPRG= <>
##$CPDPRG1= <>
##$CPDPRG2= <>
##$CPDPRG3= <>
##$CPDPRG4= <mlev>
##$CPDPRG5= <mlev>
##$CPDPRG6= <mlev>
##$CPDPRG7= <mlev>
##$CPDPRG8= <mlev>
##$CPDPRGB= <>
##$CPDPRGT= <>
##$D= (0..31)
0 0.7 0 0 0 0 0 0 0 0 0 0.03 0 0 0 0 0 0 0 0 0 0 0 0 0 0 0 0 0 0 0 0 
##$DATE= 1784801467
##$DBL= (0..7)
120 120 120 120 120 120 120 120 
##$DBP= (0..7)
150 150 150 150 150 150 150 150 
##$DBP07= 0
##$DBPNAM0= <>
##$DBPNAM1= <>
##$DBPNAM2= <>
##$DBPNAM3= <>
##$DBPNAM4= <>
##$DBPNAM5= <>
##$DBPNAM6= <>
##$DBPNAM7= <>
##$DBPOAL= (0..7)
0.5 0.5 0.5 0.5 0.5 0.5 0.5 0.5 
##$DBPOFFS= (0..7)
0 0 0 0 0 0 0 0 
##$DE= 6
##$DECBNUC= <off>
##$DECIM= 32
##$DECNUC= <off>
##$DECSTAT= 4
##$DIGMOD= 1
##$DIGTYP= 9
##$DL= (0..7)
0 120 120 120 120 120 120 120 
##$DP= (0..7)
$$ [...]
##$SUBNAM2= <"">
##$SUBNAM3= <"">
##$SUBNAM4= <"">
##$SUBNAM5= <"">
##$SUBNAM6= <"">
##$SUBNAM7= <"">
##$SUBNAM8= <"">
##$SUBNAM9= <"">
##$SW= 18.0517328524113
##$SWIBOX= (0..15)
0 0 2 0 0 0 0 0 0 0 0 0 0 0 0 0 
##$SW_h= 3612.71676300578
##$TD= 16384
##$TD0= 1
##$TE= 0
##$TE2= 300
##$TE3= 300
##$TEG= 300
##$TL= (0..7)
0 120 120 120 120 120 120 120 
##$TP= (0..7)
150 150 150 150 150 150 150 150 
##$TP07= 0
##$TPNAME0= <>
##$TPNAME1= <>
##$TPNAME2= <>
##$TPNAME3= <>
##$TPNAME4= <>
##$TPNAME5= <>
##$TPNAME6= <>
##$TPNAME7= <>
##$TPOAL= (0..7)
0.5 0.5 0.5 0.5 0.5 0.5 0.5 0.5 
##$TPOFFS= (0..7)
0 0 0 0 0 0 0 0 
##$TUNHIN= 0
##$TUNHOUT= 0
##$TUNXOUT= 0
##$USERA1= <user>
##$USERA2= <user>
##$USERA3= <user>
##$USERA4= <user>
##$USERA5= <user>
##$V9= 5
##$VALIST= <valist>
##$VCLIST= <CCCCCCCCCCCCCCC>
##$VD= 0
##$VDLIST= <DDDDDDDDDDDDDDD>
##$VPLIST= <PPPPPPPPPPPPPPP>
##$VTLIST= <TTTTTTTTTTTTTTT>
##$WBST= 1024
##$WBSW= 4
##$XGAIN= (0..3)
0 0 0 0 
##$XL= 0
##$YL= 0
##$YMAX_a= 69460
##$YMIN_a= -102560
##$ZGOPTNS= <>
##$ZL1= 120
##$ZL2= 120
##$ZL3= 120
##$ZL4= 120
##$ABSF1= 0
##$ABSF2= 0
##$ABSG= 0
##$ABSL= 0
##$ALPHA= 0
##$AQORDER= 0
##$ASSFAC= 0
##$ASSFACI= 0
##$ASSFACX= 0
##$ASSWID= 0
##$AUNMP= <proc_1d>
##$AZFE= 0.1
##$AZFW= 0.1
##$BCFW= 0
##$BC_mod= 2
##$BYTORDP= 0
##$COROFFS= 0
##$CY= -3
##$DATMOD= 1
##$DC= 0
##$DFILT= <>
##$DTYPP= 0
##$F1P= 0
##$F2P= 0
##$FCOR= 1
##$FTSIZE= 16384
##$FT_mod= 6
##$GAMMA= 0
##$GB= 0
##$INTBC= 1
##$INTSCL= 3.241238e-09
##$ISEN= 128
##$LB= 0.25
##$LEV0= 0
##$LPBIN= 0
##$MAXI= 10000
##$MC2= 0
##$MEAN= 0
##$ME_mod= 0
##$MI= 1.114404
##$NCOEF= 0
##$NC_proc= -9
##$NLEV= 6
##$NOISF1= 3.799351
##$NOISF2= 2.8
##$NSP= 0
##$NTH_PI= 0
##$NZP= 0
##$OFFSET= 15.48466
##$PC= 1
##$PHC0= -7254.183
##$PHC1= 2.82197
##$PH_mod= 1
##$PKNL= yes
##$PPARMOD= 0
##$PSCAL= 0
##$PSIGN= 0
##$REVERSE= no
##$SF= 200.130007413273
##$SI= 16384
##$SIGF1= 3
##$SIGF2= 2
##$SINO= 0.751879
##$SIOLD= 32768
##$SREGLST= <19F.Aceton>
##$SSB= 0
##$STSI= 16384
##$STSR= 0
##$SW_p= 3612.71676300578
##$SYMM= 0
##$S_DEV= 0
##$TDeff= 16384
##$TDoff= 0
##$TI= <>
##$TILT= no
##$TM1= 0
##$TM2= 0
##$TOPLEV= 0
##$USERP1= <user>
##$USERP2= <user>
##$USERP3= <user>
##$USERP4= <user>
##$USERP5= <user>
##$WDW= 1
##$XDIM= 16384
##$YMAX_p= 361080322
##$YMIN_p= -2011284
$$ End of Bruker specific parameters
$$ ---------------------------------
##NTUPLES= NMR SPECTRUM
##VAR_NAME=  FREQUENCY,     SPECTRUM/REAL,   SPECTRUM/IMAG
##SYMBOL=    X,             R,               I
##VAR_TYPE=  INDEPENDENT,   DEPENDENT,       DEPENDENT
##VAR_FORM=  AFFN,          ASDF,            ASDF
##VAR_DIM=   16384,         16384,           16384
##UNITS=     HZ,            ARBITRARY UNITS, ARBITRARY UNITS
##FACTOR=    0.220516191357247, 1,           1
##FIRST=     3098.94515033545, 0,            0
##LAST=      -513.771612670325, 0,           0
##MIN=       -513.771612670325, -2011284,    0
##MAX=       3098.94515033545, 361080322,    0
$$ Real data points
##PAGE= N=1
##DATA TABLE= (X++(R..R)), XYDATA
$$ [...]
6517B8096607k55285n8988M18587n7959Q47615J482111J693803J189210K515179
6508C5870880J496989K076180K238643K627072K190666J867057O51503N06844
6500D9525834J43503k33193k63055m67514l16050r02240k6783O81199Q23829r6922
6490D8868608O88687M74168L64344J09273J42879r70962q49169j113513k072997
6481D5641318j638340j712990j927864j741605k155252j730678j589523k219551
6473C0925515k099788j752415j593693k239312n77877n73941j070285p36860o10836
6464A9670508o21082k19135o46157m23697l0990M22869r3409P999L71516O55620
6454A9094042M97383N72828O49175N93687M53127k00467o74424l66244n52000
$$ plain form
6517 28096607 27841322 27782334 28200921 28142962 28990577 30472688 32166491 33355701 35870880
6508 35870880 37367869 39444049 41682692 44309764 46500430 48367487 49018990 49525834
6500 49525834 49669337 49436144 49173089 48705575 48389525 47487285 47460502 48141701 48965530 48868608
6490 48868608 49557295 50031463 50395807 50505080 50647959 49676997 48827828 47714315 45641318
6481 45641318 44002978 42289988 40362124 38620519 36465267 34734589 33145066 30925515
6473 30925515 28825727 27073312 25479619 23240307 22662430 22088489 21018204 20281344 19670508
6464 19670508 19049426 18830291 18184134 17760437 17729447 18152316 18058907 18066906 18438422 19094042
6454 19094042 19591425 20164253 20813428 21407115 21860242 21659775 20985351 20619107 20067107
6445B0067107o16051l90127l80122o10359p12621K66401n86179J68350N05595
6436A7711994J031027L46214R97180m29683N41869O24629k95115N57064l57242
6427B0727937o06272r30267r47226r57487p79159n96735r50927q87548k46230
6418A3826086l13421K43953n70872n94890K87435R22527l29881O63080R90979
6409A5124996j85891L5911L171Q09704N13281L79925j10204m7998M31084p8120
6399A6875859j172076K97177q78725j526408q24702l03488r23146l74572j210802
6390I959117l40326m91398o13397l60695j60817K416p06394M63432o55579Q7463
6380G183822q72196N26585l98858R3815m37929j38102J38634M42112o35652j81211
$$ plain form
6445 20067107 19451056 19060929 18680807 18070448 17357827 17624228 17038049 17206399 17711994
6436 17711994 18743021 19089235 20086415 19656732 20198601 20823230 20528115 21085179 20727937
6427 20727937 20121665 19191398 18244172 17286685 16507526 15910791 14959864 14072316 13826086
6418 13826086 13512665 13756618 13185746 12590856 12878291 13800818 13470937 14134017 15124996
6409 15124996 14939105 14975016 14978187 15787891 16301172 16681097 16570893 16522895 16953979 16875859
6399 16875859 15703783 16000960 15122235 13595827 12771125 12467637 11544491 11169919 9959117
6390 9959117 9618791 9127393 8513996 8153301 7992484 7994900 7288506 7751938 7096359 7183822
6380 7183822 6311626 6838211 6439353 6533168 6095239 5957137 6095771 6537883 5902231 5721020
6370E721020J38847o39231M20525J6117Q2669k48850L41855q23285m07141N44670
6360E147196M67182o28334M91448n86939K93892J78309l50467k57014Q47803m02512
6350E200564j91620q8763L02943K96380k93021m05220k45049Q96606o31228P9795
6340D921387J0885N48066r81905L73858p9306J92780j68966j0717K10606M45686
6330E462374q11452o0248M58711n50455k39278L7221J184249o31283M39756k63863
6320E025732n5956J52497R11976l18272J02723m76769k63722L08975j20570J74181
6310E440795j40893l25597q98790N7856k25802L01954p1214J385208l69686j64610
6300D989221L40719j57690q9036N0960n12684M30351M97831J6829r9305L1025
$$ plain form
6370 5721020 5859867 5220636 5641161 5657278 5739947 5491097 5832952 5009667 4602526 5147196
6360 5147196 5614378 4986044 5477492 4890553 5184445 5362754 5012287 4755273 5603076 5200564
6350 5200564 5008944 4920181 5223124 5519504 5226483 4821263 4576214 5472820 4841592 4921387
6340 4921387 4932272 5480338 4498433 4872291 4792985 4985765 4816799 4806082 5016688 5462374
6330 5462374 4650922 4590674 5049385 4498930 4259652 4296873 5481122 4849839 5289595 5025732
6320 5025732 4969776 5122273 6034249 5715977 5818700 5341931 5078209 5387184 5266614 5440795
6310 5440795 5299902 4974305 4075515 4133371 3907569 4209523 4138309 5523517 5153831 4989221
6300 4989221 5329940 5172250 5083214 5134174 4621490 5051841 5549672 5566501 5467196 5498221
6290E498221k85010k49733j3415q12210J49300N58744L70768p4610R8727R1645
6280E332427L38684L14897J55995l90972l97607J62861J29003l41971n9042J15110
6270E359385P57145K06378K35841N0392p8822j67696j17662j46503o10679M21272
6260E909051J94325r5443l25615K84869k54041k20413J14465L00729P3437o4514
6250E916850q34345q6340N76383R8033j55674M17553j88437L02160L80757j35487
6240F291453r4313J63685l0045M49667R61848l22015m58644L48872K12370n49713
6230F973165N45636n82137O57602q52881M6785o22723M92086J92405j39322o24097
6220F086519K07191Q1815M7154M48388r17472M99821L33980k83207k62546M41053
$$ plain form
6290 5498221 5213211 4963478 4950063 4137853 4287153 4845897 5216665 5142055 5240782 5332427
6280 5332427 5671111 5986008 6142003 5751031 5353424 5516285 5645288 5303317 5244275 5359385
6270 5359385 6116530 6322908 6558749 6609141 6530319 6362623 6244961 6098458 5487779 5909051
6260 5909051 6103376 6007933 5682318 5967187 5713146 5492733 5607198 5907927 5981364 5916850
6250 5916850 5082505 4996165 5572548 5670581 5514907 5932460 5744023 6046183 6426940 6291453
6240 6291453 6197140 6360825 6330780 6780447 7742295 7420280 6961636 7310508 7522878 6973165
6230 6973165 7518801 6936664 7594266 6741385 6788170 6165447 6657533 6849938 6710616 6086519
6220 6086519 6293710 6375525 6422679 6871067 5953595 6453416 6787396 6504189 6241643 6682696
6210F682696m95869L05199J83536j71405j58340Q52605N8578M18123j45115j65136
6200G364872M44523l49234k81973m80163J97120M00025l94587K22228L44149r62686
6190F504274O17594p53328m85685J416063M01292j050993K44529m46933n16631
6181E930182M35781L34830P26034m55288l4300l95523N27428K65264m47733L7415
6171F924090Q72223J78708O18728J62338n69063n41495k98819k05592J13029j48938
6161G105209J86591k46888m34681P65014l2981j20961p61212k26004Q96467k41606
6151F888948j11404J121048j045132j49150k07289L7950j69473j22087o0637j56451
6141F026323K4873m58299j67714K40687M35955r9448P2882l54272r5794k55579
$$ plain form
6210 6682696 6186827 6492026 6675562 6504157 6345817 7198422 7257000 7675123 7530008 7364872
6200 7364872 7809395 7460161 7178188 6698025 6895145 7295170 6900583 7122811 7466960 6504274
6190 6504274 7121868 6368540 5882855 7298918 7700210 6649217 6893746 6446813 5930182
6181 5930182 6365963 6700793 7426827 6971539 6937239 6541716 7069144 7334408 6886675 6924090
6171 6924090 7796313 7975021 8593749 8756087 8187024 7645529 7346710 7141118 7254147 7105209
6161 7105209 7291800 7044912 6610231 7375245 7342264 7221303 6460091 6234087 7130554 6888948
6151 6888948 6777544 7898592 6853460 6704310 6497021 6534971 6365498 6243411 6182774 6026323
6141 6026323 6051196 5592897 5425183 5665870 6101825 6002377 6075259 5720987 5625193 5369614
6131E369614j35049n74801L48158l35294L65793k19484J16343K10384n52077O2233
6121D655820q15202O06289R722R8119R07679L24899k08956k06907L71283L65061
6111F107807N05271j2623m84183J56652l91886l43553P27410k21485l26357m12859
6101E304194n0653l29548m99484L25835j4055l53545J93698k70243m74228O54278
6091D486249r3199m29331K00742L1344L55800M87648Q1484j93265L62661j28343
6081E161790j17331P90798m70800l68015O81955n13288K83274n6292l88615l88135
6071D615341R15484K56632l21600J77835j40631J32442n50041K7227l09483J9291
6061D822497Q2251n63588r8125l41960q92470L03311M37399M92611j62619P07524
$$ plain form
6131 5369614 5234565 4659764 5007922 4672628 5038421 4818937 4935280 5145664 4593587 4655820
6121 4655820 3840618 4446907 4456629 4554748 5462427 5787326 5578370 5371463 5742746 6107807
6111 6107807 6613078 6600455 6116272 6272924 5881038 5537485 6264895 6043410 5717053 5304194
6101 5304194 5253541 4923993 4424509 4750344 4736289 4382744 4576442 4306199 3831971 4486249
6091 4486249 4393050 3963719 4164461 4195805 4551605 5039253 5120737 4927472 5290133 5161790
6081 5161790 5044459 5835257 5364457 4996442 5678397 5165109 5448383 5392091 5003476 4615341
6071 4615341 5530825 5787457 5465857 5643692 5503061 5635503 5085462 5112689 4803206 4822497
6061 4822497 4904748 4341160 4243035 3901075 3008605 3311916 3749315 4241926 4079307 4786831
6051D786831q97722o112M61420r7394P6844P8473k88552r67164J392975L97558
6041D937157l91605M56270L99047k69541L83956M58919j73032p4531k12618m82332
6031E031690k37374K57959l24276l19082l53456j15981n88030Q91469J08558L66395
6021D717872j04797p56603J02917M93878P7039l57780p0515n69461K5342Q49639
6011D407531o95941k25547K14567k85183M69831r2221P95238q47732R27242K03014
6001D870799k99221j738m0927M17984k44172l57994j53132l79148L99683l28595
5991C883539j44159L73045o62856M03026M80025p26596K20548K21146q88368N17364
5981C676714o97152M74786J04547k30339j46517k91648P05601j27689J48225J91552
$$ plain form
6051 4786831 3889109 3882997 4344417 4247023 4323867 4402340 4113788 3146624 4539599 4937157
6041 4937157 4545552 5001822 5400869 5131328 5515284 5974203 5801171 5726640 5514022 5031690
6031 5031690 4794316 5052275 4727999 4408917 4055461 3939480 3351450 4242919 4351477 4717872
6021 4717872 4613075 3856472 3959389 4453267 4530306 4172526 4102011 3532550 3557892 4407531
6011 4407531 3711590 3486043 3700610 3415427 3885258 3793037 4588275 3740543 4667785 4870799
6001 4870799 4571578 4569840 4528913 4946897 4702725 4344731 4191599 3812451 4212134 3883539
5991 3883539 3739380 4112425 3449569 3852595 4332620 3606024 3826572 4047718 3159350 3676714
5981 3676714 2979562 3454348 3558895 3328556 3182039 2890391 3595992 3468303 3616528 3808080
5971C808080n06652L38829L43678j97215K3087K6300n33094n21979N87517k95157
5961C073394Q4342K93164N13194m15010K1364L06767N8176o2440n42623j33948
5951C196380l97118k20611j02591J93909J70839m04705J59546l40455k33191P55378
5941B777381K94742J227831l73820l6962j52706j21698k44142N98790k65421p06675
5931B997320N42928J26925R2450o79236J66307M66174j14550l37192K40856L50738
5921C852720K21436N16016L21394k07537J73205n73722l2589m50056p79053K30719
5911C272533M61333m57636P58108j47124m76349j69130N04899n72136n31658L10548
5901B953388j76342L7585l33313Q8627O46076j40339o87248N39974Q7644L57468
$$ plain form
5971 3808080 3301428 3640257 3983935 3786720 3809807 3836107 3303013 2781034 3368551 3073394
5961 3073394 3157736 3450900 3964094 3549084 3570448 3877215 3935391 3872951 3330328 3196380
5951 3196380 2799262 2578651 2476060 2669969 2840808 2436103 2595649 2255194 2022003 2777381
5941 2777381 3072123 4299954 3926134 3889172 3736466 3614768 3370626 3969416 3703995 2997320
5931 2997320 3540248 3667173 3759623 3080387 3246694 3712868 3598318 3261126 3501982 3852720
5921 3852720 4074156 4590172 4911566 4704029 4877234 4303512 4270923 3820867 3041814 3272533
5911 3272533 3733866 3276230 4034338 3887214 3410865 3241735 3746634 3174498 2642840 2953388
5901 2953388 2777046 2814631 2481318 2569945 3216021 3075682 2388434 2928408 3016052 3373520
5891C373520k66551K70680Q5961m60426m09743J98199l28901M24952L34610l41751
5881B880550j11578N44817l28343K12002L16109o65946L49380N1248K03161k13287
5871C238113L52204j9554N01133n21947p44564O29197j87744j41839J27830O55491
5861C888320q07938J09107O42129k59315Q2262k51156l33010R6419L76172k35606
5851C307384j113955Q89703R8181k83902P41502N55814r53987P4413J76748n23011
5841B968890O57601N0214P4349L2866K12244k89320N18061k33797o77364k30114
5831C083630j7517J08167N40040m3440k88450l288N17655k54522q95853O31007
5821C377429n93315J94942J094203r76661k95423O32475R8229m46287N87637L75381
$$ plain form
5891 3373520 3106969 3377649 3463610 3003184 2593441 2791640 2462739 2887691 3222301 2880550
5881 2880550 2768972 3313789 2985446 3197448 3513557 2847611 3196991 3248239 3451400 3238113
5871 3238113 3590317 3570763 4071896 3549949 2805385 3434582 3246838 3104999 3232829 3888320
5861 3888320 3080382 3189489 3831618 3572303 3654565 3403409 3070399 3166818 3542990 3307384
5851 3307384 2193429 3083132 3181313 2897411 3638913 4194727 3240740 3315153 3491901 2968890
5841 2968890 3626491 3676705 3751054 3783920 3996164 3706844 4224905 3991108 3313744 3083630
5831 3083630 3066113 3174280 3714320 3670880 3382430 3379142 3896797 3642275 2746422 3377429
5821 3377429 2784114 2979056 4073259 3096598 2801175 3433650 3531879 3085592 3673229 4048610
5811D048610n51099L74858K83032o83544q589O7217j70048M23468o83592n76646
5801B523667N40974M82227l63o01814p5343O97263k6505J98405n2660j85641O97415
5790D197625p08090L34837m02026o6144J75035P31420m57687m13980N21157o08832
5780C303315K44140L7089k06347M2515K57375O26414J24329k65456k57145n04490
5770C401739K7866o16390M61346O4015k28504J8302P84445P04318L42546k53815
5760D705868R6894J175770K60534L46788J390652J662565J830348J478340J458940
5751A4406699Q20936q18606q34300j083328q55587j607641j470889j163950o97617
5742F695717m43377q40364K07912J25957m61325N01106k23800n36096N73504l06214
$$ plain form
5811 4048610 3497511 3872369 4155401 3471857 3463268 3530485 3360437 3783905 3100313 2523667
5801 2523667 3064641 3546868 3546505 2944691 2869348 3566611 3540106 3738511 3685851 3500210 4197625
5790 4197625 3489535 3824372 3422346 3356202 3531237 4262657 3804970 3390990 3912147 3303315
5780 3303315 3547455 3584544 3378197 3420712 3678087 4304501 4428830 4163374 3906229 3401739
5770 3401739 3429605 2813215 3274561 3338576 3110072 3128374 3912819 4617137 4959683 4705868
5760 4705868 4802762 5978532 6239066 6585854 7976506 9639071 11469419 12947759 14406699
5751 14406699 15227635 14409029 13574729 12491401 11635814 10028173 8557284 7393334 6695717
5742 6695717 6252340 5411976 5619888 5745845 5284520 5785626 5561826 5025730 5599234 5293020
5732E293020K71697m79313n96043m0825M22828N7417L36670L49224M90595K99651
5722F404921O29160O16515k2427L1185m92121L23572j26075r69655p46255N49671
5712F198491m68672o27523J25502J36030n47758M83733J87043j20363j11667K97947
5702E552763K52785j13693Q21736R6720o15466j25441j35725J98484N26634J08416
5692F567213J34135M66085N24038q19902N29179L14714o4266j54320l95701q10238
5682F290937l83095j4161j061032P64703J74098o65536J67757M4765j00038K256
5672E220654J40449n91326j8820M06152j04734N08224K51753p15416j27549M31580
5662E400967L63747l17916L33692K28510m2661K53965N77340J5546L92030O89235
$$ plain form
5732 5293020 5564717 5085404 4489361 4448536 4871364 4928781 5265451 5614675 6105270 6404921
5722 6404921 7034081 7650596 7628169 7659354 7167233 7490805 7364730 6395075 5648820 6198491
5712 6198491 5729819 5102296 5227798 5363828 4816070 5299803 5486846 5366483 5254816 5552763
5702 5552763 5805548 5691855 6513591 6610311 5994845 5869404 5733679 5932163 6458797 6567213
5692 6567213 6701348 7167433 7691471 6871569 7400748 7715462 7651196 7496876 7101175 6290937
5682 6290937 5907842 5893681 4832649 5597352 5771450 5105914 5273671 5318436 5218398 5220654
5672 5220654 5361103 4769777 4750957 5157109 5052375 5560599 5812352 5096936 4969387 5400967
5662 5400967 5764714 5446798 5780490 6009000 5966339 6220304 6797644 6813190 7205220 7894455
5652G894455l43416J78155k43245j38245M17798l81966l95233N35302P63163j133227
5642G153541L35864O29918o78351k81362J22586j12636K12106L62070m34438N7877
5632G367175N90449o19840N69003M49528q28577M49783k12986n5329K03063j46938
5622G765331k64134R9900m31696J81322O6878j42960j81824n99667l23093Q66381
5612G036438l79512M92445j02075k93457N19764M43986k40324R35417J070427
5603I483109p7746L23483K5058K57836J080589j21283n06984M64563n87529M34743
5593A0775839l05145M23535j090005l91743o35485j8468K41936J02404M01857
5584I504725J81667N28863J24771k3134n23634P81298l4564j77887o09357K83282
$$ plain form
5652 7894455 7551039 7729194 7485949 7347704 7765502 7383536 6988303 7523605 8286768 7153541
5642 7153541 7489405 8119323 7440972 7159610 7282196 7169560 7381666 7743736 7309298 7367175
5632 7367175 7957624 7337784 7906787 8356315 7527738 7977521 7764535 7709206 7912269 7765331
5622 7765331 7501197 7601097 7169401 7350723 7417601 7274641 7092817 6493150 6170057 7036438
5612 7036438 6656926 7149371 7047296 6753839 7273603 7717589 7477265 8412682 9483109
5603 9483109 9405363 9728846 9753904 10011740 11092329 10971046 10464062 10928625 10341096 10775839
5593 10775839 10470694 10894229 9804224 9412481 8776996 8758528 9000464 9102868 9504725
5584 9504725 9686392 10215255 10340026 10316892 9793258 10574556 10539992 10362105 9752748 10036030
5574A0036030O51082J032668J35231J434959L91512J244356J663313J287803Q34859
5565A8711813O28886J168936k76452P93083p83162k12889o87066n33777n58420
5556A8250952o38815n28479N29435k80349r1313P01279M21841P98085k2730R05470
5546B0045376J136189O73661P17169J055605P70739R84057j36742J541559J601290
5537B8388903K510926J800806J679711K219173J939318J878862P90944l77732
5529D0830911p35885o47919j377793j000769j586823q96870j566253p56498o10737
5520C1651364k16856m55190Q48591R52193J481181J672090J778105K058808K387116
5511D2157402J621829R78653Q12470J31800l3645K41135j01362M88926J163386
$$ plain form
5574 10036030 10687112 11719780 11855011 13289970 13681482 14925838 16589151 17876954 18711813
5565 18711813 19340699 20509635 20233183 21026266 20243104 20030215 19343149 18809372 18250952
5556 18250952 17612137 17083658 17613093 17332744 17241431 17942710 18364551 19162636 19139906 20045376
5546 20045376 21181565 21855226 22572395 23628000 24398739 25382796 25246054 26787613 28388903
5537 28388903 30899829 32700635 34380346 36599519 38538837 40417699 41208643 40830911
5529 40830911 40095026 39447107 38069314 37068545 35481722 34584852 33018599 32262101 31651364
5520 31651364 31434508 30979318 31827909 32780102 34261283 35933373 37711478 39770286 42157402
5511 42157402 43779231 44757884 45570354 45702154 45668509 45909644 45808282 46297208 47460594
5502D7460594M34709J338964K23917N76771O14629m81320j521298q95864j774395
5493D5976707k404783j314490o61811q53337j00803q2482O341M67612Q61794J174749
5483D3069497L92016R26719R09277P94551J076978L42125J16339p64087k087447
5474D4775968j963345j413918j409778j647512j092269j489868j492952K70805
5466C4537131q85425j183008L1075m66345r90781q66966r46387j121812j98509
5457B7908973n69601N4832p61077o38415K07673J00398O39831N48430M6256J02455
5447B7639755J077273N66046J57440L84807k74322o10924j187972j700225l76999
5438B5674879q02230o63416k73733p82422q06023M08962M31895J31056N35904
$$ plain form
5502 47460594 47895303 49234267 49458184 50034955 50649584 50168264 48646966 47751102 45976707
5493 45976707 43571924 42257434 41595623 40742286 40641483 40559001 40565342 41032954 41894748 43069497
5483 43069497 43461513 44388232 45297509 46092060 47169038 47511163 47627502 46863415 44775968
5474 44775968 42812623 41398705 39988927 38341415 37249146 35759278 34266326 34537131
5466 34537131 33651706 32468698 32499773 32033428 31042647 30175681 29229294 28107482 27908973
5457 27908973 27339372 27394204 26633127 25994712 26202385 26302783 26942614 27491044 27537300 27639755
5447 27639755 28717028 29283074 29440514 29825321 29550999 28940075 27752103 26051878 25674879
5438 25674879 24872649 24209233 23935500 23153078 22347055 22756017 23187912 23318968 23854872
5429B3854872j204640M19242q1666K94388L99993O96510K82775Q23230Q11974
5420B6296678L28281J050420P57160J084936K24610M82508O09693k0823q57174
5411B9956289J60063o18088p40609j397278p54285j076736n5788p87217r97603
5402B3688748J8321j056926j027894j28114j15126n84715p77546j416561k32688
5393A8367499n36124k7032j09337j19182j69510P10972l21268O8781M68548N38159
5383A8871506J04355n0769Q83595P33355R62700R79357J440215J164809J589947
5374B6679070J752733J442917J096542J463989J96532Q98394L66443l92490k64168
5365C3239962q74227j868698j501568j701844j537020j386220k312750j480726
$$ plain form
5429 23854872 22650232 23069474 22987808 23282196 23682189 24378699 24661474 25484704 26296678
5420 26296678 26624959 27675379 28432539 29517475 29742085 30224593 30834286 30813463 29956289
5411 29956289 30116352 29498264 28757655 27360377 26606092 25529356 25473568 24686351 23688748
5402 23688748 23707069 22650143 21622249 21494135 21379009 20794294 20016748 18600187 18367499
5393 18367499 17831375 17804343 17695006 17575824 17406314 18117286 17796018 17864799 18333347 18871506
5383 18871506 18975861 18925092 19808687 20542042 21504742 22484099 23924314 25089123 26679070
5374 26679070 28431803 29874720 30971262 32435251 32631783 33530177 33896620 33504130 33239962
5365 33239962 32365735 30497037 28995469 27293625 25756605 24370385 22057635 20576909
5357B0576909q89236r83931j014344n71762o40245l4804j131099r50151j65895
5348A4195442K37684o26723o66364n58481O22457M94015O3013k32162N25715M08107
5338A4462703p88389l52238k59874N52662j75823O82781N8695p137m86833K92972
5328A3979519o55284M82737N87011J70042Q43791Q18276J267590J020337J107635
5319A9621654m51859J02010l87440j553004l68006p491j185251o42600j156587
5310A3971426q65497q85827n26220o24538J43932K90788j71088j03768n43381
5301A0685827L9491j145569Q6130N17396l24839r8232j07193m16506O88827l52141
5291I573191m3259K75149J088664k22927O81360J299912k72690J508875J59394
$$ plain form
5357 20576909 19687673 18703742 17689398 17117636 16477391 16442587 15311488 14361337 14195442
5348 14195442 14433126 13806403 13140039 12581558 13204015 13698030 13761043 13528881 14054596 14462703
5338 14462703 13674314 13322076 13062202 13614864 13439041 14121822 14180517 14173380 13686547 13979519
5328 13979519 13324235 13806972 14393983 14564025 15407816 16226092 17493682 18514019 19621654
5319 19621654 19169795 19271805 18884365 17331361 16963355 16955864 15770613 15128013 13971426
5310 13971426 13105929 12220102 11693882 11069344 11213276 11504064 11332976 11229208 10685827
5301 10685827 10725318 9579749 9665879 10183275 9858436 9760204 9653011 9236505 9925332 9573191
5291 9573191 9529932 9805081 10893745 10670818 11352178 12652090 12379400 13888275 14047669
5282A4047669L3877J062834N09929O2528J380561N73140M96289o09874M47020
5273A8003973M3778q95975o14354n01662r57787m87594o70356j050588J90274
5264A3059709n31901q88385r89306N18230o59030K4817N38111Q1237Q61348n49573
5254A1465257k57350K67433P08590j42176k60761M74818O79202Q80520L23928
5245A4139461P52523J253678L96184O31065J350588J720500J168779O91881N97699
5236B2702358L18124j92541M2801n21798j381380J3391j220113j245919q38879
5227A7676044j107364o52892j641086j60419m08425o04356k27450o04250j68504
5218A2101298r7093Q3745p32491p95767J06214j38254q4280N11690o58733k28902
$$ plain form
5282 14047669 14081546 15144380 15654309 15716837 17097398 17670538 18166827 17556953 18003973
5273 18003973 18047751 17151776 16537422 16035760 15077973 14590379 13920023 12869435 13059709
5264 13059709 12527808 11639423 10650117 11168347 10509317 10534134 11072245 11153482 12014830 11465257
5254 11465257 11207907 11475340 12183930 12041754 11780993 12255811 12935013 13815533 14139461
5245 14139461 14891984 16145662 16541846 17172911 18523499 20243999 21412778 22104659 22702358
5236 22702358 23020482 22827941 22870742 22348944 20967564 20980955 19760842 18514923 17676044
5227 17676044 16568680 15915788 14274702 14114283 13705858 13101502 12874052 12269802 12101298
5218 12101298 12004205 12087950 11355459 10559692 10665906 10527652 10443372 10955062 10296329 10067427
5208A0067427O09651J16851L36538N75733j28199R36426L02733J19172J238974
5199A4175306R32791R30968J28076L35002m59482n70543L30004k87113j004548
5190A4510461j176552q52503l85391l14017k39718j385385l64094J04741l91826
5181I505716n71110L28974k38347j087475P70882q5673J36434Q03646J87254J05699
5171I856000M73029n35310J851M09880m79350K01561N38127p04563K14920Q9097
5161A0065242J20086r45711m58653N40402q81798k01263k29606J55341j78699
5152G985341p6135q6509j03064O73519n60411L7142P04737K0959Q92673L55111
5142I843363j84186L08605R19535K33063K55132K22484J34195K35292K80403o5280
$$ plain form
5208 10067427 10677078 10793929 11130467 11706200 11578001 12514427 12817160 12936332 14175306
5199 14175306 15108097 16039065 16167141 16502143 16042661 15472118 15802122 15515009 14510461
5190 14510461 13333909 12481406 12096015 11781998 11542280 10156895 9792801 9897542 9505716
5181 9505716 8934606 9263580 9025233 7937758 8708640 8622967 8759401 9563047 9750301 9856000
5171 9856000 10329029 9793719 9795570 10205450 9726100 9927661 10465788 9761225 9976145 10065242
5161 10065242 10185328 9239617 8780964 9321366 8439568 8238305 8008699 8164040 7985341
5152 7985341 7909206 7822697 7719633 8393152 7832741 7869883 8574620 8595579 9488252 9843363
5142 9843363 9659177 9967782 10887317 11120380 11375512 11597996 11732191 11967483 12247886 12182606
5132A2182606k18844M06750m36960k46623p0868m7852o75936J42907l86912m63668
5122A0184600m43594N81593k61254r16J64186l44319P88398J53402K00542j11654
5112A0910984M53146J009279P04502K76401N66145J06504Q34754k7263M08080
5103A5242532P71120p1049J35742M49138Q242K14987k26701m99970q28179r20594
5093A4275268r5948j206014j39305k3994q49393N53669L09238N437Q023L46965
5083A3183946P2025J85408O37053p3815R14025J033656L92101K95457N58757Q37954
5073A8036567k8891P9344K23191J88742J24025M33835j28840m7967n36504p75544
5063A7567958q831l37093m79447m88615L56258j198912m10527L83921p86420j19304
$$ plain form
5132 12182606 11963762 12370512 11933552 11686929 11616061 11568209 10892273 11035180 10648268 10184600
5122 10184600 9741006 10322599 10061345 10060429 10224615 9880296 10668694 10822096 11022638 10910984
5112 10910984 11364130 12373409 13077911 13354312 13920457 14026961 14861715 14834452 15242532
5103 15242532 16013652 15942603 16078345 16527483 16535725 16750712 16524011 16024041 15195862 14275268
5093 14275268 14179320 12973306 12834001 12810007 11960614 12514283 12823521 12828958 12836981 13183946
5083 13183946 13255971 13441379 14078432 14004617 14918642 15952298 16344399 16639856 17198613 18036567
5073 18036567 18007676 18087020 18310211 18498953 18622978 19056813 18927973 18880006 18343502 17567958
5063 17567958 17559127 17222034 16742587 16253972 16610230 15411318 15000791 15384712 14598292 14478988
5053A4478988P36021J15044R9970N98202N65890r4465N00895L39859P24960Q04829
5043A8870193J076619L90423L42723M56333m86985j58125j59671l84171n48706
5034A9398633k36241l98347l47617n24902J67396m18620K22169m56246J93310
5025A7599535m85451k72637n48965J27208l1286n2688N12018J78572N75832M56442
5015A8058580P68304K2703J657872J316479J547371R44191J639010J192567p63897
5006B6383180j81572k36663k41176j43757j197716j251402m7839l99725m73411
4997B2209919j55737M42725j36406j86506n91057k81304l57147q14029K26383
4988B0356841R52208K20620Q452P06000P72316P66424R60340J479694J087723
$$ plain form
5053 14478988 15215009 15330053 15430023 16028225 16594115 16499650 17000545 17340404 18065364 18870193
5043 18870193 19946812 20337235 20679958 21136291 20649306 20491181 20331510 19947339 19398633
5034 19398633 19162392 18764045 18416428 17891526 18058922 17640302 17862471 17406225 17599535
5025 17599535 17114084 16841447 16292482 16419690 16388404 16335716 16847734 17026306 17602138 18058580
5015 18058580 18826884 18849587 20507459 21823938 23371309 24315500 25954510 27147077 26383180
5006 26383180 26201608 25964945 25723769 25580012 24382296 23130894 23083055 22683330 22209919
4997 22209919 22054182 22496907 22360501 22173995 21582938 21301634 20944487 20130458 20356841
4988 20356841 21309049 21529669 21538121 22244121 23016437 23782861 24743201 26222895 27310618
4979B7310618J998190J745813K044815J408265J760511j50749j91772l03103o27338
4970C4995250q18569j180528j106639k321066r55807j093587r76096o07168j265894
4961B4669896o48070m93981j044560k93529o41338K96286M16194K20024J70596
4952B2651518N16189M97466J175274L20675Q34595K001875J590509J015218J323078
4943C1926397J471689R90377J472241j22808j155069n44816r66655q36851k00532
4934C2033973j219719j616169j194354q77699n81220p87004k03694n21915m46212
4925B4585987O39238j18636n2655N59430M02243o74410N43333j9966j62707K66250
4915B5968107o4672n66314J11111L22097j93232j501L44841j09294L63206l55316
$$ plain form
4979 27310618 29308808 31054621 33099436 34507701 36268212 36117463 35925691 35622588 34995250
4970 34995250 34176681 32996153 31889514 29568448 28612641 27519054 26542958 25935790 24669896
4961 24669896 24021826 23527845 22483285 22189756 21548418 21844704 22260898 22480922 22651518
4952 22651518 23167707 23665173 24840447 25161122 25995717 27997592 29588101 30603319 31926397
4943 31926397 33398086 34388463 35860704 35737896 34582827 34038011 33071356 32234505 32033973
4934 32033973 30814254 29198085 28003731 27126032 26544812 25757808 25554114 25032199 24585987
4925 24585987 25225225 25106589 25053934 25613364 26015607 25341197 25884530 25864564 25701857 25968107
4915 25968107 25903435 25337121 25448232 25770329 25577097 25575596 25920437 25811143 26174349 25819033
4905B5819033J34109R27969l97182k11965J87324O30391J50155L86523j36257
4896B7490100J288214R14482O15307P48913J392608J393222P29914Q94873M10996
4887C5878629n78932q35210j112187j235108j330489j609394j083645j035656
4879B7058008n30809p92198p43350o69977l70349k1970J61168k20308P6641j85258
4869B3761598N72845Q66200P57221Q25666R96006J593044K098169J938192R24072
4860C4333013K009783J807225J086291J171372J151733k46069k69198j094629
4852C9949521j264880r74371q91221j664097j379426j460057k121959p18321q85294
4843B8589895q7771j147534k4834n32862l18641L54420j60870J049216O5864k94393
$$ plain form
4905 25819033 25953142 26881111 26483929 26271964 26459288 27089679 27239834 27626357 27490100
4896 27490100 28778314 29692796 30308103 31057016 32449624 33842846 34572760 35467633 35878629
4887 35878629 35299697 34464487 33352300 32117192 30786703 29177309 28093664 27058008
4879 27058008 26527199 25735001 24991651 24321674 23951325 23929355 24090523 23870215 23946856 23761598
4869 23761598 24334443 25200643 25957864 26783530 27779536 29372580 31470749 33408941 34333013
4860 34333013 36342796 38150021 39236312 40407684 41559417 41313348 41044150 39949521
4852 39949521 38684641 37710270 36819049 35154952 33775526 32315469 30193510 29475189 28589895
4843 28589895 28502124 27354590 27329756 26796894 26478253 26832673 26671803 27721019 27786883 27492490
4833B7492490J608P34320J310801J036638L86089J512196J484904J847164Q44364
4824C6650574K41596R20568n20777r23724K69923n77277j053988q11114j102023
4815C3093758j018177j091583M4q22702p36485j58652L27526m94378K89159O421
4805B9394931p33866O74084Q15745j48836J010602J042432J1255K58329J180248
4796C3504924J432271Q02051J369498J172806J439603J131490P69188L09505Q65442
4787D2796778L60303N17610M41330m38985n20560P37870l15408j98471N50608
4778D3931075O41750L89389P86230N09856j23385J467943J115848K86034R13523
4769D9918263J363204J229613J354426J290763J159808J378563J191466L65668
$$ plain form
4833 27492490 27494098 28228418 29539219 30575857 30961946 32474142 33959046 35806210 36650574
4824 36650574 36892170 37812738 37291961 36368237 36638160 36060883 35006895 34195781 33093758
4815 33093758 32075581 30983998 30984042 30161340 29424855 29266203 29593729 29099351 29388510 29394931
4805 29394931 28661065 29335149 30150894 30002058 31012660 32055092 32066347 32324676 33504924
4796 33504924 34937195 35739246 37108744 38281550 39721153 40852643 41621831 41931336 42796778
4787 42796778 43157081 43674691 44116021 43677036 43156476 43894346 43578938 43380467 43931075
4778 43931075 44572825 44962214 45748444 46258300 46134915 47602858 48718706 49004740 49918263
4769 49918263 51281467 52511080 53865506 55156269 56316077 57694640 58886106 59251774
4761E9251774J502082O16856J059085R52986R50233o8132J10277K13310P4065
4752F4662536N26875K38922k95057J361P40116N13200L12290K16126M98820L75594
4742F7790783L62841O26734O16164Q85280K021887N39902J297161J534376M01341
4733G6076469J129775J386709P45530J179620J022893j82976R2369O40113P14213
4724H2804715R2440K7817j84844k74387M47920q77858r04229K07208o502r2685
4714H1239595k87465K36701O70602M26842P45803Q74611J020295J375808J422951
4705H7725743J301019N73986J080535O52282O10536l25758k67119q7821r77852
4696I0285551j6005p18325p01143j704388j647950j846375j168139j644622k061257
$$ plain form
4761 59251774 60753856 61370712 62429797 63382783 64333016 64264884 64375161 64588471 64662536
4752 64662536 65189411 65428333 65133276 65134637 65874753 66387953 66700243 66916369 67415189 67790783
4742 67790783 68153624 68780358 69396522 70281802 72303689 72843591 74140752 75675128 76076469
4733 76076469 77206244 78592953 79338483 80518103 81540996 81358020 81450389 82090502 82804715
4724 82804715 82897155 82924972 82740128 82465741 82913661 82035803 81131574 81338782 81332280 81239595
4714 81239595 80952130 81188831 81859433 82286275 83032078 83906689 84926984 86302792 87725743
4705 87725743 89026762 89600748 90681283 91333565 91944101 91618343 91351224 91263403 90285551
4696 90285551 90269546 89551221 88850078 87145690 85497740 83651365 82483226 80838604 78777347
4687G8777347j019177j515269j955410k123689j133170q78850j265793j097128
4679F7788861n60034j117699j260206j493979r60192j410649j133555j567716
4671E8284831j787333r74525k042530j382649j647322j841898j869316j414151
4663D5325107k086315j599995j575985j334723j920601r89938q54667j183582
4655C3779301k125103n03237l55864j190889j131476q09770r11332r54167l73844
4646B5423619k28112l24858p62223l53333n68511O57591j000315p4814l34061
4637B2434983p71572r84675K69136n69978m7334l06942j65800M2247n38939r0578
4627A9270548l51824j89933j24945o92427N36469j36836n69097P8670l4501q48257
$$ plain form
4687 78777347 77758170 76242901 74287491 72163802 71030632 70151782 68885989 67788861
4679 67788861 67228827 66111128 64850922 63356943 62396751 60986102 59852547 58284831
4671 58284831 56497498 55522973 53480443 52097794 50450472 48608574 46739258 45325107
4663 45325107 43238792 41638797 40062812 38728089 36807488 35817550 34962883 33779301
4655 33779301 31654198 31150961 30795097 29604208 28472732 27662962 26751630 25797463 25423619
4646 25423619 25195507 24870649 24108426 23755093 23186582 23844173 22843858 22769044 22434983
4637 22434983 21663411 20678736 20947872 20377894 20330560 20023618 19857818 19900065 19361126 19270548
4627 19270548 18918724 18728791 18603846 17911419 18447888 18311052 17741955 17820625 17786124 16937867
4617A6937867l589o1373o60770M21493k54539j101391P5278N72548m09960n35416
4607A4980148Q5395q4135r11858K47487m77874j29391j53812j4750k57003K64316
4597A3548523n60952r21223P67685k19883m60908m12074o04676n72126N74274
4588A1138640N2551n75154J29446O69503l25391Q7575J20795r00314L16247k42542
4578A0471356l86255M51062P64351l33441J627K94651r52241j52458P08812n98224
4568A0269240K7442M96142l66299q18819j58960k57479L01218N01346O06618n29453
4558A0070996k12041N78108l51401m2558K05643O1484l57414l87722k75977P41174
4548A0030292K26373o58914J16588L60863l80358m14117l42720P55647J41930
$$ plain form
4617 16937867 16934278 16872905 16212135 16633628 16379089 15277698 15352976 15925524 15515564 14980148
4607 14980148 15065543 14981408 14069550 14317037 13839163 13709772 13555960 13541210 13284207 13548523
4597 13548523 12987571 12066348 12834033 12614150 12153242 11741168 11136492 10564366 11138640
4588 11138640 11191191 10616037 10745483 11414986 11089595 11177170 11297965 10397651 10713898 10471356
4578 10471356 10085101 10536163 11300514 10967073 10968700 11263351 10311110 10158652 10867464 10269240
4568 10269240 10296682 10792824 10426525 9607706 9448746 9191267 9492485 9993831 10600449 10070996
4558 10070996 9858955 10437063 10085662 10043104 10248747 10310231 9952817 9565095 9289118 10030292
4548 10030292 10256665 9597751 9714339 10075202 9694844 9280727 8938007 9693654 9835584
4539I835584N30222k18983p72931L18798K22809l69150M58127o89394o04039R14651
4529I625694J17710K65959n8168K7969m57938J25027L4393p373Q3325Q44250j152112
4518I448736l03912l41720O91821L04966j039711N55586N96199M60310p23293
4509I648982M52321O03696k20999m46275j47162q2127J78459L66254n77708j74209
4499I601232L21724l91954O5950L19309J11491M27646L01622l95957m36025K21145
4489A0146183j50579L20870J07982P58623q60260l68708L31485l87226K37200
4480A0135570R5356J78910j61037l29641j31634L14061J214722n28250o91131
4471A0096926M81446m17312K85816k65105J25862k86836N82123k90843O00466
$$ plain form
4539 9835584 10365806 10146823 9373892 9692690 9915499 9546349 10004476 9315082 8711043 9625694
4529 9625694 9743404 10009363 9951195 9979164 9521226 9646253 9680646 9673273 9756598 10600848 9448736
4518 9448736 9144824 8803104 9494925 9799891 8760180 9315766 9911965 10372275 9648982
4509 9648982 10101303 10704999 10484000 10037725 9890563 9808436 9986895 10353149 9775441 9601232
4499 9601232 9922956 9531002 9596952 9916261 10027752 10455398 10757020 10361063 9925038 10146183
4489 10146183 9995604 10316474 10424456 11183079 10322819 9954111 10285596 9898370 10135570
4480 10135570 10230926 10409836 10248799 9919158 9787524 10101585 11316307 10788057 10096926
4471 10096926 10578372 10161060 10446876 10181771 10307633 10020797 10602920 10312077 10912543
4462A0912543m4835q23898P3134K28327m76213j0340j51882N17610J85031l10264
4452A0099213M42618k93208J91024O72533l72092o89569M96240J93968L47756
4443A1088483j58924l55130O88987M7477j94833L64767k66946M32660m14852p13857
4433A0517832L31863K83799o04117J64819Q96211j00285l39507p2529o2736L61901
4423A1377251K92347k52825M93174k61507k60766M81962P6610q36322J08733K59079
4413A1477736J098333q5193r94354O00395N70713N2667j29319N5143m5963j28432
4403A2471726k55517N37886n50415K38775j1878L43798J46456R5172o27312n917
4393A2382774R7364M64748o103O2878L67475j25209M48461Q72499J3673L80709
$$ plain form
4462 10912543 10867708 10043810 10116944 10345271 9869058 9858718 9706836 10224446 10409477 10099213
4452 10099213 10541831 10248623 10439647 11112180 10740088 10050519 10546759 10740727 11088483
4443 11088483 10929559 10574429 11263416 11310893 11116060 11480827 11213881 11646541 11231689 10517832
4433 10517832 10849695 11133494 10529377 10694196 11590407 11490122 11150615 11078086 11015350 11377251
4423 11377251 11669598 11416773 11909947 11648440 11387674 11869636 11946246 11109924 11218657 11477736
4413 11477736 12576069 12490876 11496522 12096917 12667630 12720297 12590978 12646121 12600158 12471726
4403 12471726 12216209 12754095 12203680 12442455 12430577 12774375 12920831 13016003 12388691 12382774
4393 12382774 12480138 12944886 12938783 13001661 13369136 13243927 13692388 14564887 14578560 14959269
4383A4959269R92888m09695M45792M33557j59912m32252N25528j414546M91264
4374A5431893o3980o68119l69388O38974k57804k44465J4802j504p66834L81354
4364A4094929O36482r9602M10126m79460L44372l98354J097645k83917P6681J83870
4354A5582772L83728q249l02054R3397M35276o7341K85838j01829M09667N14675
4344A7225880P53425j10445K92819J85719l61492R64701k18136P83994j42369
4335A9374096K82259K17871M89270n37476J132839Q31129o66736J008865J042983
4326B3175100k69532K71904K41631L87811O01230M1395P60037M33054J477849
4317B7120479k74636O38649n3504O01887N9985M05672K45681P15443O16500N67521
$$ plain form
4383 14959269 15952157 15542462 15988254 16421811 16261899 15829647 16355175 14940629 15431893
4374 15431893 15367913 14699794 14330406 14969380 14711576 14467111 14481913 14480409 13713575 14094929
4364 14094929 14731411 14631809 15041935 14562475 14906847 14508493 15606138 15322221 15398902 15582772
4354 15582772 15966500 15958251 15656197 15749594 16184870 16117529 16403367 16301538 16711205 17225880
4344 17225880 17979305 17868860 18161679 18347398 17985906 18950607 18732471 19516465 19374096
4335 19374096 19656355 19874226 20363496 19826020 20958859 21789988 21123252 22132117 23175100
4326 23175100 22905568 23177472 23419103 23806914 24408144 24449539 25209576 25642630 27120479
4317 27120479 26845843 27484492 27430988 28032875 28092860 28498532 28744213 29459656 30076156 30643677
4307C0643677J426869o89698M91493J180936J738916P35719P90019O28077J358470
4298C8304478K94904J335240J128895R28308N98792J680051K003410J207776J067033
4289D8548887J569811J618955R09731J958588J212560J838925K365600K361272
4281F2384329J217009J950172J388552J324459J641718K333279J300763K237263
4273G5777544J570793Q92647J270949J251962J813596J675339Q34596L83396J230040
4264H6700862P73561O79061K77949N31144k93178K58297M68063p43178n45964
4255H8106617m4630j404841j5267j51519j517256m64183o03737j744554j459591
4246H0701039j082301j731108r39644j342842j308344j296019q75895j749601
$$ plain form
4307 30643677 32070546 31380848 31872341 33053277 34792193 35527912 36317931 36946008 38304478
4298 38304478 38599382 39934622 41063517 41991825 42590617 44270668 46274078 47481854 48548887
4289 48548887 50118698 51737653 52647384 54605972 55818532 57657457 60023057 62384329
4281 62384329 63601338 65551510 66940062 68264521 69906239 72239518 73540281 75777544
4273 75777544 77348337 78240984 79511933 80763895 82577491 84252830 85087426 85470822 86700862
4264 86700862 87474423 88153484 88431433 88962577 88669399 88927696 89395759 88652581 88106617
4255 88106617 88061987 86657146 86641879 86490360 84973104 84508921 83905184 82160630 80701039
4246 80701039 79618738 77887630 76947986 75605144 74296800 73000781 72124886 70375285
4238G0375285j593785j008041p40578q02003j269606j325075o29930p14556r50103
4229F1341608r70758k21364K6003r34766m38986j09252N24640K77716M36647o17776
4219E9313712L16767J562716Q74713Q25758P32751j36946P73686J357003O98813
4210F6318973M33751J162562J113354J396349J528458R97533J271247J491239
4202G5713466N89618M01927P17699M10432M11766L58459R62500K16487P00731
4193H0483085O78231K49075L65185J86397J93407l76938K50189j28953m94554
4184H1405124l03728j093581l46440j91982r39536j854351n66051m89071j199559
4175G4420825j092155r60684k69754r05196p16144r66797o41481l27750j159924
$$ plain form
4238 70375285 68781500 67773459 67032881 66230878 64961272 63636197 63006267 62291711 61341608
4229 61341608 60370850 60149486 60175489 59240723 58801737 58692485 59217125 59494841 59931488 59313712
4219 59313712 59630479 61193195 62067908 62893666 63626417 63489471 64263157 65620160 66318973
4210 66318973 66752724 67915286 69028640 70424989 71953447 72950980 74222227 75713466
4202 75713466 76303084 76705011 77422710 77833142 78244908 78603367 79565867 79782354 80483085
4193 80483085 81161316 81410391 81775576 81961973 82155380 81778442 82028631 81899678 81405124
4184 81405124 81101396 80007815 79661375 79469393 78529857 76675506 76109455 75620384 74420825
4175 74420825 73328670 72367986 72098232 71193036 70476892 69510095 68868614 68540864 67380940
4166F7380940m62976L33364j172500K35847o35126m15206k11563L87397j09184
4157F5330993o94252L58557J24238Q0283J85861k41345k53676o75033j78738o61938
4147F3374950m73423j51650o52178P29884j272913m49737q87985j0242o58939
4138E9547767o24885o42677j342493k02860o34003n53459j364385m56457m80671
4129E3245877p36733n55556J79588l70385k00763J16979N14314j70361M06587
4120E2429547L78482Q21330j34297O22123J728453J334156J792142J516727K660673
4111F3149336J623785K626511J723766K537016K083897K446102K465968K206833
4103H0863214K036656K644599K199350K566728K466216K050961K204879J964829
$$ plain form
4166 67380940 66917964 67251328 66078828 66314675 65679549 65264343 65052780 65440177 65330993
4157 65330993 64636741 64995298 65119536 65199819 65385680 65144335 64890659 64215626 64036888 63374950
4147 63374950 62901527 62749877 62097699 62827583 61554670 61104933 60216948 60206706 59547767
4138 59547767 58922882 58280205 56937712 56734852 56100849 55547390 54183005 53726548 53245877
4129 53245877 52509144 51953588 52133176 51762791 51562028 51679007 52193321 52022960 52429547
4120 52429547 52808029 53629359 53495062 54117185 55845638 57179794 58971936 60488663 63149336
4111 63149336 64773121 67399632 69123398 71660414 73744311 76190413 78656381 80863214
4103 80863214 82899870 85544469 87743819 90310547 92776763 94827724 97032603 98997432
4095I8997432J457080J476082J366029m65748J33832L27658j60718j096387R8102
4086A02133362n14427j43240n85482o01287o33704o74036l60434k64063l38394
4077I8018295j270950j694407n99932L1979j869570m79769k03755M45287l13042
4068I2064136R64271J181612J333501J219740J490061K538674L250360K841038
4060A06883393K709765L055213K994891K711791K252659J698318J310711K520712
4052A26137453Q85328R21669J335817J803582P12284O62212N59174J126368J528133
4043A35672020J06277n72541n30271o59985q69523j094720j371506k450361k003261
4034A26226129j487929j804423j119190j396022j140091k082605j227321j975273
$$ plain form
4095 98997432 100454512 101930594 103296623 102830875 102964707 103292365 103131647 102035260 102133362
4086 102133362 101618935 101475695 100890213 100288926 99655222 98981186 98620752 98356689 98018295
4077 98018295 96747345 95052938 94453006 94484985 92615415 92135646 91931891 92377178 92064136
4068 92064136 93028407 94210019 95543520 96763260 98253321 100791995 104042355 106883393
4060 106883393 109593158 112648371 115643262 118355053 120607712 122306030 123616741 126137453
4052 126137453 127022781 127944450 129280267 131083849 131796133 132458345 133017519 134143887 135672020
4043 135672020 135778297 135205756 134675485 134015500 133145977 132051257 130679751 128229390 126226129
4034 126226129 124738200 122933777 121814587 120418565 119278474 117195869 115968548 113993275
4026A13993275j338742j060877j629592n12400j205269n66311k56445l25883p11816
4017A06385940o595O02807j56121O86848P85264O16807J210830Q10594O57721
4008A11594095Q49711J107015J462194M11154P57736R72337j08419J6641J238297
3999A18300761L93015m9257N84641n09323N09385j98986o66943l31678p18301
3990A17313314p37281K8416j72557q54164j512540m78797j180791J73198m10253
3981A12168545j018551n80028j282161j135186j348682j426022j856279j511873
3973A02009763k187410k033741k491402j132547j863072j953805j314516r12255
3965H8121015j420447j677368j232932j296764j456275r67569j001643j382949
$$ plain form
4026 113993275 112654533 111593656 109964064 109451664 108246395 107680084 107423639 107097756 106385940
4017 106385940 106379345 106982152 106826031 107512879 108298143 108914950 110125780 110936374 111594095
4008 111594095 112443806 113550821 115013015 115424169 116181905 117154242 117045823 117062464 118300761
3999 118300761 118693776 118644519 119229160 118719837 119229222 119030236 118363293 118031615 117313314
3990 117313314 116576033 116604449 116431892 115577728 114065188 113586391 112405600 112578798 112168545
3981 112168545 111149994 110569966 109287805 108152619 106803937 105377915 103521636 102009763
3973 102009763 99822353 97788612 95297210 94164663 92301591 90347786 89033270 88121015
3965 88121015 86700568 85023200 83790268 82493504 81037229 80069660 79068017 77685068
3957G7685068n20764j466109q48556j178930q33299j624495p38462r83598n75468
3948F8915387m28545o36471r06087K16745j451019j430383j385847j533018o26152
3939F0734610j769485q55555m29374j045184j738538K7447j798754m79488n24689
3930E2120990j568930r91932o09592p61521p51195j1806o23514j271430p22631
3921D4808439m22584j047509J95296j143850J97486q41487o57204j118639O1119
3912D0031067l62866j005521K69502J22001j24805p57017n67210j290696Q00496
3903C7114951o67892n28807o35064K09810n38563O88651l20681N15293j97045
3894C5640653K15979R1281N8861R8424o5821M25131r337p7386j19845Q28344r6192
$$ plain form
3957 77685068 77164304 75698195 74849639 73670709 72837410 71212915 70474453 69490855 68915387
3948 68915387 68486842 67850371 66944284 67161029 65710010 64279627 62893780 61360762 60734610
3939 60734610 58965125 58109570 57680196 56635012 54896474 54923921 53125167 52645679 52120990
3930 52120990 50552060 49560128 48950536 48189015 47437820 47426014 46802500 45531070 44808439
3921 44808439 44385855 43338346 43533642 42389792 42587278 41745791 41088587 39969948 40031067
3912 40031067 39668201 38662680 38932182 39054183 38929378 38172361 37605151 36314455 37114951
3903 37114951 36447059 35918252 35283188 35492998 34954435 35643086 35322405 35837698 35640653
3894 35640653 35856632 35947913 36006774 36105198 36039377 36464508 36455171 36377785 36257940 37086284 36990092
3883C6990092L32040O89076O30737j14244Q48774J12279M10595M64052J284853
3874D1648254K32610N47356J459224M66152J030898J250942P27949P32255J655351
3865D9750991N8354J120999J440094J173091J179743J495392J171468J816822
3857E9206954J723968K151896J893370K269257K536587L064172M061926K935332
3849G9843462L562293M789482N335803M746242N952657N734916O945214Q784382
3841A25694451R021023J0650122J1353831J2143235J2950284J2639749J2165142
3834B06617837J1699799J1007133J0574733Q944386Q212546P822550P324236O548737
3826B78751957O918361O227134N257812N167241L845207K754595J702586J715682
$$ plain form
3883 36990092 37322132 38011208 38641945 38527701 39376475 39488754 39899349 40363401 41648254
3874 41648254 41880864 42428220 43887444 44353596 45384494 46635436 47363385 48095640 49750991
3865 49750991 49809345 50930344 52370438 53543529 54723272 56218664 57390132 59206954
3857 59206954 60930922 63082818 64976188 67245445 69782032 72846204 76908130 79843462
3849 79843462 83405755 88195237 93531040 98277282 104229939 109964855 116910069 125694451
3841 125694451 134715474 145365596 156719427 168862662 181812946 194452695 206617837
3834 206617837 218317636 229324769 239899502 248843888 257056434 264878984 272203220 278751957
3826 278751957 285670318 291897452 297155264 302322505 306167712 308922307 310624893 312340575
3818C12340575o33607p91883j851221k800382m006808m596215n343779n465317
3810B86851363o503939p606984p240717q644705r289294r279224r127032r695777
3802B19463691q365400p330243p500790p455061o601803n828359n885327n495907
3794A65000801n124653n451111o042049n433133n599565m853573m641526m784973
3786A23070218l863530l137090k665899j765481k520758k289787j482458q00046
3778A04545169j400249m03968J59397L01610n05750r74193L49506l15790m05214
3769A01350518l29577n01397r22215j061716o14699l02124k016499j183123k922902
3760I1496266k373813j992261k562886k014143k193692j816416k263248j711951
$$ plain form
3818 312340575 311706968 310915085 309063864 306263482 302256674 297660459 292316680 286851363
3810 286851363 280347424 272740440 265499723 256855018 247565724 238286500 229159468 219463691
3802 219463691 211098291 203768048 196267258 188812197 182210394 176382035 170496708 165000801
3794 165000801 159876148 154425037 148382988 142949855 137350290 132496717 127855191 123070218
3786 123070218 119206688 116069598 113403699 111638218 109117460 106827673 105345215 104545169
3778 104545169 103144920 102740952 102900349 103201959 102696209 101722016 102071522 101755732 101350518
3769 101350518 101020941 100519544 99597329 98535613 97920914 97618790 95602291 94419168 91496266
3760 91496266 89122453 87130192 84567306 82553163 80359471 78543055 76279807 74567856
3752G4567856k236182j799944k291141j530750k779750k055058k298122j429086
3744E8147823j185882r09098j005184n98509o64255Q3597K39311l90365o3629
3735E3653809K93032Q44566N85918J081797L76255J301866L8140N74653P61132
3726E9511168J721048J280574J207494Q00244P03577N40868J198876J063708R18019
3717F8945576J311018o4180j3906q95623R7320k64724o0330p98477r05547j493708
3707F5857419n39764q37429k363611p66832j559400j805078k201308k137047j118510
3698E2528440j025839k232071j520232k011099j150720k488360j598496j869736
3690C8631887j654652j418592r87792j357721j353510r26751p43796q87346q53812
$$ plain form
3752 74567856 72331674 70531730 68240589 66709839 63930089 61875031 59576909 58147823
3744 58147823 56961941 56052843 55047659 54449150 53784895 53868492 54107803 53717438 53653809
3735 53653809 53946841 54791407 55377325 56459122 56835377 58137243 58175383 58750036 59511168
3726 59511168 61232216 62512790 63720284 64520528 65224105 65764973 66963849 68027557 68945576
3717 68945576 70256594 70192414 70178508 69282885 69380205 69115481 69055151 68256674 67351127 65857419
3707 65857419 65317655 64480226 62116615 61349783 59790383 57985305 55783997 53646950 52528440
3698 52528440 51502601 49270530 47750298 45739199 44588479 42100119 40501623 38631887
3690 38631887 36977235 35558643 34570851 33213130 31859620 30932869 30189073 29301727 28447915
3681B8447915l60314m14082K59023p32938k58571L22893M1565M79450K23706l52299
3671B7656348J43136N09327P9084P4889L92299J59145l464r7198R6064O24613
3661B9634243K51670K70840k80735K39615K7747n5019K93833J27079j134805p35463
3651B8639005L17299q78527r6770J39763K2719j337490m9237r11561p86997m69191
3641B4589013l1945L78934J62464j089179M46110L10095k28235k39248n13343
3632B3784666L4699m88009q51309q98131o18886j147932j19946q76971l63631
3623A8454550o39553n86526m87782L817l00717n06692O21560q02989J99007k41570
3613A5713105m13728R09437Q23063o06175M51230R39527J034497P92335J174230
$$ plain form
3681 28447915 28087601 27673519 27932542 27199604 26941033 27263926 27305491 27784941 28008647 27656348
3671 27656348 27799484 28308811 28387895 28462784 28855083 29014228 29010764 28913566 29009630 29634243
3661 29634243 29885913 30156753 29876018 30115633 30143380 30088361 30382194 30509273 29374468 28639005
3651 28639005 28956304 28077777 27981007 28120770 28143489 26805999 26756762 25845201 25058204 24589013
3641 24589013 24557068 24936002 25098466 24009287 24455397 24765492 24537257 24298009 23784666
3632 23784666 23819365 23331356 22480047 21581916 20963030 19815098 19695152 18818181 18454550
3623 18454550 17814997 17228471 16740689 16744506 16443789 15937097 16558657 15755668 15954675 15713105
3613 15713105 15299377 16208814 17031877 16425702 16876932 17816459 18850956 19643291 20817521
3604B0817521J139201J601947R58321Q64659J211595J97698j22384j302670m03037
3595B4962851j287557j349151j206782j151769j440220L3110r95332o82295j43759
3586A6739096o07630m64734m58423J43943P9911O34504q47377n93010k71611N23280
3576A4877949J20922M15604L29480P14730O88248J34463O79622O65322j58675
3567A8467665m03017M10984k09452j60063j176440l44384p82451n59115m43650
3558A4800077l34306j73668n07550n06096N84300l7475n08350K75952J79660O20990
3548A4393534j02076P05897j07405q2697l01738L0808n40500Q27458O0675M80442
3538A5364398K38123r9735L34098K6057Q84486O99643L42918m85356o42078l35983
$$ plain form
3604 20817521 21956722 23558669 24516990 25381649 26593244 26790942 26668558 25365888 24962851
3595 24962851 23675294 22326143 21119361 19967592 18527372 18560482 17565150 16882855 16739096
3586 16739096 16131466 15666732 15208309 15352252 15432163 16066667 15219290 14626280 14354669 14877949
3576 14877949 14998871 15414475 15743955 16458685 17146933 17281396 17961018 18626340 18467665
3567 18467665 18064648 18475632 18266180 18106117 16929677 16585293 15802842 15243727 14800077
3558 14800077 14465771 14292103 13784553 13278457 13862757 13825282 13316932 13592884 13772544 14393534
3548 14393534 14291458 14997355 14889950 14807253 14505515 14536323 13995823 14823281 14883956 15364398
3538 15364398 15602521 15502786 15836884 15862941 16747427 17447070 17789988 17304632 16662554 16326571
3528A6326571R12593O63204m70373m02312O81325n23500J99666J30427O50028
3519A8167629O5008M1435K41799P68337o2254K20998N71887K95611k46921p66711
3509A9296818j83912m15663J203000O87918O62490N78586m75697N57960R37182
3500B2848682M01450J155478J002185J153788N79895Q79887J161754J648195J239513
3491C2070827J367835J947378J928423L512796M612967N026931M443251N140158
3483F0050566N622188N843119O352888O538474N491745L885839K677420J857125
3475I8319364p98810j478664k635196l490587l222426l334358k415258j261019
3467G9683046r06510m80570N32276P56212K39362L06810p3636K89336P45823P07543
$$ plain form
3528 16326571 17239164 17902368 17431995 17029683 17711008 17187508 17387174 17517601 18167629
3519 18167629 18232637 18274072 18515871 19284208 19221954 19442952 20014839 20310450 20063529 19296818
3509 19296818 19112906 18697243 19900243 20588161 21250651 21829237 21353540 21911500 22848682
3500 22848682 23250132 24405610 25407795 26561583 27141478 28021365 29183119 30831314 32070827
3491 32070827 33438662 35386040 37314463 40827259 45440226 50467157 54910408 60050566
3483 60050566 65672754 71515873 77868761 84407235 89898980 93784819 96462239 98319364
3475 98319364 97520554 96041890 93406694 89916107 86693681 83359323 80944065 79683046
3467 79683046 78776536 78295966 78828242 79584454 79823816 80130626 80056990 80346326 81092149 81799692
3457H1799692J879016K658914L781861N469385O092176O945947Q275302Q723224
3449A25625517J0392487J1037415J0234905R621408N577594N10002l327073p791945
3441A61880310r846720j1825965j2430929j1842629j1291418j0678875r419354
3434H4544420o910030o416402m164640l307267k831298k373974k112267j149035
3426E5279507P5314M36039J431886K044741K002011L758246L277679L182392L198908
3417G4686723L582328L161131L770379K450824K167675O41391l10741l208177
3409H6941533l840859m682767n499324n249175n668762m538162m599926m875239
3401D7987319m000787l016892k151025j764866j714997o17135j007015j014082
$$ plain form
3457 81799692 83678708 86337622 90119483 95588868 101681044 108626991 116902293 125625517
3449 125625517 136018004 147055419 157290324 166911732 172489326 172999328 169672255 161880310
3441 161880310 152033590 140207625 127776696 115934067 104642649 93963774 84544420
3434 84544420 77634390 71217988 67053348 63746081 60914783 58540809 56428542 55279507
3426 55279507 55354821 55790860 57222746 59267487 61269498 65027744 68305423 71487815 74686723
3417 74686723 78269051 81430182 85200561 87651385 89819060 90460451 90149710 86941533
3409 86941533 83100674 78417907 72918583 67669408 62000646 57462484 52862558 47987319
3401 47987319 43986532 40969640 38818615 37053749 35338752 34721617 33714602 32700520
3393C2700520j348324p59609o77064n42906m01886r51252o0845m14242j008081
3384B6536311l25955k40405k56057J14839N2080l90864m20888L26769o0268J062640
3374B6398202k53608q59976p5376o41608j11849q2885j93871r36465J35026j41330
3364B3236260k88731J2885M65607J10110R3558j86013Q7157o87096O33594L71389
3354B3848720K91012R05569M28128o13335L3130R0275n59372n44406r10469m32139
3344B2537113k22795K0913j6059J84122m27702L70129M65827l20284j27703k59656
3334B2203905O0933j10265n63522K30239n2433L23243N16433p9073O80756R85826
3324B4196042J196902Q07914J809096J384171J53680L16790K69044n22685j237866
$$ plain form
3393 32700520 31352196 30592587 29915523 29372617 28970731 28019479 27958634 27544392 26536311
3384 26536311 26210356 25969951 25713894 25828733 25880813 25489949 25069061 25395830 25335562 26398202
3374 26398202 26144594 25284618 25209242 24567634 24455785 24372900 24179029 23242564 23377590 23236260
3364 23236260 22947529 22960414 23426021 23536131 23629689 23443676 23530833 22843737 23477331 23848720
3354 23848720 24139732 25045301 25473429 24860094 24893224 24983499 24424127 23879721 22969252 22537113
3344 22537113 22314318 22335231 22319172 22503294 22075592 22445721 22911548 22591264 22463561 22203905
3334 22203905 22264838 22154573 21591051 21821290 21768857 22092100 22608533 22529460 23210216 24196042
3324 24196042 25392944 26200858 28009954 29394125 29547805 29864595 30133639 29610954 28373088
3315B8373088j130338j320528n16945l03254j024977o39364Q1112L90869J01728
3306B4011391J06244N71588M01322L01882K26393J68478L57968O11770m21753
3297B6335283N5177J134940J463548J847889K466572J838657K960129L331733
3289D1433928M464380M412899M413491O298420O528893O608454N924328M560807
3281H4645600L236317P54200k174180l006272l568240m765753m625813m455015
3273F6040844m925819l280951k513608k856961j783952p04652k50397k6404J031903
3264E0730003P00221J905409J658015J310322K488124K955193M176303N033840
3256G0957430O232820Q493889J0528698J2204519J3909362J3676233J1572190
$$ plain form
3315 28373088 27242750 25922222 25405277 25102023 24077046 23437682 23518794 23909663 24011391
3306 24011391 24117635 24689223 25090545 25392427 25618820 25787298 26145266 26757036 26335283
3297 26335283 26390460 27525400 28988948 30836837 33303409 35142066 38102195 41433928
3289 41433928 45898308 50311207 54724698 61023118 67552011 74160465 80084793 84645600
3281 84645600 87881917 88636117 86461937 83455665 79887425 75121672 70495859 66040844
3273 66040844 61115025 57834074 55320466 52463505 50679553 49974901 49724504 49698100 50730003
3264 50730003 51430224 53335633 54993648 56303970 58792094 61747287 65923590 70957430
3256 70957430 77190250 85684139 96212837 108417356 122326718 136002951 147575141
3249A47575141P978439K405472k392572n843917r807929j0342526j1160808j1806242
3241A06605058j0382430r246314q556385o234261m823167l959566j821614l82923
3233F1198398r04530P28864N74654l9047R2538r4576L95219P96384k36181L26743
3223F2838466K287059L157196L764758L951176M887731M247645K552090J551714
3215H9237835l40168k429299l431253n338745n483870o591187n281792n346463
3207E4995058n003923l934621l223364k009175k430034j354880n19568o07511
3199C5911982r33569m33921o21776q06457m26917j57015j3801m17436j435671
3190C0665419J60062N97127O82103J097460M12491R35899P03922l26181o17604
$$ plain form
3249 147575141 155553580 157959052 155566480 149722563 139914634 129572108 118411300 106605058
3241 106605058 96222628 86976314 78419929 72185668 67362501 63402935 61581321 61198398
3233 61198398 60293868 61022732 61597386 61558339 61650877 61556301 61951520 62747904 62511723 62838466
3223 62838466 65125525 68282721 72047479 75998655 80886386 85134031 87686121 89237835
3215 89237835 88897667 86468368 83037115 77698370 72214500 65623313 60341521 54995058
3207 54995058 49991135 46056514 42833150 40823975 38393941 37039061 36519493 35911982
3199 35911982 34978413 34544492 33922716 33116259 32689342 32532327 32518526 32101090 30665419
3190 30665419 30825481 31422608 32104711 33202171 33614662 34550561 35254483 34928302 34310698
3181C4310698j45107j794585q20487j84640j726458j899837r77552j326458j561101
3172B3874473j645864j322808j460644j141447r18719p85973P1114o67404k38971
3163A5763757J05574k30693J99338M91909L56472L91073o5567O05873J88763L75062
3153A8181561R63794L82086M2840J323865L70532L26615N67833m55947k62592
3144B1440587q76481j32202n25084o12595j640360j012219o54094j288612o0846
3135A4638094m77815O2115o82940p96230o24091j25411j20617M8063K2343j42788
3125A1800723N45487l2844k06109N2227j81788n74356K54345n75935m00208M016
3115A0685558k16163k82165O20876o89196K44412R30166n56662R1021R5391P49755
$$ plain form
3181 34310698 34165591 32371006 31550519 31365879 29639421 27739584 26762032 25435574 23874473
3172 23874473 22228609 20905801 19445157 18303710 17384991 16599018 16670132 16002728 15763757
3163 15763757 15869331 15638638 15837976 16329885 16686357 17077430 17011863 17617736 17806499 18181561
3153 18181561 19145355 19527441 19570281 20894146 21264678 21591293 22159126 21703179 21440587
3144 21440587 20564106 20431904 19906820 19294225 17653865 16641646 15987552 14698940 14638094
3135 14638094 14160279 14222394 13539454 12743224 12119133 11993722 11873105 11921168 11943511 11800723
3125 11800723 12346210 12313366 12107257 12159484 11977696 11403340 11657685 11081750 10681542 10685558
3115 10685558 10469395 10187230 10808106 10118910 10363322 11293488 10736826 10827847 10923238 11672993
3105A1672993K5687n04349m191J26149j28626O15455m00189k59935k8023m56622
3095A0658349n42492K24829o00037p81211O29790o48461p58518l32572n84513
3086G265164j83859J30091l69914K84306P2123l87091N4205j64321m19611N12266
3076F793359p9392M98947l83256j66982n09354k69449l977J22417Q314j037572
3066D973055L45095m04543O31246j65302q55661m52233K38873p66709K12778j32321
3056C624278p89583m7608O21079p12229k31985M71337q9537J67847J77548k66168
3046B924979j18046K67386j88009M04348K103J82232l58889P8565q07785m98667
3036A888217Q4874m3357j7318M80453J29598k69163l26645o27357N53431K89998
$$ plain form
3105 11672993 11698680 11194331 11190140 11316289 11187663 11803118 11402929 11142994 11114971 10658349
3095 10658349 10115857 10340686 9740649 8959438 9589228 8940767 8182249 7849677 7265164
3086 7265164 7081305 7211396 6841482 7125788 7197911 6810820 6865025 6700704 6281093 6793359
3076 6793359 6713967 7212914 6829658 6662676 6153322 5883873 5879896 6002313 6010627 4973055
3066 4973055 5318150 4913607 5544853 5379551 4523890 4071657 4310530 3543821 3756599 3624278
3056 3624278 2834695 2787087 3408166 2695937 2463952 2935289 2845752 3013599 3191147 2924979
3046 2924979 2806933 3074319 2886310 3290658 3292761 3474993 3116104 3194669 2386884 1888217
3036 1888217 1973091 1929734 1912416 2392869 2522467 2253304 1926659 1299302 1852733 2142731
3026B142731M34420n19159n77490K78289l28312K48373M1874J07901k80545r09484
3016F38598l87208L02858O7938J32609O7545J002658J22335j68933j14196M00894
3006B065098k11911l71674N11884J65006j049312n77403k586J15702M8562j08878
2996E84488O53219K68709o13357J99319j66158M54515L56695m83619L96791k27971
2986A422631j0587n01695L70151q30941L31195K70081l86424j02649M52089J07040
2976A120891k26051k33452P4226K14992K00288k9002M52229l96958o10116K56147
2966H23194M7578j05388l97223M45057K60775K76359m81548M82702j81828l58344
2956H11334k53673O2447q8970N82128l77392L77647k68664n54956M67327Q2646
$$ plain form
3026 2142731 2577151 2057992 1480502 1758791 1430479 1678852 1720726 1828627 1548082 638598
3016 638598 251390 554248 622186 754795 822340 1824998 1947333 1778400 1664204 2065098
3006 2065098 1853187 1481513 1993397 2158403 1109091 531688 529102 644804 693366 584488
2996 584488 1237707 1506416 893059 1092378 926220 1380735 1737430 1253811 1650602 1422631
2986 1422631 1412044 910349 1280500 449559 780754 1050835 664411 561762 1013851 1120891
2976 1120891 894840 661388 735614 950606 1150894 1121892 1574121 1177163 567047 823194
2966 823194 870772 765384 368161 813218 1073993 1350352 868804 1351506 1169678 811334
2956 811334 557661 620108 531138 1113266 735874 1113521 844857 289901 757228 839874
2946H39874K42273l36801J9441j95131l9663O2634p0422o85635q9399L94865J010470
2935A152506o62019M26888P5712k48764k01646j589Q56652L59598q54379N9961
2925I62920K35107k08292O2863m52753J91800m98596L6920P0594q6815l37351
2915b3603M25155m256N15752O7894m6708m08652L7098M83387m10046j17215K92784
2904H11590m39419J37889M19815m84792K65517j79955K13126o34353M05493J67530
2894F82441J71799j46286J5199K05841K15878J25418n29025k68585j81798K73313
2884E64195j17147P75090j4349K72778j49473P68849k99746o59817j82230L36176
2874A294326K68079M49945m43253K87420r1008j48185M77259m71918P25752j79728
$$ plain form
2946 839874 1082147 745346 764787 569656 529993 592627 522205 -163430 -252829 142036 1152506
2935 1152506 490487 917375 993087 744323 542677 541088 1397740 1757338 902959 962920
2925 962920 1198027 989735 1052598 599845 791645 293049 329969 400563 313748 -23603
2915 -23603 401552 397296 913048 980942 934234 525582 562680 1046067 636021 518806 811590
2904 811590 372171 510060 929875 445083 710600 530645 743771 109418 514911 682441
2894 682441 854240 707954 723153 928994 1144872 1270290 741265 472680 290882 564195
2884 564195 447048 1222138 1207789 1480567 1331094 2099943 1800197 1140380 958150 1294326
2874 1294326 1562405 2012350 1569097 1856517 1765509 1617324 2094583 1622665 2348417 2168689
2864B168689Q89310l03140m5102l80519J90829n85723L34307j63579M59053Q9041
2854B653166Q262K68055K31858K44928J47766k07238Q0619K44637J8023l5919
2844C654157k19333Q11862Q2700Q7895l50784L52212N36971M12103p33671N81354
2834E215466j88310j11253J92360j77104M7052K61262N0370j42088K48474j03396
2824E292833M05921o33127k28188p7325K12835r7628J53244k474L66674j16289
2814E276476J72610O69015L45911O53626J60535j76760N39103R74263k93672P55775
2804I076882P8530Q0812r21468o1251r7991k64046J05124r08772m40652j98606
2794F448562k29530L00401J01879q20069m1335R7594K4350K9836j94503J56618
$$ plain form
2864 2168689 3057999 2754859 2709757 2329238 2520067 1934344 2268651 2105072 2564125 2653166
2854 2653166 2661428 2929483 3161341 3406269 3554035 3346797 3427416 3672053 3690076 3654157
2844 3654157 3434824 4246686 4329386 4417281 4066497 4418709 4955680 5367783 4634112 5215466
2834 5215466 5027156 4915903 5108263 4931159 4978211 5239473 5289843 5147755 5396229 5292833
2824 5292833 5698754 5065627 4837439 4760114 4972949 4875321 5028565 5026091 5392765 5276476
2814 5276476 5449086 6118101 6464012 7117638 7278173 7101413 7640516 8614779 8321107 9076882
2804 9076882 9155412 9236224 8314756 8253505 8155514 7891468 7996592 7087820 6647168 6448562
2794 6448562 6219032 6519433 6621312 5801243 5759908 5857502 5881852 5911688 5717185 5873803
2784E873803k12636l29183j47277j74483m37977J36731K25836N10975q8165k44868
2774E112756K16509Q18517J49491Q64198p4073p12277Q1049j89499m88050k45077
2764E533544j77337l57628P7604p82255m02585o46352J87029J06069p12353O55718
2754C481454l42111m46707l11503O22576m30549l18082M52842J2072j15107J6475
2744B621360p16802k57900J43960l60034N21850P22973n2479n73127k52762o6767
2734A730272m5976r0647P04206k51813K99887p07256j23423p34674M61628k78607
2724I63597P6947J68701k42069K9437J72115j44297K34643k04293j050853L73004
2714C76932L14479m2640l53598L60469m13598N78674k63281J0320k3228L24938
$$ plain form
2784 5873803 5661167 5331984 5184707 5010224 4572247 4708978 4934814 5445789 5357624 5112756
2774 5112756 5329265 6147782 6297273 7161471 7087398 6375121 6456170 6266671 5778621 5533544
2764 5533544 5356207 4998579 5076183 4293928 3891343 3244991 3432020 3538089 2825736 3481454
2754 3481454 3139343 2692636 2381133 3003709 2573160 2255078 2707920 2719992 2604885 2621360
2744 2621360 1904558 1646658 1790618 1430584 1952434 2675407 2622928 2049801 1797039 1730272
2734 1730272 1684296 1593649 2297855 2046042 2345929 1638673 1515250 780576 1242204 963597
2724 963597 1040544 1209245 967176 996613 1168728 1024431 1259074 1054781 3928 376932
2714 376932 691411 648771 295173 655642 242044 820718 557437 567757 544529 869467
2704H69467l06913k72130Q9134k19865O15237n44628R3735p92098j95248M09885
2694b53424Q80561O3165p9798l23866K56339j218599J77346N31886K17997L44914
2684E96521j75703m78870k36795K11668L06143M19270n38226n48983K61978M63902
2674B80905p08251N4985L17842p8372l52011L17239m13607M07539l26164K04217
2664b95678J61804N69999l4892k24269M71544o24271K76121l61288j38526m8268
2654b47724K41222L71193j70922k28035l46389J29587K01137m43275N39292j27842
2644h1756k64261K59458K5979P2600n20101O30340r7422K88446k42431J98260
2634B69112l62452m72085N0360n07052M25435K58947J3200N35949j23889j10468
$$ plain form
2704 869467 562554 290424 379558 159693 774930 230302 324037 -468061 -663309 -253424
2694 -253424 627137 690302 610504 286638 542977 -675622 -498276 33610 251607 596521
2684 596521 420818 -58052 -294847 -83179 222964 642234 104008 -444975 -182997 280905
2674 280905 -427346 -372361 -54519 -132891 -484902 -167663 -581270 -173731 -499895 -295678
2664 -295678 -133874 436125 401233 176964 648508 24237 300358 -60930 -199456 -247724
2654 -247724 -6502 364691 193769 -34266 -380655 -251068 -49931 -493206 46086 -81756
2644 -81756 -346017 -86559 -60580 12020 -508081 122259 24837 313283 70852 269112
2634 269112 -93340 -565425 -515065 -1022117 -596682 -337735 -324535 211414 87525 -22943
2624b2943l88604L7680O37024k25544k79077K52081J47251n369m59743k0067o9177
2613c96488K31120n2811k5266K8396j43779J132386o01939o80972O48369L05088
2603D44104j24387k80223n34527N77779L59283M11768R2860p0563R8017J075956
2593B050067L19997Q5996m85499K40476l66440o93741M94629o11909Q4843o02007
2583E16412k04731J05274L21067q9589L19756M5334j95863o67896O14892k06752
2573E57904J22566K64853k08146m54821r8486J97477l60841J80116q55N60757
2563G60524J75410J70185p42055J75371K99517m56716l00351O04033K21615l95763
2553E11770j79231j65060k17162R4191K91446n08817N06352o07934l24865M75195
$$ plain form
2624 -22943 -411547 -373867 263157 37613 -241464 10617 157868 152499 -307244 -327311 -396488
2613 -396488 -165368 -218179 -243445 -215049 -358828 773558 171619 -509353 139016 444104
2603 444104 319717 39494 -495033 82746 442029 853797 946657 876094 974111 2050067
2593 2050067 2370064 2456060 1970561 2211037 1844597 1150856 1645485 1033576 1118419 516412
2583 516412 311681 416955 738022 648433 968189 1013523 817660 149764 764656 557904
2573 557904 680470 945323 737177 282356 183870 381347 20506 200622 199767 760524
2563 760524 935934 1106119 364064 539435 838952 382236 81885 685918 907533 511770
2553 511770 332539 167479 -49683 44508 335954 -172863 333489 -274445 -599310 -124115
2543a24115P95955l19911L93492J9192j80250J74920N69005R5409m93951o38347
2533B91399q2353j81302R3633N60089l00228O03340o30407J96070p654n5653n25722
2522c8788K32127K01555M8000m14380O14442O7946n79968l12703O6839p2936q2990
2511b70856L10189M80918J36219k11102O38934N61784o77972l46300K67432j74066
2501G15180k61074L23648n0515j87393o30043J83982R13927l22603n71221L67845
2491D81733K41622q9178j82857j3378L33853k12951m07797L79834n1751j4199
2481D64931m60006R287N93111J15050K6048J49017J50717J44465k43414J31572
2471A080778m5093L98922j79326l42952p99643n6634O84283M4061l30612N09195
$$ plain form
2543 -124115 671840 351929 745421 764613 584363 759283 1328288 1423697 929746 291399
2533 291399 209046 27744 121377 681466 381238 984578 354171 550241 542587 486934 -38788
2522 -38788 193339 394894 442894 28514 642956 710902 130934 -181769 -114930 -187866 -270856
2511 -270856 39333 520251 656470 445368 1084302 1646086 968114 621814 889246 715180
2501 715180 454106 777754 727239 539846 -90197 93785 1007712 685109 113888 481733
2491 481733 723355 634177 451320 437942 771795 558844 151047 530881 479130 464931
2481 464931 4925 14212 607323 722373 748421 897438 1048155 1192620 949206 1080778
2471 1080778 1035685 1434607 1255281 912329 112686 56052 740335 784396 453784 962979
2461I62979L01202j23686O5223j54884N75311p13159j05492l78411M65069J81931
2451A076083l84864L59779M22337j114018J31895J097513K97998q60529M11209
2442A437403O34763R9482m82236m93955l82764N87628k07590p33729j01564l00472
2432E6966N67636K67087K50439r6491K41549L73550K13746L64727N06046k65150
2422B480105j53195R038k74884L67406j151730j94505q4918L36404j89116L46523
2412A491128K57131O39295p74022L55728N16816K08789J01251j86967Q4794L16024
2402C009967l51791P3454N90304o02686p71684K18033N83142j54351P17030J39863
2392C451281Q30880p7594L43325K7842M70761m51528o6592Q61979m3453o19371
$$ plain form
2461 962979 1264181 1140495 1205718 1050834 1626145 912986 807494 429083 894152 1076083
2451 1076083 691219 1050998 1473335 359317 491212 1588725 1886723 1026194 1437403
2442 1437403 2072166 2171648 1689412 1195457 812693 1400321 1192731 459002 357438 56966
2432 56966 624602 891689 1142128 1045637 1287186 1660736 1874482 2239209 2745255 2480105
2422 2480105 2326910 2335948 2061064 2428470 1276740 1082235 997317 1333721 1144605 1491128
2412 1491128 1748259 2387554 1613532 1969260 2486076 2694865 2796116 2609149 2693943 3009967
2402 3009967 2658176 2731630 3321934 2719248 1947564 2165597 2748739 2594388 3311418 3451281
2392 3451281 4282161 4204567 4547892 4575734 5046495 4594967 4528375 5390354 5346901 4727530
2382D727530l95086K19338Q6203J08358P67510J23809j0878M96609L98662l3813
2372F488242N06808M33283o65256K32900m06731O17026O00280n51153l3013L72731
2362G595117P64170M94596O27275K68934O14587n9297P04538q5267P32437J42956
2352A1800046m7100M45052J364387M6885P92547J375457J526513J412709K517641
2343B1234137L636347K934863L361955L641092K532615K467939L516639M209225
2335D7534812N348142N543595Q074343J1008394J6536394K5366093L8359186N1338606
2327B09109565N4839056N1250568L9437639O443494j9634173k6877360l4818680
2320B79750109m0453321l9431175l6308941l4403193k7255497j9480508j3591190
$$ plain form
2382 4727530 4332444 4551782 4637985 4746343 5513853 5637662 5626784 6123393 6522055 6488242
2372 6488242 6995050 7428333 6763077 6995977 6589246 7206272 7806552 7255399 7222386 7595117
2362 7595117 8359287 8853883 9481158 9750092 10364679 10305382 11009920 10924653 11657090 11800046
2352 11800046 11752946 12197998 13562385 13609270 14401817 15777274 17303787 18716496 21234137
2343 21234137 24870484 27805347 31167302 34808394 37341009 39808948 43325587 47534812
2335 47534812 52882954 58426549 66500892 77509286 94045680 119411773 157770959 209109565
2327 209109565 263948621 315199189 354636828 361080322 341446149 314568789 279750109
2320 279750109 239296788 199865613 163556672 129153479 101897982 82417474 68826284
2313F8826284r387886p784555n118418l190100l951899m194633l066373k798645
2305B9333775k188051k740342k804809j396923j361379k160256j245013r67068
2297A4469934q43124l27343r61666n42325K97952o69159r81376m62365q22651
2288I157877l44571K04102j073611l56063j003342J56495q8934o88649K1340P237
2278E991881j33114K47305K53096J89117p91436n86092L57885m61772m12915n62092
2268D091863j78458o50991n1321l1175P69340m72402J02180K6877m66461L89339
2258C528791N2662L47438j9596m15525m6659q12067p51494L56982l29931K16696
2248B127297j96793o2503m13602O72995K893K53846J92287M09317m55432n68204
$$ plain form
2313 68826284 59438398 51653843 46535425 43345325 39393426 35198793 32132420 29333775
2305 29333775 27145724 24405382 21600573 20203650 18842271 16682015 15437002 14469934
2297 14469934 13626810 13299467 12337801 11795476 12093428 11424269 10442893 9980528 9157877
2288 9157877 8813306 9017408 7943797 7587734 6584392 6740887 6651953 5963304 5984644 5991881
2278 5991881 5858767 6106072 6359168 6548285 5756849 5170757 5528642 5066870 4653955 4091863
2268 4091863 3913405 3262414 3211093 3179918 3949258 3476856 3579036 3605913 3139452 3528791
2258 3528791 3581453 3928891 3909295 3493770 3447111 2635044 1883550 2240532 1910601 2127297
2248 2127297 1930504 1868001 1454399 2127394 2130287 2384133 2576420 2985737 2530305 1962101
2238A962101k67868p1118l42020r4122p158m35533P15894K59003R1605p2824M08533
2227B146493m83402J7871l30244P28j99669N03647n79409n57173R9546j28952
2217D89436m0387O06177j30773l50947O12621m373M27831j98879J37206m90257
2207A057655M53669m51966k72622k17284k10145m75575J28230M84177n06170K34117
2197B24086Q5927j46128P5150N25559k42694L04826P9850o50991o00994K47022
2187i8387l08423M69579k96050j83463L80949k20188K44313l71334L06157m4093
2177a20940L17724K69143P62739l60424r22861O24520k40845m25417n31759k31439
2167h59559O48848l36928o4223O73096M58347k23140l72643L68953j99442K43631
$$ plain form
2238 1962101 1694233 1623115 1281095 1186973 1179815 744282 1460176 1719179 1810784 1737960 2146493
2227 2146493 1663091 1680962 1350718 1351446 1151777 1655424 1076015 518842 618388 489436
2217 489436 449049 1055226 924453 573506 1186127 1181754 1609585 1410706 1547912 1057655
2207 1057655 1511324 1059358 786736 569452 359307 -116268 11962 496139 -10031 224086
2197 224086 310013 163885 239035 764594 521900 826726 906576 255585 -345409 -98387
2187 -98387 -406810 62769 -233281 -416744 -35795 -255983 -11670 -383004 -76847 -120940
2177 -120940 196784 465927 1228666 868242 -54619 569901 329056 -96361 -628120 -859559
2167 -859559 -210711 -547639 -611862 61234 519581 296441 -76202 292751 93309 336940
2157C36940j62444k36679l00556o0847n69687J06966k67560k3144J09025q0713
2147a148699M92048L74216M26257L13361l1634l44083l35769j13479R8255j00501
2137c70028R623m90626q2962m4703M31408J58599k63645K36922L81667M6604K16598
2126B29457K93621l46304K61755l34040J42322o30099l45447j28153M63242m91469
2116h85115j69472J009331P90659n79894n50126L63708L23761J61001p50118J80119
2106a06146j30914j48577k61645J00141K78277o45581k7321R62895o74022M71101
2096a81792M9482p1339j32767R7743P1383k05263n90907n68343O20811J43987
2086g67005K38872P68452K07313q03862j28537K94750L75310J9064o37809K19849
$$ plain form
2157 336940 174496 -62183 -362739 -423586 -993273 -886307 -1153867 -1177011 -1067986 -1148699
2147 -1148699 -656651 -282435 143822 457183 425549 81466 -254303 -367782 -269527 -370028
2137 -370028 -360405 -851031 -933993 -978696 -547288 -388689 -652334 -415412 -33745 12859 229457
2126 229457 523078 176774 438529 104489 246811 -383288 -728735 -856888 -393646 -885115
2116 -885115 -1054587 -45256 745403 165509 -384617 -20909 302852 463853 -286265 -106146
2106 -106146 -237060 -385637 -647282 -547141 -268864 -914445 -941766 21129 -652893 -181792
2096 -181792 -132310 -203649 -336416 -238673 -167290 -372553 -963460 -1531803 -910992 -767005
2086 -767005 -528133 240319 447632 -356230 -484767 -190017 185293 204357 -433452 -213603
2076b13603L0148j54779k41157M33887j6949j5595k49738J33146k83965k91888
2066h70493L54116L15448k25810L67088L07843L19956M59707j7718K72080o90988
2056E91229J41268j53522K29082j46980j12185l53304J00357L76738j21179k05490
2046C46014N96860k06763k63914N5230K91601m17686q88033q5337O3411l32753
2036h41370m51260Q08401j58849K07679L16268L91176n98457K51469k06334M93222
2026B11945k5735q11048j63052O73548l31523p27982P15905j2217J3574l2065
2016d88650l24648O67606O35101p18508M05172j99133l897K71025J50984l98556
2006c504n41375k58663n53398L11481L46603L76746n79509j23351R63942r8044
$$ plain form
2076 -213603 -183455 -338234 -579391 -145504 -162453 -178048 -427786 -294640 -578605 -870493
2066 -870493 -516377 -200929 -426739 -59651 248192 568148 1027855 1010137 1282217 591229
2056 591229 732497 578975 808057 661077 548892 195588 295945 672683 551504 346014
2046 346014 942874 736111 472197 527427 819028 401342 -486691 -572028 -508617 -841370
2036 -841370 -1292630 -484229 -643078 -435399 -119131 272045 -326412 -74943 -281277 211945
2026 211945 186210 -624838 -787890 -114342 -445865 -1173847 -457942 -470159 -456585 -488650
2016 -488650 -813298 -145692 489409 -229099 176073 -23060 -26957 244068 395052 -3504
2006 -3504 -544879 -803542 -1356940 -1045459 -698856 -322110 -901619 -1024970 -61028 -159072
1996a59072K79787M6755p6801n1442l73219m01114l2547M30432m24749p0472k6530
1985h58972J42411N09329J95288k5726p9847j69400p8815Q96743k2269q71312
1975c62570l85791Q38878J13685l95250l31491P6146k61074J48203k11850j02517
1965h73631L57956K92346k32624J81437r0029n36863K14093J97861k43247j8078
1955g50779k52697l27814K06163K58633J66645L74334m22443K789M07711k57518
1945e94976k10596K29226K13928j98402j01678j76990L13060k44303k3934M21732
1935c72933n30996l4056l8458J20788K70727J4357K82209K8401q81742j96237
1925a337940O96101j10824k88643M23509J74247j14098O9355j04459K45041M43643
$$ plain form
1996 -159072 120715 167470 90669 39227 -333992 -735106 -767653 -337221 -761970 -832442 -858972
1985 -858972 -716561 -207232 -11944 -37670 -117517 -286917 -365732 531011 508742 -362570
1975 -362570 -748361 90517 204202 -191048 -522539 -446393 -707467 -559264 -771114 -873631
1965 -873631 -515675 -223329 -455953 -274516 -364545 -901408 -687315 -489454 -732701 -750779
1955 -750779 -1003476 -1331290 -1125127 -866494 -699849 -325515 -747958 -745169 -337458 -594976
1945 -594976 -805572 -576346 -362418 -560820 -662498 -839488 -526428 -770731 -794665 -372933
1935 -372933 -903929 -937985 -976443 -855655 -584928 -570571 -288362 -259961 -1141703 -1337940
1925 -1337940 -641839 -752663 -1041306 -617797 -443550 -557648 -488293 -592752 -347711 95932
1915I5932K06566o12528P40438p32881l71963p9512n8308m41947Q16980k8799
1905d66022o61800P6996L40256N27750j429598j21123N18254L24124J44562q34460
1895a581061Q36206O70503k88397j30148K03861l14239k65830N45025j10617L98023
1885c6674n31352J94382j08942k35504L58261K81317K48972l25906n54139K47918
1875d61667j41370k92084M3130L42572K52376p36391L76853M16744m17972j60491
1865g78300M83456k77212k04696J78365P26330j19580j78214R4609k31958n63373
1855h70573k52219J09803K83853L32021o15445O43056J3872o80326m19994Q18151
1845f37801M12447n33931J64011J72033J46861k7522k80874o5855L55707O19000
$$ plain form
1915 95932 302498 -310030 430408 -302473 -674436 -753948 -812256 -1254203 -437223 -466022
1905 -466022 -1127822 -1050826 -710570 -182820 -1612418 -1733541 -1215287 -891163 -746601 -1581061
1895 -1581061 -744855 -74352 -362749 -492897 -289036 -603275 -869105 -324080 -434697 -36674
1885 -36674 -568026 -373644 -482586 -718090 -359829 -78512 170460 -155446 -709585 -461667
1875 -461667 -603037 -895121 -851991 -509419 -257043 -993434 -616581 -199837 -617809 -778300
1865 -778300 -294844 -572056 -776752 -598387 127943 8363 -169851 -75242 -307200 -870573
1855 -870573 -1122792 -1012989 -729136 -397115 -1012560 -369504 -355632 -1035958 -1455952 -637801
1845 -637801 -225354 -759285 -595274 -423241 -276380 -303902 -584776 -650631 -294924 324076
1835C24076j25262p32367l15377L8957J46013N3025L19768k4788L91122K9168
1825A04335J0359p1329l73049n18437K85309L39661J93296M835o29564N1479K46681
1814c56424O3404l33512J25034q0456j27535L9282N43402L58916o39968k69100
1804f76957N21256K46283j10495j68350k37565Q2664n14497j87284J52641m11175
1794a303479K78560J046469O4516o02950K39269m3672L30041P56156l37779k85242
1784A41889L08807p83733k69500K38317k29902J54137K78192l60028K2416k23272
1774g22677j47204M04215J41720K94038l31983m75974L76277k542J65941l3865
1764c32054l42636M37362K49913m66536p6110R59652l66048o27335K93195n8187
$$ plain form
1835 324076 198814 -533553 -848930 -809973 -663960 -610935 -291167 -315955 75167 104335
1825 104335 114694 43365 -329684 -848121 -562812 -223151 -29855 -25020 -654584 -603105 -356424
1814 -356424 -293020 -626532 -501498 -581954 -709489 -670207 -126805 232111 -407857 -676957
1804 -676957 -155701 90582 -19913 -188263 -425828 -343164 -857661 -1044945 -892304 -1303479
1794 -1303479 -1024919 21550 86066 -516884 -277615 -321287 8754 764910 427131 141889
1784 141889 450696 -333037 -602537 -364220 -594122 -439985 -161793 -521821 -499405 -722677
1774 -722677 -869881 -465666 -323946 -29908 -361891 -837865 -461588 -464130 -298189 -332054
1764 -332054 -674690 -237328 12585 -453951 -530061 429591 63543 -563792 -270597 -328784
1754c28784L74202J34352k75785j09013M1020l7254n04031K32722k80468M0028
1744g13011L24656k52608L99122j61020j0722J55302k2187M46642K61262p94100
1734c66664P9511k22226p8241N17162q02550n9813K59302l17534K33393N62085
1724a95575k67927j51461q234K42148j13376L00241P1014j93129k36095k47833
1714h00227K69853J55137K02697o70491N4959N50207P3587J548n1590k85323L2604
1703d67039q0132M07168j82171p22953L79027m38509M19416J76903l51793P1133
1693g88950M11398N99053l30864m74593K57521L58296P6095l59931m42763k4010
1683g18748m6859n25664K15047M31103j001201l64962R26026J39286L71301N47760
$$ plain form
1754 -328784 45418 179770 -96015 -205028 -164008 -201262 -705293 -472571 -753039 -713011
1744 -713011 -388355 -640963 -241841 -402861 -413583 -258281 -280468 166174 427436 -366664
1734 -366664 -287153 -509379 -587620 -70458 -873008 -932821 -673519 -991053 -757660 -195575
1724 -195575 -463502 -614963 -623197 -381049 -494425 -194184 -123170 -316299 -552394 -800227
1714 -800227 -530374 -375237 -172540 -843031 -788072 -237865 -164278 -162730 -214320 -499643 -467039
1703 -467039 -547171 -140003 -322174 -1045127 -666100 -1104609 -685193 -508290 -860083 -788950
1693 -788950 -377552 221501 -109363 -583956 -326435 31861 107956 -251975 -694738 -718748
1683 -718748 -765607 -1291271 -1076224 -645121 -1646322 -2011284 -1085258 -945972 -574671 -26911
1673b6911p37539L34747J15887J18396n41214L83872k97243m59749j47255L00569
1663i56440l58677L42132N75000J81272J25922r056J57387o4106K68995j57899
1653A04530l8629k24343M65813l26778m0267q46434j24304L46727N8629J67410
1643d57646K92116m92435P3729J90108K53246l18178K1584p44425r4689M29163
1633h47427j03385K95272j06967r8033L22870J87090p3368j69621K169O02860
1623A1460L70734j37374o77501l48275J22112J47574J88453l67949n08739O03480
1613e96025J01791j3212k8514J54663M59843n98777L15178k40520n7659q4278
1603e87510l83427K99683K44984p8876k62278k02887J71891O21317l47065O81975
$$ plain form
1673 -26911 -764450 -429703 -313816 -195420 -736634 -352762 -650005 -1109754 -1257009 -956440
1663 -956440 -1315117 -972985 -397985 -216713 -90791 -99847 57540 -6566 262429 104530
1653 104530 65901 -158442 307371 -19407 -59674 -906108 -1030412 -683685 -625056 -457646
1643 -457646 -165530 -657965 -584236 -394128 -140882 -459060 -437476 -1181901 -1276590 -847427
1633 -847427 -950812 -655540 -762507 -860540 -537670 -350580 -423948 -593569 -591400 11460
1623 11460 382194 244820 -432681 -780956 -658844 -511270 -322817 -690766 -1199505 -596025
1613 -596025 -494234 -507446 -535960 -381297 78546 -520231 -205053 -445573 -503232 -587510
1603 -587510 -970937 -671254 -426270 -505146 -767424 -970311 -798420 -177103 -524168 157807
1593A57807L2747m02126j15821p6336K09504m46818l24987n07377O03882j1468
1583h80993p87320J290100l25675o4308J68877N56129J13627r7033k1449K50315
1573B02270j13818n78328K76356m46344K206l15592j55088l73981J20897N90498
1563g90924j5324k27631L14444O39470N40428n76925N37738k62375R983O9062
1553B37946o30970k49242j098365l1486M25168Q36414p51638M88909M97473M57583
1543A81792R4648k35463K6746L9875l39617k32975P613k91311j22606M95623l95685
1532g71360n8645j21496L17666L70483n07862J93926L21243L66256R7113j03588
1522A03736m69242q7610l96013L06540o1231O9458j29532j07315M46475J88623
$$ plain form
1593 157807 190554 -211572 -327393 -403729 -194225 -641043 -966030 -1473407 -869525 -880993
1583 -880993 -1668313 -378213 -703888 -768196 -599319 -43190 70437 -26596 -48045 202270
1573 202270 88452 -489876 -213520 -659864 -657658 -973250 -1128338 -1502319 -1381422 -790924
1563 -790924 -806248 -1033879 -719435 -79965 460463 -116462 421276 158901 168884 237946
1553 237946 -393024 -642266 -1740631 -1772117 -1346949 -510535 -1262173 -773264 -275791 181792
1543 181792 276440 40977 67723 107598 -232019 -464994 -457381 -748692 -871298 -375675 -771360
1532 -771360 -830005 -951501 -633835 -263352 -771214 -577288 -256045 110211 207324 103736
1522 103736 -365506 -453116 -849129 -542589 -603820 -534362 -663894 -771209 -324734 -136111
1512a36111k12602K17242j20131k80J43545M7338j02285n15868R8616N25036q4759
1501a40259n3244k31884j29780J72862J24146L58831q62146R1811L39701l46068
1491f76030K63277J09654M36001l5744m28386j72106J67701j38565n28846n40244
1481a543288R47086M63735L57087p535m73283J01375K4677O0058J89048J83591
1471C02551n77052o09818L26967o2761n37106Q62640K67197P6010L0863k99097
1461b19606J10156R1319j94081L08021k64122j23285m71707K22517j04913L88096
1451b57605m96385J82145l1131n6732N64120J94469J2579j40495k05105r963K28483
1440a5620q98331P99709k98825n3005j78543J14001m67848M41150M9546L62255
$$ plain form
1512 -136111 -348713 -131471 -251602 -251882 -108337 -60999 -163284 -679152 -580536 -55500 -140259
1501 -140259 -193503 -425387 -555167 -382305 -258159 100672 -761474 -669663 -329962 -676030
1491 -676030 -412753 -303099 132902 97158 -331228 -503334 -335633 -474198 -1003044 -1543288
1481 -1543288 -596202 -132467 224620 217085 -256198 -154823 -130146 -70088 118960 302551
1471 302551 -274501 -884319 -557352 -620113 -1157219 -294579 -27382 48628 79491 -219606
1461 -219606 -109450 -18131 -212212 95809 -168313 -291598 -763305 -540788 -645701 -257605
1451 -257605 -753990 -571845 -602976 -659708 -95588 98881 111460 -29035 -234140 -244103 -15620
1440 -15620 -913951 -114242 -413067 -466072 -644615 -530614 -998462 -557312 -507766 -145511
1430a45511L16543Q8293M592j39286M26006M0167r2196n50146k34715q17719j37020
1419a240992O53985m05756m37820J066573j68143L38826k92592n67128N19714
1410e33333J95661K61134j36743j47880m54286K51756L41257n10771o53159N4259
1400a332105k35582M37023P28660J81083J61918O839n0707m3306o72213J41542
1390f76848M7316k69958l92299Q60735J53223o06632L66224K77867K70739l34165
1380c03798l10599j70277K09315k20145O57856k36611O30699l56700n37682k70063
1370i08005m30536L39205J06213L13662K84351K02115j02244k05535O33309l57984
1360a25449r1796K04016l49782L19495m19525J69072N4129K18507L84384K48786
$$ plain form
1430 -145511 171032 259325 263917 124631 550637 590804 498608 -51538 -286253 -1103972 -1240992
1419 -1240992 -587007 -992763 -1430583 -364010 -532153 -193327 -485919 -1053047 -533333
1410 -533333 -337672 -76538 -213281 -361161 -815447 -563691 -222434 -733205 -1386364 -1332105
1400 -1332105 -1567687 -1130664 -402004 -220921 -59003 -52164 -102871 -146177 -818390 -676848
1390 -676848 -629532 -899490 -1291789 -431054 -277831 -884463 -518239 -240372 30367 -303798
1380 -303798 -614397 -784674 -575359 -795504 -137648 -374259 256440 -100260 -637942 -908005
1370 -908005 -1338541 -999336 -893123 -579461 -295110 -92995 -195239 -400774 232535 -125449
1360 -125449 -217245 -13229 -363011 -43516 -463041 -293969 -239840 -21333 363051 611837
1350F11837q57359j23878J35129p4000M87647j31720r793m2484p04846R4342O59660
1339D4535m38225L5706k09620J52326N50800r4888j75974Q15023m54607J97766
1329D22842l02919k11556l69248j75772Q5137n50106J6552m91077M04179P13952
1319d58016m9102M60Q46621k13466l9630r0773L09145N8988O7590n72255K81066
1308A40628K95199r01758o50043L31026r8279K97180L27714j30536j64010J66473
1298c86406J003724P6830l9137m4555o77193l77937k7499l14299K07739m04754
1288i83487L64405J61067n66591l22527P59254L48635R4396L74122N07963q37263
1278a00026k94428L60545J92060l77377n18828L70409k23928j51038J93690N02211
$$ plain form
1350 611837 -245522 -369400 -234271 -308271 179376 47656 37863 -4621 -709467 -615125 44535
1339 44535 -393690 -357984 -567604 -415278 135522 40634 -135340 679683 225076 422842
1329 422842 119923 -91633 -460881 -636653 -551516 -1101622 -1085070 -1576147 -1171968 -458016
1319 -458016 -507118 -506658 339963 126497 86867 -3906 305239 364227 431817 -140438 140628
1308 140628 435827 -465931 -1115974 -784948 -883227 -586047 -258333 -388869 -552879 -386406
1298 -386406 617318 694148 655011 610456 -66737 -444674 -472173 -786472 -578733 -983487
1288 -983487 -619082 -458015 -1024606 -1347133 -587879 -239244 -144848 229274 737237 -100026
1278 -100026 -394454 -33909 158151 -219226 -738054 -367645 -591573 -742611 -548921 -46710
1268d6710o37928L97512k65841m0973J42516N04860l2359J70832l53076l46437
1258e07604L09045j18800l23422l60413M46957L8109L35505k98152L96489K49303
1248A67017K16231m89956N9206M8633m85599J78199K71147o04347j75011K15839
1238e98641L91609J98502j37916l3978l03125L38811N95460j86493K84563K95713
1228H44505j070615j84020q1102K20685N39202r3796k39793M80147p33494o89746
1218a008027K33411P35513k49465K2812L88592o19238J17993k33247n85525J95743
1208a001438N00207n16532k7366N94896L85425j08291k44192M40337M15377q36871
1198c98448j71315K6453P39894l0003j02886J08290l31858j0858j8071K65136
$$ plain form
1268 -46710 -684638 -287126 -552967 -593940 -451424 53436 21077 191909 -161167 -507604
1258 -507604 -198559 -317359 -640781 -1001194 -554237 -516128 -180623 -478775 -82286 167017
1248 167017 383248 -106708 -47502 1131 -484468 -306269 -35122 -639469 -814480 -598641
1238 -598641 -207032 -8530 -146446 -180424 -483549 -144738 450722 264229 548792 844505
1228 844505 -226110 -410130 -491232 -270547 268655 174859 -64934 415213 -318281 -1008027
1218 -1008027 -774616 -39103 -288568 -265756 122836 -496402 -378409 -611656 -1197181 -1001438
1208 -1001438 -501231 -1017763 -1045129 -450233 -64808 -173099 -417291 23046 438423 -398448
1198 -398448 -569763 -543310 196584 166581 63695 171985 -159873 -170731 -188802 76334
1188G6334q4317K38771m11618J04180j92964j0345j08488P8844J63489m31994
1178e78108k49380K74981J37777k30589R1478p8607k27773M60676M27350k19325
1168a91520l33012L27189J58999n83381J054332k01883p79627k7598K89690K17809
1158f9002r79369l79594P32668K36660q5409j53887K35372J39174l24908Q91607
1148B43312m61371l67430K85449P208k56032j24476m5510l8594l48514m75953
1138a581911M33939M56813o13420K89359O51633N38994j22359o5125j3513o51973
1128f77563j78574j4337J60817l66379K59605j85433l87676M9140J93151K32718
1118i14531L6785l19339M22336K79795M07721J89590l55078o3664o61341N78702
$$ plain form
1188 76334 -7983 230788 -180830 -76650 -269614 -279959 -388447 -309603 -146114 -578108
1178 -578108 -827488 -552507 -414730 -645319 -553841 -632448 -860221 -399545 27805 -191520
1168 -191520 -524532 -197343 -38344 -621725 432607 230724 -548903 -576501 -286811 -69002
1158 -69002 -1048371 -1427965 -695297 -458637 -544046 -697933 -462561 -323387 -648295 243312
1148 243312 -218059 -585489 -300040 -292832 -548864 -673340 -718850 -757444 -1105958 -1581911
1138 -1581911 -1147972 -691159 -1304579 -1015220 -363587 175407 53048 -12077 -25590 -677563
1128 -677563 -856137 -870474 -709657 -1076036 -816431 -1001864 -1389540 -1340400 -1147249 -914531
1118 -914531 -877746 -1197085 -774749 -494954 -87233 102357 -252721 -316385 -977726 -399024
1108c99024m16668j01792M71151O3888k92250L32325K15864j69783j31033K78375
1098a48947J74804m51749J16185K55002m11269k44129K65275N1721J36388n7229
1088c13948L18744j41413L9860q33397M76106M41100l32839P3519M18625m10210
1078b63853L6493j11381K17096l14287r8160L90094N81890j31051m45939R4386
1068d4712o72351O25420n94138O42461K29272j21116J94344m12926J7849L3336
1058a02561j54980m43154L82738k62688k10902N39163J54430n06884k04649N3570
1048g55917N05196o214k63767n65650K18166J8065k1245k3104L4080k19051O1720
1037a017721L27156M99528j26146j87175j81328K02784O40975m9922p48531K90716
$$ plain form
1108 -399024 -815692 -917484 -446333 -382445 -674695 -342370 -126506 -296289 -427322 -148947
1098 -148947 25857 -425892 -309707 -54705 -465974 -710103 -444828 -393107 -256719 -313948
1088 -313948 4796 -136617 -96757 -930154 -454048 -12948 -345787 -272268 146357 -263853
1078 -263853 -227360 -338741 -121645 -435932 -534092 -143998 437892 306841 -139098 -44712
1068 -44712 -717063 -91643 -685781 -43320 185952 64836 259180 -153746 -135897 -102561
1058 -102561 -257541 -700695 -317957 -580645 -791547 -252384 -97954 -604838 -809487 -755917
1048 -755917 -250721 -256935 -520702 -1086352 -868186 -850121 -871366 -894470 -860390 -1079441 -1017721
1037 -1017721 -690565 -191037 -317183 -504358 -685686 -482902 158073 108151 -640380 -349664
1027c49664O87779o46829J58850M1078j28950j9090M46671L60053L41040M04132
$$ plain form
1027 -349664 338115 -308714 -149864 -108786 -237736 -256826 189845 549898 890938 1295070
$$ [...]
##END NTUPLES=NMR SPECTRUM
##END=
