##TITLE=1H_DE-80H_X3
 200.13MHz, d2o
 8 sc
 
 19ns.26.2.2025
##JCAMPDX= 6.0         $$ Bruker NMR JCAMP-DX V2.0
##DATA TYPE= NMR SPECTRUM
##DATA CLASS= NTUPLES
##ORIGIN= UXNMR, Bruker Analytische Messtechnik GmbH
##OWNER= pz
$$ XWIN-NMR		Version 3.5
$$ Thu Jul 23 14:05:56 2026 Russian Standard Time (UT+4h)  Yarkov@DPX200
##.OBSERVE FREQUENCY= 200.1313
##.OBSERVE NUCLEUS= ^1H
##.ACQUISITION MODE= SIMULTANEOUS
##.ACQUISITION SCHEME= undefined
##.AVERAGES= 8
##.DIGITISER RES= 18
##SPECTROMETER/DATA SYSTEM= spect
##.PULSE SEQUENCE= zg30
##.SOLVENT NAME= CDCl3
##.SHIFT REFERENCE= (INTERNAL, CDCl3, 0, 15.4847)
##AUDIT TRAIL= $$ (NUMBER, WHEN, WHO, WHERE, WHAT)
$$ ##TITLE= Audit trail, XWIN-NMR		Version 3.5
$$ ##JCAMPDX= 5.01
$$ ##ORIGIN= Bruker BioSpin GmbH
$$ ##OWNER= Yarkov
$$ C:/Bruker/XWIN-NMR/data/yarkov2/nmr/H-C/1/pdata/1/auditp.txt
$$ ##AUDIT TRAIL=  $$ (NUMBER, WHEN, WHO, WHERE, WHAT)
(   1,<2026-07-23 14:05:14.39 +0400>,<Yarkov>,<DPX200>,
      <created by zg, POWCHK disabled, PULCHK disabled
       configuration hash MD5:
       00 E9 B6 7A A2 85 ED C7 34 08 36 98 17 FE 4E 26
       data hash MD5: 16K
       27 AD C8 B6 4A D6 A2 A2 28 C6 8D DC 6A D2 A1 C1>)
(   2,<2026-07-23 14:05:20.39 +0400>,<Yarkov>,<DPX200>,
      <Start of raw data processing
       efp BC_mod = 2 LB = 0.25 FT_mod = 6 PKNL = 1 PHC0 = -7254.183 PHC1 = 2.82197 SI = 16K 
       data hash MD5: 16K
       DB 3C 58 80 58 F1 AB 00 82 93 21 1F F3 DB D1 54>)
$$ ##END=
$$ 
$$ hash MD5
$$ 25 33 05 CB 65 CF 74 B4 04 B7 C3 87 61 B5 65 D7
##$RELAX= 
##$RELAX= 
##$RELAX= 
##$RELAX= 
##$RELAX= 
##$RELAX= 
$$ Bruker specific parameters
$$ --------------------------
##$DU= <C:/Bruker/XWIN-NMR>
##$EXPNO= 1
##$NAME= <H-C>
##$PROCNO= 1
##$TYPE= <nmr>
##$USER= <yarkov2>
##$AMP= (0..31)
100 100 100 100 100 100 100 100 100 100 100 100 100 100 100 100 100 100 
100 100 100 100 100 100 100 100 100 100 100 100 100 100 
##$AQSEQ= 0
##$AQ_mod= 1
##$AUNM= <au_zg>
##$AUTOPOS= <>
##$BF1= 200.13
##$BF2= 200.13
##$BF3= 200.13
##$BF4= 200.13
##$BF5= 200.13
##$BF6= 200.13
##$BF7= 200.13
##$BF8= 200.13
##$BYTORDA= 1
##$CFDGTYP= 0
##$CFRGTYP= 5
##$CHEMSTR= <none>
##$CNST= (0..31)
1 1 145 1 1 1 1 1 1 1 1 1 1 1 1 1 1 1 1 1 1 1 1 1 1 1 1 1 1 1 1 1 
##$CPDPRG= <>
##$CPDPRG1= <>
##$CPDPRG2= <>
##$CPDPRG3= <>
##$CPDPRG4= <mlev>
##$CPDPRG5= <mlev>
##$CPDPRG6= <mlev>
##$CPDPRG7= <mlev>
##$CPDPRG8= <mlev>
##$CPDPRGB= <>
##$CPDPRGT= <>
##$D= (0..31)
0 0.7 0 0 0 0 0 0 0 0 0 0.03 0 0 0 0 0 0 0 0 0 0 0 0 0 0 0 0 0 0 0 0 
##$DATE= 1784801113
##$DBL= (0..7)
120 120 120 120 120 120 120 120 
##$DBP= (0..7)
150 150 150 150 150 150 150 150 
##$DBP07= 0
##$DBPNAM0= <>
##$DBPNAM1= <>
##$DBPNAM2= <>
##$DBPNAM3= <>
##$DBPNAM4= <>
##$DBPNAM5= <>
##$DBPNAM6= <>
##$DBPNAM7= <>
##$DBPOAL= (0..7)
0.5 0.5 0.5 0.5 0.5 0.5 0.5 0.5 
##$DBPOFFS= (0..7)
0 0 0 0 0 0 0 0 
##$DE= 6
##$DECBNUC= <off>
##$DECIM= 32
##$DECNUC= <off>
##$DECSTAT= 4
##$DIGMOD= 1
##$DIGTYP= 9
##$DL= (0..7)
0 120 120 120 120 120 120 120 
##$DP= (0..7)
$$ [...]
##$SUBNAM2= <"">
##$SUBNAM3= <"">
##$SUBNAM4= <"">
##$SUBNAM5= <"">
##$SUBNAM6= <"">
##$SUBNAM7= <"">
##$SUBNAM8= <"">
##$SUBNAM9= <"">
##$SW= 18.0517328524113
##$SWIBOX= (0..15)
0 0 2 0 0 0 0 0 0 0 0 0 0 0 0 0 
##$SW_h= 3612.71676300578
##$TD= 16384
##$TD0= 1
##$TE= 0
##$TE2= 300
##$TE3= 300
##$TEG= 300
##$TL= (0..7)
0 120 120 120 120 120 120 120 
##$TP= (0..7)
150 150 150 150 150 150 150 150 
##$TP07= 0
##$TPNAME0= <>
##$TPNAME1= <>
##$TPNAME2= <>
##$TPNAME3= <>
##$TPNAME4= <>
##$TPNAME5= <>
##$TPNAME6= <>
##$TPNAME7= <>
##$TPOAL= (0..7)
0.5 0.5 0.5 0.5 0.5 0.5 0.5 0.5 
##$TPOFFS= (0..7)
0 0 0 0 0 0 0 0 
##$TUNHIN= 0
##$TUNHOUT= 0
##$TUNXOUT= 0
##$USERA1= <user>
##$USERA2= <user>
##$USERA3= <user>
##$USERA4= <user>
##$USERA5= <user>
##$V9= 5
##$VALIST= <valist>
##$VCLIST= <CCCCCCCCCCCCCCC>
##$VD= 0
##$VDLIST= <DDDDDDDDDDDDDDD>
##$VPLIST= <PPPPPPPPPPPPPPP>
##$VTLIST= <TTTTTTTTTTTTTTT>
##$WBST= 1024
##$WBSW= 4
##$XGAIN= (0..3)
0 0 0 0 
##$XL= 0
##$YL= 0
##$YMAX_a= 50397
##$YMIN_a= -74797
##$ZGOPTNS= <>
##$ZL1= 120
##$ZL2= 120
##$ZL3= 120
##$ZL4= 120
##$ABSF1= 0
##$ABSF2= 0
##$ABSG= 0
##$ABSL= 0
##$ALPHA= 0
##$AQORDER= 0
##$ASSFAC= 0
##$ASSFACI= 0
##$ASSFACX= 0
##$ASSWID= 0
##$AUNMP= <proc_1d>
##$AZFE= 0.1
##$AZFW= 0.1
##$BCFW= 0
##$BC_mod= 2
##$BYTORDP= 0
##$COROFFS= 0
##$CY= -3
##$DATMOD= 1
##$DC= 0
##$DFILT= <>
##$DTYPP= 0
##$F1P= 0
##$F2P= 0
##$FCOR= 1
##$FTSIZE= 16384
##$FT_mod= 6
##$GAMMA= 0
##$GB= 0
##$INTBC= 1
##$INTSCL= 3.241238e-09
##$ISEN= 128
##$LB= 0.25
##$LEV0= 0
##$LPBIN= 0
##$MAXI= 10000
##$MC2= 0
##$MEAN= 0
##$ME_mod= 0
##$MI= 1.114404
##$NCOEF= 0
##$NC_proc= -9
##$NLEV= 6
##$NOISF1= 3.799351
##$NOISF2= 2.8
##$NSP= 0
##$NTH_PI= 0
##$NZP= 0
##$OFFSET= 15.48466
##$PC= 1
##$PHC0= -7254.183
##$PHC1= 2.82197
##$PH_mod= 1
##$PKNL= yes
##$PPARMOD= 0
##$PSCAL= 0
##$PSIGN= 0
##$REVERSE= no
##$SF= 200.130007413277
##$SI= 16384
##$SIGF1= 3
##$SIGF2= 2
##$SINO= 0.751879
##$SIOLD= 32768
##$SREGLST= <19F.Aceton>
##$SSB= 0
##$STSI= 16384
##$STSR= 0
##$SW_p= 3612.71676300578
##$SYMM= 0
##$S_DEV= 0
##$TDeff= 16384
##$TDoff= 0
##$TI= <>
##$TILT= no
##$TM1= 0
##$TM2= 0
##$TOPLEV= 0
##$USERP1= <user>
##$USERP2= <user>
##$USERP3= <user>
##$USERP4= <user>
##$USERP5= <user>
##$WDW= 1
##$XDIM= 16384
##$YMAX_p= 341491495
##$YMIN_p= -1762059
$$ End of Bruker specific parameters
$$ ---------------------------------
##NTUPLES= NMR SPECTRUM
##VAR_NAME=  FREQUENCY,     SPECTRUM/REAL,   SPECTRUM/IMAG
##SYMBOL=    X,             R,               I
##VAR_TYPE=  INDEPENDENT,   DEPENDENT,       DEPENDENT
##VAR_FORM=  AFFN,          ASDF,            ASDF
##VAR_DIM=   16384,         16384,           16384
##UNITS=     HZ,            ARBITRARY UNITS, ARBITRARY UNITS
##FACTOR=    0.220516191357247, 1,           1
##FIRST=     3098.94515033552, 0,            0
##LAST=      -513.771612670263, 0,           0
##MIN=       -513.771612670263, -1762059,    0
##MAX=       3098.94515033552, 341491495,    0
$$ Real data points
##PAGE= N=1
##DATA TABLE= (X++(R..R)), XYDATA
$$ [...]
7236 1671627 2024997 2025825 2107720 2170364 1632605 1988878 1845632 1630234 1957360 1416444
7226 1416444 1675849 1835396 1637812 1793893 1214155 1237430 1052669 766145 1352192 839397
7216 839397 1066082 1593265 1283734 1431117 1662507 1633032 1665911 968344 1769851 1059064
7206 1059064 964805 1216494 629037 971552 1243400 895723 1133372 414968 908970 726627
7196 726627 619734 1809042 1042721 1239210 1536062 875562 1685420 874988 1229060 1223508
7186 1223508 1463636 2064722 1133940 1269482 2336591 1709349 2467378 1991447 916993
7177 916993 1057482 1089601 1416171 1234894 1304948 2138491 1803223 1847838 1770310 1656876
7167 1656876 1791520 1583365 1849685 1577142 1156008 1424975 1539691 1918482 1340773 1334124
7157 1334124 1777138 1300419 1510321 857051 1499839 1841470 1354715 1229530 710815 704312
7147 704312 1292971 1057522 1398505 1424352 1679351 1863155 1042319 1025579 1750786 1771226
7137 1771226 2132247 2133040 1987069 2083727 1679034 1611917 1104108 956726 1201996 1258126 1449621
7126 1449621 910918 1303395 1138954 966563 1515122 1196393 1716629 1631618 1799136 3339780
7116 3339780 2338126 1917958 2155253 1951725 2059779 1904720 1498460 1621425 1173176
7107 1173176 1574560 1250277 1363528 1011448 941694 1805304 1680471 1764631 1706799 780079
7097 780079 1716691 1821111 1447178 2092626 1749497 1681679 1712981 1214520 2138659 1838460
7087 1838460 2020656 1859765 1349839 1691891 1915506 2317220 1953000 1233437 1516355 1042900
7077 1042900 1430992 2202976 1558653 2002826 1520387 1987029 2986640 2718548 2883581 2710872
7067 2710872 2944062 3274606 2395793 2807646 2498869 1962055 2087934 1510264 1182446 1888471
7057 1888471 1919069 2221453 1581453 2320740 2653128 1479393 1690300 1927209 1909990 2258817
7047 2258817 2106666 2136055 1975895 2132675 2234305 1471090 1547317 1117931 1092780 1322024
7037 1322024 1260540 1755270 1614976 1487256 1636954 1238419 991040 1682406 1233173 1380078
7027 1380078 1352487 1510589 1952610 1348977 1411685 1442180 1366414 1482063 1722468 1700797
7017 1700797 1988480 2610783 2421810 2612123 2573428 2247871 2167727 2447786 2061048 1704664
7007 1704664 1921062 1451218 1737322 2436118 1544336 2036722 1781741 1272332 1640666 1920500
6997 1920500 2255979 2696523 1872488 1960583 2406200 1994251 2105911 2078538 2195000 1320471
6987 1320471 1048910 1850745 1804046 1793918 1250763 1372456 1701583 1245596 2208671 2297575
6977 2297575 2323172 2895329 2079190 2019942 2110685 1749054 2525436 1788898 1665676 2407039
6967 2407039 2044336 2241559 1958982 2244007 2532083 2115257 2804301 2376129 2383961 3352613
6957 3352613 3038419 2935831 2624474 2254164 2710018 2132897 2845072 3131599 2466492 2952369
6947 2952369 2199709 2842716 3277371 2986338 4121995 3834704 3705267 3709961 3928891 4410265
6937 4410265 4278394 4412803 4557380 3701290 4301167 4386760 4472841 4262608 4127105 4406873
6927 4406873 4179297 3972539 4340617 4499081 5198146 4215422 3399726 4046986 4369297 4600827
6917 4600827 4357721 4495424 5084124 4099729 4720274 4701614 3800658 5346815 4834152 4727653
6907 4727653 5667223 4943189 4722417 4879364 4578318 5064561 4223937 4987266 5117332 4815957
6897 4815957 5141782 4827228 5376928 5190940 4924335 5723413 5054904 5630076 5702954 4786682
6887 4786682 5643072 5638235 6352935 6180295 4707255 5013352 5031024 4939612 5339872 4339740
6877 4339740 4777165 4748353 4671625 5218162 4554280 4833921 4494855 4281407 5201767 4986499
6867 4986499 5446001 5542983 4900258 5464952 4918833 4692254 5104542 4574246 4618264 5541077
6857 5541077 4911642 5241194 4820976 5208917 4828352 4581834 4751049 4245966 4078733 4010667
6847 4010667 3806723 4395059 4384945 3861153 4115280 2702088 3203262 2894545 2686824 3362025
6837 3362025 2891273 2964304 4103950 3692837 3590849 3316657 3227153 3131364 3364808 3529397
6827 3529397 3402887 3796584 4084108 3595074 3631050 3520224 3494910 3817178 3111626 3535405
6817 3535405 3778168 2912234 3382706 3316602 3921273 3847254 2510424 3255343 2887161 3231380
6807 3231380 3381496 2427320 2512851 3189207 2944910 3025583 2682306 2737916 2501882 2236307
6797 2236307 2803497 2788129 3235734 3014885 2072126 2830477 2173201 1626822 1916735 2367532
6787 2367532 2900657 2675573 2558565 3034278 2892916 2957245 2316083 1999875 3143697 2250722
6777 2250722 1887771 2369212 2724589 3283646 2956225 3068368 2432290 2066305 2555184 1563626
6767 1563626 2041602 2546702 2785999 2982835 2201683 2703409 2724725 2151760 3052885 2683278
6757 2683278 2936709 3033211 2890238 2632766 2002860 2008614 2570772 2603025 3046680 3309331
6747 3309331 1983409 2846536 2714521 2708023 3004286 3231938 3226834 2876388 2586294 2372714
6737 2372714 2799009 2779825 2327828 2268141 2468702 2672935 2589254 2219692 3414759 2964185
6727 2964185 2303359 2986417 2898944 2627545 3114028 3123832 3375952 3488587 3103769 2372411
6717 2372411 2367375 2757173 3156554 3091088 2932814 2641944 3577548 3355544 2756332 2935506
6707 2935506 2646673 2707330 2683182 3303869 3483844 3185877 3317695 3839291 3593279 3490314
6697 3490314 3369365 3363788 3276247 3488078 3554956 3391196 3980622 3893573 3480596 3920362
6687 3920362 4431826 4173568 3100472 2919257 3522472 3553100 3483410 3586781 3524937 3527880
6677 3527880 3593932 3267022 3143876 3018888 3139287 3483315 3367157 3516048 3500268 3364770
6667 3364770 3021045 3490393 3130312 3097968 3621199 3749261 3466391 3693770 3715017 3326591
6657 3326591 2996447 3480685 3321905 3424375 3767640 3354302 3533708 3419005 3518239 4300410
6647 4300410 4532980 4397123 3954035 3776713 4004346 3028503 3296385 3466464 3939759 4082817
6637 4082817 4157361 4185073 3908875 4034877 5003593 4533656 4673454 4923252 4330975 5468859
6627 5468859 4822223 4929351 5133736 4839194 4593996 4273735 4411798 4777540 4841905 5129592
6617 5129592 4849850 4807866 5402726 5298500 5162104 4707407 5599551 5337226 4651857 4840309
6607 4840309 5100411 4945352 5108790 4810812 5018764 5486354 5448452 6583905 5854783 5625170
6597 5625170 6304058 5403244 5370123 5163436 5669675 5838591 5336744 5198815 5040120 5012966
6587 5012966 4654549 5084175 5329648 5055531 5391042 5189803 5108854 5117680 4746454 5478149
6577 5478149 5314645 5196564 5583133 5114584 5311667 5199968 5280836 5512177 4904303 4921169
6567 4921169 5277761 5322126 5385015 4940791 4843668 5311612 5519175 5664768 4977144 4838290
6557 4838290 5487480 5366690 5692091 6063388 6470948 6158304 5593835 6125816 5981676 6379680
6547 6379680 6492590 6346096 6766749 6478449 7336706 7283054 6562795 7165213 6805817 7795134
6537 7795134 7870379 7398640 8540579 7932980 8087100 9164517 9100429 10588071 10589812 10624630
6527 10624630 12194071 12079476 13079092 13559014 13629379 14567835 14577287 15331689 15072089 14353378
6517 14353378 15135316 15382749 15660920 16516880 16737999 17787429 17440619 17772860 18361195
6508 18361195 18203425 18668299 18392649 17934130 17843362 17315335 17861650 16890451 16383122 16393753
6498 16393753 15296815 15624228 15013152 14127378 14472712 13985158 13343677 12028097 10759638
6489 10759638 11037239 9693249 9473453 9225610 9252032 8657063 7333144 7656509 7766262
6480 7766262 6933216 7296431 6785218 7156394 7370513 7169433 7174935 6762443 6407523 7118080
6470 7118080 6911579 6640748 6706696 6177056 5830780 6285849 6376311 6226397 7035099 6659377
6460 6659377 5707289 6099825 5931685 5497450 5802134 5699302 6175634 5856215 6435282 6654274
6450 6654274 6653165 6674311 6250695 6203654 6366606 6665131 7220561 7108188 7543817 7425742
6440 7425742 7563575 8253349 8705170 9009472 9230656 8544663 9230788 9890953 9753456 10346974
6430 10346974 10484732 10593054 10763376 11053036 11270593 11168219 11211268 11146277 10990627 11269193
6420 11269193 10346207 10458785 10445958 9950954 10225298 9607395 9246052 8941241 8253425 8233807
6410 8233807 7988163 7753558 7318750 7267444 7490572 7738389 8322692 7539425 6875685 7769726
6400 7769726 7798854 7759662 8435019 7886669 7939703 8637172 9176171 9593313 9595015 9928920
6390 9928920 10063952 10275076 10337133 10349039 10639254 10262698 10296052 10954076 10174450 10501918
6380 10501918 11008785 10356233 10935424 10591319 10657606 11141927 11127921 11616334 11641805 12364531
6370 12364531 12356680 12405706 13135344 13049127 13042867 13584670 13660263 13272134 13680546 13858056 13246634
6359 13246634 12694769 13040289 13440875 13156944 12468429 12578009 13599051 13907000 13560519
6350 13560519 13444244 13743700 13882340 14831130 14260296 14857447 15291199 14730651 14636663 14269917
6340 14269917 13377241 13098232 12459410 11909060 12073653 11602685 11327268 11420247 10959292 10909301
6330 10909301 11067372 11096296 10701680 10244943 10532960 10639809 11229313 11032933 11871616 11908888
6320 11908888 11608559 12281949 12616780 12290337 12739651 13130057 12631772 13098900 13193110 13263421
6310 13263421 13256668 13042853 13361085 13023703 13091283 12871080 12693277 12750868 12624504 12061282
6300 12061282 12536179 11749015 11323906 10816271 10142316 10797330 10775025 10960757 10850340 9942742
6290 9942742 10859199 10854477 9972011 10734334 10980610 11165379 11604040 11717681 11894692 11642817
6280 11642817 12141318 11931941 12207798 12701423 11804164 12239054 12428869 12151250 12038597
6271 12038597 11759338 11593188 11774990 11258130 10875348 10857859 10591952 10667357 10830420 10722322
6261 10722322 11020760 11244420 11301931 11673663 12082792 11944421 11654829 11877051 11649552 11343552
6251 11343552 11029181 10935173 10833699 9987061 10556573 10500122 9615520 10052472 9689905 9361893
6241 9361893 9600744 9367098 9521290 9199288 9935888 10164196 9002429 9710002 10048669
6232 10048669 9545149 10012586 10162648 9824300 9891008 9959892 9602662 9292333 9051019 8727981
6222 8727981 8135127 8223432 8487254 8338738 8016711 7883343 7258811 7631647 8049899 7397306
6212 7397306 6817333 7303497 7288560 7890144 7978585 7719730 8519014 8143598 8002419 7843703
6202 7843703 8010819 8510855 8721004 8485618 8881490 8523716 8087225 7698205 8288054 7902557
6192 7902557 7748046 8357218 7708619 7773164 7796347 7410393 7768041 7670549 7586210 7736394
6182 7736394 7729918 8401744 7794062 7622235 7435327 7298293 7260643 7638698 7327597 7283912
6172 7283912 7191768 7216010 6585154 6869363 7646503 7496215 7732849 7646444 7908294 8598449
6162 8598449 7974710 8182293 8742244 8496456 8648519 8726942 8788421 8757311 9172375 9453523
6152 9453523 9132977 8551251 8261301 8239406 8625449 8421746 8582724 8106657 7637929 7700726
6142 7700726 7842873 7553567 7392112 7682783 7613929 7682634 7379928 7319816 7329098 7347794 7772727
6131 7772727 8052023 7988243 8222860 8560181 8328125 8525792 8091079 7849548 7863580 7536979
6121 7536979 7013477 6937282 7073337 7231449 7294738 7488866 7575381 7321145 7339777 7439136
6111 7439136 7681027 7401937 7345553 7155792 7330759 7698152 7775716 8315203 8191057 8208741
6101 8208741 8113294 7472476 7452371 7210764 6935182 7949935 7287645 7383420 8445910 8070499
6091 8070499 8098688 7751019 7673729 8157148 7339477 7316380 7360885 7478623 8201945 7856334
6081 7856334 7950954 7871342 7181491 7544667 7585896 7747533 7018379 6762357 7395523 6753362
6071 6753362 6852883 7066922 6885150 7388701 6672114 6490088 6727969 6273593 6763946 6590421
6061 6590421 6295262 6996883 6513832 6758050 7218565 6870395 7314414 6531504 6867363 6774264
6051 6774264 6362037 7135628 7176212 6730877 6891357 6282155 6701740 6496923 6441098 6907548
6041 6907548 5986962 6954898 6652515 6584307 7340174 6751490 6948037 6955040 7007905 7771223
6031 7771223 7412146 7722059 7507247 7604302 8597074 7707177 8217841 7925925 7398101 7793723
6021 7793723 7023569 7638637 8347654 8003598 8386869 8004404 8712897 9120734 9175855 9672998
6011 9672998 9462727 10092794 11035703 10917591 11384528 11919970 12532010 13142825 13478912 13992198
6001 13992198 14759311 14353535 14577361 14814107 14538349 14112900 13467342 13339463 12715020
5992 12715020 12022357 11829012 11515772 11171745 10645913 10794220 11215846 10830032 10810734 11092805
5982 11092805 10943134 11302361 11724783 12431582 12779242 12436315 13110120 13438595 13569337
5973 13569337 13958339 14182719 14035474 14642759 14885281 15465059 14978271 14882404 15440507 15440773
5963 15440773 15542730 15649123 14805574 14445146 13644697 13093884 12067762 11284353 10841966
5954 10841966 9872420 9938051 9929240 9875231 10301308 9595781 9379855 9741646 9554842 10176784
5944 10176784 10124625 10268857 11649265 12199662 12461667 12206293 12704485 13911284 13028643
5935 13028643 12475850 12702845 12385180 12188268 11558991 11347107 11118947 11186240 11677584 11664587
5925 11664587 13142429 13696621 12944298 13412029 12629881 11937874 11867227 10361317 10353691 9880628
5915 9880628 9511039 9428848 8799961 8847742 8558952 7723201 7552651 8038014 8127395 7927973
5905 7927973 8412355 8830544 8538042 9664334 10174658 10288075 11552456 11238566 11603315
5896 11603315 11722739 11123231 11019377 10652820 10049348 9649476 8530710 8104741 7768386
5887 7768386 7296175 7336815 6445979 6778376 6680525 6733749 6906504 6178710 6500795 5727798
5877 5727798 5684192 5934130 5197283 5426292 5583462 5333821 5505476 5172349 5233976 5357430
5867 5357430 5482727 5946691 6023902 5797483 5493159 4914548 5454242 5076033 5127114 6521173
5857 6521173 6718229 6811873 6885224 6798135 6892322 6448521 5505038 5900711 5604170 5825827
5847 5825827 5952186 5570176 5193874 5370024 5839922 5967398 5604052 5527467 5173885 6188821
5837 6188821 6287601 5851962 5945395 5565197 5820254 6084563 6021731 6189776 6429641 6872827
5827 6872827 7023513 6668239 6377812 6576463 6280049 6271407 6309036 6415517 6591145 6280326
5817 6280326 6917295 6010027 6022660 5675857 5172229 5342518 5244877 5528981 5726433 5875231
5807 5875231 6583713 6539364 6132533 6051152 5356099 4892305 4818664 4923363 5333301 5082935
5797 5082935 5441486 5006403 4973995 5428031 4773831 4484282 4761129 4971878 5535385 5371850
5787 5371850 5442783 5479775 5025206 5781894 5259570 5822209 6502801 6068097 6431908 6273443
5777 6273443 5844004 5959496 5390746 6205911 5934513 5493514 6174689 5536482 5986264 5927493
5767 5927493 5384323 6184241 5825741 5955558 5900807 5747333 6568988 6072701 6282599 6746002
5757 6746002 6610958 6994192 6632621 6829874 6864922 5824979 6683122 6447666 5897321 6448919
5747 6448919 6207251 6536725 5965017 5898485 6281200 5816235 6243155 5964359 5904249 6337574
5737 6337574 5259825 5720274 6296350 6376521 6675342 6135562 6340346 6199094 6286874 6455307
5727 6455307 5924006 6713042 6530920 6221910 7105358 6841948 6920130 6764637 5849137 5525913
5717 5525913 5821872 7064191 7739942 6579687 6831677 7027113 6890907 6743752 6360359
5708 6360359 7544273 7345842 7070450 7723232 7077868 7245863 6976174 6528713 6448668 5974962
5698 5974962 6743964 6924538 6522281 6754420 6445406 6936199 7547985 7098705 7470098 6920296
5688 6920296 6727581 6666465 6269043 6786696 6226301 6053891 6407064 5753514 6279296 6263459
5678 6263459 5983120 6238983 5466804 6612935 6290699 5838977 6517550 6265575 6140077
5669 6140077 6312606 6214458 6365169 5693757 5903389 5683718 5673060 6799278 6351429 6315223
5659 6315223 6196439 5495998 5878575 5272464 5344962 5645661 5657456 6006250 5367186 6092616
5649 6092616 6140090 5613370 6214462 5963686 6044532 6521023 6009140 6392530 6086047 5885294
5639 5885294 6739500 6830747 6323031 5696311 5510400 6290626 5699064 5569837 5685913 5557604
5629 5557604 6188741 5657952 6050744 6295412 5626078 6146021 6325028 6234870 6446515 5961737
5619 5961737 6066089 6635932 6264990 6483744 6406846 6284584 6662732 6138093 5854076 5622840
5609 5622840 6006971 6375784 6276144 7208599 7005731 6733298 6025175 5867816 6235805 6024867
5599 6024867 5567040 5967177 6243731 7015880 7460148 7333249 7363743 6968423 7665170 8056112
5589 8056112 7660538 7657152 7425701 7629980 8426128 8346209 7817394 7504932 7524805 7274672
5579 7274672 7006343 7318641 6956886 6659774 7176296 7214525 6973161 7205046 7244004 7770553
5569 7770553 6910030 7070703 8044641 7946024 8494143 8112161 8708677 8879828 8776345 9194953
5559 9194953 9397135 9747834 10680334 9970194 9791520 10166256 9986371 9949281 9353865 9501920
5549 9501920 9269166 8023595 7701158 7722177 8372708 8241642 7955500 8224792 7709781 7922183
5539 7922183 8624588 8383233 8889477 9582515 9385081 10236774 10235449 10485067 10816468 11097336
5529 11097336 12767397 13626314 13703273 15320766 15729319 16248943 16565354 16829580 16380588
5520 16380588 15426656 15723654 15226602 15006844 15000453 15071698 15917681 17720715 19501190 21669456
5510 21669456 23393075 25182471 26815299 27448733 27340573 26328785 24621744 23298062
5502 23298062 21725285 20129342 18899010 18686016 19047894 18899572 19832225 21030236 21406894
5493 21406894 22204018 22678906 23231884 23600106 22293024 21689435 21301931 20400505 19630591
5484 19630591 17531141 16904800 15940924 14977860 14645966 14247577 14018308 13468923 13532685
5475 13532685 13608456 13035520 13838466 13852333 13267529 13361519 13189437 13675371 13835607 13549474
5465 13549474 14218118 14984028 15674918 16216460 16816515 18413866 18617032 19122475 19589136
5456 19589136 18935639 18960354 18396605 18017225 17816773 17169026 16622720 15517060 15118327
5447 15118327 15240744 14386890 14582149 14599225 13995522 14067938 13749095 14017665 14238686 13509352
5437 13509352 13757031 13366219 13873959 14517726 14001797 14472501 14740126 16043021 16810225
5428 16810225 17554990 18440703 18722154 18568773 18732730 18589975 18761897 17678545 17156332
5419 17156332 17499838 16932210 16826026 16430301 16232001 17370818 16835347 16432049 16290272
5410 16290272 16148391 16257066 15521489 15307135 14602602 14248890 14366963 13371825 13680944
5401 13680944 13720040 13134668 14189570 14045415 14582461 15692560 16275330 17258473 17017500
5392 17017500 16907621 17314963 16882515 16659084 15872756 15406974 16496058 16274840 16314438
5383 16314438 16352060 16644183 16907535 16672440 17540548 17757516 16138478 15953637 15770770
5374 15770770 15862182 16027441 15541823 15815628 15185907 15341899 15751308 14670619 15273999
5365 15273999 15169553 15084149 15560780 14806953 14487194 14382813 14310243 13966753 13896327 14779605
5355 14779605 15142787 14236097 14704131 14274582 13798536 14160892 14290945 14042358 13233038
5346 13233038 12874401 13296997 12602993 12735720 12236471 12156040 12647289 12810566 13087602 13172903
5336 13172903 12865101 13070774 13142694 13495553 13978725 13685506 13830213 14205913 14876091 15957208
5326 15957208 16648705 17162706 17885179 18691544 18710235 17892527 17634640 17079341 16608356 16136645
5316 16136645 15717089 15325837 15021359 14801794 14546533 13576206 13427351 13337058 12818478 13075429
5306 13075429 12927091 13375821 13805739 13937165 14387895 14413823 13595168 13805576 13448489 14018294
5296 14018294 15175842 15508781 15990868 16342868 16034816 16075389 16113819 15927320 15690939 15114050
5286 15114050 14622486 13811506 13427663 13455099 13053274 13335637 12905778 12509353 13063610 13167293
5276 13167293 13525674 13608438 13516394 14027453 14174000 13548661 13317992 13475684 13394075 13226626
5266 13226626 13147981 13506871 13132848 13101704 13692397 14076576 13936154 13801099 14366982 14049786
5256 14049786 14033898 14010496 14031345 14308645 13897755 13707036 14108758 12513423 12108288 12179242
5246 12179242 11202434 10811939 10328380 10091949 11296031 11326202 10968043 10789957 11013682
5237 11013682 11061526 10737973 11017407 10212334 10261543 10729693 10605957 10478722 11339206 11964767
5227 11964767 11910743 12522180 12411764 13597454 13839702 14054952 14768529 15191304 16105288
5218 16105288 15839970 14789093 14712729 13920826 13003239 13018322 12593433 12485120 12252801 12137575
5208 12137575 11712456 11110942 11025990 11335355 11348855 11265371 11316504 11139649 10813691 10946245
5198 10946245 11235739 10606804 10760268 10911932 10759009 11426157 11611903 11691171 12360581 12669606
5188 12669606 13228145 13725957 13764631 13983652 13645263 13386597 13857454 14425721 15117215 14699384
5178 14699384 15194550 15409771 15431413 15381738 14739280 14578571 14455658 13641544 13728128 13654924
5168 13654924 12390704 12932481 12345196 11943184 12240002 11523278 11291998 11226646 10780879
5159 10780879 11562035 11034562 10898183 10567910 10749774 11300199 10995353 10951136 10722648 9848078
5149 9848078 9747121 9800479 9997024 10218307 10348804 10463493 10367402 10721352 11148642 11371558
5139 11371558 12065068 11924771 11312917 12173942 11789390 12034241 12419985 12428958 12917625 12456892
5129 12456892 12718048 12579496 12154937 12905650 12781562 12526307 12184743 11235335 12191433
5120 12191433 12065356 11574746 11776554 11579983 12146780 12003015 11158278 11490301 10526002
5111 10526002 10581178 11250300 10877182 10995507 10696024 10481452 10618674 10137584 10417533 10889760
5101 10889760 11087707 11324445 9976335 10005093 10656311 10538615 10942841 10951572 11744249 11684457
5091 11684457 10651340 10766743 10832087 11039520 11066575 10979885 11738103 11312116 11085563 11218264
5081 11218264 11352377 12742549 12687232 12433685 12003999 11919132 13325188 13852848 13451237
5072 13451237 14384651 14648292 15305085 15986094 15856327 16569974 16783744 16559070 18395068
5063 18395068 18798471 19389396 19355841 18581933 17924659 16491080 16684446 16625432 15823139 16210003
5053 16210003 15381916 15476757 15895278 15589530 16078666 15854908 15522881 15916178 15032636 15595073
5043 15595073 15841025 15641943 16376174 15997066 17080579 17745235 17071546 18201670 19386691
5034 19386691 21024564 21785132 22360037 24484035 25025215 25459504 24918403 23480013 22471702
5025 22471702 21444612 20862717 20301916 18659022 19357629 19794113 19107663 19775399 18520525
5016 18520525 18920315 19250507 18370535 18542191 17783889 18279787 17753858 17127587 18078206
5007 18078206 17926686 18044015 18912679 19549375 21978133 22554510 22902426 24647401 25628665
4998 25628665 26944350 27285304 25445875 25725929 24438138 23609983 23198649 21883382 21931902
4989 21931902 21483885 21366522 21579342 20920406 21443116 21837276 21843166 21771648 21358822 21600811
4979 21600811 20342072 20271285 19946667 19073601 18985311 18588268 18124479 18785214 19200331 19490601
4969 19490601 19421089 19243022 20467689 20983112 20846906 20777422 20462259 20368976 20134833 19651635
4959 19651635 19476299 19021657 19263820 18784049 19489462 20409587 20365436 21163958 22021014 21848301
4949 21848301 22285998 22433968 21925706 21850333 21661798 20980705 20299442 19605884 18929674 18803768
4939 18803768 18179076 18267853 17944001 17952950 17803919 17118668 17233150 17381565 17044667 16930053
4929 16930053 16871245 17258519 17686204 17466516 17375960 17062714 17354278 17858249 17303612 17777291
4919 17777291 18480860 18346055 18112013 18508197 18776558 18930051 19036669 18838440 18145408
4910 18145408 18786801 18241967 18339759 19264032 19145158 19188272 19554373 20058859 20600685 20804929
4900 20804929 20788984 21686397 22477597 23153722 24016590 24215679 24696698 24761623 25403768 25340595
4890 25340595 24177262 24054114 23664494 23587709 23086548 22039558 21173480 20898989 20665495
4881 20665495 20553457 20461642 20852460 20462891 20598443 20672557 20838734 20908754 20875015 21402593
4871 21402593 21784863 22029115 22403580 22859018 22757630 23603827 24790821 25378056 25411439
4862 25411439 26367438 27141565 27439070 28012088 27281115 26450382 26785655 26628564 26619786 26027901
4852 26027901 25851731 25546452 25203554 25069380 24899395 24766063 24930587 24750198 25251080
4843 25251080 25383289 25187528 25270675 25389541 26107283 26834002 26962623 26711031 27552882 28127276
4833 28127276 28925112 29082752 29946312 30108875 30107657 30821743 30806598 30448874 30495771 30468176
4823 30468176 30011891 30079633 30021905 29244514 28925573 28549313 28701299 28085482 28007970 28353614
4813 28353614 28039940 28124449 28303577 28606926 28116225 28753181 28698328 29197717 30395873 30411589
4803 30411589 30502390 31028886 31432387 31778047 32242678 32526820 33090957 33705569 34349784 34372337
4793 34372337 34626362 34840223 35118335 35207775 35850636 36078784 36048877 36316512 36988415 37063447
4783 37063447 36996297 37506017 37636949 37050180 37121242 37539987 37712710 38170692 37496083 37424303
4773 37424303 37663623 38515760 39402560 39351856 39853566 40936846 42037927 42983355 44212421
4764 44212421 45566791 46934653 47866132 48501228 49176679 50209467 50380306 50792778 51220239
4755 51220239 51753881 52036100 51115275 50757931 51514640 51324380 51702237 51517971 51412112
4746 51412112 51926552 51249311 51646755 51503654 51153454 51453346 51132341 51115090 51075616 51317335
4736 51317335 51942199 52465683 52806068 52692889 52711401 52890989 53128346 53032190 53418994 53456451
4726 53456451 53621633 53988183 54159801 53802999 54008486 53761657 53167353 53227998 53259041 52199601
4716 52199601 51994500 51489116 50539586 49730097 49088461 49074442 48569559 47470949 46594987
4707 46594987 46067417 45600142 45659013 45136358 44535272 44160663 43434635 43564109 42996074 42929954
4697 42929954 42272596 41301358 41442078 41112674 40369692 40028911 39338694 38996665 37865489
4688 37865489 36431131 36787827 35924433 35823459 35516998 34850635 33940564 33316942 33170766
4679 33170766 32847580 33155970 32602701 32102689 31173894 30907215 30647648 30295077 29381703
4670 29381703 28866641 27864768 26613165 26991538 26477973 26210366 26561411 25715495 25240577
4661 25240577 24857575 23950485 23586527 22499595 22136478 21801204 20971233 21004022 20331198
4652 20331198 19848222 20192709 20358371 20080988 18771896 18691594 18849068 18272148 18158469
4643 18158469 17939389 17576023 17042749 15929595 16078681 15776052 15195186 15197398 14929282 14802893
4633 14802893 14541371 13988323 13870124 13313964 13353699 13788334 13172265 12762654 12632949 12230739
4623 12230739 12349929 12577693 12086135 11923039 12135972 12350929 12057791 11600088 11522682 11623796
4613 11623796 11225859 10635557 10740353 11288853 10955918 10954671 10700574 10664494 10620758 10355621
4603 10355621 9550453 9546891 9966279 10174514 10150770 10407294 9471619 8574277 9120101 8239688
4593 8239688 8609889 8643160 8755585 8741628 8644548 8904877 9458490 8951287 9059698 8773259
4583 8773259 8092087 8901542 8620820 8525896 8990541 8840420 8875366 8246460 8346340 8636607
4573 8636607 8349204 8115854 8349185 8615298 8604958 8310866 8661671 8397067 7938776 8343047
4563 8343047 7977997 8060183 7972177 7933937 8504291 7951442 7477584 7562261 7597909 7575702 6996326
4552 6996326 7356689 7244796 6897650 7393793 7163550 7634504 7880258 7077432 7261987 6848345
4542 6848345 7438712 8137983 7234294 7989566 7733285 6833191 7174365 6666528 6483437 7157550
4532 7157550 6726400 7083380 6595329 7245283 7721976 6285748 7063579 6906411 6882506 6648737
4522 6648737 6280203 6573558 6541203 6669576 6951057 6801588 6725787 6178582 6667083 6694879
4512 6694879 6429146 6425185 6267707 6495752 6752613 6099793 6532914 6238215 5688575 6263502
4502 6263502 6455729 7156500 7281366 6215511 6840329 6999643 6481181 6703808 5808290
4493 5808290 6565163 6436850 6811787 7479175 6660946 6977843 6550545 6035106 6646863 6768581
4483 6768581 7008107 6947562 6405883 7060119 6715651 6661793 6816594 6599275 7363891 7187120
4473 7187120 6619308 6548443 6210806 6906434 6973866 7171988 7175925 6317904 7113564 7119690 6892505
4462 6892505 6833258 6568655 7415888 6543458 6980867 7803882 6782983 7252646 7057356 6350624
4452 6350624 7055192 7278744 7077658 7743421 6961292 6748248 6601488 6681102 6972687 6798694
4442 6798694 7201943 7628340 8144152 7916270 7255763 7163082 7228238 7130808 7516902 7343966
4432 7343966 7407451 7487208 7446898 7695422 7681135 7748555 6930531 7773135 8151474 7963015
4422 7963015 8333878 8231781 8228423 8362159 8046725 8003025 6888753 7163341 7805840 7485678
4412 7485678 7876688 7859012 7458842 7920115 7986036 7996244 8160594 7933439 8065561 8263628
4402 8263628 8580927 9279811 9041872 8520889 8787630 8016218 7991926 8050380 8556267 8688638
4392 8688638 9066686 10131252 10070061 11046939 11424424 11081219 10854846 10845705 10702211 10162866
4382 10162866 10772882 10340792 10469191 10418755 9972240 9868003 9591033 9612323 10592253 10519678
4372 10519678 10294178 10180601 9655205 9915606 10176833 10250825 10759756 10163358 10553015 10358020
4362 10358020 10534076 11396096 10661411 10632954 10905865 10808089 11017079 11126170 11158565 11019587
4352 11019587 11517982 12023976 11444895 11738351 12057481 11925187 11928061 12010515 12461606 13103726
4342 13103726 12446365 12889332 13552634 14252008 13512873 13436199 14323586 14478649 14970194 14302056
4332 14302056 14192896 14726883 15141552 15965626 16096592 16201368 16557683 16926197 16983246 18090714
4322 18090714 18222020 18962147 19289137 19314151 19744931 20949638 21240048 21567435 22142175
4313 22142175 22625109 23271976 23582530 24121897 24913167 26273678 27165913 27900544 27994904
4304 27994904 28639683 28910905 29997807 31772905 32008816 32322671 33361808 34175248 35171822
4295 35171822 35834989 37266789 37879251 38075132 39256787 40095125 40766751 42117855 42261988
4286 42261988 42758212 43192800 44010561 44183963 44451856 45497561 46269122 46297069 46091185
4277 46091185 46473756 47443753 47469305 47889492 47507582 47343048 47937800 47413029 47329004 47589945
4267 47589945 47537551 48136481 47928884 47935687 48307756 47162643 47346021 46970637 46492000 47266377
4257 47266377 46486812 46236413 45905586 45972593 46316772 45979778 46132431 45856083 45415256 45378115
4247 45378115 44817331 44985315 45695877 44760068 45013772 45149338 44537871 44376964 44540601
4238 44540601 44494353 43934622 43996634 44721414 44627787 44439034 44045251 44496865 44661100 44255297
4228 44255297 44621634 44498275 45049399 45441431 44547705 44864154 45374688 45757195 45713296 44628448
4218 44628448 44484763 44829150 45055422 45645923 45810864 45880439 45938600 45877878 46154005 46091968
4208 46091968 46406653 47013582 46696195 47905361 48061672 48525142 49020614 48732784 49289390
4199 49289390 50176199 49319678 49492591 49327764 49606735 50221431 50276082 50581612 51299037 51716107
4189 51716107 51772201 52429776 52727152 52822103 52946587 53336189 52743282 53585736 53337926 53473563
4179 53473563 54426149 54439403 54723252 54400413 54242640 55052109 55018922 55056363 55197124 54764430
4169 54764430 55301250 54816602 54558282 55198550 54685593 55836147 55615834 55695543 56178180
4160 56178180 55938048 56472720 56283310 55660115 56329794 56340693 55883889 56238345 55296586 55233932
4150 55233932 56043955 55997550 56028088 55537087 55642976 55400165 54819492 54718713 54652513 54918685
4140 54918685 54846463 54677330 54742251 54161101 53798306 53418373 53307300 52421424 51478781 51325518
4130 51325518 50927025 50508303 50564064 49950439 49847976 49184470 48081233 48360917 47967007
4121 47967007 47783898 47280241 46820084 47399471 46336317 46120692 47030552 46515338 47568190
4112 47568190 47416901 46930502 47670086 47508407 48141143 48719539 49181950 50353667 50703450
4103 50703450 51583785 52069777 53101387 54206723 55032718 55593902 55581808 56837293 57832596
4094 57832596 58475398 59477031 60093797 61385223 62471928 62603833 63719454 64575052 65136522
4085 65136522 65639854 65643467 66975439 67657835 67381597 68111714 67924369 68161192 68063602 67934383
4075 67934383 68112163 68111584 68399737 68206225 68078972 68195377 68005345 67598247 68591131 68148886
4065 68148886 68181590 68274577 68323625 68619903 68633512 69232113 69275458 69071240 69188303 70007717
4055 70007717 71213765 71647465 72868877 73983692 74624289 75747487 77194266 78848651
4047 78848651 79806087 80318836 81599420 82079960 83501677 84591496 85650025 86784947 87299844
4038 87299844 87856081 88465409 89347118 90374183 90958246 91389926 92111227 92265322 92194205
4029 92194205 92792790 92548442 92012157 91645872 90451868 90217182 89660138 88770364 88009194
4020 88009194 87254014 86612545 86635982 85789068 84358348 83856465 83233726 81924993 81562075
4011 81562075 80748231 80670004 80584278 79897868 79345929 79055798 79360786 79336093 78753390 78618286
4001 78618286 78963998 79189779 78816491 78481360 78579398 78164389 78426626 78288481 78126800 78836365
3991 78836365 78430199 79448779 79043993 78635874 78943547 78933639 78860332 78802844 78729323 78479720
3981 78479720 78303842 78290555 77787118 77191313 76787453 76783403 76520069 76355542 75515504 75174960
3971 75174960 73585292 73024140 72745984 70509066 70600020 69443497 68212718 68187439 66699045
3962 66699045 66388368 66215861 65164679 64618896 63017099 63029517 61931960 61870224 62305262
3953 62305262 60607387 59930611 59294127 58913073 58947050 58197024 57811005 56721428 56035660
3944 56035660 56296664 56193839 56389509 56383943 55791409 55131135 54425889 55091780 55087434 53983932
3934 53983932 54390805 54315486 54559942 55108895 55060666 56431214 56384862 55686010 54542080 53098993
3924 53098993 51920759 49918006 48953429 48011163 46944287 45683350 44246277 43640993 43529003
3915 43529003 43245925 43474498 43313778 42669714 42987998 42913133 43340565 43919698 44256669 45299643
3905 45299643 45909068 46380529 46864465 47519037 48695638 49317797 50530667 50564401 51403396
3896 51403396 51368316 50536154 51117988 51283589 51969323 52645936 52986542 54678970 56225652
3887 56225652 57905554 59841837 61176838 63674453 65926007 68123575 70576236 72750755
3879 72750755 75537372 78849999 81387547 83018181 85081616 87556764 89144883 90204767
3871 90204767 90950203 91940193 93599190 94526019 94920769 96334047 97723330 98517362 98154815
3862 98154815 98189839 98794267 98566829 98882479 98331554 97998217 97901714 96794110 97250965 96979075
3852 96979075 96953388 97759180 97649813 98357557 99252263 99667443 101258264 102180775 103352784
3843 103352784 105051190 105235060 107073379 108725323 109320542 110683830 112186933 113455890
3835 113455890 113978751 114885373 115695640 117044236 118627166 119033295 119490747 119944140 119743292
3826 119743292 119751887 119822890 119445735 118533993 116737185 116158304 114538546 112830959 111961420
3817 111961420 110719081 109489825 108078001 107062030 106054499 104246260 103728760 102297609
3809 102297609 100043209 99412047 97868619 96145547 94447465 92740750 92137511 91313878
3801 91313878 89878572 88776855 87320274 86169470 85692299 85303703 84746780 84437609 84897219
3792 84897219 85419834 84861037 84946069 84480681 85121610 85340289 85649902 86273913 86551358 87390791
3782 87390791 87537905 87950840 88146341 88675711 90084150 90623894 90180911 90863356 91356695
3773 91356695 91374106 91586770 91396705 91929766 91467284 91623294 91707268 91171301 90411940 89466283
3763 89466283 88895498 88903850 87419763 86235015 86357764 84303934 83813068 82646510 81739400
3754 81739400 81218433 79814759 78917906 77923725 76680517 75404045 74235707 72946913 71736335
3745 71736335 70541930 68500140 67449150 66884131 65922140 65344140 64439671 62860370 61901979
3736 61901979 60955786 59844200 59227700 58504994 57459490 56018456 55412902 54040158 53137672
3727 53137672 52430293 51267909 50274026 49414612 48169082 47565424 47299701 46070917 45839977
3718 45839977 45380170 44556411 44517608 43460770 43026032 42592656 41183709 41068930 40720397
3709 40720397 40449207 40504004 40078511 39876231 39378953 38778742 39136330 39020907 38604487 38582484
3699 38582484 38285891 38323795 37921753 37374552 37510354 37064307 36719285 36470411 36642650 36758209
3689 36758209 36438153 36522362 36358250 35776544 35139999 34626391 33730398 33670741 33763367 33262129
3679 33262129 33236621 33571185 34058143 34040501 34427850 34732767 35193744 35529049 35364481 35488233
3669 35488233 35523688 35425987 35506982 34405235 33291246 32520895 31876329 31766586 31087701 30958832
3659 30958832 31295952 30657935 31287729 30624765 30105968 30438010 29196378 28818158 27863187
3650 27863187 26290923 26259569 25397482 24796730 24692036 23733096 24151830 22857740 22102102
3641 22102102 22170817 21552063 21357540 21455231 21446120 21889369 21284389 21429788 21634361 20501773
3631 20501773 20220365 20357544 20666319 21328528 21357875 21638466 22085048 23270014 23471140
3622 23471140 23312383 24859591 24882474 25536885 26156123 26598176 28024979 28045916 29089397
3613 29089397 31190635 32179231 33747433 33893322 35261700 37166163 37632580 38445782 39864171
3604 39864171 41133884 42893109 43329503 44041302 44299459 44210671 45225998 45380587 45751715
3595 45751715 46023797 44582348 44351895 44173583 43091367 42694802 42187621 40928357 39723612
3586 39723612 38669188 37623020 36254641 34948883 33652402 32447819 31264913 29568801
3578 29568801 29302787 27910899 27303460 26940974 25485080 25373004 24302896 22718376 22799757
3569 22799757 21425793 20706988 19982999 19040016 18714326 17926621 17601481 17820521 17520256
3560 17520256 17386867 16932519 17237585 16843557 16023182 16517732 16799719 17464064 17612761
3551 17612761 17090027 17838009 18744249 18812678 18870768 19525094 19886134 20201046 20147413 20275465
3541 20275465 20289732 20082696 20131662 20401123 19915921 19358381 19403120 18825496 18477768 18446867
3531 18446867 18901442 19884789 19501658 19230522 19325167 19470458 19521228 18519932 19067749 19093586
3521 19093586 19003150 18913483 18391042 18899541 19478876 20221884 20994680 21245334 22180681 22979477
3511 22979477 23875469 24848046 25115375 24652489 23713811 23338707 23111758 22424333 22859118
3502 22859118 23433651 22655864 23135145 23658522 24300993 25007270 25009631 24863150 24654237 24516078
3492 24516078 24993188 25172604 26069720 26489238 25959161 27631036 28557643 29450102 30991360
3483 30991360 31668347 33264808 35227736 38640925 41299106 43605511 47210668 50054411
3475 50054411 52721611 55007618 56641752 59616431 62703673 64691277 66865541 69017532
3467 69017532 70150804 69371762 68330263 66450939 63831235 60671049 56806264 52998339
3459 52998339 49907090 47352617 45717936 43686749 42790596 42685912 42925341 43819631 45281024
3450 45281024 46552855 49541702 51530900 55137577 59014321 62116827 65615505 67623727
3442 67623727 69350036 71396069 72394940 73718609 75946644 77990164 79784005 80430223
3434 80430223 80876061 78967261 75740040 72179631 67448130 61873856 56607457 51848462
3426 51848462 48597245 45981841 44296279 43431910 42919766 42462576 43231306 45211098 47705768
3417 47705768 51474269 54890756 57690565 61174639 61821978 61812503 61888248 60757290 59272938
3408 59272938 56989368 54841773 53591849 52756554 52630867 52528557 51896521 50947618 49218171
3399 49218171 47182231 44598239 41508430 37912304 36085555 33736638 32259917 31630074
3391 31630074 30952616 30976007 30764221 31413211 32891932 34461839 37363211 40231299 42344590
3382 42344590 45266402 46232301 46167534 44862626 42357078 40000605 36408415 32362553 29360042
3373 29360042 26791456 25198954 23535810 22361355 21346719 20397910 20103087 18994137
3365 18994137 18545472 18920782 18829109 18421771 18316973 18419000 18602743 18420232 18530283 18600229
3355 18600229 18335945 19169359 18881854 19652463 21437540 22542692 23585872 22770571 22984585
3346 22984585 22471229 21126872 20705875 19212320 17861462 17247504 16222428 15282637 14933962
3337 14933962 14887945 15114179 14095821 13977960 13182021 12838197 13764135 13377842 13272747
3328 13272747 12922361 12418615 13213310 12950546 12866219 12679207 12249706 12367548 12576772 12552549
3318 12552549 12859239 12918059 13346308 12803201 12945319 13910391 13786405 14477035 14869833 15646316
3308 15646316 16979299 18317217 19343134 20677517 22081277 25164800 26920790 28850792
3300 28850792 30618094 31039648 31468864 30624789 29930936 28815559 26821339 25411127 22799251
3291 22799251 21377861 20480291 18839778 19013389 18643797 17887343 17768768 17558904 18091409
3282 18091409 18428379 17924886 19151778 19088857 20381066 22213402 23059038 24841936 26752800
3273 26752800 30053349 33671510 36662034 41171452 45181919 49241941 52296788 52158884
3265 52158884 52050651 50287238 46856870 42727003 38379934 34989034 31773930 28584470
3257 28584470 26087675 23514640 22099324 20828685 19244305 17765489 17112717 17457310
3249 17457310 17451234 17160094 17494194 17499397 17072783 18251415 18640182 19431271 20764174 21409221
3239 21409221 23002110 24282873 26095604 27945479 28834994 29411672 29267362 28383493 27879526
3230 27879526 26537614 24890732 22824752 21046699 19826113 18378969 16719259 16299806
3222 16299806 15765978 15054296 14150932 13824753 13010118 12095372 11965129 11927322 11476269 11241037
3212 11241037 10740537 10487708 10345216 9909447 10456915 10345898 10584727 10668078 10664853 10178202
3202 10178202 9353561 9337120 9607771 9576428 10227212 10456034 10854176 11231981 11038307 11997361
3192 11997361 11827942 11810489 12604726 12408875 12752792 13296943 12915627 12565603 11808717 11464533
3182 11464533 11403139 10317539 10329712 9535248 8785571 8398623 8913963 9384311 9009105 8635019
3172 8635019 8487378 7983708 7823198 8880564 8341239 8985845 9520930 8805960 8638132
3163 8638132 8304226 8375185 8163394 8952917 9673355 9167737 9183871 10257055 10004390 9827036
3153 9827036 9770262 9470799 9714052 9879060 9554347 8865425 8823265 8926876 8476581 8502102
3143 8502102 8345016 8176062 8053984 7357932 7630783 7350930 6734600 7220473 7119070 7502329
3133 7502329 8195777 7639717 7914721 7448021 7226758 7994331 7466204 8151437 7687294 6969202
3123 6969202 7488622 6571514 6261292 6754912 6249122 6443374 6562902 6582608 7156862 6464786
3113 6464786 6509888 6136265 6192154 6535855 5843664 5679590 5995951 5719182 6341992 6220439
3103 6220439 5991022 6102991 5716577 6569857 6264254 6478181 6929353 7104988 6350488 5396876
3093 5396876 5747617 5629772 4555216 4652126 3919761 4320222 5240207 4295980 3928464 3803220
3083 3803220 4477597 4826484 3868738 4187280 4609155 4168443 4556406 4563725 4448916 3882712
3073 3882712 3681865 3493893 3207496 3997028 4451842 4043758 4595544 4116280 3787328 3838462
3063 3838462 3341194 3471896 3964046 3860121 3391059 2713553 2384785 2694434 2887691 2256746
3053 2256746 2334234 2418158 2773849 3160644 2496166 2391524 2747907 2810042 3032094 2741710
3043 2741710 2645139 2942111 2953364 3434035 2777604 2349943 2378312 2208064 2673813 2721097
3033 2721097 2536501 2221129 1447653 2436702 2673287 2327809 2544990 2524594 2558704 1680423
3023 1680423 983628 995460 874061 1701452 1251958 661823 1363482 837861 1266729 931760
3013 931760 740288 1314120 986855 1522302 1708348 1118802 1232797 1061307 1038512 1235245
3003 1235245 1121385 1463264 694158 829184 1191188 577745 860095 896639 948768 1440547
2993 1440547 661403 860426 1140557 338851 1423512 583826 704146 786482 601151 1490848
2983 1490848 662953 453658 504655 594619 829327 66233 346338 651173 407466 1095188
2973 1095188 430376 1042888 931435 561390 736188 -339897 172511 685051 -160368
2964 -160368 632774 844533 581478 870122 307664 617987 -88992 320350 682915 11942
2954 11942 963486 997721 690624 367098 298475 1423301 932714 847932 1248920 494080
2944 494080 834925 519488 439480 -14752 -92160 697413 561762 230051 210144 -964264
2934 -964264 -211923 849932 680065 908660 386332 319120 99221 120798 976751 139239
2924 139239 879802 1254108 14762 336587 -91822 592021 617244 -141649 459525 -13130
2914 -13130 652664 681252 -205104 528085 547387 850610 356340 -169712 792117 850579
2904 850579 314758 711291 46228 52040 -218616 -47792 -191878 -487651 426392 -237672
2894 -237672 -509944 483587 -383512 372110 233322 365737 1120464 66188 914585 1124811
2884 1124811 347417 1169263 466671 739495 1145484 1048921 1254897 767242 1036218 857244
2874 857244 376473 1670265 1021372 321321 856901 49797 1032090 1310105 1917864 1477752
2864 1477752 667683 1406964 983892 767575 1470606 1180909 1481784 1454245 873356 1053804
2854 1053804 828602 1279501 1460349 1181814 2055063 2212598 2638885 1990640 2168159 2331732
2844 2331732 2242640 2414012 1858730 1972824 2384274 2154260 2201585 1331821 2160882 2070486
2834 2070486 1490393 2021722 2049123 2069082 2390320 2146705 2610769 2233920 2249418 2817412
2824 2817412 1661693 1798878 1970223 1831529 2199729 2440160 2821412 2631188 2561037 3162692
2814 3162692 2599665 3502923 3298786 2760416 2584433 2384989 2696020 2251755 2166108 2751650
2804 2751650 2309293 2329929 2902240 2291300 2750023 1923923 1026252 1691018 1743705 2151782
2794 2151782 1990775 2301121 3181265 2120354 1804569 2362996 2229399 1909807 1214066
2785 1214066 1379816 1807955 2013527 2233053 2087316 2012727 2199170 2265227 2758790 2158846
2775 2158846 2280179 2486793 2307379 2570620 1950379 2066248 1964211 826380 1092266
2766 1092266 676120 1150734 1683453 1415547 1302900 1029156 1053528 2026990 1185841 803599
2756 803599 1055589 616167 1286926 833995 953158 1160136 1016671 980708 992155 1112857
2746 1112857 913937 736245 1029073 1052343 1317824 1207460 994390 950591 809114 457514
2736 457514 374782 220001 442273 439130 -215500 -296605 332744 532029 349097 238283
2726 238283 114980 37878 -286846 369619 320618 280721 88518 -42124 -132538 54711
2716 54711 322380 295051 -150379 -230354 582285 400172 365578 558614 -212774 -253679 -313594
2705 -313594 -96318 -66634 67188 575631 215452 459248 894590 402088 550574 345697
2695 345697 19409 385071 178292 106402 -462733 -168708 303082 -68969 749354 597261
2685 597261 278550 161530 -201847 401638 498682 45017 320612 558272 306836 758150
2675 758150 540733 260155 156429 338183 702749 419554 491739 7752 -351824 642817
2665 642817 145149 343933 445870 138120 375414 95351 881925 1206064 410636 256200
2655 256200 348533 516763 -377279 -313127 540399 399885 90055 685244 366033 783923
2645 783923 823073 297636 407363 -51918 76589 889068 179984 573887 -104446 -201485
2635 -201485 436935 54852 442683 101775 106610 -65021 -226313 322130 242602 686190
2625 686190 899571 523144 950158 1221099 491685 606273 754407 1190401 1030357 580947
2615 580947 1045853 690126 1029847 1338266 270370 420993 1004553 728324 980253 589527
2605 589527 1381850 1352190 1610718 2009350 1615836 1667872 2044033 1926481 2409536 1977258
2595 1977258 1921870 1780463 1215931 1414404 890991 509528 1067370 261488 830552 673163
2585 673163 210719 679152 484116 588080 10009 295504 538210 143220 652247 666340
2575 666340 288673 1351812 1618326 1011244 637791 386087 975641 440025 498670 751354
2565 751354 295665 1013842 344863 218225 620901 570953 1012014 536793 993423 592691
2555 592691 -75400 398354 368168 384002 419690 58585 430698 448769 174754 294866
2545 294866 23191 67285 274923 353853 780976 385486 243592 366117 -18219 421825
2535 421825 465566 333987 253866 548870 790557 448182 450163 120252 -291878 321612
2525 321612 17461 94803 634168 569989 768793 366256 412227 666934 611876 705940 413966
2514 413966 535569 1077621 1411316 1119752 266084 503157 550887 -128704 865244 855931
2504 855931 1012689 900363 911650 943863 1292730 1447604 992103 920308 511355 416031
2494 416031 651307 607229 447488 565313 360882 794181 878816 1025355 807310 543676
2484 543676 1154597 989204 1407931 1466365 909659 1337323 1470477 1550466 1353521 1446681
2474 1446681 1732385 1787307 996473 1097866 1039304 1513677 1538376 2073694 2597864 2024424
2464 2024424 1575581 1287202 1697449 1602281 1542000 1574563 1627497 1201291 1480622 1130569
2454 1130569 1381673 1576040 1685451 1403428 1450050 1550303 1449034 1911999 2762026 1898964
2444 1898964 1361202 2208957 1924065 1566112 1321253 1379521 1627337 1850730 2211713 2493326
2434 2493326 2850377 2686648 2284657 1984199 1889563 2142854 2473226 1941622 2457464 3186458
2424 3186458 2602882 2801634 3138131 2523709 2527943 3046715 3200494 3099941 2498036 3020759
2414 3020759 3287998 3549360 3213841 2816493 3398769 3589277 3273682 3099876 3449057 3932073
2404 3932073 3617712 3529489 4281910 4848688 4393329 4592675 4909963 4346697 4400564 4652378
2394 4652378 3937312 4621291 4951820 4808785 4980148 5215575 5542671 5004368 5045256 5608818
2384 5608818 5649359 5745845 5827047 5656093 6156047 6301874 6595198 7204747 8061750 8042817
2374 8042817 7303865 7648474 7766390 7581983 8343263 7856601 8543682 9076250 9393246 10080253
2364 10080253 10399048 11182322 11448476 12117058 12849449 12893667 13743951 13939810 15305246
2355 15305246 16639392 17013029 18509245 20145794 21846651 24186217 26665328 30766501
2347 30766501 34210183 37024791 39750455 42340940 47243446 51817050 56497293 64210356
2339 64210356 74888912 90126012 111602669 140773482 180051000 226747358 275996681
2332 275996681 314990276 340464637 341491495 324359799 301742315 269442604 221483729
2325 221483729 172490766 133651022 104724415 86090617 73269728 64927388 57313995
2318 57313995 51874625 47601294 43139357 39890246 36246865 32800689 30844369 28232193
2310 28232193 25823833 24075083 21886360 20236167 18930624 17647949 16889260 15426545
2302 15426545 15099182 14458341 13497205 13535532 12414217 11451823 11118958 10703454 10320167
2293 10320167 9723258 9667028 8947553 8371545 8531762 8913148 9058388 8156248 7259565 7716658
2283 7716658 7132668 6378450 7013287 6465403 6279872 6093871 5348799 5805454 5784246 6251783
2273 6251783 4962608 4789111 4775942 3916270 4203349 4559821 4300203 3822149 3698864 3958052
2263 3958052 4077658 3578603 3819699 3323383 3500479 3338458 2672574 2992363 2484369 2298741
2253 2298741 2455304 2979080 2685079 2920795 2883947 2832143 2309327 2339032 2474485 1817812
2243 1817812 2779581 2585891 1954430 1903046 2204413 2012495 1333755 1629349 1688998 1763520
2233 1763520 2048144 1892125 1494651 1236406 869672 1151665 1026577 1460471 2115753 1301194
2223 1301194 1296089 637540 418503 629384 31753 451373 634358 236078 989402 932230
2213 932230 838246 1044716 733304 1373182 1654359 1213009 670193 631730 741546 97404
2203 97404 -134442 2014 551569 841858 983196 127076 205841 -339186 33273 -53296
2193 -53296 -79085 820240 501193 649137 512960 203091 614346 3228 -197220 177408
2183 177408 147227 567496 518515 568913 193652 342672 652252 644529 255240 -117420 -841992
2172 -841992 -488292 26184 29118 727040 493410 324374 724854 299168 749531 269507
2162 269507 -10010 494158 47015 -271031 395333 219537 516525 453004 -392556 483697
2152 483697 148312 262841 106347 -668489 -14939 -504519 -589372 -143191 -448755 317617
2142 317617 -286319 -422914 -115907 -479176 -163321 94210 288780 592684 266681 256397
2132 256397 166661 -70534 -112016 -707328 -150830 62899 128156 469949 -113588 -583244
2122 -583244 262920 -346997 -597081 -557225 -499190 699025 -147107 121600 -583529 -1153208
2112 -1153208 -269674 -525458 5661 -31874 -740594 -670404 -607714 -230241 -369177 -707427
2102 -707427 -39525 -311201 -1238108 -481860 -566993 -104169 -228990 -928165 115431 -309897
2092 -309897 82660 435078 -203981 185599 -327963 -864461 -567518 -107202 2372 -140187
2082 -140187 -336626 -167876 -533008 66575 -367496 -253535 412774 -234371 354676 -106290
2072 -106290 349088 810177 149298 68284 -250545 -383433 305472 -185527 478237 676366
2062 676366 484327 846498 426010 1073004 816342 -466224 -74459 -315138 -95891 387549
2052 387549 -72294 604028 314859 -547203 309440 -126598 253917 350891 68658 97382
2042 97382 -689763 -993107 -1241162 -825888 104191 -180308 -528958 526169 -168208 -307862
2032 -307862 -834706 -808770 295233 -96475 178622 -80649 -281227 -181062 -656069 -534143
2022 -534143 -181042 -216502 469546 282925 -308105 -641828 -795241 -175980 -657605 -810672
2012 -810672 -568832 -929390 -517697 -774224 -404378 -237059 -663078 -549302 -882187 -776119
2002 -776119 -280141 -656242 -628805 -76180 -674077 -531566 186074 220743 161353 -237681
1992 -237681 -430039 -555311 -290330 -356217 -756920 -153885 -70874 -329587 -525320 -566065
1982 -566065 -589468 -603856 -605010 53697 -281362 278243 -15288 -163192 -106855 -406731 -672615
1971 -672615 -790527 -1191411 -515843 -553873 -524584 -179369 -231665 -456859 -481315 92719
1961 92719 209331 -667425 -1309553 -1125942 -673924 -673111 -501854 130947 -41604 -376069
1951 -376069 -357403 -38290 -477490 118515 -137265 186736 -265357 -665103 -506649 -660141
1941 -660141 -949479 -572325 -784484 -354590 -452307 -545633 130394 -86838 102288 -108012
1931 -108012 -581188 -679743 -940546 -327445 -278769 -1003784 -674179 -506437 -143804 225501
1921 225501 -462128 -547802 -816745 -323407 -658954 -847441 -84250 -329417 140503 -116978
1911 -116978 -554560 -655448 -116617 -28293 110348 -556865 -823078 -555919 -1092111 -401717
1901 -401717 -1073383 -1137294 -609907 -1092993 -1227448 -1115774 -70381 -1000727 -1652025 -1066042
1891 -1066042 -785665 -206082 250227 -400860 -253181 -294055 -693847 -572507 -695868 252370
1881 252370 -150202 -859607 332292 146616 -518039 -204694 -579388 -552465 -392648 -521595
1871 -521595 -431150 -1082445 -906327 -778579 -1038075 -1142332 -1273969 -939139 -733191 -532677
1861 -532677 226738 -665546 -267745 121539 -725956 -521587 -580583 -540632 -796479 -728726
1851 -728726 -451495 -725296 -551056 -165792 -723961 376927 -328512 -384511 351178 -584568
1841 -584568 214567 -71711 -363677 562605 -354588 -65786 -200724 -446560 -342228 -703304
1831 -703304 -540954 -457874 -854619 -322060 -450134 -545686 -359572 -336189 547050 -46106
1821 -46106 174610 -128093 138055 657165 -261649 -521923 -912843 -896952 -382424 -676061
1811 -676061 -457024 -214366 -736732 -93751 -417582 -247302 35508 -754358 285939 -322411
1801 -322411 -523037 -471169 -819051 75373 -349057 -803751 -587032 -1173276 -843806 -483843
1791 -483843 -50999 -54529 -165368 39756 -371724 -738833 -203673 -543407 -772898 -674570
1781 -674570 -753225 -601968 -1116629 -919590 -694390 -651464 -944820 -617736 -165890 -60689
1771 -60689 -141172 -296864 -862584 -79508 -208737 -1102414 -828241 -583401 -43606 -437765
1761 -437765 -240482 364840 81984 451790 232083 15401 -150630 -735582 -316948 -582410
1751 -582410 -1076394 -868115 -1109058 -590579 -651153 -1198500 -165615 -842684 -1173598 -675485
1741 -675485 -448536 120703 19295 -236833 -447108 -348086 -8487 1974 -703944 -273441
1731 -273441 -305710 -769717 -461653 251761 275486 218617 23177 -799462 -750774 -635462
1721 -635462 -736757 -297176 -111986 -423173 -288037 -59093 212310 63467 -557421 -1036863
1711 -1036863 -599852 -378895 -740006 -637220 -293280 347609 370892 -433825 208387 38090
1701 38090 -325303 430022 -212929 -230131 355044 194535 75900 -404845 -611872 -454611
1691 -454611 -338723 -723355 -846198 -608153 -800460 -1064230 -812744 -1333405 -1026670 -488047
1681 -488047 -723747 -837398 -737158 -740248 -1586480 -1762059 -765218 -513805 -629931 -697618
1671 -697618 -860698 -1142889 -913900 -422612 -210269 -675788 -497571 -897721 -853035 -486799
1661 -486799 -328174 -17615 -170055 -657831 -306467 -862590 -469070 -202711 -855414 -171216
1651 -171216 -832992 -231497 265309 -19825 383881 -83822 -200728 167754 -574166 158681
1641 158681 76491 -431712 -874569 -921255 -554810 -693946 -740606 -347579 -503118 14986
1631 14986 -617172 -605424 -292195 -440303 -288777 -386403 -308911 -74206 -624558 -112292
1621 -112292 -461096 -937126 -169058 -672400 -467446 -487332 -770291 41461 -961772 -957302
1611 -957302 -306541 -534852 -171745 -154123 -601731 -737766 -406784 -221656 -301634 -834550
1601 -834550 -325607 -345174 -135916 -532979 -725487 -76607 -990766 -163705 -467092 -338938
1591 -338938 241894 -282329 -203918 -169991 -524484 -671608 -1187032 -881577 -791741 -769799
1581 -769799 -178285 -257402 -425633 -773688 -748718 -574369 -474547 -465764 -837774 -794745 310844
1570 310844 318745 303764 -288782 -262878 -731069 -370752 -165737 76973 -1329 -314497 -908729
1559 -908729 -600271 -179118 -19588 267140 -238180 -8345 50729 -10379 -355774 -1072888
1549 -1072888 -552170 -623716 -105711 231945 -255290 -238189 -43903 -109064 128716 -586299
1539 -586299 -560455 -269531 18256 163121 -284923 -565632 -384450 -338981 -209536 -694053
1529 -694053 -793149 -684981 -232639 -388736 -209140 -66268 -961708 -1192547 -707108 -760134
1519 -760134 -947328 -502973 -658818 -98190 189477 18038 -331960 34467 59990 -165455
1509 -165455 32030 -134147 151375 -44990 -581603 -78734 -529798 -81173 23687 -570560
1499 -570560 -814521 -1235817 -866519 -638231 -1312866 -537977 -336998 -1061829 -498073 -505653
1489 -505653 -724883 -253344 -240284 -444575 -516242 103 -38488 -201472 -163124 -50242
1479 -50242 -134781 -447475 -527650 278716 21603 -43554 -227010 -573612 -128477 -795717
1469 -795717 -824491 -252813 93329 658733 -370763 -126490 -461778 -975131 -610604 -743761
1459 -743761 -621918 -67939 -201085 -123847 638671 375367 -210448 -455861 -603450 -183979
1449 -183979 -280454 -158917 -910650 -592149 -103641 -259353 -240633 -957964 -463027 -105698
1439 -105698 -591564 -286971 -1025166 -868462 513428 180776 -154038 -503026 -298886 128898
1429 128898 7470 -411287 -621504 -483354 -14582 -409627 -248308 -551842 -622121 -421185
1419 -421185 -38607 -193097 -457632 -950105 -695090 -258850 54377 -154088 -425965 22499
1409 22499 -328504 24777 196214 -64803 282197 -335067 -387839 87371 56364 -448043
1399 -448043 -700985 -172292 -114870 -287562 18030 109017 51061 -22255 -265948 -727611
1389 -727611 -1515300 -1282181 -442336 -818038 -936401 -960054 -801106 -437503 84179 -99869
1379 -99869 -503485 -42043 -544608 -481857 49817 -73174 -106848 -140999 -310582 -443468
1369 -443468 -619357 -419522 -218413 -648425 -682555 -1046976 -896008 -432067 -56308 -131339
1359 -131339 -651927 -57993 -190700 -544612 -231256 -622070 -247681 -254835 -1013916 21481
1349 21481 -125617 -401565 -591355 -256700 15386 -685150 -631303 398514 57136 520771
1339 520771 452373 13867 230072 -572095 -53919 -115825 -529314 416175 36090 -31218
1329 -31218 -186661 -235053 217698 89040 79841 212957 -949674 -808106 -397074 -374134
1319 -374134 353078 -217331 -22284 -118531 -484526 -521583 -876595 -641825 180441 -169223
1309 -169223 276730 -398540 -550507 -346453 -657273 -292237 -77814 -669368 -116691 -567673
1299 -567673 -467918 -63899 -483945 50748 1435 -99027 -826 -164106 151051 -271981
1289 -271981 -14059 493856 68493 545370 187542 -332509 736926 207115 318986 177198
1279 177198 -721294 -365030 -652272 -863150 -461472 -627893 -165430 338775 -206173 116292
1269 116292 -81002 -413384 -360066 -509673 -399225 -1592 369729 284958 35850 -199229
1259 -199229 -306727 195688 40248 -645033 -241174 -587159 -621558 -379260 -645314 298946
1249 298946 362024 -364839 486560 297993 -33010 98199 -951082 -386927 -1265652 -944278
1239 -944278 -735100 -1035757 46936 -306116 -874332 -296782 -930803 -335849 -209880 -775772
1229 -775772 -275537 -379630 64350 248385 -299245 -167119 -457005 25554 444099 -149401
1219 -149401 -255536 -73331 294508 617790 -227907 -430320 -702535 -570023 -138799 -304733
1209 -304733 -413352 -981666 -760141 3727 -365737 166586 3586 -625628 -302876 -516861
1199 -516861 -521276 -12941 -59453 100113 -267953 -604988 -854017 -1127873 -208210 -383109
1189 -383109 -723604 -598639 -1511734 -1074135 -661035 -1103465 -653123 -925784 -555666 115834
1179 115834 -620098 -564981 -153001 -11124 238803 -327793 -369719 -450183 -818866 -1296119
1169 -1296119 -969173 -438137 -556767 -851748 -352372 87677 490229 -79633 -428649 -119113
1159 -119113 295730 140713 -47475 -288843 -388224 117684 407204 391928 -329516 -473370
1149 -473370 51065 324190 107728 -421734 -132930 292569 260206 -235758 -456283 -249477
1139 -249477 -238789 -271300 365283 104487 -198411 -559541 -650307 157587 72467 -512578
1129 -512578 -766870 -684637 -338097 -524887 -510461 -778842 -1024672 -667215 -1037167 -779283
1119 -779283 -406382 -196324 -34022 -405097 112331 48255 -97961 -626357 -758656 -485685
1109 -485685 -375041 -129752 299125 40444 -104915 304380 496205 330828 -435506 248880
1099 248880 784416 22494 -189140 -651379 -848356 -1027844 -1198963 -769646 -153336 -452676
1089 -452676 57291 -4684 -130739 -161993 -429707 -235239 -531111 123222 353870 -746236
1079 -746236 -538424 -430619 -938939 -988685 -959608 -250598 66008 -90418 -253225 -330953
1069 -330953 -125568 36852 -536515 -1261839 -1143333 -206918 -517192 -350773 -561319 -423004
1059 -423004 -13718 -513346 -877343 -537761 -850876 -122419 158274 -465627 -179431 -86481
1049 -86481 -424715 -220304 -563199 -535277 -117427 -145066 -622218 -632896 -278466 -350783 -613984
1038 -613984 -115429 -331478 -580724 -678122 -589921 356727 19226 -607300 -220979 -427108
1028 -427108 -375451 -555056 -491911 -527523 -473773 414357 504712 577991 44252 -321480 -3217
1017 -3217 42396 -60134 420923 -428834 -154481 71429 -249764 -731531 -889804 -584508
1007 -584508 -424447 -401247 -606867 -182774 17246 232413 -82795 -523076 -856880 -854439
997 -854439 -592646 -584481 -374776 -522074 -618226 -980529 -1012945 -275429 -854901 -698322 -278867
986 -278867 -247571 -283814 403738 -214730 -323193 -670419 -1021625 -809235 -286005 -351479
976 -351479 -241622 -478481 -77198 299005 -580689 -545722 -133680 -324693 -622136 -509427
966 -509427 -833915 -624861 -46918 491869 -262918 73115 -218910 -177248 437683 351337
956 351337 409128 125873 -483790 -373897 -119378 -55436 129707 -691970 -328112 52583
946 52583 -441216 -161616 37917 -74566 -252025 47847 135982 -130797 172487 110967
936 110967 -167196 -289023 -669580 -356911 -694234 -629823 -154179 -189483 11381 -121645
926 -121645 -429563 169500 202512 102052 -398724 -588941 -409042 -32957 -74179 -240831
916 -240831 -614369 783 -188496 -335456 -63004 -311617 -95857 9991 -265535 40253
906 40253 177610 -102592 -28972 -79437 -448425 -644764 -655287 -224385 -681 309557 -250274
895 -250274 -522132 -827648 -581776 -518038 -935527 -737979 -437750 -197138 -431284 -303661
885 -303661 -840080 -157637 -34176 -466317 -261579 203505 484269 34603 6811 -190016
875 -190016 -527351 -567296 -924852 -300151 -452989 -79474 201305 167560 76077 65065 101499
864 101499 -424414 -148230 -200778 -7094 -315894 -215793 -307806 -70973 -320416 -893277
854 -893277 -816285 -904903 -787499 -237522 -470329 -452943 -304331 -659475 -710586 -1046542 -730101
843 -730101 -414582 -442601 -715071 -619162 -201974 111284 -235886 -53138 -2037 261554
833 261554 451146 431912 51966 -642541 -721268 -800930 -203094 441603 -270460 -256858 -481237
822 -481237 -104400 207041 -87607 -235630 -363056 -142137 -170879 -492675 -387886 -664703
812 -664703 -416210 -108239 -145060 -94783 -170663 -228417 -8196 -377941 -210753 -53612 -409179
801 -409179 211552 87469 -277834 367930 398710 788976 -15298 66847 -176547 -261342
791 -261342 290801 -384976 -79902 -306145 -1009567 -899624 -921953 -581315 -446724 -497867
781 -497867 -104194 35030 -61726 669645 -67722 -221139 -129455 -128263 -486749 -636684 364482
770 364482 387238 -186510 -259472 -215861 -409782 140643 -219643 842927 319645 -346128
760 -346128 -70254 -49131 -356829 -220637 -43889 251660 190930 432502 510893 109670
750 109670 97732 -39786 254745 188813 -330873 -420307 -727165 -253199 -195305 -385709 -251725
739 -251725 -107770 102259 -15825 -455325 -232963 -749398 -792669 -481751 -212217 224791
729 224791 -89674 -717206 -378698 -327838 -455014 -553861 -598863 -147943 -327628 172512
719 172512 399244 637946 522240 -90715 -225232 -24457 -725008 -325350 -368311 -796690
709 -796690 202594 -12093 -353942 -228744 -720507 -402558 -124089 452278 363636 -573756
699 -573756 -269097 -583327 -184528 -202983 -434761 -94705 151223 -375040 -184571 -278608
689 -278608 -525520 -709605 -603264 -554749 -971957 -302861 78187 -95180 248309 207441
679 207441 26142 -782324 -623382 123385 -122279 2673 -17515 -501748 37094 306608
669 306608 -149418 44655 -473537 -512745 -772410 -617826 418757 -216810 -637240 -459880
659 -459880 111225 421369 587072 552379 -287509 -505857 -496355 -1046924 -1156021 -337502
649 -337502 -645301 -127137 -323223 -641145 -449160 -401827 -13892 -382689 -829629 -35080
639 -35080 -84324 -236713 157193 -482788 -436048 -325996 -626796 -1075290 -991545 -137709 -222732
628 -222732 -410231 -81736 74229 138727 -366233 -273856 -353709 -703358 319550 433414
618 433414 -205426 -235236 -160860 -328099 -230719 -581885 -588755 -291985 259307 363842 401784
607 401784 -51491 52115 -307558 -496035 -359674 -183150 -213072 18924 26994 -309107
597 -309107 -483318 383609 -6641 28896 300470 -251391 -463400 -866348 -1268895 -1432663
587 -1432663 -780279 -510362 -546918 -487763 -440735 -769599 -1098192 -308954 -380436 -948955
577 -948955 -812206 -96655 -578855 -300372 128796 -396641 117470 -356876 -344592 -120775
567 -120775 4799 64829 192763 -282909 124312 112256 163245 301578 87731 -228022
557 -228022 -465913 -430451 179678 -153702 -99084 -48115 -532249 -973442 -499316 -234914
547 -234914 95507 285113 367358 371211 -196163 -248145 330878 -8046 70648 -506494 -103812
536 -103812 297098 -133231 43112 -327970 -489500 -94230 108395 42645 -240260 -399999
526 -399999 -365946 -278027 81291 73009 1789 345350 160011 60394 -77737 -910759 -923351
515 -923351 -272680 248425 284702 154384 441317 282919 -291602 -65930 -152994 -221954
505 -221954 -434170 -676440 -508859 -662762 -760978 33685 -183840 -198504 -69448 274600
495 274600 -189673 -394430 124097 -124518 -142618 337296 -295998 -526 3857 -215890
485 -215890 58335 -105984 110947 9112 -539414 -383449 -225219 -491373 -91835 -272727
475 -272727 -755848 -937797 32962 469630 74188 387353 118919 -159473 5357 -141936
465 -141936 -241469 -421379 -751642 -257872 -395773 -88385 472539 -117491 -275338 -118051
455 -118051 -396998 -59817 -107658 86542 -445399 -232062 118738 -682931 -491816 -588413
445 -588413 -634474 -246196 -176380 -95318 -562357 -368081 -194815 -425709 414347 -588890
435 -588890 -833947 -420904 -286272 311229 411257 161418 22693 -94755 -131439 -289996
425 -289996 -698837 -598920 -222277 -150987 -201341 -98701 -43336 -483451 -273158 -352617 -248150
414 -248150 -273002 -554954 -543340 -761252 -220897 114876 162442 105349 -406970 -41345 322869
403 322869 -142160 -230591 -248705 -304002 -138846 -594388 376421 -189728 -908966 -677101
393 -677101 -543412 -481341 -330142 -1174889 -814702 -983935 -601074 -924484 -1004773 -99622
383 -99622 -404665 -420240 -983738 -735463 -410594 -770775 -365496 -472532 -381674 136097
373 136097 -326443 -155007 -363271 -694822 -709168 -859722 -363264 424829 -22753 320076
363 320076 -45191 -244664 -246 -653739 -817043 -33036 -477133 -21058 -497787 -326472
353 -326472 -424606 -797916 -347400 -934440 -953660 -133512 -319425 -628365 -1195693 -855561
343 -855561 -220847 -495482 -528841 -735851 -661387 -418405 -846541 -634593 -114949 -328135
333 -328135 -258732 -248954 -181974 46440 -438606 -305739 -447514 -430748 -126030 -476874 -151969
322 -151969 -457643 -523761 -214826 -737229 -452256 -67978 -238460 -246243 -88363 209038
312 209038 559901 764946 550645 423891 -167230 -485455 -595572 -235387 281696 -168281
302 -168281 316188 488758 528650 502772 194655 166637 -190066 -760316 -479376 -750999
292 -750999 -219447 214255 -35315 278402 -121439 -90686 472780 303867 307034 -50354
282 -50354 -542860 -612282 -634402 -225826 133204 -408802 -766066 -971815 -78316 355768
272 355768 -521803 -258242 -426816 -372953 -606319 -708227 -300527 59031 -437392 52060
262 52060 -354705 -540894 -442172 -439528 -422812 -775718 -385879 -199529 -495309 6478 -82703
251 -82703 162949 -59558 -837715 -405534 -307836 -127302 -156358 -878774 -534826 -439309 -519966
240 -519966 -520113 -410393 -385417 -444264 -608039 -46391 -28930 214394 91651 -173633 161209
229 161209 44345 -208270 -6424 -152526 94505 -252835 -912906 -560156 -402036 301339
219 301339 19616 -313611 95509 -54420 -115600 -288187 -224472 -169256 -122286 45870 63715
208 63715 -172640 431463 84188 286841 -187227 -428342 203228 -640647 -240811 72550
198 72550 -351549 -96966 -43240 -490251 -59276 -40904 -449097 -596584 -746924 -500553
188 -500553 -483104 -221261 -47664 -566695 -75699 -280982 -85168 -731636 -766875 -411785
178 -411785 -955582 -707936 -330283 -386643 15055 14620 -522684 -716739 -168281 -104649 -64379
167 -64379 -7105 -318292 -452152 -463077 -91898 226605 143253 -245812 -420987 -324104 -38033
156 -38033 -6363 -704198 -433614 -489448 -568766 -823107 -386811 -227604 -73273 -369475 -307580
145 -307580 -226269 204184 -247386 -773057 -463297 -333405 -804686 -352711 -597994 -684644
135 -684644 -238616 -254341 -529109 -1062423 -889256 -512610 -146840 301186 109883 -299259
125 -299259 -239294 -207867 206492 283231 184726 -72994 -317941 -36291 -181435 -545314 -365985
114 -365985 -444252 -327079 -437280 -531836 -618223 -31485 77496 -192177 -269863 138106 -124936
103 -124936 -91069 2478 -224525 -649616 -796327 -370727 -590886 -808376 -385879 -554469
93 -554469 51676 15556 -808410 -220291 -75015 -623954 -274457 -391141 87830 -221023
83 -221023 -481386 -368887 -290450 -87900 187849 -485910 -595803 -805325 -555116 -154568
73 -154568 -327683 -239347 -379634 -331377 -137060 -555835 -549842 -799155 -1090370 -607562 -533900
62 -533900 -365432 -701155 -871663 -552524 -432882 281766 171830 -237310 -212161 -700449
52 -700449 -23368 -476710 -401449 11030 -775868 -493569 -232454 -468182 170031 -555486
42 -555486 -903023 -518589 -576257 270352 54920 -638661 -180308 -747753 -206393 -339778
32 -339778 -444532 -363749 -690467 -484538 -537738 -341460 -154607 -470774 -90197 18619
22 18619 -658021 -106401 -570947 -503422 35670 -558454 -505208 -633010 -475395 -397946 -313572
11 -313572 62181 -714215 -527870 -128937 -589801 -167308 -244135 -315710 47048 -739061
1 -739061 -188428
0 -188428
$$ Imaginary data points
##PAGE= N=2
##DATA TABLE= (X++(I..I)), XYDATA
16383 -2557623 -2150058 -2306888 -2534992 -2361099 -2596408 -2079475 -2110014 -2223399 -1801190 -1938865
16373 -1938865 -1840509 -2028330 -2331733 -1720671 -1991976 -1699190 -1318747 -1772823 -1357420 -1911167
16363 -1911167 -1989288 -1776700 -1844810 -1338289 -1424705 -1552142 -1127420 -1218573 -1094208 -1634006
16353 -1634006 -1199176 -788848 -1040737 -917188 -1436904 -1233293 -1465065 -1548365 -832644 -999147
16343 -999147 -952242 -660342 -1152122 -865829 -425272 -1027072 -785307 -1158441 -622792 127015
16333 127015 -251938 -552960 -292566 -86824 -245697 -215558 134315 -91122 76885 33471
16323 33471 -119081 -352132 -240358 -513216 -12460 63474 -359751 -25665 -135037 341416
16313 341416 435426 156750 303764 356174 537542 901355 529612 523669 438255 -339046
16303 -339046 -6050 264612 414355 431258 243515 951835 683985 849280 1177266 793444
16293 793444 1266934 1051391 657728 941630 429346 1259005 1096746 1110298 1513090 840726
16283 840726 1137950 1302481 848413 1010500 707062 1176539 1161327 937478 1519647 534402
16273 534402 464959 955876 -80943 1240713 1028460 982915 1590700 987666 1817343 1812533
16263 1812533 979593 1836831 992246 1433886 1341215 1404214 2050564 488608 1322019 1708265
16253 1708265 1228430 2128148 1290226 1688060 2300939 2003355 3187123 2281554 2185510
16244 2185510 2306451 2117199 2571332 2041696 1765269 1994349 1279731 1768988 2160483
16235 2160483 2335973 2441556 1962003 2676269 1955672 1953005 2376920 1961279 2964981 2067375
16225 2067375 1717210 2934764 2306053 2780678 2769023 2120891 3531682 2288249 1933116
16216 1933116 2318110 1720098 2724384 2640679 2109703 2694600 1821507 2135920 2060465 2596854
16206 2596854 2892936 2399109 2850702 2972156 3081483 3240781 2620899 3011569 3310422
16197 3310422 2845335 2957535 2784092 2815496 2576848 2314244 2528263 2214203 2239213 2491354
16187 2491354 2693227 3006824 2588977 3176266 2868109 2275382 3117673 3061914 2479884 2725380
16177 2725380 2125233 2586500 2808901 2641166 3140066 2479595 2480042 2866420 2569024 2768681
16167 2768681 2235997 2460072 2593198 2928961 3375402 3228786 2710487 2963341 3364277
16158 3364277 3082001 3053943 2629048 3082589 3333051 3388093 3229737 3303989 3637366 3354153
16148 3354153 3048281 2982309 3111622 2794917 3327038 3150260 2791146 3127173 2956749 2766425
16138 2766425 3156793 3490981 3228868 3210086 3255714 2731830 3205392 3667521 3666749 3036322
16128 3036322 1805652 2265737 2715153 2731708 3469426 3446666 3268483 3544273 2913443 3071099
16118 3071099 2908323 3522799 4207779 3646860 3609645 3290982 3375238 3956526 3564876 3613464
16108 3613464 2719214 2848925 3462538 2765946 3046914 3084998 2291038 2985790 3499347 3206755
16098 3206755 3586793 3388673 3636481 3011857 2801790 2961955 2797047 3406720 3289058
16089 3289058 2963487 2695447 2209057 3054857 2913710 2978864 3442414 2488999 3126600 3010365
16079 3010365 2614735 3191713 3063001 3475716 3434793 3278693 3798031 2797979 3284389
16070 3284389 3724573 3525823 3141601 2960688 3183276 3046831 2501781 3173855 2969367
16061 2969367 3372943 3565978 2783346 3730623 3043997 2979893 3698519 2842493 3784743 3712695
16051 3712695 2875252 3088242 2348115 2890120 2817765 2970593 3376571 2307930 2804105
16042 2804105 3045797 2109208 3274789 2903145 3943151 3780252 2427785 3418894 3118552
16033 3118552 3121425 3578054 2987175 4040238 3930577 3846936 3795768 3132029 3897827 3797563
16023 3797563 3942391 4041796 3577687 4455491 3716866 3332005 4162905 3233789 3649234 3733950
16013 3733950 2932174 3942681 3877296 3512066 3991865 3542060 4062780 4078137 3465343 3605600
16003 3605600 3096499 3445003 3439835 3262263 3363350 3360421 4007520 3564387 3440277 3748496
15993 3748496 3692805 3347434 3105947 2673498 3059594 3342544 3472809 3343395 3057549 3855006
15983 3855006 3655404 4069684 3923527 3138101 3001475 3513788 3377102 3475385 3707241 3940096
15973 3940096 3423404 2909086 3466215 3480947 3290410 3590220 3307861 3084109 3318318 3102952
15963 3102952 3056325 3185870 3275713 3126979 2951644 2911720 3506392 3563903 3699231 4028151
15953 4028151 3850970 4029129 3366613 2828290 3403607 3272624 3816075 3041469 2691749
15944 2691749 3398623 3214173 3297871 3034343 2823468 3739966 3551530 3916547 3551616 3036388
15934 3036388 3757379 3724260 3175141 3615593 3402605 3337656 3370317 2838782 2787667 2397455
15924 2397455 2908524 3161969 3537479 3174415 2910060 3534208 2761549 2906990 3810305
15915 3810305 2941819 3557578 3945400 3545311 4092784 3622680 4090148 3662807 2850747
15906 2850747 3540828 3037380 3376547 3724553 2857844 3569961 3570302 3742911 4312597 3733580
15896 3733580 3692870 3062940 2882927 3501893 3039427 3380902 3514038 3570698 4299453 3852171
15886 3852171 4076067 4196253 3612990 4823831 4010363 3292498 3942650 3066261 3076793
15877 3076793 3389683 2982995 3250181 3126774 3603320 3475938 3224606 3927589 3205600
15868 3205600 3570480 3389387 2960383 3040205 3157345 3725209 3391073 3054257 3498159 3190169
15858 3190169 3436016 4260570 3343935 3216158 3043593 2492557 3564528 2802980 3672774
15849 3672774 3571200 2903277 3488837 2566407 2864241 3987966 3202297 3813602 3736030
15840 3736030 3683238 4503397 3829765 4191057 3601327 3379320 3692986 3497010 3796652 3990778
15830 3990778 3162874 3402909 3404226 3871612 4142958 3706612 4175881 3787129 3300490 3340738
15820 3340738 3756972 4038495 3437350 3627950 3840385 3142864 3443270 3423046 2743121 3370094
15810 3370094 3053043 3412429 3411079 3124021 3891964 3315454 3430848 3087579 2714029 3147178
15800 3147178 3302634 3846210 3862542 3333564 3603738 2786282 2864355 3563454 2939215 3255952
15790 3255952 3639148 3198305 3734254 2869060 3466470 4439007 3411975 3636789 3344483
15781 3344483 3072234 3593553 3534482 3995804 3608213 3508562 3256047 3621173 4225124 3259296
15771 3259296 3166288 3601820 3456503 2922539 3252233 2962326 3322876 3803002 3546435 2976899
15761 2976899 2872482 3269831 3392987 2892760 2914202 3019493 3565364 3406104 2914582 3274436
15751 3274436 2883067 3124843 3113709 2717190 3518090 3477974 3313969 3839933 3213687 3120352
15741 3120352 3206798 3217223 4127890 3459249 3725646 3934213 3732101 4075683 3601144 3467203
15731 3467203 3901575 3812377 3849543 2923957 3073654 3786406 3510741 3721430 3041726 2954467
15721 2954467 3336330 3468324 3481328 3857914 2989515 3637144 3547143 3130159 3433558 3451496
15711 3451496 3696305 3314743 2991428 3239075 3170285 3386707 2690662 3106386 3468421 2959873
15701 2959873 3932886 3447961 3992045 3895536 2965702 3753660 3260599 3228275 4474365 3507728
15691 3507728 3385276 3152307 2434179 3234933 2853708 2763662 3572365 2949422 2807731 2788473
15681 2788473 3838490 4060727 3625442 3818598 3053828 2705585 3122829 2695758 3125986
15672 3125986 2825064 2888911 3626303 3702004 4580930 3532581 2959919 3098311 3091803 4278032
15662 4278032 3931265 4033306 4611697 3832121 4239289 3602469 3299573 3979241 3146545
15653 3146545 3709026 3789958 3336914 3942024 3489814 3266032 3346313 2786184 3142999 3705798
15643 3705798 3793775 3461165 3125727 3594407 3165696 3073558 3415121 3570058 3954770 4096500
15633 4096500 3283119 3523669 3174427 3605483 4414707 4214130 4321047 3774891 3337538
15624 3337538 3775103 3950231 3609879 3325924 3419305 2810388 2376852 2873231 3141965 3333697
15614 3333697 2901077 2872305 3260681 3503663 3795714 3982790 3444625 3627312 3591543 3749092
15604 3749092 4266475 4042539 3853374 3810673 2995579 2901416 3105638 3189809 3353792 3420163
15594 3420163 3598370 3365365 3456958 3396454 3517670 3384699 3797151 3884977 3768983 3528724
15584 3528724 3576835 3398729 3040542 3115254 2921695 2836232 3573968 3523202 3645404 3551834
15574 3551834 3069674 3161557 3466884 3557027 3591480 3717243 3600227 3688810 3485903 3213274
15564 3213274 2815751 3418971 3056007 3186975 3565859 3661791 3690538 3775162 3783695 3994341
15554 3994341 3844498 3176920 3447370 3283098 3672436 3889811 3305282 2966009 3756401
15545 3756401 4221272 4096172 4357824 3401923 3326381 3234921 2927738 3525607 4040426 4108764
15535 4108764 3896556 4306816 3887455 3795638 3761817 3698714 3214813 2943410 3216532 3266903
15525 3266903 3227283 2975981 3754087 3702496 3198372 3379001 3339274 3571299 3359001 3431813
15515 3431813 4170524 3418981 3045776 3098802 3209343 4041301 3865693 3523987 3528742 3802219
15505 3802219 4146156 4151954 4241197 4037879 4372132 4704449 4455484 3975824 4202904 3861453
15495 3861453 3219543 3530961 3647149 3585814 3824846 3659131 3389005 3268188 3478578 3736055
15485 3736055 3475629 3330851 3876079 3868623 3665594 3931473 3648484 3779771 4016058 3502177
15475 3502177 4008836 4421955 4233503 4292966 3665755 3699784 3882949 3397526 3444627 3751365
15465 3751365 3117891 3100969 3588864 3431022 3361755 3936963 3780771 3349082 3274541 3289502
15455 3289502 3393649 3618692 3564148 3590867 3240692 3542726 3545241 3144996 3868175 4328046
15445 4328046 3413552 3443250 4090469 4115343 3345242 3924671 4401809 3897415 3520754 3171058
15435 3171058 3491132 3786384 3198591 3376774 3939784 3795392 4139914 4205737 4140764 4272762
15425 4272762 4032804 3622856 3881369 3553862 3440865 3203566 2979352 3437899 3666839
15416 3666839 3669514 3480018 3606555 4106325 3499707 3830443 3374979 3702516 3546882 3356492
15406 3356492 3306784 3169007 2831313 3358089 3067673 3156390 3947676 3811701 3028775 2743517
15396 2743517 2972701 3096992 3703052 3785023 3486794 3389554 3523661 3305469 3481435 3219819
15386 3219819 3163303 3512819 3605438 3687503 3644755 3575980 3899483 3075703 3045199 3505859
15376 3505859 3078789 3491640 3774915 3418261 3562941 3114841 2898838 3480423 3824840
15367 3824840 3942967 3754145 3097480 2968313 3254920 3726660 3254002 3339856 3346897 3243360
15357 3243360 3330056 3799227 4076192 4002761 3771391 3749886 3426985 3325727 3466308 3681502
15347 3681502 3614675 3887592 3478747 3391094 3451136 3593761 3569005 3570652 3776941 3399130
15337 3399130 3594476 4675431 4045797 4234552 4167085 3897948 3599327 3422137 3754886
15328 3754886 3526797 3002137 3370095 3540845 3761074 3907804 3907807 4179220 3589431 3384333
15318 3384333 3269716 3688376 3785805 3991648 3792236 3970254 3294855 3550250 3259229 2972802
15308 2972802 3133759 3212643 3795977 4165162 3306641 3926791 4011630 3637459 3910897 4343198
15298 4343198 3894066 3950285 3798836 4557517 4227505 3885381 4226143 3757974 3343118 3133151
15288 3133151 3133909 3231623 3370040 3543487 3183353 3080550 3265965 2707101 3561989 4068752
15278 4068752 3657674 3479396 3473664 3544445 3379826 3552756 3552079 3574680 3649330 3010736 3191423
15267 3191423 4217226 3845413 3326770 3472657 3128888 3598052 3339865 3482302 4264598
15258 4264598 3669797 3858523 3976359 2703115 3205517 3686035 3870920 4421478 4243514
15249 4243514 3513983 3772610 4361517 4190544 3841454 3899384 3256750 2946754 3210394 3811635
15239 3811635 4256529 3465220 3399263 3248009 2855630 3270376 3491371 3421741 3542247 4084529
15229 4084529 4073539 3831202 3894904 4047880 3632092 3810227 3790834 3593080 3532395 3912845
15219 3912845 4171794 3659932 3703003 3489946 3234425 4265134 4298479 3844722 3584653 3390633
15209 3390633 3209783 3595582 4515420 3384581 3632856 3907597 3843020 3604518 3440269
15200 3440269 4186782 4095455 3555072 3275243 3635863 3203959 3574116 3738605 3708904 3822550
15190 3822550 3975768 4117801 3523613 3943879 4092901 3263949 3654179 3485259 3233569
15181 3233569 3506490 3516637 4042051 3713538 3408335 4045937 3810863 3527373 3803041 3307007
15171 3307007 3540359 4035486 3527230 3585464 3523630 3891286 4086186 3404344 3004060 3323075
15161 3323075 3211115 3150065 3685339 4220086 4267996 3949058 4111506 3645022 3939683 4065945
15151 4065945 4023932 3375328 3534009 4238643 4293718 3879620 3222215 3093448 3862965 3489885
15141 3489885 3164871 3307727 2892876 3481924 3099103 3563449 3802226 3525605 4234131
15132 4234131 4060385 3987805 4287616 4012722 3579422 3999374 4010121 4134076 3935380 3686259
15122 3686259 3897737 3016875 3049177 3261675 3611187 3638216 3538773 3441350 3391578 4001339
15112 4001339 3718448 3078575 3394894 3590722 3540821 3490326 3786918 4229971 3220147 3670805
15102 3670805 3845163 3394366 3636896 3307295 3318154 3341378 3335015 4114862 4168508 4043145
15092 4043145 3653824 2548779 3495197 4366154 4105220 3723226 3106445 3497338 3497605 3482061
15082 3482061 3443179 3937877 4393496 3573681 3706514 4136942 3547623 3840848 3435801 3142061
15072 3142061 3362679 2742536 3949541 4330839 3638413 3896149 3778668 3725104 3791286 4010019
15062 4010019 3770394 2962201 3742674 3768218 3500617 3955507 3294172 3870315 4236836 3658012
15052 3658012 3734529 3558457 3731160 4269798 3956110 4510950 3734895 3580226 4292243 3870127
15042 3870127 4208861 4017493 3788756 3007885 2710301 3351314 3351635 3518706 3566668 3058811
15032 3058811 3505545 4208445 4638633 4459463 3251623 3592747 4228863 3609836 4489439
15023 4489439 3997459 4099720 4518354 3739481 4364027 3853715 3776276 4141727 3318066 4300933
15013 4300933 3895387 3674292 4233564 3780037 4382405 4110208 3725034 4103232 4073702 4358338
15003 4358338 4322889 3811866 4022860 3392926 3727260 3550893 3180588 3664269 3327844 3008233
14993 3008233 3724318 3898825 4035695 3653138 3734628 4282849 3426571 4014816 4001910 4222175
14983 4222175 4306331 3928255 4298978 4072961 3724417 4257098 3565745 4097400 4099914 3649484
14973 3649484 3996737 4355575 4451994 3811085 3569534 3671764 3506478 4047498 3758220 3555234
14963 3555234 4296402 3863013 3618797 3989714 4325680 4307421 3859781 3662510 4303960 3864607
14953 3864607 3752037 4089913 3609014 3041742 3806843 3798836 2961003 3630008 3796407 3391648
14943 3391648 3173236 3414092 4050819 3747880 3386272 3721643 3391895 3940128 3888765 3309235
14933 3309235 3221399 3516920 4157435 4062171 3695183 3488026 3569740 4336934 4198806 3786846
14923 3786846 3970424 3525223 3445936 3482309 3494166 3828128 4355724 4009959 3484168 3396748
14913 3396748 3960347 3829484 3708253 3298235 3216291 3665934 3198109 3428286 4342296 4506592
14903 4506592 4806980 4348864 4081140 4331696 4212703 4440659 4239459 4084907 3937835
14894 3937835 3075607 3516498 3146676 2805057 3137508 3132066 3547873 3302179 3231834 3257612
14884 3257612 2737514 3897707 4257829 4110589 4556740 3822704 2920543 3096660 3107257
14875 3107257 3531003 3400097 3513791 3741273 4246330 3990316 3333272 3750836 3784969 3855277
14865 3855277 4161790 3751025 3940969 3991453 3354499 3989708 3627766 2835032 3449947 3344457
14855 3344457 2886712 3347764 3892215 3944889 3704996 3676913 3870073 3869069 3637846 3332227
14845 3332227 3653435 3631808 3577286 4422775 4226856 3909513 3706064 3492486 3404306 4146760
14835 4146760 3997013 3819135 3822100 3654991 3349432 3235575 3680698 3903671 4042414 4152791
14825 4152791 4346266 4433041 4489138 4406164 3938862 3812515 4105630 4013285 3960969 4295782
14815 4295782 4061045 4344171 3821833 3782341 3578928 3750734 4022846 4105881 3971652 3592213
14805 3592213 3374132 3429987 3271267 4137792 4612259 4415139 4526993 3669828 2534417
14796 2534417 2809271 3252659 3975880 3820521 3758437 4246946 4144849 4266310 3820231 3169830
14786 3169830 3459539 3404495 3347295 4137709 4350531 4264359 3775812 4079766 4077076 3482402
14776 3482402 4314742 4060906 4258013 4872038 4485230 4280458 4145728 4216785 4089982 3473179
14766 3473179 3624839 3854874 3885346 3509737 3343009 4187632 3997192 4664139 4627032 4412685
14756 4412685 4606218 3822537 3234684 3492225 3258308 3813496 4095143 3595394 3678068 3638955
14746 3638955 3393041 3486501 3499114 4006423 3874032 3666823 3551212 3884928 3732299 3141936
14736 3141936 3962011 3855853 3271924 3983247 3969058 4279131 3529231 2808481 3033255 2624495
14726 2624495 3226469 4230619 3226879 3697079 4206035 3779022 4031723 4068898 4049864
14717 4049864 3837710 3464216 3399546 3621315 3178546 3388123 3230789 3501828 4055678 3548537
14707 3548537 3668866 3656671 4004845 4370527 3767185 4099298 4275458 4103753 3871563 4374866
14697 4374866 4476265 4280262 3703480 3676563 4448347 4263493 3837217 3606308 3338955 3509616
14687 3509616 3225825 3241197 3405150 3680342 4419577 3758575 3868255 4077712 4090314 3790030
14677 3790030 3787724 4006804 4272899 4305302 4601046 3928160 3820692 3752092 3058459 3353130
14667 3353130 2882419 3411855 4138060 4360398 4810049 3909541 3804793 3642058 3063664
14658 3063664 4215941 3831580 3624559 3891045 3060067 3732551 4274437 4418061 5123068
14649 5123068 3722124 3541027 3931385 4048565 4371876 3522712 3728456 4102535 3761389
14640 3761389 4104191 3351000 3448082 3446769 2901625 4140020 3467474 3666133 4270830 3585956
14630 3585956 3792067 3563980 3778075 3924747 3033306 3697944 3445297 3161726 3827126
14621 3827126 3468790 3859000 3446199 3756362 3986914 3204228 3952198 3978737 4030900 4729314
14611 4729314 3999708 3938534 4457554 4385842 4773148 3948018 4001122 4105389 3324042 4212949
14601 4212949 4313704 4163602 4141685 3778729 3781615 3412702 3423507 4412777 3713281 4297036
14591 4297036 4316558 4195576 4635772 4375641 4753042 4016079 3460873 3505781 3291891 3819526
14581 3819526 4057904 3425467 3926117 4212413 4056579 3760259 4119420 5164416 4331919
14572 4331919 4087943 3493601 3318784 3790357 3566195 3710058 3309864 3303427 3593195 3219753
14562 3219753 3972192 4575254 3871007 4027493 3746523 3393711 3641007 3674629 3798749 3434759
14552 3434759 4087041 4148773 3304585 4110842 3838909 2914489 3091634 3117726 3202221 3157210
14542 3157210 3841883 4211088 3981294 4309930 4050300 4088066 4120998 3759771 4051746 3470930
14532 3470930 3511669 3633215 3351120 3970448 4598742 4376995 3814529 4200744 4572632 4533301
14522 4533301 4106746 4161904 4160554 3818278 3968329 4100210 4981579 4862179 3847225 3868381
14512 3868381 3808020 4091084 3560561 3947821 4170997 4447125 4863437 4399448 3903206 3817306
14502 3817306 4103255 3670996 3787973 4140060 3943968 4077110 3932249 4240274 3446318
14493 3446318 2751471 2632269 2897706 3733938 4106650 3893217 4138456 3841178 3094140
14484 3094140 3596318 3715790 3995383 4399810 4190474 4065220 3601952 3721502 4178385
14475 4178385 3650625 3648075 3726474 3521669 3541352 3564314 4490184 5074076 4504385 4087818
14465 4087818 3988645 4278782 4480766 3845418 4026872 3925618 4170859 3905278 4391919 5008490
14455 5008490 4390276 4187621 4107853 4094578 3980273 3398669 3602337 3875662 3354145 3452132
14445 3452132 3624879 3943555 3881768 3458162 3805801 3893512 3783012 4993222 4454314 3900155
14435 3900155 4075798 4313973 4202944 3995332 4090817 4207586 4000805 3774338 3441497 4085944
14425 4085944 4605152 3847654 3692422 3218209 3749852 3327661 3201282 4291919 4357847
14416 4357847 3850400 3694346 3589792 3935498 3943232 4544356 4413324 3525881 3810850 3978255
14406 3978255 3717812 3810640 3575876 3400689 3909847 3983549 4102322 4127367 4577104 4050690
14396 4050690 4082207 3881393 4275112 4475089 5039832 4849989 4103830 4765473 4241662 4020018
14386 4020018 4151657 4178035 3954919 3779593 4116839 4192878 4004673 3162770 3457931 3599900
14376 3599900 3905421 4204216 3976129 3792349 3895710 4263706 4416429 4068369 3605112
14367 3605112 3599540 3592313 3921006 3695627 3481588 4046965 3777855 4308618 4444058 4854387
14357 4854387 4521836 3904505 4247636 3593144 3241458 4386829 4191524 3757245 4095832
14348 4095832 3746673 3624597 3800804 4302664 3954428 3809055 4585475 3871468 3348407
14339 3348407 4346185 3859230 4051194 3680833 3489923 3916087 3389552 3625892 4221514
14330 4221514 4436922 4117285 3641969 4188250 3850838 3225045 3821640 3645107 4095737
14321 4095737 4717144 4302950 4045648 3295446 3739151 3889254 3674431 4590252 4384257
14312 4384257 3989454 3994802 3379048 4158695 4258762 3506979 3877374 3420950 4360551 4887190
14302 4887190 4393182 4860489 4159767 4376617 4554009 3902599 4173269 3443675 3413796 3868324
14292 3868324 3537554 3648157 3085855 2876166 3574236 3727633 4219983 4234515 3703610 4085915
14282 4085915 3233418 3913532 4205715 3493855 4059182 3496185 3676776 3999653 4060746 4613177
14272 4613177 3622129 3540210 4205287 3730022 3939857 4183719 3924659 4339227 4585063 4719626
14262 4719626 4780674 4012043 3727703 3214493 3806689 4089983 3998115 4265689 4356410 4880754
14252 4880754 3462830 3721298 3726521 3878682 4193830 4321962 4048484 4035413 4258224 3802785
14242 3802785 4402309 3945653 3392927 3490631 3976472 4407019 4146399 4341995 3951917 3603479
14232 3603479 3744266 3867139 3594030 4448448 3543005 3522117 3521205 3011850 3526437 3263937
14222 3263937 3376575 3295154 3445509 3433462 3488770 3540302 4627523 4088292 3861624 4083630
14212 4083630 3769725 4159246 4094855 3892718 4223136 3643285 3445841 3030201 3036576 3275760
14202 3275760 3585535 4154360 3186057 2913769 3695280 3727851 4008720 4416324 4262612 3987363
14192 3987363 3743057 4043438 4030109 4135271 4697269 3876191 3716471 3969558 3548416 4448659
14182 4448659 4137117 3301186 3386306 2945617 3731072 4041256 3934501 4141708 3828629 4706200
14172 4706200 5421320 4347445 3821765 3209097 3683452 2826723 2901764 3791673 3447779
14163 3447779 4163947 4872706 4439973 4010308 3436068 3481773 4029367 4172120 4738202 3742650
14153 3742650 3703372 4751372 4141559 3989083 4687946 4334871 3923643 3820714 3994593
14144 3994593 4259255 3632357 3816064 3961999 4131691 4166612 3991542 4060254 3688743 3633078
14134 3633078 3444849 3181784 3870196 3922424 4019835 3693838 3201592 4061957 4070731 4249960
14124 4249960 3909198 3809161 4534563 4293694 4478040 4428085 4282753 4432472 3832585 4043837
14114 4043837 4169570 3525415 4088960 3634692 4276231 4724460 4152330 4245466 4297049 4470253
14104 4470253 4208867 3998305 3810920 4188339 4253218 5036927 5025537 4755637 4445063 3788942
14094 3788942 3451365 3676240 3555868 3974269 4318640 4252566 4272095 3969834 4214243 5079129
14084 5079129 4730509 4687243 4686937 3871094 3685559 4233680 3954140 4807717 4523962 3641354
14074 3641354 3586889 3680761 4205055 3855983 3551727 3870819 4485361 4871538 4380264 4851429
14064 4851429 5309934 4653333 4021809 4007803 4367335 4403523 4517327 4627017 3616999 3471874
14054 3471874 4241423 4091116 4627347 4296716 4290002 4570296 4773879 4692398 4385651 4005457
14044 4005457 4499885 4367747 3943323 3915918 3965215 4842017 4621678 4429867 4375615 4570504
14034 4570504 4914638 4199160 4130909 3755273 3161603 3836884 3980099 3954735 4117421 3826133
14024 3826133 3763267 3845783 3448901 3961750 3821486 3480149 3570564 3603010 3858600 3240182
14014 3240182 3739635 4099730 3660152 4112953 4173676 4395287 4829882 4099954 4280073 4056533
14004 4056533 3942807 4446315 4005988 4162473 4153517 3743246 4362407 4218561 4450949 4431515
13994 4431515 3821422 4182325 4144859 4099341 4367427 4453184 4513997 4342348 3930123 4274640
13984 4274640 4525125 4506895 4607815 4540438 4359536 3956004 3869037 4464832 3704285 4278974
13974 4278974 4574396 3962739 4521811 4436734 4165404 4101601 3200283 3569983 4031223 4183327
13964 4183327 4141119 3831166 4843415 4430408 4081767 4223471 3492409 3249939 3810772
13955 3810772 4333425 4862427 4101399 4109317 4192550 3768564 4283750 4048480 3965953 4272272
13945 4272272 3702013 4362742 4067252 4305453 4613238 4018798 4560399 3456060 4155115
13936 4155115 4786646 3833487 4778667 4281121 3589565 3777789 3659510 4406808 4583315
13927 4583315 4116541 4934291 4530164 4520274 4362003 4424279 4290030 3916772 4672050 4278319
13917 4278319 3953119 4139951 3702066 4174910 4141467 3624697 4214440 3949113 3972625 4671102
13907 4671102 3578274 3858542 4270004 4522118 5278942 4676653 3995344 4284956 4528398
13898 4528398 4007932 3935998 4545747 4709203 4036598 4099531 3677936 4368718 4642437 4452544
13888 4452544 4685505 4307959 4224368 4180265 3888480 4576536 4498083 3885681 4027335 4357718
13878 4357718 4101460 4374566 3987097 3592568 3846875 3884327 3816866 3781525 4109567 3750899
13868 3750899 3687149 4062927 4019396 4382392 4438546 4184602 4097754 4463742 4204178 3591305
13858 3591305 3922171 3819522 4293995 4632384 4302181 4449356 5108624 5295806 4858591
13849 4858591 4615311 4224265 4769907 4585405 4142697 4180130 3699326 3388739 3131630 3069705
13839 3069705 3832447 3850360 3869984 4162432 3840232 4063143 4705937 4527635 5028636 5129360
13829 5129360 4924756 4689131 4202550 3740678 4074435 4665165 4308177 3976069 4221260
13820 4221260 4250734 4168117 4392388 3996900 3959174 3747880 4167549 4111795 4138370 4364387
13810 4364387 4693213 4296299 3640945 3561528 3367579 3905258 3807613 3935237 4199857 4147922
13800 4147922 3739774 3680683 4177641 3953234 4187070 4144268 4459450 5113548 5156238 4411283
13790 4411283 4051108 4006403 4004327 3897677 3968098 4279986 4204372 3955754 3864147 4495107
13780 4495107 4329589 4744003 3941597 3644396 3619715 3539852 4274464 4461920 4329093 4366870
13770 4366870 4408827 3860200 4079262 4350271 4160943 4680575 4503896 4456875 4734284 4662434
13760 4662434 4348528 4002228 3881329 3082337 3858669 4504226 4100963 4651883 4537979
13751 4537979 4218876 4129524 4025169 4107237 3954477 4257105 4679012 4725885 4752481 4355871
13741 4355871 4051571 4207289 4337890 5009851 4732670 4529806 4843815 4551862 4625245 4322407
13731 4322407 3945565 4603838 4028426 4185263 4664272 4423938 4050497 4163537 3948863
$$ [...]
##END NTUPLES=NMR SPECTRUM
##END=
