##TITLE=1H_DE-80H_X3
 200.13MHz, d2o
 8 sc
 
 19ns.26.2.2025
##JCAMPDX= 6.0         $$ Bruker NMR JCAMP-DX V2.0
##DATA TYPE= NMR SPECTRUM
##DATA CLASS= NTUPLES
##ORIGIN= UXNMR, Bruker Analytische Messtechnik GmbH
##OWNER= pz
$$ XWIN-NMR		Version 3.5
$$ Wed Jul 22 14:03:18 2026 Russian Standard Time (UT+4h)  Yarkov@DPX200
##.OBSERVE FREQUENCY= 200.1313
##.OBSERVE NUCLEUS= ^1H
##.ACQUISITION MODE= SIMULTANEOUS
##.ACQUISITION SCHEME= undefined
##.AVERAGES= 8
##.DIGITISER RES= 18
##SPECTROMETER/DATA SYSTEM= spect
##.PULSE SEQUENCE= zg30
##.SOLVENT NAME= DMSO
##.SHIFT REFERENCE= (INTERNAL, DMSO, 0, 15.4924)
##AUDIT TRAIL= $$ (NUMBER, WHEN, WHO, WHERE, WHAT)
$$ ##TITLE= Audit trail, XWIN-NMR		Version 3.5
$$ ##JCAMPDX= 5.01
$$ ##ORIGIN= Bruker BioSpin GmbH
$$ ##OWNER= Yarkov
$$ C:/Bruker/XWIN-NMR/data/yarkov2/nmr/H-C/1/pdata/1/auditp.txt
$$ ##AUDIT TRAIL=  $$ (NUMBER, WHEN, WHO, WHERE, WHAT)
(   1,<2026-07-22 14:02:08.28 +0400>,<Yarkov>,<DPX200>,
      <created by zg, POWCHK disabled, PULCHK disabled
       configuration hash MD5:
       00 E9 B6 7A A2 85 ED C7 34 08 36 98 17 FE 4E 26
       data hash MD5: 16K
       45 D9 A5 5E 4B 44 FD 2A C0 2A 8A 3F 9F 10 66 61>)
(   2,<2026-07-22 14:02:35.17 +0400>,<Yarkov>,<DPX200>,
      <Start of raw data processing
       efp BC_mod = 2 LB = 0.25 FT_mod = 6 PKNL = 1 PHC0 = -7264.547 PHC1 = 21.42198 SI = 16K 
       data hash MD5: 16K
       91 8D 10 B1 73 9F 7C 4F D4 AC B9 2E 5B FE CD A9>)
(   3,<2026-07-22 14:02:45.57 +0400>,<Yarkov>,<DPX200>,
      <abs ABSG = 5 
       data hash MD5: 16K
       82 FA 34 2D 26 37 B6 0E 8E 13 2B 89 A9 A6 B2 B5>)
$$ ##END=
$$ 
$$ hash MD5
$$ 6A 39 D5 87 21 E2 AB 04 A5 6C F3 9A BD 3F EC 15
##$RELAX= 
##$RELAX= 
##$RELAX= 
##$RELAX= 
##$RELAX= 
##$RELAX= 
$$ Bruker specific parameters
$$ --------------------------
##$DU= <C:/Bruker/XWIN-NMR>
##$EXPNO= 1
##$NAME= <H-C>
##$PROCNO= 1
##$TYPE= <nmr>
##$USER= <yarkov2>
##$AMP= (0..31)
100 100 100 100 100 100 100 100 100 100 100 100 100 100 100 100 100 100 
100 100 100 100 100 100 100 100 100 100 100 100 100 100 
##$AQSEQ= 0
##$AQ_mod= 1
##$AUNM= <au_zg>
##$AUTOPOS= <>
##$BF1= 200.13
##$BF2= 200.13
##$BF3= 200.13
##$BF4= 200.13
##$BF5= 200.13
##$BF6= 200.13
##$BF7= 200.13
##$BF8= 200.13
##$BYTORDA= 1
##$CFDGTYP= 0
##$CFRGTYP= 5
##$CHEMSTR= <none>
##$CNST= (0..31)
1 1 145 1 1 1 1 1 1 1 1 1 1 1 1 1 1 1 1 1 1 1 1 1 1 1 1 1 1 1 1 1 
##$CPDPRG= <>
##$CPDPRG1= <>
##$CPDPRG2= <>
##$CPDPRG3= <>
##$CPDPRG4= <mlev>
##$CPDPRG5= <mlev>
##$CPDPRG6= <mlev>
##$CPDPRG7= <mlev>
##$CPDPRG8= <mlev>
##$CPDPRGB= <>
##$CPDPRGT= <>
##$D= (0..31)
0 0.7 0 0 0 0 0 0 0 0 0 0.03 0 0 0 0 0 0 0 0 0 0 0 0 0 0 0 0 0 0 0 0 
##$DATE= 1784714527
##$DBL= (0..7)
120 120 120 120 120 120 120 120 
##$DBP= (0..7)
150 150 150 150 150 150 150 150 
##$DBP07= 0
##$DBPNAM0= <>
##$DBPNAM1= <>
##$DBPNAM2= <>
##$DBPNAM3= <>
##$DBPNAM4= <>
##$DBPNAM5= <>
##$DBPNAM6= <>
##$DBPNAM7= <>
##$DBPOAL= (0..7)
0.5 0.5 0.5 0.5 0.5 0.5 0.5 0.5 
##$DBPOFFS= (0..7)
0 0 0 0 0 0 0 0 
##$DE= 6
$$ [...]
##$SUBNAM3= <"">
##$SUBNAM4= <"">
##$SUBNAM5= <"">
##$SUBNAM6= <"">
##$SUBNAM7= <"">
##$SUBNAM8= <"">
##$SUBNAM9= <"">
##$SW= 18.0517328524113
##$SWIBOX= (0..15)
0 0 2 0 0 0 0 0 0 0 0 0 0 0 0 0 
##$SW_h= 3612.71676300578
##$TD= 16384
##$TD0= 1
##$TE= 0
##$TE2= 300
##$TE3= 300
##$TEG= 300
##$TL= (0..7)
0 120 120 120 120 120 120 120 
##$TP= (0..7)
150 150 150 150 150 150 150 150 
##$TP07= 0
##$TPNAME0= <>
##$TPNAME1= <>
##$TPNAME2= <>
##$TPNAME3= <>
##$TPNAME4= <>
##$TPNAME5= <>
##$TPNAME6= <>
##$TPNAME7= <>
##$TPOAL= (0..7)
0.5 0.5 0.5 0.5 0.5 0.5 0.5 0.5 
##$TPOFFS= (0..7)
0 0 0 0 0 0 0 0 
##$TUNHIN= 0
##$TUNHOUT= 0
##$TUNXOUT= 0
##$USERA1= <user>
##$USERA2= <user>
##$USERA3= <user>
##$USERA4= <user>
##$USERA5= <user>
##$V9= 5
##$VALIST= <valist>
##$VCLIST= <CCCCCCCCCCCCCCC>
##$VD= 0
##$VDLIST= <DDDDDDDDDDDDDDD>
##$VPLIST= <PPPPPPPPPPPPPPP>
##$VTLIST= <TTTTTTTTTTTTTTT>
##$WBST= 1024
##$WBSW= 4
##$XGAIN= (0..3)
0 0 0 0 
##$XL= 0
##$YL= 0
##$YMAX_a= 91401
##$YMIN_a= -161353
##$ZGOPTNS= <>
##$ZL1= 120
##$ZL2= 120
##$ZL3= 120
##$ZL4= 120
##$ABSF1= 15.51772
##$ABSF2= -2.534129
##$ABSG= 5
##$ABSL= 3
##$ALPHA= 0
##$AQORDER= 0
##$ASSFAC= 0
##$ASSFACI= 0
##$ASSFACX= 0
##$ASSWID= 0
##$AUNMP= <proc_1d>
##$AZFE= 0.1
##$AZFW= 0.1
##$BCFW= 0
##$BC_mod= 2
##$BYTORDP= 0
##$COROFFS= 0
##$CY= -3
##$DATMOD= 1
##$DC= 0
##$DFILT= <>
##$DTYPP= 0
##$F1P= 0
##$F2P= 0
##$FCOR= 1
##$FTSIZE= 16384
##$FT_mod= 6
##$GAMMA= 0
##$GB= 0
##$INTBC= 1
##$INTSCL= 3.241238e-09
##$ISEN= 128
##$LB= 0.25
##$LEV0= 0
##$LPBIN= 0
##$MAXI= 10000
##$MC2= 0
##$MEAN= 0
##$ME_mod= 0
##$MI= 1.114404
##$NCOEF= 0
##$NC_proc= -9
##$NLEV= 6
##$NOISF1= 3.799351
##$NOISF2= 2.8
##$NSP= 0
##$NTH_PI= 0
##$NZP= 0
##$OFFSET= 15.49237
##$PC= 1
##$PHC0= -7264.547
##$PHC1= 21.42198
##$PH_mod= 1
##$PKNL= yes
##$PPARMOD= 0
##$PSCAL= 0
##$PSIGN= 0
##$REVERSE= no
##$SF= 200.13000587021
##$SI= 16384
##$SIGF1= 3
##$SIGF2= 2
##$SINO= 0.751879
##$SIOLD= 32768
##$SREGLST= <19F.Aceton>
##$SSB= 0
##$STSI= 16384
##$STSR= 0
##$SW_p= 3612.71676300578
##$SYMM= 0
##$S_DEV= 0
##$TDeff= 16384
##$TDoff= 0
##$TI= <>
##$TILT= no
##$TM1= 0
##$TM2= 0
##$TOPLEV= 0
##$USERP1= <user>
##$USERP2= <user>
##$USERP3= <user>
##$USERP4= <user>
##$USERP5= <user>
##$WDW= 1
##$XDIM= 16384
##$YMAX_p= 503535549
##$YMIN_p= -1996952
$$ End of Bruker specific parameters
$$ ---------------------------------
##NTUPLES= NMR SPECTRUM
##VAR_NAME=  FREQUENCY,     SPECTRUM/REAL,   SPECTRUM/IMAG
##SYMBOL=    X,             R,               I
##VAR_TYPE=  INDEPENDENT,   DEPENDENT,       DEPENDENT
##VAR_FORM=  AFFN,          ASDF,            ASDF
##VAR_DIM=   16384,         16384,           16384
##UNITS=     HZ,            ARBITRARY UNITS, ARBITRARY UNITS
##FACTOR=    0.220516191357247, 1,           1
##FIRST=     3100.48802935708, 0,            0
##LAST=      -512.228733648697, 0,           0
##MIN=       -512.228733648697, -1996952,    0
##MAX=       3100.48802935708, 503535549,    0
$$ Real data points
##PAGE= N=1
##DATA TABLE= (X++(R..R)), XYDATA
$$ [...]
5008B5289378O20739J413025J321219J097038O78182O30305J915148J905862K339717
4999C7210613L517258M508177M230027M072166K787436L279183K452159J595128
4991F3652147R28980R07360l38722j013655j727151k256946k576055l068278k929776
4982E1577904l037299k903762k557873k442752j812569j150195j251402m44787
4974C5977265m23452J39133N11154J084709O60505J554886J865910K916009K982991
4965D7269110K626895L050792K857296K820153J677853R20616J142687J348840
4957F3714242Q33512L98274p77289j060542j790050l023912l432777l222823l267535
4948D8371100l180344k531372k159225k705176j423332j173434k88086n50907
$$ plain form
5008 25289378 25910117 27323142 28644361 29741399 30419581 31049886 32965034 34870896 37210613
4999 37210613 40727871 45236048 49466075 53538241 56325677 59604860 62057019 63652147
4991 63652147 64581127 65488487 65149765 64136110 62408959 60152013 57575958 54507680 51577904
4982 51577904 48540605 45636843 43078970 40636218 38823649 37673454 36422052 35977265
4974 35977265 35553813 35692946 36204100 37288809 37949314 39504200 41370110 44286119 47269110
4965 47269110 49896005 52946797 55804093 58624246 60302099 61222715 62365402 63714242
4957 63714242 64547754 64946028 64168739 63108197 61318147 58294235 54861458 51638635 48371100
4948 48371100 45190756 42659384 40500159 37794983 36371651 35198217 34910131 34359224
4940C4359224j081718m43888J7710K31166J26044J157108M55170M99450R94897
4931C6315163L29961Q84042N48299k92419K39692k29489N63982N4462M60896j143655
4921C7730934n08941l17430o09460l73765r99638j027782q92288l92573n58944
4912C2050113q46177j7150J28019l53520J21724n71929l96766J26167r53625r01870
4902B8384986n18485K05907l74472r66347j96892M45423L21144j37997k25047
4893B6938220j05746J07989j08949j01465L76918o2504P7721N8827N08421l75634
4883B7313798J9111M42356P48555k26915m58987N56772J62154L1484o5225J69613
4873B8692716k3100L90643j36244K72982J55855M41768R20550J11692m9963J02062
$$ plain form
4940 34359224 33277506 32833618 32851328 33082494 33208538 34365646 34820816 35320266 36315163
4931 36315163 36645124 37529166 38077465 37785046 38024738 37795249 38359231 38413693 38874589 37730934
4921 37730934 37221993 36904563 36295103 35921338 34921700 33893918 33001630 32609057 32050113
4912 32050113 31203936 31186786 31314805 30961285 31083009 30511080 30114314 30240481 29286856 28384986
4902 28384986 27866501 28072408 27697936 26731589 26534697 26980120 27301264 27163267 26938220
4893 26938220 26832474 26940463 26831514 26730049 27106967 27044463 27122184 27181011 27689432 27313798
4883 27313798 27332909 27775265 28523820 28296905 27837918 28394690 28556844 28588328 28523103 28692716
4873 28692716 28669616 29060259 28924015 29196997 29352852 29794620 30715170 30826862 30776899 30878961
4863C0878961L36099M02341J87686O62994O10837P66299K36848P38557J54615
4854C4975237M21266M5971K74495K52113J69537L90670J35938k13355K9362Q53025
4844C7334259J401703N99224N99844J679681J761871J876177J934617J773421
4836D8960797J954118K833344L509453L567300N879627R390510J2227797J5850036
4828A04172982J7072626J4532044P086669J983976j537615n666724r959498j1895492
4820A15788968j0610429r193161p846311n721626m083591k712405r36315o40352
4812G4044778M26315k4538k20646N07896j10817N45446P45215K4599J60386o68826
4802G5429808J31854M84891L43092N2488l55397n41061q64335p18288o01937n90758
$$ plain form
4863 30878961 31215060 31617401 31805087 32468081 33078918 33845217 34082065 34820622 34975237
4854 34975237 35396503 35442474 35716969 35969082 36138619 36529289 36665227 36451872 36481234 37334259
4844 37334259 38735962 39335186 39935030 41614711 43376582 45252759 47187376 48960797
4836 48960797 50914915 53748259 57257712 60825012 66704639 76095149 88322946 104172982
4828 104172982 121245608 135777652 142864321 144848297 143310682 137643958 127684460 115788968
4820 115788968 105178539 95985378 88139067 82417441 78333850 75621445 74685130 74044778
4812 74044778 74471093 74446555 74225909 74733805 74622988 75168434 75913649 75938248 76098634 75429808
4802 75429808 75561662 76046553 76389645 76442133 76086736 75545675 74681340 73963052 73361115 72770357
4792G2770357n33160p01058p06452o86642m25371o60304l00632o46317n21604
4783F7588817k46743m84695L0583k57987n79026m10925J0867k15096r97709q09858
4773F3628228n77716j304293j136357m57214m68054o76728m71854j132937p93136
4764E6609939m18195p19091j111670p61501p67153n09749n44479j88532j17884
4755E1471685j62230k97535l28484M84615L73160K84395M08675P75784J226871
4746E4236936j54722K45047O07276M60277J648045R00445N39334J078034P30727
4737F0291399O76990J178507J543613J352287P90708Q06323P27691N21316J053746
4728F8942580J590872J676774J180377Q94372J035769J155063K073874J436089
$$ plain form
4792 72770357 72237197 71536139 70829687 70143045 69717674 69057370 68756738 68110421 67588817
4783 67588817 67342074 66857379 66887962 66629975 66050949 65640024 65650891 65435795 64438086 63628228
4773 63628228 63050512 61746219 60609862 60152648 59684594 59007866 58536012 57403075 56609939
4764 56609939 56191744 55472653 54360983 53599482 52832329 52322580 51778101 51589569 51471685
4755 51471685 51309455 51011920 50683436 51168051 51541211 51825606 52234281 53010065 54236936
4746 54236936 54082214 54327261 54934537 55394814 57042859 57943304 58482638 59560672 60291399
4737 60291399 60968389 62146896 63690509 65042796 65833504 66639827 67367518 67888834 68942580
4728 68942580 70533452 72210226 73390603 74284975 75320744 76475807 78549681 79985770
4720G9985770J138280K043335J737128J307726J817505J965335J670671J944773
4712I3610523K216288J624861J554631J344514R52565Q55419J309300J318360
4704A04786461P74206R51598P04480Q26729J302808J083635K23915j50379l69329
4695A10134124m7887l75154j034929j082853o55357j065925j437946j484720q55065
4686A02094288r84033j784465j925482j959088j998154k367049j759166j192058
4678H8124793j868463k286432j563023k016080j924817j401094j839402j854795
4670G3370687k005388k649919k230006j135212k028846k017695j824557k163859
4662E7315205j967931j913373j888629j721231j644521j379472j964474j681205
$$ plain form
4720 79985770 81124050 83167385 84904513 86212239 88029744 89995079 91665750 93610523
4712 93610523 95826811 97451672 99006303 100350817 101303382 102158801 103468101 104786461
4704 104786461 105560667 106512265 107216745 108043474 109346282 110429917 110653832 110503453 110134124
4695 110134124 110086237 109711083 108676154 107593301 106937944 105872019 104434073 102949353 102094288
4686 102094288 101110255 99325790 97400308 95441220 93443066 91076017 89316851 88124793
4678 88124793 86256330 83969898 82406875 80390795 78465978 77064884 75225482 73370687
4670 73370687 71365299 68715380 66485374 65350162 63321316 61303621 59479064 57315205
4662 57315205 55347274 53433901 51545272 49824041 48179520 46800048 44835574 43154369
4654D3154369j371966j289356j084379j367866o97470j058944j413389j255200
4646C3615799k26759o75268q75466q08557l94655n18216q16324n37819j46815
4637B8615920j148793J34828N94995K31003L69306J38366N39006J188358K150563
4628C2813552K870406M071008L675800J596828K46753m04845j330775k205737
4620D1332990k933346l002358k125806j246728j485861o78845n11401N13182J400768
4611C1262595J885727K000705J754666J318042J633872J945284J645697K449863
4603D5896451K457972K109859L419584K747024K174865R59644J092361J972726
4595F2830486J933611K214536K055199K365319J276573N25086n98599r15723j305748
$$ plain form
4654 43154369 41782403 40493047 39408668 38040802 37343332 36284388 34870999 33615799
4646 33615799 33389040 32713772 31838306 31029749 30635094 30116878 29300554 28762735 28615920
4637 28615920 27467127 27601955 28196950 28427953 28797259 28935625 29474631 30662989 32813552
4628 32813552 35683958 39754966 43430766 45027594 45274347 44869502 43538727 41332990
4620 41332990 38399644 35397286 33271480 32024752 30538891 29860046 29348645 29861827 31262595
4611 31262595 33148322 35149027 36903693 38221735 39855607 41800891 43446588 45896451
4603 45896451 48354423 50464282 53883866 56630890 58805755 59765399 60857760 62830486
4595 62830486 64764097 66978633 69033832 71399151 72675724 73200810 72602211 71686488 70380740
4586G0380740j802991j529447j421456k227738j408239j738260k843788l183442
4578E4225379l374373l052739k095891k273551k297934k155117k838245k624502
4570C3513027k179680k409185k222067j791339k194899j489312j538976r78619
4562A8708950r14311j161054n19042j85668o39012p9976l83573o98195M89459
4553A4617578o12100o02806K01443j96151k24036q88246J53719J85131p7488J55885
4543A2712929l11369q1099L8804k93723m40846p17737L8386K3228k62943j6708
4533A0688922k83830k53373k32925n16285j70851P8611N84067J31496J83891p17771
4523I491952j63344J72027k19388N97736J08149r127r35652L6487n0312L42136
$$ plain form
4586 70380740 68577749 67048302 65626846 63399108 61990869 60252609 57408821 54225379
4578 54225379 50851006 47798267 45702376 43428825 41130891 38975774 36137529 33513027
4570 33513027 31333347 28924162 26702095 24910756 22715857 21226545 19687569 18708950
4562 18708950 17794639 16633585 16114543 15928875 15289863 15209887 14826314 14128119 14617578
4553 14617578 14005478 13402672 13604115 13407964 13183928 12295682 12449401 12634532 12557044 12712929
4543 12712929 12401560 12320461 12359265 12065542 11624696 10906959 10945345 10968573 10705630 10688922
4533 10688922 10405092 10151719 9918794 9402509 9231658 9310269 9894336 10025832 10209723 9491952
4523 9491952 9328608 9500635 9281247 9878983 9987132 9978005 9042353 9078840 9028528 9370664
4513I370664j16851k36377m11241N44898j88593j015045l00979L66861Q6149p587
4503H091899j35102L22136j20066j78309L04172k03713k33123J45667K29877m95884
4493G727554l69196r132J021675M17916r31290r5365N83691j4884J19057l59124
4483H090902O65541j157103j42626l57728l86569N27646m5924n6631n03396K47962
4473F882074K68542j86732p1778J79545n16311K94118l33521P5608J94893K14461
4463G000899K96325J14657k01441j3418q252o3779O33554L59035r2928K56691
4453H281343K50064n71891j34518M2064j28719K06561J04825l71524l71409K7915
4443G334711J63444k68971M3476M66974K39471m27126n71078j92527N38971M40117
$$ plain form
4513 9370664 9253813 9017436 8606195 9151093 8962500 7947455 7646476 8013337 8099486 8091899
4503 8091899 7956797 8278933 8158867 7980558 8284730 8081017 7847894 7993561 8223438 7727554
4493 7727554 7358358 7349226 8370901 8788817 7857527 7762162 8345853 8330969 8450026 8090902
4483 8090902 8756443 7599340 7456714 7098986 6712417 7240063 7194139 7137508 6634112 6882074
4473 6882074 7150616 6963884 6892106 7071651 6555340 6849458 6515937 6591545 6786438 7000899
4463 7000899 7297224 7411881 7210440 7197022 7188770 7124991 7758545 8117580 8024652 8281343
4453 8281343 8531407 7959516 7824998 7867062 7738343 7944904 8049729 7678205 7306796 7334711
4443 7334711 7498155 7229184 7272660 7739634 7979105 7551979 6980901 6788374 7327345 7767462
4433G767462O47049n70660m18961L88176J17093K49040k47532j76349J46243J50252
4423H051813J02240M2494J16220j66329m26050J50288K02292J48373L11850k0369
4413H512822P0391k88688J7500N4831m28894L60038J56544K16443o6198k45674
4403H359115J10559O7598j23454k05466O84600j77111l76811L32493j24559l18991
4393H227973j30010M70297J99130K86569l64490j02901L07499M67320k85871k28934
4383H846582L05481n04714K31051L21080l02141k83354N25252K00197p1450N36065
4373I804049K18642l88975N45863N67758m40037O85023L93566o25997m52232N07249
4363A0814909P37307L63899l99545N44406Q55375N85034Q29638p1631M81342N32419
$$ plain form
4433 7767462 8414511 7843851 7424890 7813066 7930159 8179199 7931667 7755318 7901561 8051813
4423 8051813 8154053 8196547 8312767 8146438 7720388 7870676 8072968 8221341 8533191 8512822
4413 8512822 8583213 8294525 8312025 8366856 7937962 8298000 8454544 8670987 8604789 8359115
4403 8359115 8469674 8537272 8413818 8208352 8892952 8715841 8339030 8671523 8546964 8227973
4393 8227973 8097963 8568260 8767390 9053959 8689469 8586568 8894067 9361387 9075516 8846582
4383 8846582 9152063 8647349 8878400 9199480 8897339 8613985 9139237 9339434 9267984 9804049
4373 9804049 10022691 9633716 10179579 10747337 10307300 10992323 11385889 10759892 10307660 10814909
4363 10814909 11552216 11916115 11516570 12060976 12916351 13501385 14331023 14259392 14740734 15273153
4353A5273153l5647J70869m44092j63167l01056J29473j89171q1719K40025j36195
4343A4462473O12446K54198R27132j17499k09994N14351M93682J9297J28013P28829
4333A7812928M74294L49483K96525J158557L75580P57354P87372O59829J244545
4324B3916467O63070R48521J188202J635139J455910R98896J420872J681319K178352
4315C6086748J659303J259576J920011J778949J715001J804304K607729J772707
4307E0604328J925957K633042K459737J956383L323345L050288K970521K999118
4299G1922719K956325K979663K886656L189580L095386L199449K971451L271149
4291I6472378L401649L493357K908402L483538L209866K555577L459419L061541
$$ plain form
4353 15273153 15237506 15408375 14964283 14801116 14500060 14629533 14440362 14358643 14598668 14462473
4343 14462473 15074919 15329117 16256249 16138750 15928756 16443107 16936789 16956086 17084099 17812928
4333 17812928 18287222 18636705 18933230 20091787 20467367 21224721 22012093 22671922 23916467
4324 23916467 24579537 25528058 26716260 28351399 29807309 30806205 32227077 33908396 36086748
4315 36086748 37746051 39005627 40925638 42704587 44419588 46223892 48831621 50604328
4307 50604328 52530285 55163327 57623064 59579447 62902792 65953080 68923601 71922719
4299 71922719 74879044 77858707 80745363 83934943 87030329 90229778 93201229 96472378
4291 96472378 99874027 103367384 106275786 109759324 112969190 115524767 118984186 122045727
4283A22045727K281956K178273K279836J278798J769931K032718J095027J814539
4275A36776805J255268J302963O18103N92900J121920L38595J47082n51170l26149
4266A41276317m35529j008500r44720j050193j480008j459160j671326j144172
4258A32082709j414889j489493j693867k574504k291475k324855j957146k085567
4250A16250913k095141k568952k623955k742503j846699k365908l080611j811558
4242I7115586j769658k387139k278358k167212j861723k333171j447086j557853
4234H1313386j927195k261175k204325j672329j482662p26664j355980j554153
4226F8128903j521422j748674j477230j135946j211089j255172n59900q58782
$$ plain form
4283 122045727 124327683 126505956 128785792 130064590 131834521 133867239 134962266 136776805
4275 136776805 138032073 139335036 139953139 140546039 141667959 142006554 142153636 141602466 141276317
4266 141276317 140840788 139832288 138887568 137837375 136357367 134898207 133226881 132082709
4258 132082709 130667820 129178327 127484460 124909956 122618481 120293626 118336480 116250913
4250 116250913 114155772 111586820 108962865 106220362 104373663 102007755 98927144 97115586
4242 97115586 95345928 92958789 90680431 88513219 86651496 84318325 82871239 81313386
4234 81313386 79386191 77125016 74920691 73248362 71765700 71039036 69683056 68128903
4226 68128903 66607481 64858807 63381577 62245631 61034542 59779370 59219470 58360688
4218E8360688r62244r29763j048171r36178q93781n81157r63827p41484m12727
4209E0891356k1961m20876j058280l62245n66855j08108J89978k79448P4775J1987
4199D8350323m57383M83733q7631M03290L78962L68855O10210Q31920J016926
4190E1899205N35518N28020N23571M40320L34650N87121Q02580N89410J62907
4181E6403302O30329M171J20320K2796L01250Q10197N15751P38890J38295k33753
4171E9451548N29331M28668k18378M01374k19995p84288N06194k59443j06263
4162E9728748K86790O7925M3789Q15698K02086N78098j35624K84577J83211L01836
4152F2357134N65997L54422Q62123J068956J500623O20898J271606J973906K074346
$$ plain form
4218 58360688 57398444 56468681 55420510 54484332 53590551 53009394 52045567 51304083 50891356
4209 50891356 50869395 50448519 49390239 49027994 48461139 48353031 48543009 48263561 48338336 48350323
4199 48350323 47892940 48376673 48289042 48692332 49071294 49440149 50050359 50882279 51899205
4190 51899205 52434723 52962743 53486314 53926634 54261284 54848405 55650985 56240395 56403302
4181 56403302 57033631 57037802 57158122 57180918 57482168 58292365 58808116 59547006 59685301 59451548
4171 59451548 59980879 60409547 60191169 60592543 60372548 59588260 60094454 59835011 59728748
4162 59728748 60015538 60083463 60127252 60942950 61145036 61723134 61587510 61872087 62055298 62357134
4152 62357134 62923131 63277553 64139676 65208632 66709255 67330153 68601759 70575665 72650011
4143G2650011J629098J707852J860037K237382K099708K053370K206350K103309
4135H8547117K040272K340076K874234K736580K194333K106097K774805K180622
4127A07794136J630125J919201K662915K137103J632389J702886J403197J073570
4119A21955522M41541Q24704R59006M47961Q44988O65773J084268P80764J030435
4110A29034962P60711P44105N95293Q19582J193494O19637J076052P44546J358994
4101A36947376J566396Q84181J882669K419525J727154K628090K190904K780431
4093A53026726K762069J995704K754027K024634J940383J960693J838127J976110
4085A70278473J290068J268482J207216J629636J907817J285830R65444Q37365
$$ plain form
4143 72650011 74279109 75986961 77846998 80084380 82184088 84237458 86443808 88547117
4135 88547117 90587389 92927465 95801699 98538279 100732612 102838709 105613514 107794136
4127 107794136 109424261 111343462 114006377 116143480 117775869 119478755 120881952 121955522
4119 121955522 122397063 123221767 124180773 124628734 125473722 126139495 127223763 128004527 129034962
4110 129034962 129795673 130539778 131135071 131954653 133148147 133767784 134843836 135588382 136947376
4101 136947376 138513772 139397953 141280622 143700147 145427301 148055391 150246295 153026726
4093 153026726 155788795 157784499 160538526 162563160 164503543 166464236 168302363 170278473
4085 170278473 171568541 172837023 174044239 175673875 177581692 178867522 179832966 180670331
4077A80670331L39681j0858j56463K4151n94164n41220J61091p30713p70599m98746
4067A77892491m27511p46105j22772k22656J6460L25861R4011L32663J025791
4058A78168233J648093J947347K649721K619694K452607L452944L148775K440481
4050A98527895K731639K553895K668430K360329K881729L414510L632927L529714
4042B22301068L793428L617005L451407L130052L263707K730186K517775K516347
4034B47320975J573714J847464K563510J838270J475984K104219K720541J580315
4026B63024992J056343M32556j16482o0544j058441j957821j283297j621556k491643
4017B55924107j746241j674964j351422j500352j625044j119064j179881j443364
$$ plain form
4077 180670331 181010012 180999154 180842691 180866842 180272678 179731458 179892549 179161836 178391237 177892491
4067 177892491 177464980 176718875 176596103 176373447 176389907 176715768 176809779 177142442 178168233
4058 178168233 179816326 181763673 184413394 187033088 189485695 192938639 196087414 198527895
4050 198527895 201259534 203813429 206481859 208842188 211723917 215138427 218771354 222301068
4042 222301068 226094496 229711501 233162908 236292960 239556667 242286853 244804628 247320975
4034 247320975 248894689 250742153 253305663 255143933 256619917 258724136 261444677 263024992
4026 263024992 264081335 264513891 264397409 264336865 263278424 261320603 260037306 258415750 255924107
4017 255924107 254177866 252502902 251151480 249651128 248026084 246907020 245727139 244283775
4009B44283775k079725k666409k820834k344483l040716l569082l443931l748883
4001B20569712l952452l784875m260512m009602l249892m166224m357189m182432
3993A88606534m163038l686341m324369l790319l782866l920181l549815l741814
3985A57647791l583297k567354l012358k725334l087538k171281j658831k238016
3977A36603782j465508j227930j827003j127537j243631j444042r79286q92327
3969A26396518j471337j281780j608161p55811n71756r27006j142713j090948
3961A17547006q31909q31766P0536q9834M81817J24439J320107O33407J58070
3952A18581873j211807j757077l112663k873683l294224l434571l457278k872053
$$ plain form
4009 244283775 242204050 239537641 236716807 234372324 231331608 227762526 224318595 220569712
4001 220569712 216617260 212832385 208571873 204562271 201312379 197146155 192788966 188606534
3993 188606534 184443496 180757155 176432786 172642467 168859601 164939420 161389605 157647791
3985 157647791 154064494 151497140 148484782 145759448 142671910 140500629 138841798 136603782
3977 136603782 135138274 133910344 132083341 130955804 129712173 128268131 127288845 126396518
3969 126396518 124925181 123643401 122035240 121279429 120707673 119780667 118637954 117547006
3961 117547006 116715097 115883331 115953867 115864033 116345850 116470289 117790396 118423803 118581873
3952 118581873 117370066 115612989 112500326 109626643 106332419 102897848 99440570 96568517
3944I6568517k551430k600447k048904k100000j963113j670239j949256j291332
3936H0393796j401906j037424j093343j335450p22024n12279j067372L72075M80949
3927G4077022K92144J177563J539327J734847K101939P09433l07504m95662j278231
3918G9550878j537341j988882k031756j864910p82431q22928j388181q51733L79984
3909F8662700j32819m03194J7236m93295P54882O46454L49905K15115L52383K24685
3899G0194052J96309J5186O07986N16913L21614Q41075O0957M33890N12374J249588
3889G4949944O28841N88027R26987O23374P61558O52830J650045J099698J525975
3880H3407279K258527K132495J285733J727446K384150K903166K762175L116541
$$ plain form
3944 96568517 94017087 91416640 89367736 87267736 85304623 83634384 81685128 80393796
3936 80393796 78991890 77954466 76861123 75525673 74803649 74291370 73223998 73596073 74077022
3927 74077022 74369166 75546729 77086056 78820903 80922842 81632275 81324771 80829109 79550878
3918 79550878 78013537 76024655 73992899 72127989 71345558 70522630 69134449 68282716 68662700
3909 68662700 68529881 68126687 68143923 67650628 68405510 69051964 69401869 69616984 69969367 70194052
3899 70194052 70390361 70405547 71013533 71530446 71852060 72693135 72754092 73187982 73700356 74949944
3889 74949944 75578785 76166812 77093799 77717173 78478731 79131561 80781606 81881304 83407279
3880 83407279 85665806 87798301 89084034 90811480 93195630 96098796 98860971 101977512
3872A01977512L771224L973190M712949M482840N709323N941050O182579O008911
3864A42759578P488532O877043P520065P977327P539152P195535P564207P281317
3856B02202756P904304Q040026Q132602Q051609Q663675R071317R474056Q845498
3848B70385843Q819300R301395R173697P981449O998388O125862N977573N193545
3840C29957052L272428K194998K334210J495701P37613J197485R59702n257J10145
3831C42254077J66960o41320q43668k122338l342489m353037n469578o611445
3823C19037162p960533q171478r160546r422920r691462r844363j0145595r457771
3815B45182494r043367q951797q912281q542314q320275r102452q475370q000595
$$ plain form
3872 101977512 105748736 109721926 114434875 118917715 124627038 130568088 136750667 142759578
3864 142759578 150248110 157125153 164645218 172622545 180161697 187357232 194921439 202202756
3856 202202756 210107060 218147086 226279688 234331297 242994972 252066289 261540345 270385843
3848 270385843 279205143 288506538 297680235 305661684 312660072 318785934 324763507 329957052
3840 329957052 333229480 335424478 337758688 339254389 339992002 341189487 342149189 342143932 342254077
3831 342254077 342421037 341779717 340936049 338813711 335471222 331118185 325648607 319037162
3823 319037162 311076629 302905151 293744605 284321685 274630223 264785860 254640265 245182494
3815 245182494 236139127 227187330 218275049 209732735 201412460 192310008 183834638 175834043
3807A75834043p371457p032696p055771o581571n093926m786040m189168l747042
3799A29976372k806418j599804k343032j796656j685859j283998j093401j728654
3791A15638550j703169k462985j570517j673142k097154k208334k204590j653492
3783A00065167j629274j559410j349607j440231j042897j286955j590724j825206
3775H8340863q03156j084637j534179j101162j289534j857812j081685j596321
3767G7992377j575941j203028r83952j294268j510238j233960j398479j286886
3759F7505625j119763j326373p37952p22791j218436p00248q6752m87920o32418
3750F0472972j097964o94581j50807J15182J3513l4513O42523P29642p31543L21702
$$ plain form
3807 175834043 168462586 161429890 154374119 147792548 142698622 137912582 133723414 129976372
3799 129976372 127169954 125570150 123227118 121430462 119744603 118460605 117367204 115638550
3791 115638550 113935381 111472396 109901879 108228737 106131583 103923249 101718659 100065167
3783 100065167 98435893 96876483 95526876 94086645 93043748 91756793 90166069 88340863
3775 88340863 87537707 86453070 84918891 83817729 82528195 80670383 79588698 77992377
3767 77992377 76416436 75213408 74229456 72935188 71424950 70190990 68792511 67505625
3759 67505625 66385862 65059489 64321537 63598746 62380310 61680062 61593310 61105390 60472972
3750 60472972 59375008 58680427 58529620 58644802 58658315 58623802 59266325 59995967 59264424 59586126
3740E9586126Q90323N25922L38913O35751K17726L65116R3440N74094K66737K67670
3730F3761818Q05179R01840N66647K02080j25314o49679J33960o72179o16822
3721F4307530L5441K3082n83850m38415j143703q49892l27646p41874j87765n99098
3711E9493810q00269o39461K7290L77436m62189m03462p18906j78306k42282K04941
3701E6658602m70324k1953k98376J63375M3700L18963J25637K24250J44086q3098
3691E6804862O30741P87825k60810m42440J9088J47891L86642l98214o14025j353853
3681E5707707r5549j589336o11018p50177j467573j101376p22321o47151j187115
3672D7536091j498133j519496r90052j181169n05236r19129j164637j177635r28736
$$ plain form
3740 59586126 60476449 61002371 61341284 61977035 62194761 62559877 62653317 63227411 63494148 63761818
3730 63761818 64566997 65468837 66035484 66237564 66112250 65462571 65596531 64924352 64307530
3721 64307530 64342971 64366053 63782203 63343788 62200085 61350193 61022547 60280673 60092908 59493810
3711 59493810 58693541 58054080 58081370 58458806 57996617 57593155 56874249 56695943 56453661 56658602
3701 56658602 56188278 56166325 55867949 56031324 56075024 56393987 56519624 56743874 56887960 56804862
3691 56804862 57435603 58223428 57962618 57520178 57539266 57687157 58073799 57675585 57061560 55707707
3681 55707707 55612158 54022822 53411804 52661627 51194054 50092678 49370357 48723206 47536091
3672 47536091 46037958 44518462 43528410 42347241 41842005 40922876 39758239 38580604 37651868
3663C7651868r87448p51546r42416q67209n56225p47448p82891o90095m64250
3654C0862340m73211o95605k84733j02858M97501n11436o70841M88614j4287p2275
3644B9023209k30461k89753J76568j29870l64632j80468j23011L98851P00839
3635B8981272l55145k18473m4947P255O334J97396l12729L07538j99815k80074
3625B8088612j76592Q5831n47800l89966L86106j46470k75286p87748l71912j37214
3615B5727561o15250r5529k66272j79646n03735n18475j68276k74362l15492m04771
3605B2385753K61764q9678n94695l93702o6377k69544k99798k26610j39481O40061
3595B1207693l7191l49666k04949m36925l70695K45520k40524j98445N69190N69734
$$ plain form
3663 37651868 36664420 35912874 34970458 34103249 33547024 32799576 32016685 31326590 30862340
3654 30862340 30389129 29693524 29408791 29305933 29803434 29291998 28621157 29109771 29095484 29023209
3644 29023209 28792748 28502995 28679563 28549693 28185061 28004593 27881582 28280433 28981272
3635 28981272 28626127 28407654 28362707 28369962 28376296 28573692 28260963 28568501 28368686 28088612
3625 28088612 27912020 27997851 27450051 27060085 27446191 27299721 27024435 26236687 25864775 25727561
3615 25727561 25112311 25016782 24750510 24570864 24067129 23548654 23380378 23106016 22790524 22385753
3605 22385753 22647517 22557839 21963144 21569442 21503065 21233521 20933723 20707113 20567632 21207693
3595 21207693 21170502 20820836 20615887 20178962 19808267 20053787 19813263 19614818 20184008 20753742
3585B0753742K10072J00835l8647o9465M16966L04758M30772k00357Q5575N86969
3575B2581220j37972L01192P27845M38682R21338R61363N03153O85210J83975
3566B7166006m18502p9286N7822m42574r18392k97460L57829l2976j52363j15508
3556B5124596N80781O73022q85427J35852K09349N272m8429Q16787j72539M43709
3546B6882973L07103j97030j80508J48156K49448K07566n0178l11932O400p1414
3536B6990584L26281K28914K46204J47255n55213J07570M40654K67958M99383
3527B8699590O52155J47923R51538M18232P60298J284502O91713Q97603J798030
3518C6301584J515260K406647K417217K778909L401170N138287O175530O167722
$$ plain form
3585 20753742 20963814 21064649 21026002 20956537 21373503 21678261 22109033 21908676 21994251 22581220
3575 22581220 22443248 22744440 23472285 23910967 24832305 25793668 26296821 26982031 27166006
3566 27166006 26747504 26668218 26726040 26283466 25365074 25067614 25425443 25392467 25240104 25124596
3556 25124596 25705377 26378399 25492972 25628824 25838173 25843445 25795016 26611803 26439264 26882973
3546 26882973 27190076 26993046 26812538 26960694 27210142 27417708 27367530 27055598 27061998 26990584
3536 26990584 27316865 27545779 27791983 27939238 27384025 27491595 27932249 28200207 28699590
3527 28699590 29351745 29499668 30451206 30869438 31629736 32914238 33605951 34503554 36301584
3518 36301584 37816844 40223491 42640708 45419617 48820787 53959074 60134604 66302326
3510F6302326P788698O406902N175026M795442K862779J445276k20282q60420
3502I3695747j812020k572559k441146j535051j828507r97576o24354K70959J028415
3493H3183908N82182J404144P24046J426183J284308J015421J312011J695316
3485I2627519J847101K718165L134713M094863M938766O881949Q879854J0227849
3477A35350779J0480071Q944657M759993J548516l24025m374284p577470p896969
3469A40911268r199935q089020q303079o111852n209824l598301k744279j753062
3461I5901916j495723j453367p8195m4192j34527K08158K089872J413245P67079
3452I7174266K537614K689903K790410L447977L281381L382513L155247L008513
$$ plain form
3510 66302326 74091024 80497926 85672952 90468394 93331173 94776449 94556167 93695747
3502 93695747 91883727 89311168 86870022 85334971 83506464 82508888 81884534 82155493 83183908
3493 83183908 83766090 85170234 85894280 87320463 88604771 89620192 90932203 92627519
3485 92627519 94474620 97192785 100327498 104422361 109361127 116243076 125122930 135350779
3477 135350779 145830850 154775507 159535500 161084016 160759991 156385707 148808237 140911268
3469 140911268 131711333 123622313 115319234 109207382 103997558 100399257 97654978 95901916
3461 95901916 94406193 92952826 92874631 92830439 92695912 92904070 94993942 96407187 97174266
3452 97174266 99711880 102401783 105192193 108640170 111921551 115304064 118459311 121467824
3444A21467824J650849p28217j435369l811339n449998o119654o811937o373829
3436I2388330o356879n473484m673156l273580l121047k818817j522697p66017
3428F4382653l29611M9586N33832M20963R94317J234519K652262L528431M821174
3419G8288126O417768Q563105J0804109J1237298J0547783P774440M117786N33558
3411A38283973k575914n022486o294625o162255n874401n231623l362747j231040
3403A02528882J173875K659064L935388M796119M045872M464641N225504L727908
3395A32557253L019376L238730J823596R69622J298098J470723K460770L982552
3387A50820720O859983J0081498J3121331J4371637J4574833J1132363P182540
$$ plain form
3444 121467824 123118673 122390456 120955087 117143748 111693750 105574096 98762159 92388330
3436 92388330 86031451 80557967 75884811 72611231 69490184 66671367 65148670 64382653
3428 64382653 64053042 64102628 64636460 65057423 66051740 67286259 69938521 73466952 78288126
3419 78288126 84705894 93268999 104073108 115310406 125858189 133632629 137750415 138283973
3411 138283973 135708059 130685573 124390948 118228693 112354292 107122669 103759922 102528882
3403 102528882 103702757 106361821 110297209 115093328 119139200 123603841 128829345 132557253
3395 132557253 135576629 138815359 140638955 141608577 142906675 144377398 146838168 150820720
3387 150820720 157680703 167762201 180883532 195255169 209830002 220962365 228144905
3380B28144905K691487j899533n632264q554455r706290r252483q115157o496261
3372A81179949l133515J93724L090690N092259O735854Q257088Q635873P362339
3364B17414261O633112N433956K544702k41802k724999m166352n376637n520420
3356B13995821m657049j572400O60993L103118O413953Q611494Q479149N854673
3348B40889752J957468q40002m464425q286401j1532555j2564238j1728350j1113874
3340A82317375r851331p040538n657776m848788k396254j570380j172732n00571
3332A49279005r41347j178073r68902k129803l069027l499468l740031l384102
3324A30368252l614137k801377l257839j495321j662536p31067K22932M14352
$$ plain form
3380 228144905 230836392 228936859 223304595 214750140 205043850 195791367 187676210 181179949
3372 181179949 178046434 178240158 181330848 186423107 193158961 201416049 210051922 217414261
3364 217414261 224047373 229481329 232026031 231784229 229059230 224892878 219516241 213995821
3356 213995821 209338772 207766372 208427365 211530483 217944436 226555930 235035079 240889752
3348 240889752 242847220 242007218 237542793 229256392 217723837 205159599 193431249 182317375
3340 182317375 172466044 165425506 159767730 154918942 152522688 150952308 149779576 149279005
3332 149279005 148337658 147159585 146190683 144060880 140991853 137492385 133752354 130368252
3324 130368252 126754115 123952738 120694899 119199578 117537042 116805975 117028907 117443259
3316A17443259n85802k127931j840402l050507m193932m739698n462817n530733
3308H9911437n246401m939714m037285m517907m010981k919429k958987l302559
3300E7978174k059043k160660k062553j706652j741684j508684j275158j957932
3292D3505808j243640j061488j241716q38622o74660j303742j044487o96614k87579
3283C5113260o07541p93839l59520j94122q00966l21692q31200o51684p20228
3274B9832468l54255o07378K00013j64895r38996q68253l64201p84007m15976
3265B5534520l60966l50175J93677k89641q43562o10474J40398L2745n07362q5899
3255B2853261n35129r6088K50478l49488q89100J09266M51876k0085J89373j154335
$$ plain form
3316 117443259 116857457 114729526 112889124 109838617 105644685 100904987 95442170 89911437
3308 89911437 84665036 79725322 75688037 71170130 67159149 64239720 61280733 57978174
3300 57978174 55919131 53758471 51695918 49989266 48247582 46738898 45463740 43505808
3292 43505808 42262168 41200680 39958964 39120342 38445682 37141940 36097453 35400839 35113260
3283 35113260 34505719 33711880 33352360 33158238 32357272 32035580 31204380 30552696 29832468
3274 29832468 29478213 28870835 29070848 28905953 27966957 27098704 26734503 25950496 25534520
3265 25534520 25173554 24823379 25017056 24727415 23883853 23273379 23413777 23446522 22939160 22853261
3255 22853261 22318132 22222044 22472522 22123034 21233934 21343200 21795076 21774991 21964364 20810029
3245B0810029M19531m02877n71936o8499j18837l97200J86505J07182m69624m75785
3235A9018489j48668k36684o46215l40072K27865k02700l12585k47169O88468
3226A7800729K58650j73259M33299n89287N14999k41038O74963J62834j80918
3217A8660972O37767K07725M23126k09692O15055J26523J374203M59714K91935
3208B2587328P38967J04672K39513M8178k44777l60819o19046R9992k34460q18269
3198B1541279p02589p20458k28418k57354Q8008o95201l56520j76803P9043j60126
3188A8410861j80367N81591M32415j29811m54416L52812J063808P90735J45516
3179B1013144J098604J143819Q29105J292035J242622J498689K383647J768691
$$ plain form
3245 20810029 21229560 20826683 20254747 20186248 20067411 19670211 19856716 19963898 19494274 19018489
3235 19018489 18869821 18633137 17986922 17646850 17874715 17672015 17359430 17112261 17800729
3226 17800729 18059379 17886120 18319419 17730132 18245131 18004093 18679056 18841890 18660972
3217 18660972 19298739 19506464 19929590 19719898 20334953 20461476 21835679 22295393 22587328
3208 22587328 23326295 23430967 23670480 23718658 23473881 23113062 22494016 22594008 22359548 21541279
3198 21541279 20838690 20118232 19889814 19632460 19720468 19025267 18668747 18491944 18570987 18410861
3188 18410861 18230494 18812085 19244500 19114689 18660273 19013085 20076893 20867628 21013144
3179 21013144 22111748 23255567 24084672 25376707 26619329 28118018 30501665 32270356
3171C2270356J906055R97712P14345L76285q13529j235059j254599j327789j622051
3162C0011726j499571j660121j710832r16938r37710m28596K99913r93415q50044
3153B1314412m71248n37825m61946M76296j74977l11772j35419j33782J20357
3144A9684096P11037M86457M09083Q12512O98157J90578Q25845J106548Q71202
3135B5795515R01554M16955O09833l86798L35310J96650p38139p03561n86634
3126B5840685j69944o19709q82601o61179q37447j254615j541516j080201j023019
3117A7770454j112181m63576o53349j090815j028798J44734l03372Q9281l98612
3108A2953766o39839L56732J72080M5453j092J10877l50445k50014L8437K6000
$$ plain form
3171 32270356 34176411 35174123 35888468 36264753 35451224 34216165 32961566 31633777 30011726
3162 30011726 28512155 26852034 25141202 24224264 23286554 22857958 23157871 22164456 21314412
3153 21314412 20843164 20305339 19843393 20319689 20144712 19832940 19697521 19563739 19684096
3144 19684096 20395133 20881590 21290673 22103185 22801342 22991920 23817765 24924313 25795515
3135 25795515 26697069 27114024 27723857 27337059 27672369 27869019 27130880 26427319 25840685
3126 25840685 25670741 25051032 24168431 23507252 22669805 21415190 19873674 18793473 17770454
3117 17770454 16658273 16194697 15541348 14450533 13421735 13566469 13263097 13352378 12953766
3108 12953766 12313927 12670659 12842739 12888192 12887100 12997977 12647532 12397518 12435955 12461955
3098A2461955N48274M08614p50122j23632O50040K30694j41242k24173p7971k60036
3088A2722401p85547n29479m28464J04260l13732p21105m58253m71964o33376
3079H484741M04179J44733M4307K8546o72707j54070m68922K36110j96134l04488
3069G546295P4660J16302j20391l74168k11455n8791K93711o5834L08588l69321
3059G139596l47039M8018K56150K43521n50534j12332J56567k58277n1821j77727
3049F346122j047438o10099L20945L56404j56000j3560J30814J7526l29034j14827
3039D900853j06782J68114L61991J85741o26160n22753L65753k78071q85435N019
3029C568270J90824J12156L26105k46018K5826J63691m14788o44675L73611M6783
$$ plain form
3098 12461955 13010229 13418843 12668721 12545089 13195129 13425823 13284581 13060408 12982437 12722401
3088 12722401 11936854 11407375 10978911 11083171 10769439 10048334 9590081 9118117 8484741
3079 8484741 8888920 9033653 9077960 9106506 8433799 8279729 7810807 8046917 7850783 7546295
3069 7546295 7620955 7737257 7616866 7242698 7031243 6972452 7266163 7200329 7508917 7139596
3059 7139596 6792557 6840575 7096725 7340246 6789712 6677380 6833947 6575670 6523849 6346122
3049 6346122 5298684 4688585 5009530 5365934 5209934 5196374 5327188 5344714 5015680 4900853
3039 4900853 4794071 4962185 5324176 5509917 4883757 4361004 4726757 4448686 3563251 3568270
3029 3568270 3759094 3871250 4197355 3951337 3977163 4140854 3726066 3081391 3455002 3501785
3019C501785M31379k89521K48378j60435r11710K14429j1649R2326k09111L4592
3009B940463L23418j84218j06290k13123p96478L90213K25524P45984l26766m70773
2999B527954K38233N03157o34971k83055Q7610K99424k5407J18546M21663q20267
2989B432887n84545O38919K09187M0511J18789k90946n0264J32878j25825m19551
2979B102040N65092m53841k06151L80789L47662p33549n81764j10017P59307M28026
2969B497594j10686j20909k41944M24079j15958l07434J15707J93490K46109m46216
2959B133832o77874J02944Q95637l01829P6755k53523n81854M96300K27952l80716
2949A737624o41542q2242K58664K23902Q16191n32023q14647M82021K51670r3384
$$ plain form
3019 3501785 3933164 3643643 3892021 3731586 2819876 3034305 3022656 3114982 2905871 2940463
3009 2940463 3263881 3079663 2973373 2760250 1963772 2353985 2579509 3325493 2998727 2527954
2999 2527954 2766187 3269344 2634373 2351318 2438928 2738352 2712945 2831491 3253154 2432887
2989 2432887 1848342 2487261 2696448 2736959 2855748 2564802 2514538 2647416 2521591 2102040
2979 2102040 2667132 2213291 2007140 2387929 2735591 2002042 1420278 1310261 2069568 2497594
2969 2497594 2386908 2265999 2024055 2448134 2332176 2024742 2140449 2333939 2580048 2133832
2959 2133832 1455958 1558902 2454539 2152710 2229465 1975942 1394088 1890388 2118340 1737624
2949 1737624 1096082 1013840 1272504 1496406 2312597 1780574 965927 1447948 1699618 1606234
2939A606234k03099j46854M91461O3753R696j71553j76419K78769l07541l00545
2929A143902o70794L5268N86888k3601K70766n46614j62571L57748k14288K6785
2919H03489O0589m6390m37952q6691L22458j88838M02998K14656k18800K88547
2909A114066M3357P7835l68706M51207L58076J84102k58154m47304K1900O2617
2899A238996j28907J59540j59553Q1070j81647j5320J85828J70405K16627n35373
2889A031666m02045P09664N74745l5744m99288K20233l54343l54679K48622J53195
2879A292026M29418O7306n79699J535K79541j87158K43096M63206K02547n03906
2869A707912r858M78110p10400j51567J76749k24939K79519K40894L15295j49909
$$ plain form
2939 1606234 1403135 1256281 1747742 1811495 1821191 1649638 1473219 1751988 1444447 1143902
2929 1143902 473108 508376 1095264 1071663 1342429 795815 633244 990992 776704 803489
2919 803489 864078 817688 379736 293045 615503 426665 829663 1044319 825519 1114066
2909 1114066 1157423 1235258 866552 1317759 1675835 1859937 1601783 1154479 1176379 1238996
2899 1238996 1110089 1269629 1110076 1191146 1009499 994179 1180007 1350412 1567039 1031666
2889 1031666 629621 1339285 1914030 1878286 1378998 1599231 1244888 890209 1138831 1292026
2879 1292026 1721444 1788750 1209051 1210586 1490127 1302969 1546065 2009271 2211818 1707912
2869 1707912 1698054 2176164 1465764 1314197 1490946 1266007 1545526 1786420 2101715 1951806
2859A951806R1682K27607j57067L92O55059L3815K90871M54159m1033J11801j01504
2848C517588j7189k92521K32359J69026j10809N06963J05199m76221K5080J56443
2838C815918l59907j43482k26562L85616j55885L64058j40207K73769j14853O1934
2828C760399j95455M26838N41001j86659J68729K66959O73652P50535O37074L14549
2818G157622O01797N5951l36337J24077O44398l04682n09790O4970k60712n62404
2808F674890j88342j97819K9105l29094J79457L64682K31031m2194L76722L7279
2798G135717p95304N7016j01439J895j50086N17270K76853K70020K21198K98887
2788G732027P70472J74735L62798J184198Q85749J64608m01455q6731M46610m79575
$$ plain form
2859 1951806 2043488 2271095 2114028 2114420 2769479 2803294 3094165 3548324 3507291 3619092 3517588
2848 3517588 3500399 3207878 3440237 3609263 3498454 4005417 4110616 3634395 3659475 3815918
2838 3815918 3456011 3312529 3085967 3471583 3315698 3679756 3539549 3813318 3698465 3760399
2828 3760399 3564944 3991782 4532783 4346124 4514853 4781812 5455464 6205999 6843073 7157622
2818 7157622 7759419 7815370 7479033 7603110 8247508 7942826 7433036 7498006 7237294 6674890
2808 6674890 6486548 6288729 6317834 5988740 6168197 6532879 6763910 6721716 7098438 7135717
2798 7135717 6340413 6397429 6295990 6297885 6147799 6665069 6941922 7211942 7433140 7732027
2788 7732027 8502499 8677234 9040032 10224230 11109979 11274587 10873132 10786401 11233011 10753436
2778A0753436n48925k71479o4702j019632p74046k77439k69057q4428M4979j02813
2768G385894l4558k50169R9650k26730J46523N3401R2801J50276p80191n99401
2758F037496m9078K98791o1212K35050L10974k55544M30795M16850M82632L7799
2748G884553N073J48411K50547m0183l90741k93551n18254p11982k28824k52756
2738E852293j407804l92540J71558o55299K75909N32824K49024L18627o8882o85797
2728D189913R6481n1320n46405L8747m21134j05892L045P1805J27375m14148J60328
2717C148795n2970M0956J68588j40027Q9436n13045r8979l92948m6753L89011
2707B592064l8998k99795R631m67022k51439J92712l03555J37287P01884l3433
$$ plain form
2778 10753436 10204511 9933032 9868330 8848698 8074652 7797213 7528156 7443728 7488707 7385894
2768 7385894 7351336 7101167 7200817 6974087 7120610 7174011 7266812 7417088 6636897 6037496
2758 6037496 5988418 6287209 6225997 6461047 6772021 6516477 6947272 7364122 7846754 7884553
2748 7884553 7889626 8038037 8288584 8248401 7857660 7564109 7045855 6333873 6105049 5852293
2738 5852293 4444489 4051949 4223507 3568208 3844117 4376941 4625965 4944592 4875710 4189913
2728 4189913 4286394 4235074 3688669 3727416 3306282 3200390 3203435 3275240 3402615 2988467 3148795
2717 3148795 3095825 3136781 3305369 3165342 3254778 2741733 2642754 2249806 2203053 2592064
2707 2592064 2553066 2253271 2262902 1795880 1544441 1737153 1433598 1570885 2272769 2239336
2697B239336L6680k20730P3301m0111l5989n80940k64209K72818o1987m49215
2687I68954l3290r8530J95606L68454J09784m48045l4027K81574q1069J6070k46373
2676I99108l88359j27120M62544j4809j90290n3687J1335k2680j29750m5338r2160
2665D08794J15344O4489K7183n1021k32636J22607L98801m35458j39159L35987
2655F14931k52629L41232N1623K03186o1931k58725k81000m76936l64864K97932
2645a87181L90691O09915j7028m62542M6544m486k56169o5030K0793m0103J28512
2634A63916j27281l19698j63555j59708M36189K72843Q7521R667o4462J99448
2624C34880K13381k25935R1825k11409j09614J73541m15071J61493K68257m80936
$$ plain form
2697 2239336 2276016 2055286 2128587 2088476 2052487 1471547 1207338 1480156 1418169 968954
2687 968954 935664 837134 1032740 1401194 1510978 1062933 1028906 1310480 1229411 1245481 999108
2676 999108 610749 483629 946173 931364 741074 687387 698722 676042 546292 500954 408794
2665 408794 524138 588627 615810 564789 332153 454760 853561 418103 278944 614931
2655 614931 362302 703534 755157 958343 896412 637687 356687 -120249 -485113 -187181
2645 -187181 203510 813425 796397 333855 380399 375913 119744 54714 75507 35404 163916
2634 163916 36635 -283063 -446618 -606326 -170137 102706 190227 199894 135432 334880
2624 334880 548261 322326 414151 202742 93128 266669 -148402 13091 281348 -199588
2614a99588k64733N94270j31454L014L26237j12620p1872k52790j3202k23236
2604c45974K75336l40069K85468J01074M40187o1627J91157K6192K65551M26102
2594A263397L94858O15419j91958R58576O27671J35884p31433m17183p30467j51328
2584A773436N878j43326k73945o17452m4410M27858j67120m58042l0478l17248
2574A55151J3110M66934K67872M5692n65015L12084m60934R7330M52737M936q63493
2563g3596K41613K62927M7816O8762m86067L94425j38439l22509m0709J61214
2553A15437J63053N64895m02864j04241o3529K91001n66962m07388O61606K16694
2543D67702L89445l52880j72865K08253p7686J59016M4808k69649j71621l14907
$$ plain form
2614 -199588 -464321 129949 -1505 1509 327746 215126 143254 -109536 -122738 -345974
2604 -345974 -70638 -410707 -125239 -24165 416022 354395 545552 571744 837295 1263397
2594 1263397 1658255 2273674 2081716 3040292 3667963 3803847 3072414 2655231 1924764 1773436
2584 1773436 1779314 1635988 1362043 744591 700181 1128039 960919 502877 472399 155151
2574 155151 168261 635195 903067 948759 383744 695828 234894 332224 784961 789897 -73596
2563 -73596 168017 430944 478760 547522 61455 455880 317441 -5068 -45777 115437
2553 115437 278490 843385 440521 336280 272751 563752 -3210 -410598 251008 467702
2543 467702 857147 504267 331402 539655 461969 620985 665793 396144 224523 -90384
2533i0384J66446M77154k6333p46898n901M52367L66309j65599o1384M27363K63684
2522A056824m21881r23184L19841l22768K5123K89292K70895M27913J25501k90272
2512E57284N3962K06088N3315n61978n35381j63444J01611J04389L48338L16039
2502D80223l90006J05482K87257m38444L98925j02541p7069j08232K67279L93056
2492H15930j37628J515N1474M1692k81657L11985J20084R064l20968J95066k48772
2481E57785j6120P417l8961j8668J66824m31490J15580M0245P14411O4903o09471
2470E52455j48365K66339M33582M10138p46454k41947M81950l56369k09792j21944
2460C19593M32901P32132n86260k93805J77201L58952l55661n97252j37056M40204
$$ plain form
2533 -90384 76062 553216 526883 -220015 -225916 226451 592760 427161 365777 793140 1056824
2522 1056824 634943 -288241 31600 -291168 -266045 23247 294142 722055 847556 557284
2512 557284 611246 817334 870649 308671 -226710 -390154 -288543 -184154 164184 480223
2502 480223 90217 195699 482956 44512 443437 340896 263827 155595 422874 815930
2492 815930 678302 679817 731291 772983 491326 803311 923395 932459 611491 806557 557785
2481 557785 541665 549082 510121 491453 658277 226787 342367 382612 1097023 1161926 552455
2470 552455 404090 670429 1104011 1514149 767695 525748 1007698 651329 441537 319593
2460 319593 752494 1484626 898366 604561 781762 1140714 785053 187801 50745 490949
2450D90949L79985k17449j37563j45563K97634L03668n1741o33264O55293P2587
2440A014536n15501L47092J82227l5179N69659p63458k05305K62062N01930n3065
2430A304998k59859p3969L54091O8685r7583M24189Q135o76337n66697N12438
2420I98091J87561m16844J15557O25626J88174R3953J73471m13235M27334K32692
2410B212380K26279l98380M11933L81778j6162N57420k02504j65591K94492n77551
2400B724094k00066N81478q2405l8094j89115J46550L76956O09783J46375k06421
2390C869135N7428K48947K03469n6409O3303j37169m61846K28681N34896J47073
2380D697508K80486K0222m55356L6290J01976R8249L31280k60932n67823m32817
$$ plain form
2450 490949 870934 653485 515922 370359 667993 971661 919920 286656 941949 1014536
2440 1014536 499035 846127 1028354 993175 1562834 799376 594071 856133 1358063 1304998
2430 1304998 1045139 971170 1325261 1393946 1296363 1720552 1728687 1052350 485653 998091
2420 998091 1185652 768808 884365 1509991 1698165 1792118 1965589 1552354 1979688 2212380
2410 2212380 2438659 2040279 2452212 2833990 2817828 3375248 3172744 3007153 3301645 2724094
2400 2724094 2524028 3105506 3023101 2985007 2795892 2942442 3319398 3929181 4075556 3869135
2390 3869135 3926563 4175510 4378979 4322570 4385873 4248704 3786858 4015539 4550435 4697508
2380 4697508 4977994 4998216 4542860 4579150 4681126 4779375 5110655 4849723 4281900 3849083
2370C849083M94495N47373J76650r3729O80516P6827J63697L04100M35864K7564
2360F662440N12247N55245O10961K44394M40384N52431m2273O21310M0010J131094
2350A1328243R60564J241995J198422J198985J461603J904039K941906L634437
2342B5870194L337323M332822M213720L635058L991699M271062L919989N042616
2334E8614483N823179P876841J1044264J5313805K4031969L9041562N6881996
2327B18628099P3317803Q3355517P6844486M0446011J0943633p916781k8800679
2320D66818089m9293663o1886108o2255490n6510397m7596275l8069946k8833642
2313A22372568k0060449j3149203r455701o500847n819157n342759n632974m819569
$$ plain form
2370 3849083 4343578 4890951 5067601 4973872 5654388 5731215 5894912 6199012 6634876 6662440
2360 6662440 7174687 7729932 8340893 8585287 9025671 9578102 9535829 10157139 10197149 11328243
2350 11328243 12288807 13530802 14729224 15928209 17389812 19293851 22235757 25870194
2342 25870194 29207517 33540339 37754059 41389117 45380816 49651878 53571867 58614483
2334 58614483 64437662 72314503 83358767 98672572 122704541 161746103 218628099
2327 218628099 291945902 375301419 452145905 492591916 503535549 495618768 466818089
2320 466818089 417524426 355638318 293382828 236872431 189276156 151206210 122372568
2313 122372568 102312119 89162916 79707215 73206368 67387211 62044452 56411478 51591909
2305E1591909m541153l478108l299887l378317k591278j520150j987186j289582
2297B9506248j487738p05596n50082j157028j534863o03973q02742l6448n23339
2288B2104439j303662p65275m60313n25453o23026n02916j58108m17544m2104
2279A7306038l88398j4414J2774p05682n3692r16128j362831n057o53958o98788
2269A2519864m7135p10330j082454k65734k91065R1553o68838q27912l262j98482
2259H516205l73769o29502k74450p57003k78188L01514K49045j11473K69625p02326
2249F209678m35105M76653j05845J66817l6978l38261k88860m20677j38424K2162
2239E111160m25371K63354M30305k80409l06838o92604k6477k15377l70298Q81792
$$ plain form
2305 51591909 47050756 43572648 40272761 36894444 34303166 32783016 30795830 29506248
2297 29506248 28018510 27312914 26762832 25605804 24070941 23466968 22664226 22627778 22104439
2288 22104439 20800777 20035502 19575189 19049736 18426710 17923794 17765686 17348142 17306038
2279 17306038 16917640 16903226 16916000 16210318 16156626 15240498 13877667 13872610 13218652 12519864
2269 12519864 12472729 11762399 10679945 10414211 10123146 10214699 9545861 8717949 8714687 8516205
2259 8516205 8142436 7512934 7238484 6481481 6203293 6504807 6753852 6642379 6912004 6209678
2249 6209678 5774573 6251226 6145381 6312198 6275220 5936959 5648099 5227422 5088998 5111160
2239 5111160 4685789 4949143 5379448 5099039 4792201 4099597 4073120 3857743 3487445 4369237
2229D369237J336809l6985k33989J24427j06792p5689q49025j03524m94587J32108
2219D061990J78911q0963Q6840k13395k15801J99234L3572j40221J64965k43445
2209C831687q5686k6374j49249o9867R9534n98314j54170L7069l48569j2358Q4568
2198B608271L86335L41055j72291n29860k6884M54104j41100m142K707l06377
2188B611818p608J69959p51219j93866O29116L1151l87839O4734O3758j90079
2178B039925l22278K37708K44714k64494n2642m04006K70911L76991j51107Q69473
2168B845195p3282p32841j45176J81420L69851P8643o88305l17598o3565L67428
2158A821770K55708j31760m73016O1993n503l00649l4652n8395Q2678N03856q47714
$$ plain form
2229 4369237 5706046 5669061 5435072 5559499 5452707 5377018 4527993 4424469 3929882 4061990
2219 4061990 4240901 4159938 4246778 4033383 3817582 4016816 4050388 3910167 4075132 3831687
2209 3831687 3746001 3719627 3570378 3500511 3600045 3001731 2847561 2884630 2536061 2523703 2608271
2198 2608271 2994606 3335661 3163370 2633510 2606626 3060730 2919630 2915488 2918195 2611818
2188 2611818 2604210 2774169 2022950 1829084 2458200 2489351 2101512 2166246 2230004 2039925
2178 2039925 1717647 1955355 2200069 1935575 1882933 1478927 1749838 2126829 1975722 2845195
2168 2845195 2771913 2039072 1893896 2075316 2445167 2523810 1835505 1517907 1454342 1821770
2158 1821770 2077478 1945718 1472702 1534695 1529192 1228543 1193891 1135496 1218174 1722030 874316
2147H74316J04560L36958j16411J359j08350L3799M70544L93696l52430m19773
2137A218268k8523L74536j85301Q9129m50246j02207K74658k84114J64043J28738
2127A198981l44570Q1469P3492p1148j09254Q2542j69307M9802j03295J20728
2117H09440R1760J95103J44271k82225r6533j76706r4817K76255k02916J40141
2107H03773o4779k4899j22041m47920L65098O21734J48935Q9521k50583l42854
2097G75985j12129L12455N71855q8865r14842k2722L32248M01408l93927o04502
2087B56964k52734L58122O85748m6961k86917k69231p3942L00962k46902K57423
2077F82532K80720m83506N08530l4042k89874l28303j77054L3767j7446J42237
$$ plain form
2147 874316 978876 1315834 1199423 1200782 1092432 1126231 1596775 1990471 1638041 1218268
2137 1218268 1189745 1564281 1378980 1468109 1017863 915656 1190314 906200 1070243 1198981
2127 1198981 854411 935880 1009372 938224 828970 911512 742205 792007 688712 809440
2117 809440 901200 1096303 1240574 958349 861816 685110 590293 866548 663632 803773
2107 803773 738994 714095 592054 144134 509232 1130966 1279901 1369422 1118839 775985
2097 775985 663856 976311 1548166 1459301 544459 521737 853985 1255393 861466 256964
2087 256964 4230 362352 1048100 1001139 714222 444991 371049 672011 425109 682532
2077 682532 963252 479746 988276 954234 664360 336057 159003 192770 175324 317561
2067C17561L72426P22680m95497K23554O38149K9274K79079K03725q13621l98726
2057A078604J6752N23601N93118l0485l09201J16287K81206n05952j79884j85749
2047A398297J81995k04425k82299l66026L48000n46255j70897K72735K22995l3103
2037H21017j10879J7820l08637L9858K87039K17524L18369p46977J96658P2673
2027H04465r08563L903K16229K21526L34000K68125n24207J59824k27697J62334
2017E09939K31858j27286o1220R1608K59509j64629l97006j67729K07294l97980
2007a5642M99090m7477k63581m0697j15996L27254N69061n21822j80738N52285
1997G61737m85896m8302k42262J93935L26865L57783o6062l28501m26693M31429
$$ plain form
2067 317561 689987 1412667 917170 1140724 1778873 1808147 2087226 2290951 1477330 1078604
2057 1078604 1095356 1618957 2212075 2181590 1872389 1988676 2269882 1763930 1584046 1398297
2047 1398297 1580292 1375867 1093568 727542 1075542 529287 358390 631125 854120 821017
2037 821017 710138 727958 419321 459179 746218 963742 1282111 535134 731792 804465
2027 804465 -104098 -100195 116034 337560 671560 939685 415478 575302 347605 509939
2017 509939 741797 614511 553291 644899 904408 739779 342773 175044 382338 -15642
2007 -15642 483448 435971 172390 131693 15697 342951 912012 390190 209452 761737
1997 761737 275841 227539 -14723 179212 506077 863860 797798 469297 42604 474033
1987D74033O76643K9548q63225o43171M70698P49084j99864l05469L33689n78778
1977A43188o67962P22775J82851r5119l909k47086M93474r9504j47135J53574
1967D35147l9267K1140R7701N91272J80041p67660j27848o50486N50935J63456
1957D54431m84623l7660J31802J06344K43891n06820n83190M74303P60344K13909
1947G72731o31606J50596L57508j66791p9841K50105o41797k07833j40922O9949
1937b67901J91888j39353L39970K36876J25248j17917n52200L07313l83741L40782
1927H0965L9164j90394L13318m09289k11893M49036L27137L31538M81737m63418
1917G47901k72303J71231n2172n99727K69872L42741j99694k04148n9989L63898
$$ plain form
1987 474033 1150676 1180224 316999 -326172 144526 893610 693746 388277 721966 143188
1977 143188 -524774 198001 380852 285733 281824 34738 528212 428708 281573 435147
1967 435147 395880 417020 514721 1105993 1286034 518374 390526 -259960 290975 454431
1957 454431 -30192 -67852 63950 170294 414185 -92635 -675825 -201522 558822 772731
1947 772731 141125 291721 649229 482438 402597 652702 10905 -196928 -337850 -267901
1937 -267901 -76013 -215366 124604 361480 486728 368811 -183389 123924 -259817 80965
1927 80965 120129 -70265 243053 -166236 -378129 70907 398044 729582 1211319 747901
1917 747901 475598 646829 594657 -5070 264802 607543 407849 203701 143712 507610
1907E07610j63843j27805J3792l79694M28134k79429o8753K72175j2301l26562
1897a36676j96287q9634j44797j20530M48417j45067j23705j12411j61628N23908
1887b58410M49893j26471L56714N22715l94161j00187j60260M28857j68831l52301
1877A97558L67529m17326m65007J47838P9573m27743N08012J69265j64403J94759
1867A90055o6349j66953k21204K03257n2764M92619M01k48751J69141K95933k28889
1856C66496L11623o080j47404l00761j39093n0930L81886k11340l31917r9623
1846b27143J90836j63458O62799M08984p79424n02642M83358N23900n46029j24864
1836g3683K93858J06334m13035K11723J1898m07782J24400J90907K01902k72625
$$ plain form
1907 507610 343767 215962 229754 -149940 278194 -1235 -69988 202187 189886 -136676
1897 -136676 -332963 -422597 -567394 -687924 -239507 -384574 -508279 -620690 -782318 -258410
1887 -258410 191483 65012 421726 944441 550280 450093 289833 718690 549859 197558
1877 197558 565087 147761 -317246 -169408 -89835 -517578 -9566 159699 -4704 190055
1867 190055 123706 -43247 -264451 -61194 -113958 378661 379062 130311 299452 595385 366496
1856 366496 678119 672039 524635 223874 84781 33851 415737 204397 -127520 -227143
1846 -227143 -36307 -199765 463034 872018 92594 -410048 73310 597210 51181 -73683
1836 -73683 220175 326509 -86526 125197 137095 -270687 -146287 44620 246522 -26103
1826b6103L64042L26473n51441O6387l60974l28771k06793J104166K43748K7663
1816F58397M7003n61341O4989J31907j35708m13596j87685O79673J20600m18662
1806a4423K16990K30846q6253j04707J42022R9925k4585J26534l0300j61430o23134
1795b28515M59113j37486J4741M9493j18025n9410n40482J85779P09983j03709
1785B31482k03607j4204j96802l74827J89893O06846k76123K46800N44038l50512
1775D02984p85233q2021L18706O7602M08600q8060o96769k85057K13712P08505
1765A82969k00827j95473L2927J38310L63792m12965l93433J60797O1543M57125
1755A94765J99086j80154m01059J9542n45537L98026O69954O2324j99962l12575
$$ plain form
1826 -26103 337939 664412 112971 179358 -181616 -510387 -717180 386986 630734 658397
1816 658397 705400 144059 209048 340955 205247 -208349 -396034 283639 404239 -14423
1806 -14423 202567 433413 347160 242453 384475 484400 459815 586349 556049 394619 -228515
1795 -228515 230598 93112 107853 157346 39321 -20089 -560571 -374792 335191 231482
1785 231482 27875 13671 -183131 -557958 -368065 238781 -37342 209458 753496 402984
1775 402984 -382249 -464270 -145564 -77962 330638 242578 -454191 -739248 -525536 182969
1765 182969 -17858 -213331 -180404 -42094 321698 -91267 -484700 -323903 -262360 194765
1755 194765 393851 213697 -187362 -167820 -713357 -315331 354623 416947 216985 -95590
1745i5590J17292k34931M4489K68267J16534n5011j67002L23710K46626k20187
1735C44197o50558q3778J52870k45549K3387M78868l14354L18499k5193L43250
1725C41639J70209l02886n99960k20698k7197P3229N16161q5501j25912j26213
1715c87129O1399l96239L57527L22526q4995k02639l84651p99466N39198L52033
1705f22436K72278R601N58535j14120j56473r4273J28408L39788l48215o94993
1695g21900J64957Q62601J51696k10900k82514j40395l44458L80350j40256R2719
1685a88100l19465l30803N007l92094M37070N05709n0709n6o79240k51312Q18585
1674d45408K70930l9658L24645j55343J24938L90367n5976p41274j5049l01843
$$ plain form
1745 -95590 21702 -213229 -168740 99527 216061 161050 -5952 317758 564384 344197
1735 344197 -306361 -390139 -237269 -482818 -459431 19437 -294917 23582 -1611 341639
1725 341639 511848 208962 -390998 -611696 -638893 -565664 -49503 -135004 -260916 -387129
1715 -387129 -325730 -721969 -364442 -41916 -126911 -329550 -714201 -1513667 -974469 -622436
1705 -622436 -350158 -340557 217978 103858 -52615 -146888 -18480 321308 -26907 -721900
1695 -721900 -556943 305658 457354 246454 -36060 -176455 -520913 -140563 -280819 -188100
1685 -188100 -507565 -838368 -833361 -1225455 -788385 -282676 -333385 -333441 -1012681 -1263993 -445408
1674 -445408 -174478 -214136 110509 -44834 80104 470471 414495 -326779 -341828 -643671
1664f43671N6763P75298l31592K61919o05032l37912M56640N8206m05754O30847
1654h4288p1158j57461J73482n51430J020124N46815m88940n19743K3611L31124
1644B22136L94873k54197l93738J15474j97179L25899k2317k5918L9967j35930
1634F9070O75949p70100J44453K10451l27729K84673q3497L532N530l71813K32967
1623G3486J8392l37472p3461P6249P08993K2221k16820k84887P1656j21040L6122
1612b6561o35435K1590K26702P2771K69035J55361k09851m05736j69767K90906
1602d10985L02870K08049m81289L456M32191p6494l87116k78273R53997J87840
1592D54246m0462K86944j83019J16624j47662p63737p2430L68010K50142l151
$$ plain form
1664 -643671 -586908 188390 -143202 118717 -486315 -824227 -367587 -309381 -715135 -84288
1654 -84288 -155446 -312907 -139425 -690855 329269 876084 387144 -132599 -108988 222136
1644 222136 617009 362812 -30926 84548 -112631 213268 190951 165033 205000 69070
1634 69070 745019 -25081 119372 329823 2094 286767 203270 206802 212332 -159481 73486
1623 73486 91878 -245594 -319055 -242806 466187 488408 271588 -13299 58357 -62683 -26561
1612 -26561 -661996 -640406 -413704 -340933 -71898 83463 -126388 -532124 -701891 -410985
1602 -410985 -108115 99934 -381355 -377899 54292 -22202 -409318 -687591 266406 454246
1592 454246 413784 700728 517709 634333 486671 -277066 -349496 18514 268656 265505
1582B65505p3068j48125P3161l62807Q3107M73081J2557p3515j92311q4603j57557
1571a84575J78342R7525O6021k25134j31479N5254m6505j02049K83960K48291
1561B39651k72229J02928m37572k06098l686N81970l27526o34041L40015N06413
1551a10175j3491L49721k80603k52207j49840K54445J06876L1739l7500N0370
1541e0665o7884M42767p066m41420k08774l5031k73087M5156K06479l59132K01660
1530e46997j61465M98078L41804K14699j90540m04958j06816O9254l6428M16193
1520I2824O9029k85700m10143N07986L40591L00196K49194p82796N5155l20691
1510a84355k42306M17972J69391q1060k00176k12196l89743J59173J09262Q30084
$$ plain form
1582 265505 192437 44312 117473 -245334 -162227 310854 323411 249896 57585 -27018 -184575
1571 -184575 -6233 91292 157313 -67821 -199300 -144046 -190551 -292600 -8640 239651
1561 239651 -32578 70350 -367222 -573320 -577006 4964 -322562 -956603 -616588 -110175
1551 -110175 -123666 226055 -54548 -306755 -456595 -202150 -95274 -63535 -101035 -50665
1541 -50665 -118549 324218 317152 -124268 -333042 -368073 -641160 -596004 -389525 -748657 -546997
1530 -546997 -708462 -210384 131420 346119 155579 -249379 -356195 -286941 -323369 92824
1520 92824 161853 -123847 -533990 -26004 314587 614783 863977 81181 136336 -184355
1510 -184355 -426661 -8689 160702 79642 -120534 -332730 -722473 -563300 -454038 376046
1500C76046r741o28359o1312m40603n0j23452m5210N35281R7152J02317K45117
1489D7186p1366k66398J91616K64036j8583q86260K05997O8638N28299l73410
1479c10245r6956O41427k65631r0931j04652P1250K4987O581j05325K94250l11866
1468b47111j06313l41172J29130L22384q3913j08200L85621K22054l04735M21558
1458B89303j22995o6884J46071J90859j93949q59504l59552K48192J02377L26404
1448b99678l78372L52729N44249j38230j76826q09238N44971K738k69626j40680
1438g67963O30256M1166r4469O97935l6825l46271m98294M64119n48682o7140
1428e26168n4471k26989L65145j16656J82651J52542K83537L44199K44781p57245
$$ plain form
1500 376046 366305 -262054 -323366 -763969 -764019 -887471 -932681 -397400 -300248 -197931 47186
1489 47186 -24180 -290578 -98962 165074 146491 -739769 -533772 -465134 63165 -310245
1479 -310245 -407201 234226 -31405 -122336 -226988 -155738 -130751 -124170 -229495 64755 -247111
1468 -247111 -353424 -694596 -565466 -243082 -326995 -435195 -49574 172480 -132255 289303
1458 289303 166308 99424 245495 436354 242405 -617099 -976651 -728459 -626082 -299678
1448 -299678 -678050 -325321 218928 80698 -96128 -905366 -360395 -357657 -627283 -767963
1438 -767963 -137707 -96541 -191010 506925 470100 123829 -374465 89654 -459028 -526168
1428 -526168 -580639 -807628 -442483 -559139 -376488 -223946 59591 403790 648571 -108674
1418a08674L30882l51360m75726J17232N28834k00910R0143n7849j16804j03192
1408c47424k10574K63338j72545J98753K91734K22886j21311n93696K1676N71531
1398A24368o30606J39784O55585n8367o21459j08973o4288n00091N19837j36245
1388f80455L09906L47150m32929j70502j31190n2426K66213N9054M70290m53909
1378d68798o5351M01520M64808n5175j69903J33620j13160K37390n706K87472
1368F46717l85133l04237m09931J43558M68376J44627l99900q0474k54434M03862
1358b6969k30760R4221M37060j94165l07024k80226L32943N70638l93506j75949
1348a73737K35821M95858J06531o75176m37587j65211J60194L14511j47760J42625
$$ plain form
1418 -108674 222208 -129152 -604878 -487646 41188 -159722 -69579 -127428 -244232 -347424
1408 -347424 -557998 -294660 -467205 -268452 23282 246168 124857 -468839 -447163 124368
1398 124368 -506238 -366454 289131 230764 -390695 -499668 -563956 -1064047 -544210 -680455
1388 -680455 -370549 -23399 -456328 -626830 -758020 -810446 -544233 -485179 -14889 -468798
1378 -468798 -534149 -132629 332179 277004 107101 240721 127561 364951 359245 646717
1368 646717 261584 -42653 -452584 -309026 159350 303977 -95923 -176397 -430831 -26969
1358 -26969 -257729 -163508 273552 79387 -227637 -507863 -174920 395718 2212 -173737
1348 -173737 62084 557942 664473 -10703 -448290 -613501 -453307 -138796 -286556 -143931
1338a43931N81437j05755k10478N8644n43365l23685K73103O17294k29531n9972
1328h6239N18529l667o06115m99041L80335L27818j04325j4718M53128m49001
1318h3296O7813K93353k60823P6474n2784Q8815k55484M4633M3125k98504K05874
1307a30804K07922L62714O8833m07668j18178n71327L3014L17084K09222n4989
1297h4177l43579J45470K66068J73177o32614j82153Q44617k19726j42761J02018
1287g3660J27779l01o51809K65132R7862P68327o55447K0064k66355L0415P97662
1276D59669J28979j54348o90190l21673M88350N1320j97054J53367k0824J95380
1266I2976K67692o13796k57085j51117M583L53365J67602l29005J64077N47899
$$ plain form
1338 -143931 437506 331751 121273 179917 -363448 -687133 -414030 203264 -26267 -86239
1328 -86239 432290 428623 -177492 -676533 -296198 31620 -72705 -87423 365705 -83296
1318 -83296 -15483 277870 17047 93521 40737 129552 -125932 -81299 -38174 -336678 -130804
1307 -130804 77118 439832 508665 100997 -17181 -588508 -555494 -238410 -29188 -84177
1297 -84177 -427756 -282286 -16218 156959 -475655 -657808 186809 -32917 -175678 -73660
1287 -73660 54119 53818 -597991 -332859 -234997 533330 -122117 -102053 -368408 -337993 459669
1276 459669 588648 434300 -255890 -577563 -89213 -37893 -234947 -81580 -102404 92976
1266 92976 360668 -253128 -510213 -661330 -656747 -303382 -135780 -464785 -300708 247191
1256B47191J78698l89808k75309k21150K08678Q53635n28431o27754J92214M15120
1246E3084j20781K75768j94625J71597R7734l16794l51812K03133o0295K12424
1236c0567P9383k84080j86370k69097N31590j5582k60521N7809p4151K78793K69616
1225I6823K88532k64409n97909q5573K51181K96175N43067j98576M4001j88254
1215A85058n83079J22324l17760N93996J76034k61540q2233L6483j25300j47870
1205d03887R2633J76489k70118K16443j29325M4615N0632k03817N6123J8073O51998
1194B99859j64314O9866K49724j71322j35870K62062J17402l42696j76088N0532
1184E9155p70701M52652K06130P1275J90552J59151l51130K7742k46083m46808
$$ plain form
1256 247191 425889 36081 -239228 -460378 -251700 601935 73504 -554250 -362036 53084
1246 53084 -67697 208071 13446 185043 282777 -34017 -385829 -182696 -242991 -30567
1236 -30567 48816 -235264 -421634 -690731 -159141 -174723 -435244 -377435 -451586 -172793 96823
1225 96823 385355 120946 -476963 -562536 -311355 -15180 527887 329311 373312 185058
1215 185058 -398021 -275697 -593457 539 176573 -84967 -167200 -130717 -256017 -403887
1205 -403887 -311254 -134765 -404883 -188440 -317765 -273150 -222518 -426335 -370212 -352139 299859
1194 299859 135545 205411 455135 283813 147943 410005 527407 184711 8623 59155
1184 59155 -711546 -258894 -52764 18511 209063 368214 17084 44826 -201257 -648065
1174f48065P40831k73916m63250J27453N62385p3687j43078n0993K14041m59005
1164d67284l42192P08712K39507r1858Q0399j43469l55938J4478j17714L04808
1154a70551j54989N1791m4549N47779R1106j116l85811k34429P5024j77995q240
1143d11980l5524M02313J46862K30164l312l48582m08833q299N89830j95018j39829
1132a82208P2096l99226j45928L47013N11582m09097R1528o8491J09052Q0374
1122F695M0601k61218L52839o0148j61044p3497J12171L08177L3163l26602M19907
1111C91044l82605j08637n20618P4221L89875j28101j65527j82491l69299M27367
1101e74771J74630L85722J51622J40481o0807N4257j89551k12709k6019p38622
$$ plain form
1174 -648065 92766 -181150 -644400 -516947 45438 -28249 -171327 -222320 -8279 -467284
1164 -467284 -809476 -100764 138743 46885 127284 -16185 -372123 -357645 -475359 -170551
1154 -170551 -325540 -273749 -318298 229481 320587 319471 -66340 -300769 -225745 -403740 -411980
1143 -411980 -447504 -45191 101671 331835 328523 -20059 -428892 -437191 152639 -42379 -182208
1132 -182208 -110112 -509338 -655266 -308253 203329 -205768 -114240 -182731 -73679 6695
1122 6695 47296 -213922 138917 78769 -82275 -155772 -43601 264576 297739 -28863 391044
1111 391044 8439 -100198 -620816 -546595 -156720 -284821 -450348 -632839 -1002138 -574771
1101 -574771 -400141 -14419 137203 277684 216877 271134 81583 -131126 -157145 -895767
1091h95767L60005L30700K99389m76850N27469m73681P3982K65102k87896R1249
1081a86298p6950k20146L95711J67711N5046n28790k64160J23894j63472j05550
1071h03004Q08256L5785k14098P0822k90443L78738R7180n5369K90563m33196
1061a14766k8153L25462Q4538k26717m93431k07406M01394M28348p12519J73916
1051c69334O66933n72199m05502J44728J78728P1445k38325O01472M5789l87505
1041b63770j97331N0897k05974K84359M95204J05368M70966l81129q02737k93829
1031g37976R2804j19589K47415K98884J94951L02967l21091l23995j75964K6065
1021e15529R17774l01183k14131M71613M288p06181k14018L16158J85324m09853
$$ plain form
1091 -895767 -535762 -205062 94327 -382523 144946 -328735 -254753 10349 -277547 -186298
1081 -186298 -263248 -483394 -87683 80028 135074 -393716 -657876 -533982 -697454 -803004
1071 -803004 5252 41037 -173061 -102239 -392682 -13944 83236 27867 318430 -114766
1061 -114766 -142919 182543 267081 40364 -453067 -660473 -259079 169269 -543250 -369334
1051 -369334 297599 -274600 -680102 -535374 -356646 -285201 -523526 77946 123735 -263770
1041 -263770 -461101 -410204 -616178 -331819 163385 268753 739719 358590 -444147 -737976
1031 -737976 -645172 -764761 -517346 -218462 -23511 279456 -41635 -365630 -541594 -515529
1021 -515529 402245 101062 -113069 358544 362832 -343349 -557367 -241209 -55885 -465738
1011d65738o34747L37581L21947J86148J40822L08908j81424k15498j80138M33257
1001E1118L86416l26308k92453J02989K94746j2269j23119k00345p6459k03689
991c99373R784L4124K99341o9471o2886J35733p4272q3214J3917K33826m09979
980c72470P07566q7608l86197L52440k80440J96772m93732k97585K37206k36416
970f60464J74932J55861K18316M22346k38868m46837M41798j40558K53098k77970
960i8346l52399J48472J7091N9911l15695L16518q1940k77448L90546n0020l98189
949f41499R4717m0961L43056n0656l75966J10584J38975N72048K38660n22375
939a33417N83159K9057j86985o09117O246J77454k4454J39475j95368L25239L41793
$$ plain form
1011 -465738 -1100485 -762904 -440957 -254809 -113987 194921 13497 -202001 -382139 51118
1001 51118 437534 111226 -181227 -78238 216508 204239 81120 -119225 -195684 -399373
991 -399373 -389589 -355465 -56124 -125595 -188481 -52748 -127020 -210234 -196317 37509 -372470
980 -372470 335096 247488 -138709 213731 -66709 130063 -363669 -661254 -424048 -660464
970 -660464 -485532 -329671 -111355 310991 72123 -374714 67084 -73474 179624 -98346
960 -98346 -450745 -302273 -285182 -225271 -540966 -224448 -306388 -583836 -193290 -243310 -641499
949 -641499 -546782 -587743 -244687 -295343 -671309 -560725 -421750 150298 388958 -133417
939 -133417 449742 478799 291814 -317303 -311057 -133603 -158057 -18582 -213950 111289 453082
928D53082K18004k35751m26523l02783Q22455k74856n81902K99120j24445l49254
918e02853J95491o3783L98748r380k48626n5763J7173J06770n57639J60793L95737
907a63332j93410K44065l7695k80572J76910K86717j92331k4315l95894l00888
897h80745L55040M71958K0685J40083r9708o7838m56773l6929J90431M308K64472
886i5016J95004M64476l20570m3500k29360N2370k05241k08471j5014k99493j34019
875h38834J08523O7115Q21099k54213L77104l7150J68921J04875n18871O3081
865F1650O710K02787l31316m30853l6818K875M75312l231k59722J67543J76279
854C1216j0438J68878k30301Q12J04873j73682l79960m9182K67075q2188K5725
$$ plain form
928 453082 671086 435335 8812 -293971 528484 253628 -328274 -29154 -153599 -502853
918 -502853 -307362 -371145 27603 18223 -230403 -286166 -268993 -162223 -719862 -559069 -163332
907 -163332 -356742 -112677 -150372 -430944 -254034 32683 -159648 -183963 -579857 -880745
897 -880745 -525705 -53747 -33062 107021 7313 -60525 -517298 -554227 -363796 -359488 -95016
886 -95016 99988 564464 243894 200394 -28966 23404 -181837 -390308 -405322 -704815 -838834
875 -838834 -730311 -663196 157903 -96310 280794 243644 412565 517440 -1431 61650
865 61650 68360 271147 -60169 -491022 -527840 -524965 -49653 -52884 -312606 -145063 31216
854 31216 20778 189656 -40645 -39833 65040 -108642 -488602 -537784 -270709 -352897 -327172
843c27172k43965M66414P4872Q3889n785K27178J79201k11736n2933J84668m67255
832i2624n2649J03638K5283K03558j75551k87390o2303j21157N46777m4557j32287
821h9262k75560J34812j2183L7091k24980n88277J94989M92027N55125J03722
811C27504R5591o1833j30256L62060p1260m33198Q4769j0389L05502M77169q70417
800G5242r39438P31435O91n52955L15210k2888j60770J93589J01148L33005J2209
789H6478r977j59692o44243o4272j32696j07210P73799N25343O1992o50218K72176
778d8520N20873o73511J52573J66996L00636K84044q09385J7720J161q5907L02529
767A29209J40677l45000j83072o97527Q60417K6785j74634L36821L05058q9384
$$ plain form
843 -327172 -571137 -104723 -29851 54038 48253 275431 454632 242896 189963 374631 -92624
832 -92624 -145273 -41635 -16352 187206 11655 -275735 -338038 -459195 87582 43025 -89262
821 -89262 -364822 -230010 -242193 -205102 -430082 -1018359 -823370 -331343 223782 327504
811 327504 423095 361262 231006 593066 521806 88608 173377 162988 468490 945659 75242
800 75242 -864196 -132761 -132070 -685025 -369815 -392703 -553473 -359884 -258736 74269 86478
789 86478 76501 -83191 -727434 -791706 -924402 -1031612 -257813 267530 329522 -320696 -48520
778 -48520 472353 -201158 -48585 118411 419047 703091 -106294 -88574 -87413 -173320 129209
767 129209 269886 -75114 -258186 -955713 -95296 -68511 -243145 93676 398734 309350
757C09350l60202j49293K44196K89455P4442L0057m16705R1620M05585k01122
747C17383j16723J08185n6733L32470l19965j85895l26333K448Q9776M30207k02035
736G2785J57298l7967m59578l60944O35370K08497o24962k370J09327M08277K83774
725C89507K47091k51491P8210m20102m11975K07909q234j84963L75981J69441
715A91374m10709J40573j01073j56378J15546K75678l37720j02392P281K73454
705a04366l32081q2429L86782N65290J27406k34526l49514l02720R3177K19433
695a3548K09105m56296L51803j06346j87180J76366j0704l99199J88684k05180
685d52495J10469j01295J10403J77494P6804O27926q13975K44710O1146K43923
$$ plain form
757 309350 -50852 -200145 44051 333506 407948 438005 21300 112920 518505 317383
747 317383 200660 308845 252112 584582 264617 78722 -247611 -245163 -155387 274820 72785
736 72785 230083 192116 -267462 -628406 6964 215461 -409501 -411871 -302544 105733 389507
725 389507 636598 385107 463317 43215 -368760 -160851 -169085 -354048 21933 191374
715 191374 -219335 -78762 -179835 -336213 -220667 55011 -282709 -385101 -377820 -104366
705 -104366 -436447 -518876 -132094 433196 560602 326076 -23438 -326158 -232981 -13548
695 -13548 195557 -260739 91064 -15282 -202462 -26096 -36800 -435999 -247315 -452495
685 -452495 -342026 -443321 -332918 -155424 -78620 549306 -264669 -19959 41187 285110
675B85110K57332L76935p0258p4975n13599m09262o9034j92490P0299P85439M8247
664D93744m29080m95175q1105l20127J14317P67655P201j55050P0856J13905m3106
653D4035J74860L7043M1488j66236K21396m89640J76649K19127J43319N75568
643I77609J49171p0483l29207m04188j75391k66566K53816j85602K84709o85531
633d51663k72890O48892J90507L65264j68123J36547q2346m13699l43816j71465
623e62792N03637N10203k36265K6844J49284p7749N5375l37626k55643K69594
613D4862L32064m25132j27004j86487L80956M96687N3325l37408L55644j42068
603D45439n30980K83185J18362N76503k92977K57348k81273p54110J79999k80252
$$ plain form
675 285110 542442 919377 849119 774144 260545 -148717 -217751 -410241 -339942 445497 493744
664 493744 64664 -430511 -511616 -831743 -717426 50229 57430 -97620 -26764 87141 44035
653 44035 218895 255938 297426 131190 352586 -137054 39595 258722 402041 977609
643 977609 1126780 1056297 727090 322902 147511 -119055 134761 -50841 233868 -451663
633 -451663 -724553 -75661 114846 480110 311987 448534 366188 -47511 -391327 -562792
623 -562792 -59155 451048 214783 241627 390911 313162 368537 30911 -224732 44862
613 44862 376926 -48206 -175210 -361697 19259 515946 569271 231863 587507 445439
603 445439 -85541 197644 316006 892509 599532 856880 575607 -178503 1496 -278756
593b78756K62594j11056j90815O9676K29323j59790P62821j57601o048j07687
583C12661q1922M5064K09397K76914q70774j8166L69417K36423L4811o64447N42479
572C91857J57987k22395r648n48859K89939M89990n696o92710k03611K52962J04205
561D021o97506j62562L45268L47062J21072L81168o30771j9158L60656k62655
551b13405k16504L55101j7487O9420M62775J13034J74548o46331q9770j18750
541a27369p54015L33135N4397M8475k68164N57260k51284l83434M31800N68500
531B09301M16827k62835k22845o4843m97147J87494q5288k62348J20151l05172
521g66705M38062M78024m4216j78722j48096J44256j63892M6237L05632r4031
$$ plain form
593 -278756 -16162 -127218 -318033 -248357 -19034 -178824 583997 426396 420348 312661
583 312661 230739 275803 485200 762114 -108660 -126826 242591 479014 513825 -150622 391857
572 391857 549844 327449 317801 -231058 58881 548871 543175 -149535 -353146 -100184 4021
561 4021 -693485 -856047 -510779 -163717 -42645 338523 -292248 -311406 49250 -213405
551 -213405 -429909 -74808 -92295 -22875 439900 552934 727482 81151 -8619 -127369
541 -127369 -881384 -548249 -493852 -445377 -713541 -156281 -407565 -790999 -359199 209301
531 209301 626128 363293 140448 75605 -421542 -234048 -319336 -581684 -461533 -766705
521 -766705 -328643 149381 105165 -73557 -221653 -77397 -241289 -195052 110580 16549
511A6549j99809j53834q5551K17150K24618K19164N5148l38029J53602K04307
501C13315K29804o57287p71661J333428M6195j96050q3255k17660M41724j67531
491B71022p36516J74780O17055L08937j30740m24449J26081J76117m00202j07960
481a25875K12032j44781k08484R8138m8655l89621J44287k09195n1448n9320N97161
470a85761M75849K20520j85551j32264j63080P7943M02070n59078q18846O26299
460b41899K94912l04730J78278L67434K9622Q8315p6487k085k81926Q9492l31736
449a90810j78816k06925r0815L54703K92037J71777m48513J89654M00410p6158
439B16544k47182P1503R2016n49798J66057r0884L98063M76574L55850l5016q9997
$$ plain form
511 16549 -183260 -337094 -422645 -205495 19123 238287 293435 -44594 109008 313315
501 313315 543119 -114168 -885829 447599 493794 297744 214489 -3171 438553 271022
491 271022 -465494 -290714 326341 635278 504538 80089 206170 382287 -17915 -125875
481 -125875 86157 -58624 -267108 -168970 -217625 -607246 -462959 -672154 -723602 -782922 -185761
470 -185761 290088 510608 325057 192793 29713 107656 509726 -49352 -868198 -241899
460 -241899 53013 -251717 -73439 293995 323617 411932 335445 333360 51434 140926 -190810
449 -190810 -369626 -576551 -667366 -312663 -20626 151151 -297362 -107708 292702 216544
439 216544 -30638 40865 132881 -416917 -250860 -341744 56319 532893 888743 853727 763730
428G63730o23789o05230M85978K30181j86235l8547n640M15920j88L06749J70476
417I13405o37611L86866n98403J05923j10655k7029L7408n50721P80321k2038
407B77466m96872m938K84485O64775M50429j75851l93258j48561j86152J07715
397C79238j1416L7420O96024j02758n18217K1056J2529j23479J87701J95691j84830
386E88959p46989k26264R17014M45827L8537j83457m99259m54116m23643M02570
376a40821L95396J56797K45030m36460J26106M03456j6999l68276O5934L28635
366G58798J12957k41130j40964k26488J87614j76859N45758k00438l16835L736
356C06149l06871l73572O75832M91161L56243k19512o41511l33904J65948K18120
$$ plain form
428 763730 139941 -465289 20689 250870 64635 26088 20448 436368 436180 742929 913405
417 913405 275794 662660 64257 170180 59525 32496 69904 -480817 299504 277466
407 277466 -219406 -224344 60141 724916 1175345 999494 606236 457675 271523 379238
397 379238 367822 405242 1101266 998508 480291 501347 513876 390397 578098 773789 588959
386 588959 -158030 -384294 532720 978547 1017084 833627 334368 -119748 -543391 -140821
376 -140821 254575 411372 656402 219942 346048 749504 732505 364229 430163 758798
366 758798 871755 630625 489661 263173 450787 273928 819686 619248 302413 306149
356 306149 -722 -374294 301538 792699 1148942 929430 287919 -45985 119963 338083
346C38083Q6335k0374L15587l8550k33242o2506j19211M59392l53435m08903o1493
335i8317K07715L73006k93897m19875o2702L11740M05200O00178K06608L7737
325A267393l83488P7711n198J26144j75036n11158o3706l05532K83490j0291Q946
314C09275J19129L36309K25853j66852q79881M75210L44063j0500k87732N53514
304A018388L53891k10314n29557n28962J89440k29063N9797K54131j92693q347
294A76711M944O2073K78104L5624l50096M23742R962M5590M3613K4174m85268
283B69173J47039K80461J4787k28147j98445K39101J37444J26827q05203l19026
273c35989K78812J86166n3357k80335J34431j8157J60946N69055j15916K88328
$$ plain form
346 338083 424418 404044 719631 681081 447839 385333 266122 725514 372079 -36824 -98317
335 -98317 109398 482404 188507 -231368 -294070 17670 422870 1023048 1229656 1267393
325 1267393 883905 961616 956418 1082562 907526 396368 332662 27130 310620 300329 309275
314 309275 428404 764713 990566 823714 -56167 419043 763106 752606 464874 1018388
304 1018388 1372279 1161965 632408 103446 292886 63823 123620 377751 185058 176711
294 176711 181655 243728 521832 557456 207360 631102 641064 686654 730267 754441 269173
283 269173 416212 696673 711460 483313 284868 523969 661413 788240 -16963 -335989
273 -335989 -57177 128989 75632 -204703 -70272 -88429 72517 641572 525656 813984
263H13984m39908l79822P01528L61980j18655k7182j70792j3008J2286k06453
253E33958k58144J17957K44121J270k12316q40590j20935K05201M62265J00364
243B33151k34752J85458k1091M89560K3094J37228j16331Q34117n57281n58268
233D14885R1699j09832j87585R9192J92671l93816J78284J58269M41739J16168
223A001674l54243o35224M17514k60351p2351l20054K81048M18468L91428O35068
213A502977l34568K35603n61895N2373P5940l12136M0817N4472L62573k44588
203H71568r4654j95048L23225m29570j10880O6167j39338m04481j17696M09115
193A78408M3811K67184k8123l99870p8226M0482M41457k5622k25520J73804j09235
$$ plain form
263 813984 374076 -5746 695782 1057762 939107 911925 741133 728125 740411 533958
253 533958 275814 393771 637892 639162 426846 -413744 -534679 -329478 132787 233151
243 233151 -1601 183857 162766 652326 675420 812648 696317 1530434 973153 414885
233 414885 506584 396752 209167 308359 501030 107214 285498 443767 885506 1001674
223 1001674 647431 12207 429721 169370 97019 -223035 58013 476481 867909 1502977
213 1502977 1168409 1404012 842117 894490 970430 658294 699111 753583 1116156 871568
203 871568 776914 581866 905091 475521 364641 430808 291470 -113011 -230707 178408
193 178408 222219 489403 461280 61410 -16816 23666 465123 439501 213981 387785 278550
182B78550J5215j15204J75030M41286R4924l00624J38321k71711J67592K28871
172H52250m03468L844K6776k59014K00889k906N10507K36814k5490N3497j36904
161A056795o29154j06507J67833R8785l31061l7390J63036N76725l67076m60816
151A31170K32110m31658K21022M33218k64538J8377j46244L9567L76040K82417
141H91481o2726m51810m3162K17488L62910n0033r8767n20346k70145Q0801K81848
130C37539J26819p441L18219k35890r8417O64170K50835j23152n32407L67568
120A067843n42116k40064J48571p7911n90386J33210K09181N14425J64513J23178
110I10444k03179n80811j9211j51564L09085P8086J30583k37206L55597j26243
$$ plain form
182 278550 293765 178561 353591 794877 889801 589177 727498 455787 623379 852250
172 852250 448782 452626 479402 220388 421277 418371 928878 1165692 1140202 1193699 1056795
161 1056795 427641 321134 488967 587752 256691 219301 382337 959062 591986 131170
151 131170 363280 -68378 152644 585862 321324 339701 193457 233024 609064 891481
141 891481 828755 376945 333783 551271 914181 864148 765381 245035 -25110 55691 337539
130 337539 464358 456917 775136 539246 440829 1104999 1355834 1232682 700275 1067843
120 1067843 525727 285663 434234 356323 -234063 -100853 108328 622753 787266 910444
110 910444 707265 126454 107243 -44321 264764 342850 473433 236227 591824 465581
100D65581J77368j45785N8841J97522l12638n77330O9566K03886R9571K93004
90E29586k055l31743J44583K48887l05811j89396J59875Q1120R8324j31753K28780
79E30397M4304k2100L14126J01848k01549l58506L47290J80369j60083J38798
69I14894m8931J13092l80321k30446L17137j50739j80466k73300K65762l39471
59G211j04714P74205J66525j22412k68750k78475K04197K60345l9290j02478M34118
48I30482Q4412j70957n3173M1679l0538k28809J33222r926j80540M7855n70520
37f813K90873M59646l3355K60061l82031l51220q9601N6561j8037L74643J19274
26F80001l30428J31941m0213J21430l73067K2238L26319J8430j68551L9160l98528
$$ plain form
100 465581 642949 497164 556005 753527 440889 -136441 -66875 137011 236582 529586
90 529586 527531 195788 340371 589258 283447 94051 253926 335046 433370 301617 530397
79 530397 574701 552601 866727 968575 767026 408520 755810 936179 776096 914894
69 914894 865963 979055 598734 368288 685425 534686 354220 80920 346682 7211
59 7211 -97503 676702 843227 720815 452065 173590 377787 638132 598842 496364 930482
48 930482 1014894 843937 790764 832443 801905 573096 706318 696392 515852 563707 -6813
37 -6813 284060 743706 710351 970412 588381 237161 147560 204121 186084 560727 680001
26 680001 349573 481514 441301 562731 189664 211902 538221 556651 388100 427260 28732
15B8732M33494K92599k41362K17809n9611j52219K23448j54912l70954q3452L35326
4D68898K26498m8738J78837k78633
0E46862
$$ plain form
15 28732 462226 754825 513463 731272 671661 519442 742890 587978 217024 133572 468898
4 468898 695396 646658 825495 546862
0 546862
$$ Imaginary data points
##PAGE= N=2
##DATA TABLE= (X++(I..I)), XYDATA
16383d026879P1371l5468J55674r9889L4488r6627r696K52550L2510J33048J59047
16372c429871J91201m12044M62122L5699n3501J23775l8365L03599K5426J35701
16362b656258j36861k15991K03346K28733m7429q6070M11651K37438M74530J45373
16352a441538l59775R9182K82817r9897J3314o9538K72671j11929j49026j14431
16342a678150j8334M95410O5953L2046J63764J41097j06002M4422J90066K63933
16332d05795q6275J38334J34160J81422l10189J86318l80405m34373J30452M63475
16322c82876M10000J67836P1130J52464j0118p7263K62197j7676m33501J25073
16312B67266N57357k51603K59245K80664j2799J12903M476L960k71431K84684
$$ plain form
16383 -4026879 -3955508 -3990976 -3835302 -3935191 -3900703 -3997330 -4007026 -3754476 -3721966 -3588918 -3429871
16372 -3429871 -3238670 -3650714 -3188592 -3152893 -3206394 -3082619 -3120984 -2817385 -2791959 -2656258
16362 -2656258 -2793119 -3009110 -2805764 -2577031 -2624460 -2710530 -2298879 -2061441 -1586911 -1441538
16352 -1441538 -1801313 -1702131 -1419314 -1519211 -1505897 -1575435 -1302764 -1414693 -1563719 -1678150
16342 -1678150 -1696484 -1201074 -1135121 -1103075 -939311 -798214 -904216 -859794 -669728 -405795
16332 -405795 -492070 -353736 -219576 -38154 -348343 -162025 -542430 -976803 -846351 -382876
16322 -382876 27124 194960 266090 418554 408436 331173 593370 575694 142193 267266
16312 267266 824623 573020 832265 1112929 1100130 1213033 1217509 1221469 950038 1234722
16302A234722K1433J42240R8275J15759k87735j52015K17327k77935J89177J6413
16292A317661j7351q3921R9499K32573m4531L51664j39190j71822K34475K37316
16282B016373K67388l05288l76719P8308L84380K72401J29040J8696K12048k40800
16272B455827J53277J08855L98J49881L09251N5471j3970L66278l16513l00511
16262B968244P86657K76967j14018p88367P0020J92287K15375K66787R5547k00168
16252C769331l789P5412k0650L5861p4891j62150P7686J75632j68037k67065o1560
16241C375780K75100K81685M59049j88690O3865J7851p8294L5201j78308j39070
16231C924169M36189O987l39526O4766N30493M91374m35535p6127L0468j46014
$$ plain form
16302 1234722 1256155 1398395 1496670 1612429 1324694 1172679 1390006 1112071 1301248 1317661
16292 1317661 1300310 1216389 1315888 1548461 1503930 1855594 1716404 1544582 1779057 2016373
16282 2016373 2283761 1978473 1601754 1680062 2064442 2336843 2465883 2484579 2696627 2455827
16272 2455827 2609104 2717959 2718357 2868238 3177489 3232960 3218990 3585268 3268755 2968244
16262 2968244 3754901 4031868 3917850 3129483 3199503 3391790 3607165 3873952 3969499 3769331
16252 3769331 3765542 3840954 3820304 3856165 3781274 3619124 3696810 3872442 3704405 3437340 3375780
16241 3375780 3650880 3932565 4391614 4202924 4266789 4284640 4206346 4241547 4063239 3924169
16231 3924169 4360358 4367345 4027819 4092585 4623078 5114452 4678917 4602790 4633258 4487244
16221D487244j96705Q4480L16231J8391l97487K66065J83783L1711K46089n35772
16211D504030J50592L76028k3676l0538k19101K40025K3770l15851K51318K85275
16201E241872Q905L57913k93799k89374k5318l63315M70850M19233J8590n4822
16191E490735m85844q3665P77557M02160k33518j67216L19641o06759K20993o0940
16181E573144q5187L41424J38890K37879n89512N04985J83889l33196l35718J15571
16171E752169J4640l74059N24164J74505K25041l62388J70627l00945L41071J08617
16161F273442j37534K83265J40171l45945N0281K16381K201k1886l1507p4317
16151F354552j25739Q5607p0973K28026q0902k21933m7650J36006L39696k93341
$$ plain form
16221 4487244 4290539 4375019 4691250 4709641 4312154 4578219 4762002 4793713 5039802 4504030
16211 4504030 4654622 5030650 5006974 4976436 4757335 4997360 5021130 4705279 4956597 5241872
16201 5241872 5250777 5608690 5314891 5025517 5000199 4636884 5107734 5526967 5545557 5490735
16191 5490735 5004891 4921226 5698783 6100943 5867425 5700209 6019850 5413091 5634084 5573144
16181 5573144 5487957 5829381 5968271 6206150 5616638 6121623 6305512 5972316 5636598 5752169
16171 5752169 5766809 5392750 5916914 6091419 6316460 5954072 6124699 5823754 6164825 6273442
16161 6273442 6135908 6419173 6559344 6213399 6263680 6480061 6482262 6460376 6428869 6354552
16151 6354552 6228813 6314420 6243447 6471473 6390571 6168638 6120988 6256994 6596690 6303349
16141F303349K11593j0971m13052N08312j88984Q8796q0054J34811J84410M68338
16131G206548J82994j49678l19116j24638J96974p60500J65702L31194N9385j54534
16121F634331n94720N17080m03998k83174M50726J87526l9749k13935J84659r9399
16111F339347K62317L76652P7356l37217j4497M38725r2100k91945j20810R0348
16101F728176q65204J00966M05189L38197k68256J66780K93657m39705R370N45681
16091G014851j53045J39096J46751j6994m50462j17877O86530l71633n00268J43750
16081F520699J79469j89139Q5379K93422J62672J74505l18441m72133P439J48673
16071F592545K69451k0296L62558o1929l19159N79092J5516k48742O7622l93387
$$ plain form
16141 6303349 6514942 6503971 6090919 6599231 6410247 6499043 6418989 6553800 6738210 7206548
16131 7206548 7389542 7239864 6920748 6796110 6993084 6232584 6398286 6729480 6788865 6634331
16121 6634331 6039611 6556691 6152693 5869519 6320245 6507771 6468022 6254087 6438746 6339347
16111 6339347 6601664 6978316 7055672 6718455 6703958 7142683 7050583 6758638 6637828 6728176
16101 6728176 5862972 5963938 6369127 6707324 6439068 6605848 6899505 6459800 6469170 7014851
16091 7014851 6861806 7000902 7147653 7130659 6680197 6562320 7248850 6877217 6376949 6520699
16081 6520699 6700168 6511029 6596408 6889830 7052502 7227007 6908566 6436433 6443872 6592545
16071 6592545 6861996 6841700 7204258 7142329 6823170 7402262 7417778 7169036 7236658 6843271
16061F843271l04053m23638K60418M34663J95036N9887m9190k79232l3723k20122
16051F483317J78302k31155J55570K33604j8612k47822l31059L84142M43875L37564
16041G387726j06971l16276K73538l56631N24690R3134o65133K57701K233k04715
16031F889296j16379J67647l699J61008L21256K2365N83099j04088q04126K53718
16021G370097j2803m51161R3198m1851O7942M00823n33002K38273Q3305k94397
16011F920424n69828L05741K28107j40456n07749J17523K09947Q1597K20148K08419
16001G073873R3601j58227k30339P7934j03619k52704K72142j56160k63347j26895
15991F226259Q78863L1095k73895N60153o08391l09153L89585j95882o560j97236
$$ plain form
16061 6843271 6539218 6115580 6375998 6810661 7005697 7065584 7016394 6737162 6703439 6483317
16051 6483317 6661619 6430464 6586034 6819638 6801026 6553204 6222145 6606287 7050162 7387726
16041 7387726 7280755 6964479 7238017 6881386 7406076 7499210 6834077 7091778 7094011 6889296
16031 6889296 6772917 6940564 6936865 7097873 7419129 7441494 8024593 7920505 7116379 7370097
16021 7370097 7357294 6906133 6999331 6957480 7025422 7426245 6893243 7131516 7214821 6920424
16011 6920424 6350596 6656337 6884444 6743988 6236239 6353762 6563709 6645306 6865454 7073873
16001 7073873 7167474 7009247 6778908 6856842 6753223 6500519 6772661 6616501 6353154 6226259
15991 6226259 7105122 7136217 6862322 7422475 6814084 6504931 6894516 6698634 6692074 6494838
15981F494838k75728N04712K21823j31422j75294J02152q1932N0465N36092J1594
15971G257300j56224n9944r2446j40889M09519j53968J91858k24614l99377J21679
15961F752894L09671o13150M02205m41719N74129J84335q47372L57809K15603
15952F894405j3673K180m07796l04585Q34199l80485q1113j77393l52235O49501
15942F663005R08338K31310n50019r13279j76695O15612N65185k44753j15689
15933F983015J33884J65585K55382j61341o96537J04977l77492M4252N23439O14479
15923G589643N14855l12040k67232k1256J50494P8144o26254k83687J38085m4255
15913F916497j37380m79040N32M09225K9886J18791M20582J76017m01384K14756
$$ plain form
15981 6494838 6219110 6723822 6945645 6814223 6638929 6741081 6659149 6709614 7245706 7257300
15971 7257300 7101076 7041132 6948686 6807797 7217316 7063348 7255206 7030592 6631215 6752894
15961 6752894 7062565 6449415 6851620 6409901 6984030 7168365 6320993 6678802 6894405
15952 6894405 6880732 6882912 6475116 6170531 7004730 6624245 6543132 6365739 6013504 6663005
15942 6663005 7571343 7802653 7252634 6339355 6162660 6778272 7343457 7098704 6983015
15933 6983015 7116899 7282484 7537866 7376525 6679988 6784965 6407473 6451725 6975164 7589643
15923 7589643 8104498 7792458 7525226 7503970 7654464 7732608 7106354 6822667 6960752 6916497
15913 6916497 6779117 6300077 6300609 6709834 6739720 6858511 7279093 7455110 7053726 7268482
15903G268482O18554j54447n38900j28226m03370L62505M88846j019800L45773
15894F839417K29947J86770k01528k41543M24362l09189o680m07490j63213M21523
15884F772376j31495l45473L47390O48268R6074n36655q7740J76450k84675K21250
15874F875770N8055k52986K94739q570L93016L01030l09419k32974j01275J41595
15864G158981K9060j72968k59337k5048K37251K47444J6949K52805j89629o26714
15854F668794O2891O7378N61597K81804m85264j07759K06768N9700N0074l53737
15844G012246N96716K56179j139578j94477j97770L10043j56509K38742N85252
15835G310844J64900j28206k35739l8060k70910J34935m53731m63002J008027
$$ plain form
15903 7268482 7887036 7732589 7193689 7065463 6662093 7024598 7513444 6493644 6839417
15894 6839417 7069364 7256134 7054606 6813063 7237425 6928236 6921556 6514066 6350853 6772376
15884 6772376 6640881 6295408 6642798 7291066 7387140 6850485 6762745 6939195 6654520 6875770
15874 6875770 6933825 6680839 6975578 6967008 7360024 7661054 7351635 7118661 7017386 7158981
15864 7158981 7188041 7015073 6755736 6730688 6967939 7215383 7232332 7485137 7295508 6668794
15854 6668794 6731685 6799063 7360660 7642464 7157200 7049441 7256209 7315909 7365983 7012246
15844 7012246 7608962 7865141 6725563 6531086 6333316 6643359 6486850 6725592 7310844
15835 7310844 7475744 7347538 7111799 7073739 6802829 6937764 6484033 6021031 7029058
15826G029058L8426p5075L00471n38155j8652j38520N0885l76528j67174N38580
15816F643316J8467J78519K47447o6066k54827L15785j30081M15076n67175K28483
15806G028944O67537l23354q6516N6428M2771k39329J46137J24319k31735l35242
15796F849960m7702N06832j93269J69688o8078k22671n8804m85965k50153O65986
15786F865824M21380N3178p6522l13307N65319l17204N63843l11694J23028k11344
15776G362501k43588J7780K99978L56400l35478j83763j10313m41059j29752J52802
15766F745508k75829P357L5101M351L1640N25950K09832k26502j81108j3586l58371
$$ plain form
15826 7029058 7067484 6992409 7292880 6754725 6736073 6597553 6648438 6271910 6104736 6643316
15816 6643316 6661783 6840302 7087749 7021683 6766856 7082641 6952560 7367636 6800461 7028944
15806 7028944 7696481 7373127 7286611 7343039 7385810 7146481 7292618 7416937 7185202 6849960
15796 6849960 6802258 7309090 7115821 7285509 7217431 6994760 6935956 6449991 6199838 6865824
15786 6865824 7287204 7340382 7263860 6950553 7515872 7198668 7762511 7450817 7573845 7362501
15776 7362501 7118913 7136693 7436671 7793071 7457593 7273830 7163517 6722458 6592706 6745508
15766 6745508 6469679 6477036 6512137 6516488 6548128 7074078 7283910 7057408 6876300 6862714 6504343
$$ [...]
##END NTUPLES=NMR SPECTRUM
##END=
