##TITLE=1H_DE-80H_X3
 200.13MHz, d2o
 8 sc
 
 19ns.26.2.2025
##JCAMPDX= 6.0         $$ Bruker NMR JCAMP-DX V2.0
##DATA TYPE= NMR SPECTRUM
##DATA CLASS= NTUPLES
##ORIGIN= UXNMR, Bruker Analytische Messtechnik GmbH
##OWNER= pz
$$ XWIN-NMR		Version 3.5
$$ Tue Jul 21 14:10:01 2026 Russian Standard Time (UT+4h)  Yarkov@DPX200
##.OBSERVE FREQUENCY= 200.1313
##.OBSERVE NUCLEUS= ^1H
##.ACQUISITION MODE= SIMULTANEOUS
##.ACQUISITION SCHEME= undefined
##.AVERAGES= 8
##.DIGITISER RES= 18
##SPECTROMETER/DATA SYSTEM= spect
##.PULSE SEQUENCE= zg30
##.SOLVENT NAME= DMSO
##.SHIFT REFERENCE= (INTERNAL, DMSO, 0, 15.4924)
##AUDIT TRAIL= $$ (NUMBER, WHEN, WHO, WHERE, WHAT)
$$ ##TITLE= Audit trail, XWIN-NMR		Version 3.5
$$ ##JCAMPDX= 5.01
$$ ##ORIGIN= Bruker BioSpin GmbH
$$ ##OWNER= Yarkov
$$ C:/Bruker/XWIN-NMR/data/yarkov2/nmr/H-C/1/pdata/1/auditp.txt
$$ ##AUDIT TRAIL=  $$ (NUMBER, WHEN, WHO, WHERE, WHAT)
(   1,<2026-07-21 14:09:12.85 +0400>,<Yarkov>,<DPX200>,
      <created by zg, POWCHK disabled, PULCHK disabled
       configuration hash MD5:
       00 E9 B6 7A A2 85 ED C7 34 08 36 98 17 FE 4E 26
       data hash MD5: 16K
       AD B4 91 22 CC B8 98 32 DE 94 72 C0 5A 85 A4 88>)
(   2,<2026-07-21 14:09:18.14 +0400>,<Yarkov>,<DPX200>,
      <Start of raw data processing
       efp BC_mod = 2 LB = 0.25 FT_mod = 6 PKNL = 1 PHC0 = -7259.724 PHC1 = 15.42198 SI = 16K 
       data hash MD5: 16K
       76 DA C6 62 91 58 F2 5A 6E BD F5 AD 4F 64 E5 B9>)
$$ ##END=
$$ 
$$ hash MD5
$$ 9D F1 0A 3E B9 1A 91 5D DF 5D 6C 7B 8E 03 66 EA
##$RELAX= 
##$RELAX= 
##$RELAX= 
##$RELAX= 
##$RELAX= 
##$RELAX= 
$$ Bruker specific parameters
$$ --------------------------
##$DU= <C:/Bruker/XWIN-NMR>
##$EXPNO= 1
##$NAME= <H-C>
##$PROCNO= 1
##$TYPE= <nmr>
##$USER= <yarkov2>
##$AMP= (0..31)
100 100 100 100 100 100 100 100 100 100 100 100 100 100 100 100 100 100 
100 100 100 100 100 100 100 100 100 100 100 100 100 100 
##$AQSEQ= 0
##$AQ_mod= 1
##$AUNM= <au_zg>
##$AUTOPOS= <>
##$BF1= 200.13
##$BF2= 200.13
##$BF3= 200.13
##$BF4= 200.13
##$BF5= 200.13
##$BF6= 200.13
##$BF7= 200.13
##$BF8= 200.13
##$BYTORDA= 1
##$CFDGTYP= 0
##$CFRGTYP= 5
##$CHEMSTR= <none>
##$CNST= (0..31)
1 1 145 1 1 1 1 1 1 1 1 1 1 1 1 1 1 1 1 1 1 1 1 1 1 1 1 1 1 1 1 1 
##$CPDPRG= <>
##$CPDPRG1= <>
##$CPDPRG2= <>
##$CPDPRG3= <>
##$CPDPRG4= <mlev>
##$CPDPRG5= <mlev>
##$CPDPRG6= <mlev>
##$CPDPRG7= <mlev>
##$CPDPRG8= <mlev>
##$CPDPRGB= <>
##$CPDPRGT= <>
##$D= (0..31)
0 0.7 0 0 0 0 0 0 0 0 0 0.03 0 0 0 0 0 0 0 0 0 0 0 0 0 0 0 0 0 0 0 0 
##$DATE= 1784628552
##$DBL= (0..7)
120 120 120 120 120 120 120 120 
##$DBP= (0..7)
150 150 150 150 150 150 150 150 
##$DBP07= 0
##$DBPNAM0= <>
##$DBPNAM1= <>
##$DBPNAM2= <>
##$DBPNAM3= <>
##$DBPNAM4= <>
##$DBPNAM5= <>
##$DBPNAM6= <>
##$DBPNAM7= <>
##$DBPOAL= (0..7)
0.5 0.5 0.5 0.5 0.5 0.5 0.5 0.5 
##$DBPOFFS= (0..7)
0 0 0 0 0 0 0 0 
##$DE= 6
##$DECBNUC= <off>
##$DECIM= 32
##$DECNUC= <off>
##$DECSTAT= 4
##$DIGMOD= 1
##$DIGTYP= 9
##$DL= (0..7)
0 120 120 120 120 120 120 120 
##$DP= (0..7)
$$ [...]
##$SUBNAM2= <"">
##$SUBNAM3= <"">
##$SUBNAM4= <"">
##$SUBNAM5= <"">
##$SUBNAM6= <"">
##$SUBNAM7= <"">
##$SUBNAM8= <"">
##$SUBNAM9= <"">
##$SW= 18.0517328524113
##$SWIBOX= (0..15)
0 0 2 0 0 0 0 0 0 0 0 0 0 0 0 0 
##$SW_h= 3612.71676300578
##$TD= 16384
##$TD0= 1
##$TE= 0
##$TE2= 300
##$TE3= 300
##$TEG= 300
##$TL= (0..7)
0 120 120 120 120 120 120 120 
##$TP= (0..7)
150 150 150 150 150 150 150 150 
##$TP07= 0
##$TPNAME0= <>
##$TPNAME1= <>
##$TPNAME2= <>
##$TPNAME3= <>
##$TPNAME4= <>
##$TPNAME5= <>
##$TPNAME6= <>
##$TPNAME7= <>
##$TPOAL= (0..7)
0.5 0.5 0.5 0.5 0.5 0.5 0.5 0.5 
##$TPOFFS= (0..7)
0 0 0 0 0 0 0 0 
##$TUNHIN= 0
##$TUNHOUT= 0
##$TUNXOUT= 0
##$USERA1= <user>
##$USERA2= <user>
##$USERA3= <user>
##$USERA4= <user>
##$USERA5= <user>
##$V9= 5
##$VALIST= <valist>
##$VCLIST= <CCCCCCCCCCCCCCC>
##$VD= 0
##$VDLIST= <DDDDDDDDDDDDDDD>
##$VPLIST= <PPPPPPPPPPPPPPP>
##$VTLIST= <TTTTTTTTTTTTTTT>
##$WBST= 1024
##$WBSW= 4
##$XGAIN= (0..3)
0 0 0 0 
##$XL= 0
##$YL= 0
##$YMAX_a= 102137
##$YMIN_a= -152998
##$ZGOPTNS= <>
##$ZL1= 120
##$ZL2= 120
##$ZL3= 120
##$ZL4= 120
##$ABSF1= 0
##$ABSF2= 0
##$ABSG= 0
##$ABSL= 0
##$ALPHA= 0
##$AQORDER= 0
##$ASSFAC= 0
##$ASSFACI= 0
##$ASSFACX= 0
##$ASSWID= 0
##$AUNMP= <proc_1d>
##$AZFE= 0.1
##$AZFW= 0.1
##$BCFW= 0
##$BC_mod= 2
##$BYTORDP= 0
##$COROFFS= 0
##$CY= -3
##$DATMOD= 1
##$DC= 0
##$DFILT= <>
##$DTYPP= 0
##$F1P= 0
##$F2P= 0
##$FCOR= 1
##$FTSIZE= 16384
##$FT_mod= 6
##$GAMMA= 0
##$GB= 0
##$INTBC= 1
##$INTSCL= 3.241238e-09
##$ISEN= 128
##$LB= 0.25
##$LEV0= 0
##$LPBIN= 0
##$MAXI= 10000
##$MC2= 0
##$MEAN= 0
##$ME_mod= 0
##$MI= 1.114404
##$NCOEF= 0
##$NC_proc= -8
##$NLEV= 6
##$NOISF1= 3.799351
##$NOISF2= 2.8
##$NSP= 0
##$NTH_PI= 0
##$NZP= 0
##$OFFSET= 15.49237
##$PC= 1
##$PHC0= -7259.724
##$PHC1= 15.42198
##$PH_mod= 1
##$PKNL= yes
##$PPARMOD= 0
##$PSCAL= 0
##$PSIGN= 0
##$REVERSE= no
##$SF= 200.130005868925
##$SI= 16384
##$SIGF1= 3
##$SIGF2= 2
##$SINO= 0.751879
##$SIOLD= 32768
##$SREGLST= <19F.Aceton>
##$SSB= 0
##$STSI= 16384
##$STSR= 0
##$SW_p= 3612.71676300578
##$SYMM= 0
##$S_DEV= 0
##$TDeff= 16384
##$TDoff= 0
##$TI= <>
##$TILT= no
##$TM1= 0
##$TM2= 0
##$TOPLEV= 0
##$USERP1= <user>
##$USERP2= <user>
##$USERP3= <user>
##$USERP4= <user>
##$USERP5= <user>
##$WDW= 1
##$XDIM= 16384
##$YMAX_p= 279178146
##$YMIN_p= -1334154
$$ End of Bruker specific parameters
$$ ---------------------------------
##NTUPLES= NMR SPECTRUM
##VAR_NAME=  FREQUENCY,     SPECTRUM/REAL,   SPECTRUM/IMAG
##SYMBOL=    X,             R,               I
##VAR_TYPE=  INDEPENDENT,   DEPENDENT,       DEPENDENT
##VAR_FORM=  AFFN,          ASDF,            ASDF
##VAR_DIM=   16384,         16384,           16384
##UNITS=     HZ,            ARBITRARY UNITS, ARBITRARY UNITS
##FACTOR=    0.220516191357247, 1,           1
##FIRST=     3100.48802933718, 0,            0
##LAST=      -512.228733668604, 0,           0
##MIN=       -512.228733668604, -1334154,    0
##MAX=       3100.48802933718, 279178146,    0
$$ Real data points
##PAGE= N=1
##DATA TABLE= (X++(R..R)), XYDATA
$$ [...]
7202 -39702 420665 576382 357733 366534 518697 147273 168388 452032 615964 313925
7192 313925 144294 269974 411366 520158 240450 462537 541604 269003 237433 512841
7182 512841 211069 126599 292298 285287 242853 88554 105708 307666 724688 358055 -54600
7171 -54600 314548 638115 516696 199356 197824 327878 40432 -38753 67838 344954
7161 344954 449391 448300 567716 525970 234007 388689 493472 429764 358084 159673 311880
7150 311880 350797 154224 -168499 -33383 409202 556005 23608 57827 134271 221074
7140 221074 2850 55769 201697 281070 206239 270267 225388 223501 77100 399496 646126
7129 646126 565690 658850 593189 446877 237723 285011 520320 538216 340548 64507 -60360
7118 -60360 161610 314522 142463 72309 415445 391984 82290 228812 739818 706166
7108 706166 230706 531199 496313 564017 301918 371043 658113 495917 299628 708350
7098 708350 708610 303047 258423 252543 600780 118780 224542 224987 553143 355245 218125
7087 218125 276550 496404 526708 457016 599753 653251 528234 135782 238786 282339 287630
7076 287630 50160 119223 54517 -161148 89591 372756 577050 160532 21883 233530
7066 233530 488041 502709 470580 426602 476626 280020 286057 337187 252667 -289240 -319104
7055 -319104 285688 399142 292637 -84856 145763 313991 171651 237553 357455 307285
7045 307285 273229 459257 726371 682246 34450 42756 376131 372415 271928 385565 566110
7034 566110 540667 10964 115665 487124 620245 304611 -32622 55503 70895 336148
7024 336148 598483 615784 304085 -106322 38658 484979 290916 152979 352878 450376
7014 450376 477405 275967 233539 655401 546764 188034 212026 349982 256953 71528
7004 71528 388733 738143 764767 509211 465805 512112 286579 -71636 5642 10441 -162907
6993 -162907 -149308 141835 403131 145123 -44159 101120 329965 125457 -202767 -169881
6983 -169881 76584 284272 448347 405161 329483 -32640 -142201 171368 345969 178445
6973 178445 39932 198459 718174 541667 223823 437197 710326 384823 177277 343606
6963 343606 651457 311060 181844 473164 595790 262138 224507 526945 785765 529072
6953 529072 225122 481264 566742 257162 37399 478903 786943 314973 38533 359943
6943 359943 383927 38848 39422 333054 500939 315092 84498 384115 459337 -214145 120197
6932 120197 788499 584954 331775 306791 427014 286133 -68078 5151 498015 415566
6922 415566 -97788 253252 491337 310972 -30438 2369 265964 118132 -210591 -193321
6912 -193321 131420 161306 -181827 26255 505257 516232 211076 506977 856974 625484
6902 625484 422993 506397 681053 556891 372626 806440 1203856 942674 704273 689191
6892 689191 829655 346433 84734 253114 478495 96962 174235 501726 704356 206262
6882 206262 179930 624403 724916 484980 423096 608576 574132 363972 661967 736044
6872 736044 619651 679848 660085 852009 1018911 705390 764051 1099869 885732 577592
6862 577592 538360 940333 1265670 875999 800650 983997 1121434 863126 917744 1020791
6852 1020791 1209484 1371365 1538907 1416881 1113353 1284656 1499872 1431996 1523840 1441503
6842 1441503 1498123 1667309 1629903 1684152 1888550 2215014 2368246 2357861 2225242 2542480
6832 2542480 2822369 2693392 2821520 2885833 3069270 3510247 3387796 3375673 3427326 3502885
6822 3502885 3525836 3496893 3279099 3396121 3411316 3422385 3833734 3932829 3582396 3460012
6812 3460012 3754488 4080624 3532208 3526323 4002077 4112516 3865510 4237301 4666827 4593189
6802 4593189 4700656 5066549 5459090 5421239 5258621 5169332 5530265 5418779 4996985 5260648
6792 5260648 5741370 5422763 4962277 5269197 5466908 5240303 4703298 4647517 5148691 5522750
6782 5522750 4944802 5085915 5392715 5414946 5099329 5153539 5279414 5313180 5354190 5210720
6772 5210720 5494760 5321981 5024095 5166474 5414115 5079869 4708952 4711971 4922854 4574909
6762 4574909 4115040 4379782 4772841 4653713 4477420 4497699 4829954 4568971 4223385 4524991
6752 4524991 4839655 4403662 4127184 4574226 4428288 4252960 3898690 3858134 4014622 3605208
6742 3605208 3784431 4073664 3970870 3070484 2904460 3512481 3496553 2841612 2847886 3348125
6732 3348125 3087798 2881392 2674808 2926289 2712829 2805963 3011341 3016174 2905075 2414255
6722 2414255 2306121 2365043 2305434 1723802 1780777 2182432 2197375 1828327 1436048 1476186
6712 1476186 1233451 1284607 1175182 1279435 1265868 952833 982885 1341981 1240671 1038647
6702 1038647 1240761 1674097 1482398 1164598 1362496 1511030 1390343 911414 1180230 1644559
6692 1644559 1340494 830649 1018563 1293492 1104145 850618 1197939 1422840 1098043 567271
6682 567271 1013962 1463611 1310242 1269895 1370431 1275015 1109185 969024 1196360 1218556
6672 1218556 987228 770619 1257839 1772175 1078168 983909 1282418 1676456 1762047 1654201
6662 1654201 1861968 2152576 1827974 1499267 1976883 2232926 1960066 1532828 1981394 1711160
6652 1711160 1263673 1463467 2082125 1797648 1389580 1391571 1675255 1695238 1365009 1572957
6642 1572957 2332287 2205427 1410830 1395712 1749742 1939456 1655656 1585020 2107308 2245213
6632 2245213 1857578 1675545 1764773 1817298 1907536 1995548 2601066 2372325 1923250 1733172
6622 1733172 1907042 2231549 2018216 2061288 2146967 2490183 2445580 2533495 2580727 2712767
6612 2712767 2852675 3177639 3126972 3391011 3434940 3611876 3859213 4066906 3822039 3934095
6602 3934095 4483424 4575960 4692877 4940559 5239787 5635582 6200702 6605762 7285166 7850976
6592 7850976 8237111 8335738 9178139 9961604 10461800 11099112 11437813 12307252 12941388 13819515
6582 13819515 14171770 14751204 15195468 15756496 15907775 16183484 16098433 16353800 16839990 16766407
6572 16766407 16532118 16302006 16476720 16251860 16338545 16197119 16727762 16925654 16770212 16438104
6562 16438104 16764665 17040315 16615568 16629964 17020396 17041562 16429221 16022388 15571233 14745913
6552 14745913 13666465 12993892 12815510 12064560 10843868 10392875 9950887 9279602 8380432
6543 8380432 7559505 7625143 7197165 6548540 5949748 6047504 5744733 5220175 5058804 5168748
6533 5168748 4979746 4539296 4361007 4436571 4611307 4021661 4110610 4076481 3842186 3566700
6523 3566700 3667414 3848728 3605931 3133140 3126361 3452507 3491443 3269112 3168000 3727979
6513 3727979 3359698 2976148 2686092 3242221 3227603 3021055 3215267 3670364 3808573 3802952
6503 3802952 4373773 4093324 3903106 3793007 4128496 4092953 3623973 3454423 3947672 3852403
6493 3852403 3229497 3059856 3236405 3774594 3812135 3614570 3623737 3677832 3444040 3214359
6483 3214359 3376327 3619915 3002169 2743237 2781498 2832294 2545500 2405256 2726013 2971592
6473 2971592 2720782 2134614 2588581 2870836 2801210 2708327 3025861 3304110 3103763 3323319
6463 3323319 3738197 3628960 3318002 3561305 4124286 4204840 3789206 4069151 4109868 3883944
6453 3883944 3935234 3977589 4465245 4474932 4040425 4059784 4223898 4259044 4354477 4156381 4404982
6442 4404982 4438623 4779182 4753293 4680849 4640778 4995539 4926751 4890835 4882998 5010655 5418837
6431 5418837 5336819 5315811 5274880 5532954 6215707 6629335 6498279 6403046 6860950 7271659
6421 7271659 7058837 6844115 6686106 6828831 6839668 6791306 6574477 6788182 6647437 6558017
6411 6558017 6645786 6443613 6017495 6199983 6510709 6258690 5727111 5576265 5776508 5875930
6401 5875930 5411304 5322783 5770578 6371114 6428248 6240859 6728275 7205755 7153900 7350240
6391 7350240 7585947 7627133 7852643 7955053 8060741 8059036 7912151 7984798 8270911 8085464
6381 8085464 7743503 7362608 7773375 7462527 6814237 6493854 6852936 7121360 6502330 6173834
6371 6173834 6513439 6774568 6440349 6169266 6134648 6032589 5637090 6212857 6523874 5949563
6361 5949563 5622129 6179930 6405903 5694778 5513103 5914307 6022510 5481845 4688793 4850972
6351 4850972 5223280 4887276 4248744 4383598 4698900 4478059 4335857 4347191 4070080 3661272
6341 3661272 3503329 3818807 4133135 4172636 4236182 4642107 5233762 5012624 4972497 5431418
6331 5431418 6063878 5765468 6002416 6598806 7188820 7729833 7811727 8240000 8271850 8483098
6321 8483098 8888125 9084480 8955767 8519602 8830397 9338602 8846250 8078483 8271039 8285974
6311 8285974 7780318 7330026 7204685 7843799 7226992 7026599 7086274 7216009 7758019 8216677
6301 8216677 8565171 8606412 8668350 9289870 9794691 9839548 9936457 10315303 10709510 10666071
6291 10666071 10378013 10382802 10780433 10958437 10845608 10581724 10352811 10130958 10200036 10139727
6281 10139727 9868940 9791373 10052156 10028239 9848772 9428431 9748984 10007903 10163775 10340986
6271 10340986 9956491 9934802 9988162 9901615 9733517 9572943 9406993 9257771 9237452 9030320
6261 9030320 8626908 8563522 8865458 8480454 7965827 7741251 8106663 7961436 7896211 7898004
6251 7898004 7480993 7690769 7663389 7416860 7380644 7568577 7826133 7908727 7715316 7383234
6241 7383234 7320994 7452921 7486292 6894570 6456156 6331761 6257279 5801248 5471602 5550592
6231 5550592 5582339 5060917 4836132 4817260 4846319 4516365 4257784 4412590 4119104 3602116
6221 3602116 3845455 4174772 3610600 3139932 3003306 3434319 3448734 2923671 2568338 2707191
6211 2707191 3010895 2918215 2959761 3077734 3082200 3069985 3138510 3155548 2950335 3100127 3156862
6200 3156862 3288006 2917887 3046897 3341001 3605741 3196666 2706423 2698455 3322505 3446621
6190 3446621 2922644 2533635 2895403 3153978 2591378 2463486 2734593 2754917 2657518 2677647
6180 2677647 2999863 3005876 2795884 3073182 3247217 2952421 2508267 3002768 3166741 2755125
6170 2755125 2776251 2893169 3251009 2942932 2666966 2728775 2750872 2878868 2900282 2816681
6160 2816681 2707484 2639904 3259494 3314428 3142774 2866474 2868215 3639403 3548279 3324250
6150 3324250 3161879 3533935 3694046 3257640 3032359 3165336 3106718 2938811 3150207 3501628
6140 3501628 3323474 3474620 3541002 3527848 3752629 3238460 3503068 4009007 3946454 3670532
6130 3670532 3629179 3825933 3647685 3325979 3635016 4120894 3822768 3718177 3835341 3997576
6120 3997576 3555693 3460993 3407134 3395610 3659855 3626403 3654307 3411649 2942417 2923555 3297652
6109 3297652 3163630 2984692 3087690 3401723 3777362 3421418 3013325 3379687 3763844 3479017
6099 3479017 3536226 3716948 3640103 3348755 3371567 3546867 3765343 3280712 3001709 3033274
6089 3033274 3148766 2920631 3245746 3680316 3633764 3246714 3265568 3608028 3804675 3744154
6079 3744154 3776006 4305979 4340839 4016922 4197298 4952297 5072942 4825069 4943392 5412616
6069 5412616 4847273 4615585 5079719 5659734 5434779 4908498 5101300 5141655 4702667 4306347
6059 4306347 4620490 4683032 4429807 4630125 4984386 4941582 4552232 4678639 4882551 4869149
6049 4869149 4842992 5104792 5195214 5058576 4772748 4928741 5393382 5726879 5897170 6417424
6039 6417424 7193384 7588741 8009559 8962665 10340511 10953839 10795587 11165850 11445705
6030 11445705 10776301 10166456 9892882 9760449 9340672 8685809 8141732 8317060 8382656 7960046
6020 7960046 8346509 8969266 9441000 9757687 10712615 11393128 11697430 11758571 12062121 12146771
6010 12146771 11103678 9943404 9371255 9019771 8214504 7225541 6917911 6670402 5845055
6001 5845055 5532003 5725768 5572664 5291770 5203721 5350691 5194984 4610438 4750179 5321025
5991 5321025 5087136 4890693 5152712 5906718 5892027 5674507 5815652 6123806 5950593 5812681
5981 5812681 5678745 6034578 6307295 6356597 6672651 7110051 7416369 7401443 8340033 9405063
5971 9405063 10027189 10604416 12009852 13827053 14894961 15140859 16192753 16882612 16408659
5962 16408659 15311220 14527665 13930147 13013395 12031812 11553049 11355610 10911993 10459273
5953 10459273 10563425 11237823 11538834 12137778 13498536 14423676 14750436 15257993 16202437
5944 16202437 15935628 14784497 13962217 12962413 11502331 10402015 9370609 8552017 7518809
5935 7518809 6639514 5872643 5438026 4986405 4734394 4215859 3820895 2948584 2718386 3078135
5925 3078135 3566603 3176218 2443590 2533657 3173471 3038718 2627925 2429967 2314935 2360462
5915 2360462 2449982 2803274 2896372 2643480 2596779 2979616 2966505 2231854 2073474 2709818
5905 2709818 3012845 2605441 1974317 2335966 2685191 2287059 1767925 2323126 2272870 2249463
5895 2249463 1856990 1787912 1801824 1656918 1695627 1927246 1778878 1339323 1754969 2033810
5885 2033810 1665835 1355508 1486223 1737312 1755586 1449912 1738652 2059659 1715677 1617690
5875 1617690 1551464 1820873 1640869 1887332 1946862 1972199 1497056 1769017 2056292 1825610
5865 1825610 1545114 1627387 1816001 1722770 1642498 1100864 1448638 1863064 1778830 1327668
5855 1327668 1319554 1770015 1740831 1360777 1307709 1809603 1864984 1755669 1897806 1753978
5845 1753978 1326677 1360972 1751065 2080283 1352561 1416862 2143407 2262234 2003436 1647911
5835 1647911 1978305 2170053 1992567 2006892 2381833 2365614 2282210 2695452 2480575 1986406
5825 1986406 2088287 2381502 2545040 2265037 2191315 2564058 2532997 2144908 1971413 2140252
5815 2140252 2612671 2773171 2318428 2157618 2690605 2910629 2692254 2698351 2773527 2887103
5805 2887103 3267873 3289413 3579507 3730831 3799671 4153956 4907570 4797373 4920008 5441578
5795 5441578 6165700 6390140 6372263 7076233 8219991 8566223 9442559 10966648 12102837
5786 12102837 13374573 14602806 15838290 16018959 15632239 15150698 14681031 13854795 12687464
5777 12687464 11910413 11570941 11028739 10045779 10004631 10215253 10336180 10122527 10574719 10829846
5767 10829846 11566133 12786963 13876202 14906956 16561537 19276957 22375201 25525906
5759 25525906 30153321 36890365 45987013 57194442 71305194 86181706 97309002 103676898
5751 103676898 100322498 89576196 76894819 65055213 54882720 45533973 37895422
5744 37895422 31862153 26962579 22502172 18851430 16240091 14641675 12997451 11939339
5736 11939339 11175528 10128190 9496120 9097042 9127976 8681130 8187839 8113655 8544214 8480680
5726 8480680 8149786 8193539 8333606 8775601 9465991 9673227 10173754 10677572 11357634 11522867
5716 11522867 11510824 11661044 11764368 11385469 10379641 9731679 9316670 8560272 7895625
5707 7895625 7413207 6979396 6313322 6156383 5934256 5455489 4948128 5186916 5797952 5577188
5697 5577188 5179921 5539257 5964351 6353060 6537726 7186908 7724041 8309041 9121361 10058714
5687 10058714 10668606 10582485 10510817 10293169 9279468 8409107 7671199 7286550 6877423 6216895
5677 6216895 5720009 5320084 5193317 4587863 4231519 4045303 4092592 3733575 3471709 3294772
5667 3294772 3046229 3093627 3005352 2786776 3062149 2741988 2667909 2913824 2955043 2535631
5657 2535631 2386748 2865414 3221795 2809083 2827731 2915042 3177060 3032486 2849991 3265237
5647 3265237 3128375 2775024 2858536 3093081 2922457 2905277 2918635 3168868 2895104 2296919
5637 2296919 2835648 3122075 2800041 2701267 2897760 3122197 3033299 3028507 3012095 3074746 2805566
5626 2805566 3022394 3239753 3035845 2888727 3219884 3538963 3515022 3997112 4283277 4267694
5616 4267694 4288720 4400152 4426287 4127957 4072410 4103372 3605172 3562476 3838379 3682347
5606 3682347 3425097 3170463 3318011 3391233 3307894 3351265 3136887 3054275 3337286 3647796
5596 3647796 3751620 4064652 4358532 4697170 4747619 4617700 4543390 5040393 5356420 5522031
5586 5522031 5598619 5789266 5806788 6163965 6583320 6400136 6198324 5866198 5831958 5584989
5576 5584989 5201198 4855553 4996078 5062648 4694519 5021936 5030512 4411791 4432275 4656740
5566 4656740 4705799 4936173 5426586 5560265 5308289 4891617 5473114 6141973 6358708 6319473
5556 6319473 6611033 7020177 7348224 8097469 8845609 9188990 9188599 9369140 9657065 9451084
5546 9451084 9236330 8609476 8103697 7439013 7022361 7267940 6925457 6512181 6305812 6231011
5536 6231011 6306900 6353484 6394802 6442059 6174290 6219185 6722455 7105260 7472333 7803261
5526 7803261 8382987 8608667 9363969 10151664 10506027 11213605 12066816 12772890 13070071 13260593
5516 13260593 14036962 14558485 13951764 13455421 13446649 13404527 12554725 12227093 11817339 11168550
5506 11168550 10486158 10345276 9898337 9172109 8781844 8814719 8914782 8568760 8363485 8883916
5496 8883916 9216647 9193841 9642904 10357827 11106232 11348805 11639429 12096121 12362118 12277780
5486 12277780 12474663 12197087 11744072 11277470 11136330 10857656 10111330 9945728 9897617 10232093
5476 10232093 10190661 10552671 10248919 10424982 11053454 11353226 11636072 11992990 12812172 13288003
5466 13288003 13753322 14276554 15064146 15130059 15594013 16185016 16085390 16000081 16192053 16634887
5456 16634887 16214988 15119254 14801095 14502392 13635328 12432851 11755012 11599224 10553134
5447 10553134 9753213 9553291 9000117 8406500 8194460 7956469 7431191 7093799 7035024 7592313
5437 7592313 7706184 7396369 7337804 7515086 7606356 7720359 8212161 8368786 8750413 9129197
5427 9129197 9416579 9612871 9901012 10433005 11010811 10815953 10680169 11178739 11502988 11274799
5417 11274799 11013687 11038582 10890938 10697245 10455279 10127068 9694425 9397471 8909646 9007080
5407 9007080 8799005 8961029 9107359 9358091 9156107 9107718 9351362 9826463 10060511 9948882
5397 9948882 9815480 9731275 10048057 9880258 9774117 9681814 10084622 9929912 9341124 9176896
5387 9176896 9070813 8462891 7718720 7581718 7507215 7265960 7544974 7807587 7250817 6994218
5377 6994218 7120817 7919767 8238355 7887451 8081181 8921496 9046133 8860146 9630404 10355578
5367 10355578 10570726 10368008 10803660 10847645 10921778 11046857 11214150 11110682 10885666 11243121
5357 11243121 11478802 11974041 11707368 11344381 11437546 11138563 10513508 10261701 10239698 10186145
5347 10186145 10177150 10001369 9727363 9528570 9813670 10416458 10981420 11123931 11561492 12014959
5337 12014959 12719547 13171035 13219764 13273819 13787517 14149964 13857088 13340514 13260295 13355668
5327 13355668 13135343 12698305 12429862 12318181 12305555 12231892 11813298 11712565 12097182 12287181
5317 12287181 12425086 12464366 12679817 13205369 13565328 13596015 13737843 14083359 14548830 14928988
5307 14928988 15615651 16491173 17283383 17842774 18700776 19302345 19496455 19839681 20247759
5298 20247759 20177208 19596883 19223085 19087700 18953592 18412150 18033016 17943148 17946069 17492439
5288 17492439 17077642 16689737 16725738 16923780 17571780 17950885 17699217 18304495 18689825 18710354
5278 18710354 18624441 18830701 19484931 20188592 20588909 21126009 22031108 22924414 23487347 23573295
5268 23573295 24016378 24366578 24535519 24568695 24315890 23988378 23469997 23215860 22964026 22577746
5258 22577746 22153041 21836864 21787812 21743896 21381977 21016337 21567911 22148255 22279372 22130150
5248 22130150 22538642 22862873 22858366 22952129 23487199 23957768 24533626 25313264 25939001 26231910
5238 26231910 26191709 26657575 27396003 26600281 25647850 25720409 25503089 24493684 23486361
5229 23486361 22979822 22692303 22038538 21127568 20580401 20297564 19982801 19841069 19589301
5220 19589301 19673208 19722258 19741129 19687726 19621037 19573878 19682366 20504028 21225940 21684625
5210 21684625 21882877 22562038 23615073 24230792 24127017 24449373 24743465 24292258 23068888
5201 23068888 22357539 22090283 21289037 20179371 19479183 18989469 18019651 17281534 17086306
5192 17086306 16978431 16301092 15901591 16205364 16208230 15474030 15209386 15735210 16002423 16181223
5182 16181223 16135580 16640342 17140791 17170309 17477601 18111707 19013828 19288419 19898173 20429138
5172 20429138 20679586 20267956 20351514 20527593 20002720 19181450 18782761 19215632 19056730 17893330
5162 17893330 17333183 17673131 17846377 17306367 17029211 17560973 17794036 17406642 17460914 18057078
5152 18057078 18218051 18267030 18179505 19044867 19429645 19421631 19955018 21269661 21638607 21006732
5142 21006732 21781669 23059335 23532051 23100050 23494975 24561197 24517013 23994709 24042077
5133 24042077 24887945 24743247 24463396 24844195 25528611 25127721 25545463 26671890 27315049
5124 27315049 27113087 27083320 28229371 28992694 29074070 29145305 29926709 30995335 31277261 31586487
5114 31586487 32710485 33536173 33976874 34402371 35483302 36307331 36768226 37468206 38535782
5105 38535782 39486777 39988425 40576858 41353116 42301955 42381781 42990898 44157852 45114392
5096 45114392 45067989 45240384 46814162 47766795 47995511 48294434 49212862 49686694 50004168
5087 50004168 50398163 51038020 51269447 51453616 52192890 52635425 52502665 52257565 52581718
5078 52581718 53204986 52613621 52075351 52256128 52209909 51953244 51222410 50918612 50562187 50166849
5068 50166849 49489525 48641965 48217985 47679205 46986805 46035230 44999791 44220307 43668822
5059 43668822 42929375 42164824 41075112 40437267 39511480 38834081 38138965 37227286 36518414
5050 36518414 35803161 35504003 34897949 34213470 33833697 33690836 33059003 32199492 31760407
5041 31760407 30882599 30253624 29901847 29398899 28658780 27926601 27334495 27064704 26330400
5032 26330400 25890086 25244712 25149247 24808261 24360845 23976736 23843386 23720366 23036115 22370020
5022 22370020 22239349 22355795 21933566 21462651 21292672 21560056 21508799 21453363 21507228 21980823
5012 21980823 21704990 21771454 22177294 22369467 21843085 21111933 21143629 21098409 20523655 20187017
5002 20187017 20350054 20232579 19903537 19927975 20399506 20828686 20870839 21393485 22077838 22192269
4992 22192269 21527720 21145847 20880734 20517819 20031136 20137841 20217062 19897496 19006374 19341633
4982 19341633 20165422 19926132 19571066 19674843 20234948 19843419 19167807 18583535 18319839
4973 18319839 18047051 17417450 17194345 17156185 16663158 16271659 16473725 16478049 16225045 16294807
4963 16294807 16825726 16928737 16734368 16289335 16115413 16081170 15642126 15029051 14742283 15131094
4953 15131094 14858716 14373246 14432891 14410948 14202493 14090360 14284971 14820700 14519103 14435853
4943 14435853 14916022 15382854 15007142 14832427 15233099 15331992 15259933 14897204 15386030 15737963
4933 15737963 15546530 15522348 15582633 15605214 15489957 15507738 15582859 15317208 15443871 15491316
4923 15491316 15431171 15393040 15270499 15602989 15919889 16345178 16520596 17028575 17730926 18289582
4913 18289582 18576235 18581281 18652368 19188036 19387640 19087637 19042506 19332785 19280254 18425689
4903 18425689 18174296 18006952 17397193 16944381 17094086 16998451 16162687 15477924 15521932 15583705
4893 15583705 15220765 15164100 15300836 15843837 15709480 15671616 16086642 16700195 16838493 16517656
4883 16517656 16724887 16979884 16810035 16702426 16792050 16837980 16852459 16458929 16375302 16876113
4873 16876113 16969699 16531806 16525833 16629273 16076553 15753927 16138163 16445703 16362480 16128184
4863 16128184 16389204 17059533 16915391 16994123 17297830 17942906 18086861 18035824 18623946 18897834
4853 18897834 18569112 18437652 18832220 18657862 18045973 18095150 18650383 19011347 18617656 18596235
4843 18596235 19586048 20143592 20413031 20887561 21479262 22068857 22891312 23757886 25053132
4834 25053132 26188656 27856403 30010607 33194906 37159424 42525953 49666917 58626876
4826 58626876 67103181 73434232 75981363 73063632 67585583 61602322 55908983 51103405
4818 51103405 46987604 43953516 41633200 39895089 38436210 37359774 36881609 36549575
4810 36549575 36030141 35593347 35374021 35691921 35663400 35298642 35431684 36044276 36031649 36195700
4800 36195700 36464061 36482408 36486200 36699619 37091727 37450972 37884131 37711630 37802433 37626117
4790 37626117 37647101 37796889 38089140 38145494 37866505 37841923 37920726 37704885 37606772 37369350
4780 37369350 36929399 36711782 36581445 36135289 34955015 34666471 34167712 33398295 32950113
4771 32950113 32628173 32138128 31316337 31196276 30833589 30728230 30283958 29961358 29765344
4762 29765344 29720342 28895740 28846924 29143361 28753382 28231831 28412537 28663191 28764144 28924459
4752 28924459 29153536 29848065 30418395 30993602 31763577 32665577 32912191 33554904 34340326
4743 34340326 35176017 35953278 36788191 37388824 38051588 38787146 39243334 39962278 40511432
4734 40511432 41008201 41022734 41332647 41700893 42256190 42608283 42828535 43920929 44843659
4725 44843659 45347034 46212155 47350622 48396613 49791550 51387598 53173616 54672237
4717 54672237 56339753 58712559 60955906 62895701 64439367 66368096 67815256 68987594
4709 68987594 69838589 70563866 70853210 70543497 70330863 70260887 69858246 69345537 68895491 68842662
4699 68842662 68455892 67741992 67488594 67196922 66275570 65187561 64863113 64306170 63776340
4690 63776340 62777310 62280680 61279149 60471213 59805434 59002615 58231125 57020182 56022027
4681 56022027 54687521 52846504 50974985 49460698 48135428 46635749 45068442 43621050
4673 43621050 42308716 40638200 39001262 37443880 36235087 34794588 33421055 31701096
4665 31701096 30574307 29264005 28168338 26798997 25457421 24336558 23413224 22749515
4657 22749515 21817044 20833264 20121936 19552916 18856954 18329862 17598159 17034036 16485505
4648 16485505 16204155 15800416 15442951 15284697 14934685 14779274 14895674 14616381 14333354
4639 14333354 14167115 14091198 14148926 14330699 14215845 14177342 14277522 14365259 14682699 15056410
4629 15056410 16016599 17423046 18694317 20247644 21783372 23111721 22709492 21357315
4621 21357315 19682253 18536696 17222241 15992357 15016459 14669430 14452336 14033132 14189656
4612 14189656 14580871 15263222 16057405 17172724 18308137 19412799 20151909 21341584 22336972
4603 22336972 22727556 23544427 25443813 27777685 29061597 30278580 31212207 31590666 31696048
4594 31696048 32179985 33646153 34961047 36175981 37186228 37195264 36337958 34735199 33598486
4585 33598486 32984101 32205423 31576071 30996689 30721153 29391753 27129377 25338750 24032018
4576 24032018 22663094 20946522 20097930 19390610 18010155 16220710 14995096 13784586
4568 13784586 12331968 11180840 10795682 10092407 8884845 7940382 7778034 7870143 7285123
4559 7285123 6600628 6624509 6902455 5941233 5150774 5382278 5849478 5281791 5151665 5332712
4549 5332712 5435828 4827447 4673616 5128869 4748430 4343237 4253155 4618555 4440832 3890008
4539 3890008 3998034 4554201 4328651 3719999 3689494 3911756 3683829 3208418 3398200 3453151
4529 3453151 3516353 3229395 3230612 3502449 3278805 3019814 3331660 3538248 3468137 3029683
4519 3029683 3498901 3944907 3630453 3288220 3467306 3644111 3386154 3294202 3312120 3468792
4509 3468792 3268129 3333356 3532490 3593903 3276579 3222240 3513840 3148344 2761027 2701294
4499 2701294 2969101 2926485 2287418 2119300 2478973 2576879 1925334 2066342 2305657 2528426
4489 2528426 2222095 2355808 2493033 2318962 2144311 2362203 2573097 2278260 2035230 2140923
4479 2140923 2433255 2045896 2177558 2396543 2689239 2406947 2093604 2261861 2113169 2188182
4469 2188182 2257261 2294702 2084680 1959095 2129041 2138659 1903858 2016804 2167727 2065342
4459 2065342 1867789 1871550 1813804 2026400 2071658 2028382 1736751 1620641 1913834 2115458
4449 2115458 2306515 2238202 2357764 2521754 2684643 2555759 2447803 2436060 2601113 2409136
4439 2409136 2141292 2226737 2292291 2560759 2301951 1939627 2050415 2096068 2065548 1848114
4429 1848114 1623255 1562825 1663970 2029948 2125927 2160281 2093455 2178881 2232247 2017113 1890877
4418 1890877 2228961 2549004 2583531 2654627 2778599 2869133 2555394 2526165 2425815 2475684
4408 2475684 2677465 2843090 2782225 2390046 2361514 2861380 2993125 2503945 2334245 2496474
4398 2496474 2560704 2498621 2314326 2647766 2851303 2892472 2681478 2629777 2409911 2318707
4388 2318707 2653703 2760112 2563341 2505367 2995359 3001519 3026399 2840409 3110587 3184342
4378 3184342 3154781 3132031 2908674 3432647 3363227 3538911 3253804 3530606 3503449 3620132
4368 3620132 3579197 3534444 3519462 3621739 4019202 4018590 3801592 3767525 4210128 4387455 4938013
4357 4938013 4923474 5515829 6067099 5934440 5577593 5262061 5238880 5246055 5194870 5094802
4347 5094802 4925062 5064423 5350814 5127700 5087248 5217958 5926568 6092464 5980355 5985642
4337 5985642 6296187 6441769 6507426 7047976 6954452 7123547 7305906 7836382 7656305 7990259
4327 7990259 8158337 8896460 9511127 9669304 10163849 10935731 11733090 11931225 12567913 13555715
4317 13555715 14502657 14970143 15632302 16668722 17444701 18241114 19651385 20605085 21089947
4308 21089947 22012825 23665500 24609631 25001540 25978968 27231276 28538580 29219031 29977910
4299 29977910 31468065 32938713 33495198 34166222 35283492 36267932 37426834 38309570 39517137
4290 39517137 40432272 41254926 42193179 43263016 43735399 43854209 44536071 45209444 45553796
4281 45553796 45472093 45793847 46550059 46763155 45902960 45831674 46065838 46301475 46031700 45789041
4271 45789041 45537108 45008933 44608415 44565456 44400606 43331229 42338025 41778945 41461728
4262 41461728 40444798 39336725 38865904 38427785 37432805 36345893 35825886 35440469 34375521
4253 34375521 33265759 32749464 31923953 30959014 30353654 29759833 28504010 27456469 27148045
4244 27148045 26739306 25848635 24903928 24455614 24184007 23345902 22428748 22095679 21828187
4235 21828187 21406902 20797113 20269644 20025233 20172282 20066521 20183469 19571595 19006164
4226 19006164 19088647 18958883 18560070 17955942 17629619 17598960 17333630 17077765 16944755 16952038
4216 16952038 17113441 17106808 17087366 17134357 17380313 17612921 17770619 17969269 17934073 17888636
4206 17888636 17987747 18391391 18544219 18811218 19615640 20436481 20585637 20438406 21179446 21841832
4196 21841832 22146430 22638574 23690135 24195645 24577490 25223826 26073492 27052941 27905107
4187 27905107 28650090 29261809 29696277 30159816 30709811 31253525 31603469 31482000 31596499
4178 31596499 31913220 31716173 31742337 32120417 32139225 32229149 32498708 32713870 32499529 32300493
4168 32300493 32410711 32722093 32472776 32083796 31949270 32046351 31737491 31507726 31670905 31974075
4158 31974075 32078799 32051989 32311547 32670017 33052151 33481933 33690736 33916545 33904982 34152848
4148 34152848 34706191 35692212 36103310 37011140 38389487 39581129 40939380 42164127 44242006
4139 44242006 45822984 47191344 48535259 50374160 52019718 53336197 54490586 56060371
4131 56060371 57502051 58567628 60006452 62123186 63995428 65443898 67070968 68938784
4123 68938784 70762485 71427709 72258054 73283669 74035298 74626156 75750242 76810298 77354625
4114 77354625 77975723 79052430 80754901 81692751 82782164 84339193 85432668 86404995 87655933
4105 87655933 89204486 90426150 91445925 92556599 94184249 95786123 97536516 99317703
4097 99317703 101131764 103110053 105583992 108177670 109863761 111682260 113344033 114698302
4089 114698302 115597322 116059662 116420941 117175478 117806216 117880163 118108988 118200348 117856099 117637916
4079 117637916 117279092 116166018 114864724 113641602 112402502 110714881 108736924 106853033
4071 106853033 105369140 103602962 101793033 100405333 98849568 97184440 95554129 94094958
4063 94094958 92653677 91376123 89804852 89137571 88330895 87600294 87149988 87309444 88015702
4054 88015702 88467474 88585344 89205368 90182221 90646743 90950015 91709417 93124750 94021536
4045 94021536 95066237 96675386 98499851 100047730 101642930 103652232 105771991 107081347
4037 107081347 108235156 110224244 111480230 112312193 112880563 114307026 115443843 115404424 115540756
4028 115540756 116447550 116914674 116825378 116939940 117512727 118062079 117791880 117610294 117732725
4019 117732725 117537717 116935764 116648106 115944324 114822708 113736323 112931344 112343156 111475118
4010 111475118 109982224 108554215 107730530 106116437 104214759 102591657 101398413 99538836
4002 99538836 97523138 95944177 94385456 93009491 91167132 89475586 88280783 86977655
3994 86977655 84884808 83700489 82618100 80987965 78950502 77498898 76425244 74937125
3986 74937125 72991419 71625163 70777697 69538878 67792857 66583941 65831123 64779940
3978 64779940 63134699 62035924 61152677 60068040 58775269 58414321 57872323 56819766 55960152
3969 55960152 55410111 54916540 54004387 53129337 53025527 52541781 51843141 50644386 49923348
3960 49923348 49760121 49077716 48599401 48413087 48699459 48958053 49685758 50455579 50694720
3951 50694720 50065006 48907235 47233803 45596222 43748806 41607235 40152481 39404699
3943 39404699 38079076 36530743 35906569 35186277 34297850 33246655 32880920 32840943 32129522
3934 32129522 31298615 31114764 31272932 30788242 30260336 30208834 30395080 30070471 30220573 31076898
3924 31076898 31924392 32313928 33396057 34852294 35144751 34159301 32921518 31718649 30936214
3915 30936214 29404338 28119939 27522552 26702152 25886181 25313586 25187683 24945884 24258685
3906 24258685 24130155 24374474 24503755 23815244 23890870 24400555 24414538 24134751 24487665 25267546
3896 25267546 25491020 25079220 24955294 25668523 26336250 26488019 27048037 28022786 28421863
3887 28421863 28272646 28658410 29245845 29317721 29686877 30661830 32033231 32630403 32951762
3878 32951762 34388186 36069257 36997167 38032561 39735101 41911753 43732657 45630832
3870 45630832 48524837 51432816 54093646 57366154 60838669 63790665 66590458 69954039
3862 69954039 73526110 76577639 79309693 82243740 85440190 88643160 91500691 94465391
3854 94465391 97728069 101008810 103872188 106622356 109228498 111610886 113229441 114919456
3846 114919456 116408706 117772725 118555214 118978520 119822270 120317703 120380031 120248257 120303218
3837 120303218 119822891 119168871 118760202 118161860 117340588 116609078 115963993 115281797 114659936
3828 114659936 113712317 112775742 112092207 111236095 110353628 109669433 109104750 108766228 108516998
3819 108516998 108611855 107962455 106773128 105100647 103183908 100316669 96441914 92748041
3811 92748041 89041923 85211986 81477174 78109347 74650832 71674477 69557031 67581910
3803 67581910 65319413 63613364 62525809 61454014 60814869 60098121 60245012 60804811 61330544
3794 61330544 62457387 63684664 65131832 66430329 67799084 68987352 69772893 69263770
3786 69263770 68291742 66898970 65220607 63462809 62095972 61116335 59775458 58136026
3778 58136026 57242195 56709533 55571996 54785937 54029109 53414704 52750270 52269497 51832861
3769 51832861 51591364 51047145 50275520 50175145 50341987 50025897 49312181 49092341 49292605
3760 49292605 49158543 48747462 48366256 48271884 48070356 47846243 48003634 48537126 48837920 48529002
3750 48529002 48887797 49808905 50281436 50459587 51418848 52346371 52777502 53624975 55125763
3741 55125763 56201291 57024152 58169035 59465602 60733273 61610047 62844867 64117146
3733 64117146 65086017 65542846 66339405 67697098 68376470 69044030 69625179 70380470 70906514
3724 70906514 70614218 70625896 70757849 70425873 69599532 68969926 68496029 67818281 67094103 66358971
3714 66358971 65564579 64743484 63849360 63279648 62555812 62154372 61862337 61522920 61713470
3705 61713470 61794346 61658492 61632375 61796344 61869664 61999360 61852989 62316715 62482533 62423453
3695 62423453 62778802 63532615 63889915 64034048 64875115 65567641 65893742 66037005 66124579 66043134
3685 66043134 65428869 64958773 64122443 62963336 61789021 60407854 59014369 57236197 55445062
3676 55445062 53763229 52212510 50158195 48249923 46554659 44885547 42881743 40873272
3668 40873272 39369146 37719346 36034665 34284135 32535333 30690358 28875185 27659680
3660 27659680 26768951 25609867 24695396 23906935 23155479 22535984 22410595 22078095 21789856
3651 21789856 21970890 22029845 22570694 22674921 22691369 22710835 22670695 22831893 22638664 22660687
3641 22660687 22937530 22897422 23041311 23291445 23134881 23099477 23559843 23681022 23650164 23736670
3631 23736670 23538808 23561792 23522494 23276139 22944773 22691156 22432764 21835736 21063827 20604772
3621 20604772 20681596 20694455 20070937 19796780 19467232 18958925 18420627 17909302 17734344 17127863
3611 17127863 16526506 16263225 15837018 14825309 14505436 14355188 13995154 13631647 13520241
3602 13520241 13311724 13036076 12748220 12066712 12068570 12120017 11920205 11979586 11908341 11725152
3592 11725152 11848022 12164837 11999513 11679845 11336431 11335930 11677967 11804883 11680608 11568900
3582 11568900 11646972 11967448 12454420 12646565 12707532 12828905 12991047 12982332 13150470 13217645
3572 13217645 13374082 13312827 13790482 13997458 14195031 14545000 14677429 14997685 15455310 15443924
3562 15443924 15854002 16465718 16633748 17005228 17622707 18274698 19148522 19520677 19834594
3553 19834594 20499560 20720438 20960147 21453676 22097407 21933454 22202619 22283038 22485883 22618520
3543 22618520 22814783 22825491 22706880 22346385 22518136 22558717 22743214 22442283 22078676 22161981
3533 22161981 22446284 22200822 21678822 21977933 22159228 21754478 21555894 21719895 21958342
3524 21958342 22234130 22069786 22644037 22662547 22828441 23530633 24217827 24606585 25398468 26445310
3514 26445310 27964831 29608981 31441349 33589102 36159153 39017184 41441093 44237647
3506 44237647 47312394 50558520 54018891 58240818 62509391 67197067 71841227 76099092
3498 76099092 80366558 83396842 85844141 87943284 89399093 90470492 91297895 92422199
3490 92422199 94119313 95908986 98180720 100381851 103184107 105536727 107638260 109124654
3482 109124654 109740313 110246793 110391121 110430798 110255655 110008692 109477798 108784453 107336600
3473 107336600 105632624 103698361 101536738 99774970 98119180 96502984 94817805 93778845
3465 93778845 92600997 91431618 90368908 89644431 89325413 88741205 88314497 87750605 87270141
3456 87270141 86655343 86090774 85751531 85228291 84221571 83515150 82570310 80922526 78638466
3447 78638466 76034918 73106961 69849372 66108005 62705106 59185461 55401582 51817570
3439 51817570 48552807 45960816 43413096 40726424 38791372 37610703 36440762 35392039
3431 35392039 34911933 34441812 33975761 33712946 33837897 34189409 33930567 33590747 33879852
3422 33879852 34816440 35345929 35773368 36561935 37663249 38998293 40705664 42619459 44875329
3413 44875329 46578054 48061650 49436098 49751888 48916455 48443724 48345692 48171291 48047738
3404 48047738 48394526 48933565 50117971 50623524 51271521 52262945 52722474 52630818 52025835
3395 52025835 51757235 51010803 50411117 50069810 50406205 50724323 51710347 53458216 56132306
3386 56132306 58708993 61637406 65049127 68939716 72388173 75028433 77144805 78698702
3378 78698702 78660345 77404973 75474631 73531799 72168152 71275605 71409038 72084156 73010263
3369 73010263 74365480 76362645 77849704 78034385 77713567 76628925 74834308 72541265
3361 72541265 70766559 69534130 69012144 69651577 71255420 74151927 77712604 82725570
3353 82725570 87920573 92515723 96295818 98574511 99256716 97813730 95121881 91780589
3345 91780589 87712414 83288495 78583360 74232224 69705040 66216398 63238508 60911371
3337 60911371 59382599 58054826 56918916 55483817 54049599 52384844 50536015 49079127
3329 49079127 47582277 46020153 44964410 44719351 44762899 44854202 45478015 46516112 47684961
3320 47684961 48412274 49046050 49354125 48766409 47664306 46048808 44229727 42202140 39685160
3311 39685160 37253838 35244413 32982398 30239984 28582670 27280573 25588948 24027906
3303 24027906 22638140 21893251 20772893 19406857 18886753 18775324 17870023 16902331 16386014
3294 16386014 16166611 15448219 15179423 15181091 14815624 14094321 13570424 13742293 13644607 13057288
3284 13057288 12608153 12617349 12912471 12582487 11992417 12411314 12387527 12374609 12210737 12430654
3274 12430654 12318235 11716346 11643796 11734456 11567890 10963374 10798681 11338111 11419498 10688486
3264 10688486 10457328 10923377 10889885 9816595 9674270 10307707 10250460 9565870 9337916 9784341
3254 9784341 9572171 8716947 8979436 9361260 8986992 8613681 9189213 9828069 9338478 8984682
3244 8984682 9166914 9744390 9509819 9049804 9482705 9843103 9440337 9565204 9902043 10015826
3234 10015826 9613579 9354157 9820365 9852478 9558260 9408983 10128980 10583235 10131180 10225082
3224 10225082 10814436 11232800 10931026 10807701 11348937 12018954 12470223 12863805 13522406
3215 13522406 14297375 14872475 15753646 16832621 17839733 18759927 20003321 21234892 21830741
3206 21830741 22526285 23140791 23891098 24097143 23449878 22513199 22179603 21767626 20343369
3197 20343369 19581148 19443207 18747113 17532766 17040343 17028984 16488682 15820734 16174539
3188 16174539 16320315 16090382 16227124 17255715 18189453 18374034 18865535 20156393 21578550
3179 21578550 22435168 24025110 26120287 28137374 30199489 32298337 35423397 38292215
3171 38292215 40607443 43176238 45055626 45905209 45426224 44174053 42272550 39528089
3163 39528089 36761664 34021925 31500653 29503325 27164838 25090340 23717371 22714682
3155 22714682 21541220 20099544 19416461 19158918 18889186 18936375 18743131 18660936 18573575 18460416
3145 18460416 19042166 19750887 19917874 20599312 21799020 23057418 23964065 25175491 26708168
3136 26708168 28179369 29137847 30280851 31214743 31305792 30623572 29787181 28867251 27450969
3127 27450969 25981611 24797310 23724042 22510628 20933949 19547855 18431195 17252458
3119 17252458 16008329 15256455 14628372 13767400 12893038 12398764 11971310 11676835 11320082
3110 11320082 10958637 10807996 10401300 10322603 10420004 10292258 10335597 10648490 10444200 10269230
3100 10269230 9798434 9550642 9792434 9921077 9820896 9907767 10198679 10307144 9873598 9704400
3090 9704400 9967645 10040645 9586425 9022421 9072694 8903232 8406657 8106812 8026547 8068955
3080 8068955 7699439 7949836 7983323 7621555 7539857 7654529 7711692 7568605 7344256 7328340
3070 7328340 7139147 6963760 7131025 7254016 7152841 6814443 6670413 6869094 6385643 6221206
3060 6221206 6334480 6436577 6096875 6010426 5944302 5615525 5464089 5062276 5231234 5247769
3050 5247769 5116171 4897361 4967858 5301373 5225809 5161882 5374418 5242252 4750228 5076069
3040 5076069 5392775 4991505 4636431 4414327 4649832 4855259 4606076 4212359 4265495 4332726
3030 4332726 4438082 4282833 4116536 4044764 3898776 3866655 3879963 3817489 3590030 3499551
3020 3499551 3741710 3778929 3625029 3659604 3914013 3518668 3381780 3396757 3706775 3406507
3010 3406507 3182764 3252589 3595407 3527128 3344847 3845827 3717774 3305293 3176774 3484799
3000 3484799 3474107 2950800 2934620 3335400 3273521 2822063 2601499 3012522 2931267 2638541
2990 2638541 2819230 2823116 2447715 2454495 2625575 3184891 2624851 2196045 2818923 3021776
2980 3021776 2632211 2371192 2417055 2443320 2432749 2403809 2583408 2830110 2909832 2960991 3086927
2969 3086927 3157669 3164655 3090349 3247047 3167193 2779287 2672072 2742952 2749783 2586430 2482826
2958 2482826 2588319 2754810 2399578 2348723 2450092 2314561 2359496 2413712 2677350 2469925
2948 2469925 2078360 1910783 2278062 2240134 1746127 2166515 2605878 2447037 2079604 2395947
2938 2395947 3012707 2502566 2370986 2372241 2365062 2569975 2506742 2707834 2708389 2726363 2660577
2927 2660577 2902826 2501044 2177563 2444782 2503770 2208669 1839928 2049585 2556814 2248951
2917 2248951 1901507 1997651 2258765 2125129 1950816 2106289 2113365 2190087 2366569 2518132
2907 2518132 2512891 2193704 2389983 2777645 2760197 2641060 2443816 2568422 2896999 2664482
2897 2664482 2217323 2664646 3021785 2730458 2534787 2763401 2857188 2630370 2663584 2858816
2887 2858816 2449232 2458092 2576491 2718494 2826859 2799400 2774381 2843352 2572474 2397913
2877 2397913 2705658 3111038 2762644 2535576 2935923 3200459 3028056 2743974 3286005 3375001
2867 3375001 3140319 3379574 3645285 3456771 3363325 3635837 3979287 4188164 3884409 4137293
2857 4137293 4761322 4655373 4488564 4787209 5014205 5225282 5156973 5334018 5683720 5738108
2847 5738108 5852336 5715503 5551559 5360928 5580177 5890292 5866305 5543500 5707632 6068505
2837 6068505 6109437 5920680 5836270 6311628 6713764 6776559 6810017 6835489 7011659 7088845 7226537
2826 7226537 7800614 8248682 8576441 8898384 9669272 10163360 10498751 11399992 11966491 12234073
2816 12234073 12228161 12119243 12443733 12248596 11795984 11158908 11371674 11263024 10563019 10479572
2806 10479572 10550190 10560188 10604779 10820146 11066713 10791963 10820496 11316366 11406299 11187055
2796 11187055 11241429 11679226 11745152 11494332 11405539 11991690 12469209 12777422 13152359 13914848
2786 13914848 14812174 15718217 16453917 16995109 17254561 17216849 16981014 16703758 16124762 15378898
2776 15378898 14836856 14133167 13195920 12582994 12414925 12027572 11665505 11512043 11346970
2767 11346970 11345968 11890127 11790331 11529881 11484071 11366604 11381547 11034723 10834280 10723684
2757 10723684 10523550 10463657 10451868 10533938 10938565 11143585 11654321 12079378 12454040 12938571
2747 12938571 13148817 13163170 13059158 12409530 12084407 11724758 11046620 10272633 9449224 8663970
2737 8663970 8368178 7927443 7740553 7477276 7445174 7279240 7194145 7358728 7456422 7223715
2727 7223715 6728804 6691708 6350858 6081454 5803525 6038932 5980178 5814619 5660893 5520408
2717 5520408 5365399 5148438 5019141 5256417 5329657 5154783 5049242 4940636 4939622 4631521
2707 4631521 4458124 4284875 4213227 3958250 3715207 3814335 3596339 3515448 3563964 3394141
2697 3394141 3446357 3555564 3467712 3306544 3103329 3028019 3224879 3311772 3267637 2984928
2687 2984928 2895469 2809833 2586786 2752181 2858612 2762432 2531347 2562220 2487031 2273129
2677 2273129 2480925 2242493 2176601 2183320 2075563 1976406 1661436 1668119 1684266 1925916 1979227
2666 1979227 2274906 2319089 2093302 1782929 2130819 1939328 1619656 1894390 2143427 1957183
2656 1957183 1961674 1970356 2019517 1868803 1719989 2072916 2117817 1971461 1911297 2027500 2070045
2645 2070045 1961242 1939913 1900847 1590043 1216148 1518024 1689880 1443905 1376016 1294085
2635 1294085 1266659 1436614 1382713 1329557 1320274 1392721 1217287 1430555 1692670 1987426 1555246
2624 1555246 1328284 1381307 1637708 1451803 1217275 1603182 1800738 1693914 1263156 1556432
2614 1556432 1691872 1151891 852401 1446597 1503738 1466017 1284043 1633815 1390545 1390682
2604 1390682 1357385 1467206 1244470 1292861 1561908 1828254 2002795 1741427 1655078 2110040
2594 2110040 2384804 1896029 2625433 3107512 3236201 3183335 2911985 2989579 2405804 2009226
2584 2009226 2013861 2132894 1835965 1796516 1790533 1813017 1621773 1373054 1621328 1478102 1362546
2573 1362546 1638925 1609326 1609121 1483972 1162670 1295254 1383921 1264805 1213881 1339947 1445946
2562 1445946 1338158 1161118 1381721 1442380 1366137 1301800 1492474 1553748 1108429 1393575
2552 1393575 1650162 1667386 1310486 1557927 1910608 1938142 1688149 1169436 1514715 1456493
2542 1456493 1289953 1521701 1744937 1231496 1012825 1253451 1160868 1074289 820048 1172494
2532 1172494 1383753 884820 965053 1260485 1566788 1424399 1428551 1755726 1683506 1296869
2522 1296869 1639724 1644798 1397795 1350855 1272500 1375270 1215781 1391909 1527164 1208658
2512 1208658 1176866 1047575 809474 1190263 1201351 1107330 880169 825463 1134380 1098315
2502 1098315 974035 1098287 988669 833655 1128841 1352673 1149006 847945 1121249 1063961
2492 1063961 962217 1220210 1677897 1509144 1201602 1381149 1419473 1674368 1596730 1752678
2482 1752678 1960144 2049859 2015466 1933521 1926349 1473474 1107385 1254044 1505389 1308766
2472 1308766 1278472 1401173 1622407 1274959 1485303 2028177 2119710 1662857 1477289 1626608
2462 1626608 1643687 1564168 1577216 1622939 1344845 1222895 1545990 1797185 1662161 1544717
2452 1544717 1617003 1868298 1892726 1690484 1708091 1904367 1649286 1417863 1665984 1321346
2442 1321346 1297927 1634621 1781864 1886497 1908849 1841848 1731800 1894538 2069741 2283243
2432 2283243 2478377 2612086 2099742 1746414 1740591 2089430 2334962 2433852 2513297 2528970
2422 2528970 2466969 2405222 2446124 2513085 2350672 2437426 2483745 2444622 1985891 2235411 2280316
2411 2280316 2222759 1880888 1945239 2200352 2349859 2255770 2175930 2464031 2466602 2747137 2680572
2400 2680572 2490253 2421578 2431676 2417940 2587060 2624747 2762468 3148262 3148596 3180080 3309112
2389 3309112 3283779 3314974 3401185 3636815 3768779 3673669 3779982 3846936 3896729 4067570 3916589
2378 3916589 4118108 3960968 4126630 4313212 4591905 4466692 4406460 4651124 4688504 4847511
2368 4847511 4930814 4562957 4596780 4542575 4659212 4675885 5135982 5294061 5370806 5624265
2358 5624265 5840818 6295212 6545460 6830134 7104359 7227741 7416766 7783012 8029614 8202765
2348 8202765 8886011 9654802 10741246 11640897 12576863 13891332 15487974 17272659 19633622
2339 19633622 21947629 24810452 26953536 28986085 31352356 34489817 38768068 44712360
2331 44712360 52744237 62917855 77537600 98544318 127850505 166625171 211445580
2324 211445580 250084141 277340480 279178146 256293825 223414275 189661888 158654096
2317 158654096 131554289 109797115 92117930 76403258 63501042 53598079 47147516
2310 47147516 42286795 38209845 35138130 32204867 29467930 27130949 25091904 23090551
2302 23090551 21480797 20279520 18781166 17568829 16845687 15771215 14896226 14399755 13974171
2293 13974171 13343253 12914968 12569856 12062510 11432151 11181414 10712074 10381123 10037851
2284 10037851 10031305 9758442 9453508 9195276 8801875 8497179 7956926 7464645 7144894 7024513
2274 7024513 6938432 6452935 6290283 6587912 6255853 6053347 6045499 5830822 5765116 5424076
2264 5424076 5679229 5745644 5463475 5252726 5348940 5303429 5342293 5082889 5222650 5282092
2254 5282092 5130876 4583443 4706399 4770034 4758617 4690394 4574509 4833822 4564564 4193339
2244 4193339 4263181 4198645 3971293 3692896 3902408 4147235 3672100 3492377 3982928 3953745
2234 3953745 3652418 3409814 3769937 3683900 3168844 3248570 3675208 3770225 3153218 2976581
2224 2976581 3341223 3551880 3070313 2832277 3095851 3477515 3130336 3023041 3077785 2926789
2214 2926789 2628123 2742742 2865055 2673364 2088066 1974144 2505087 2882226 2475151 2476906
2204 2476906 2855706 3155860 2792465 2691434 2623211 2432429 2409181 2197339 2294928 2472093
2194 2472093 2420200 2410850 2539154 2356107 2202112 2502567 3001622 2835701 2217453 2378406
2184 2378406 2902864 2577873 1927486 2195933 2287679 1938832 1583360 1370729 1707253 2010664
2174 2010664 1683897 1646615 1938445 2143621 2002727 1782317 1973350 1554362 1346818 1695339
2164 1695339 2037232 1802508 1584343 1869690 2259861 1971609 1627542 1893112 2098081 1763184
2154 1763184 1386275 1642397 1842308 1750622 1674695 1811292 1984564 1967179 1648683 2016697
2144 2016697 2307339 1820888 1576047 2063801 2322064 2027679 1529807 1689078 2016547 1640372
2134 1640372 1415480 1736063 2398431 2024172 1830274 1703790 2044685 1970357 1880139 2101700
2124 2101700 2246985 1978794 1637440 1865252 2035903 1818972 1928572 1991040 1988307 1548110
2114 1548110 1349028 1963771 1882466 1491947 1212624 1420467 1694518 1720599 1502230 1537741
2104 1537741 1951407 1743822 1509855 1713379 1893237 1663847 1579792 2004233 1996441 1791149
2094 1791149 1820227 2049764 2098263 1764270 1631681 1903756 1714342 1396975 1174688 1418332
2084 1418332 1506320 1221892 1231555 1790929 1881408 1295502 1383890 1745424 1909348 1437528
2074 1437528 1255903 1521480 1505203 1388112 1680832 2021655 1668690 1142791 1249206 1973268
2064 1973268 1988204 1585592 1691483 2165115 2029926 1803875 2086500 2211054 2251003 2375001
2054 2375001 2540540 2850798 2441015 2051696 2218800 2091455 1981036 1623667 1570593 1662043
2044 1662043 1344603 1053665 1493719 1859286 1643269 1494371 1373869 1654821 1244092 1036001
2034 1036001 1104438 1726913 1468394 1212977 1449328 1760043 1555154 1414400 1358220 1674975
2024 1674975 1579758 1414891 1626085 1812689 1593377 1212548 1263161 1752200 1647528 1118089
2014 1118089 1367143 1753506 1720167 1252315 1015416 1180745 1618212 1367248 1333859 1145495
2004 1145495 950730 942054 1265949 1331476 1265743 1262086 1890626 1892001 1339471 1108522 1506472
1993 1506472 1583093 1608856 1232854 1333415 1482693 1251249 1096152 1232402 1333525 1149862
1983 1149862 867496 582056 888553 797925 803153 1040218 1198935 942510 613330 837697
1973 837697 861707 821805 782394 950516 1046540 960439 736264 1266528 1588276 1369264 995901
1962 995901 1317347 1614617 1415316 1218600 1249856 1322186 1328697 1286045 1180519 1244045 892232
1951 892232 906847 1174560 1349128 1081904 818977 1065651 1041481 836367 958972 955376
1941 955376 932183 932056 738080 891851 1321696 1195759 932962 952431 1040333 897756 1152783
1930 1152783 1470828 1436401 1255316 1371837 1631895 1753363 1543228 1158462 1093536 1105204
1920 1105204 780794 823575 734664 1176405 944340 787129 980348 984330 753497 655089
1910 655089 880231 899023 1093617 961356 860569 787992 599129 754095 1112920 1067141
1900 1067141 891664 1080186 1210767 1147063 1061123 998843 1220415 1335441 1633673 1102630
1890 1102630 990182 1456123 1468709 1265974 1099895 1155014 1150466 993186 1165800 1308190
1880 1308190 1031784 920629 1102993 1405183 1220067 721487 818850 878035 832359 535542
1870 535542 737329 1003152 906550 835760 774073 1097564 964733 844306 1113998 1419716
1860 1419716 1321868 1069514 1237160 1312964 911106 922720 1212789 1564223 1370433 956339
1850 956339 1183924 1345771 857966 563299 930451 1064550 572771 407097 926944 1199946
1840 1199946 766352 610485 1178432 1512177 821213 631818 1238180 1393509 1110496 1003778
1830 1003778 1169996 1035871 606129 985318 1256551 1322157 988646 721786 1171468 1227640
1820 1227640 636807 777437 1224612 1030355 729261 705950 1019952 1048743 814306 839803
1810 839803 1350213 1347052 904399 853666 1349742 1271942 555613 810074 1228245 1196802 762745
1799 762745 880009 1243007 1159595 824216 1028736 1379386 1541060 1099852 1143275 1560933
1789 1560933 1156385 738483 826479 1359175 834309 792859 1013507 1387083 1429427 1054809
1779 1054809 1337178 1478206 837661 698345 940935 1404973 1025881 666526 1090724 1292800
1769 1292800 1313895 762976 1162451 1265170 1099292 929785 1013103 1237160 940589 1106749
1759 1106749 1140942 1270931 1155753 1060892 1409887 1610801 1079334 786079 783968 1212555
1749 1212555 1018513 668322 882866 956838 1050119 855788 1107677 1397884 881844 578673
1739 578673 1004329 1188015 925637 730803 1038117 1335117 1099978 950063 951269 1225516
1729 1225516 695425 651947 905427 1409559 1018536 482522 1124660 1226097 851022 828881
1719 828881 1071390 1284617 889065 572094 1204174 1039366 756622 1146853 1329458 1356457
1709 1356457 728810 655589 1162387 1241365 848008 878912 968960 1027306 1029469 811909 1068970
1698 1068970 1137208 815361 894048 1342617 1236286 902259 887139 1286686 1019483 955552
1688 955552 1261097 1432244 1111303 737589 557148 1140029 1174773 678977 863147 1276954
1678 1276954 1204237 899256 808149 1203782 1147313 754617 758200 900396 781464 573722
1668 573722 803293 1039723 985299 933356 877470 832201 1055285 1090312 920812 1006006 555072
1657 555072 628080 1123168 1207614 929567 847283 907473 804113 889094 906893 1053199 968619
1646 968619 947956 880463 1028769 1096052 936572 800621 808724 937421 995979 1164648 894277
1635 894277 835445 782910 759221 894256 679824 570089 931009 1020866 1202167 995732
1625 995732 943404 764683 1101838 1088905 793677 877602 1066761 1215424 832159 684758
1615 684758 907269 747628 527021 433609 851035 1160261 968650 777239 924636 1212593
1605 1212593 704916 389186 991358 1345584 942939 1096096 1080379 987996 950730 981942
1595 981942 1161664 1237158 988999 864303 1138068 1258909 803917 654391 1153937 877063
1585 877063 782940 1062571 949327 703104 791840 1008851 1038961 883997 542512 915891
1575 915891 1242316 1061842 791447 721865 977531 947314 565136 904156 1027856 962606
1565 962606 649543 703707 739562 851764 957513 1060051 1110594 733157 495266 903148
1555 903148 1302654 1108347 634847 911211 1004772 843202 809038 944802 1159149 766059
1545 766059 600491 739209 889250 1136465 830327 961374 1131272 1069358 1163065 1179600
1535 1179600 838031 520571 512768 785837 588002 378806 427088 939744 904057 767421
1525 767421 675866 653086 773972 882817 948852 1135539 1192935 994589 1018442 1095584 1127255
1514 1127255 949683 1019858 956870 1231315 920688 895775 1165508 1112287 607881 621892
1504 621892 737262 673162 658596 637190 660710 625636 927139 610845 600798 573398 701524
1493 701524 454501 229663 409538 496222 620756 955423 1197780 872834 827264 827521 1223217
1482 1223217 981783 701468 539292 1019226 827629 867521 1024146 1153245 1117417 829006
1472 829006 698778 1159546 963208 922099 1053650 1086781 1063880 667555 1067455 1365246
1462 1365246 969755 716834 1063766 985331 642955 483820 752727 914759 458371 328707
1452 328707 844530 1141168 691771 402684 786799 768019 715322 917505 1128025 1136863
1442 1136863 522477 655284 1133670 1215005 814755 971432 1615479 1357053 657335 958555
1432 958555 1508355 1286650 712253 570361 862313 784847 415552 509053 918224 570625
1422 570625 361093 657588 983350 797498 385395 984187 1211567 715307 306953 628160
1412 628160 1249812 1151846 834657 865062 1291107 1304808 846935 796279 1245369 813029
1402 813029 567918 754813 808612 661044 596172 1052553 1247170 601488 480816 1157953
1392 1157953 901897 272284 525155 1107729 1098775 423907 269658 1000239 1002967 561929
1382 561929 652223 826516 1077850 599032 628267 1022680 841375 419560 969140 1279280
1372 1279280 1169896 741998 971575 1406732 1482644 1024931 741130 1295484 1091672 432656
1362 432656 567286 970624 947365 664570 802922 1166343 1039132 572295 568568 628570
1352 628570 436774 309741 483028 413745 615552 585917 825733 1258050 660817 485339
1342 485339 691415 1029228 1001435 726644 1014310 1055786 684590 985949 1136008 986393
1332 986393 881754 844545 772614 896981 762870 669601 690025 673636 341877 425253 799708
1321 799708 638149 367359 555147 687858 770527 705088 586192 959231 858569 440364
1311 440364 483291 802919 547673 534514 879860 924132 790047 835485 868524 971098 943866
1300 943866 922779 819201 739315 751414 656678 649748 712443 929961 477603 761956 801306
1289 801306 471538 328872 304497 445227 509397 370014 661264 837749 984482 761679
1279 761679 775075 953430 683379 558577 1002443 1309090 1073620 617842 734593 1034030
1269 1034030 908496 702938 774828 972432 816554 709538 876141 1009752 625067 469221
1259 469221 587546 958974 903991 717527 833038 1226341 949382 532670 736795 727840
1249 727840 537590 532862 704080 721770 653946 775297 874826 860450 860824 832384 1034807
1238 1034807 772286 475698 728804 1217922 940038 531601 773163 1071977 931376 635508
1228 635508 801860 858333 606088 466929 887917 994777 911473 473482 513713 805826
1218 805826 604708 669886 1058367 963782 459855 385637 806204 1027921 704185 611745
1208 611745 1031988 1023969 653940 805494 1056328 1124847 710927 647486 1081200 677302
1198 677302 313470 613528 1054272 870407 907175 1243946 1051448 883822 682779 565486
1188 565486 708346 575741 367579 693009 1014212 719548 635678 605326 920220 913745
1178 913745 573713 678275 808289 904793 928844 926252 1154412 646990 561829 868080 1094796
1167 1094796 803696 250763 495820 825582 337806 350444 951815 1009031 711684 561595
1157 561595 1280871 1226978 1023813 879653 942637 1000853 449793 666986 827752 468218
1147 468218 211277 479915 835294 569359 208327 729727 1242575 900555 468898 314881
1137 314881 869834 836112 676784 609561 685814 623072 684178 559106 688892 423666 240400
1126 240400 288362 671423 601277 353489 691632 782380 801175 564850 678403 810683
1116 810683 809184 797625 1038365 1287269 1110819 619581 800372 1133800 1005661 932233
1106 932233 1006764 1270129 1084545 866239 1006052 869360 474505 331624 836334 1197534
1096 1197534 611583 433306 940474 1221092 792357 544662 657798 802291 1132147 886235
1086 886235 874350 883091 902502 657628 998434 1334745 886437 714791 749979 802231 652119
1075 652119 654413 791415 1196413 967745 336834 696777 981590 784733 472190 782624
1065 782624 1140966 919672 576170 787514 718197 430812 579294 1385509 1119568 817751
1055 817751 927773 1197537 1153941 594791 864121 971825 844081 333369 439557 880219
1045 880219 874579 828566 778727 978835 947425 507894 467138 1024263 857808 621200 902603
1034 902603 705752 440007 207432 386354 772885 690975 327174 377034 429413 542711
1024 542711 424462 602263 1036665 1045410 823569 836421 953454 951910 584168 811433 1058094
1013 1058094 803381 700301 1121664 1205328 830401 661133 947291 1192287 505845 189929
1003 189929 615235 833617 342412 453454 1155634 1262456 940657 466431 779884 836640
993 836640 449189 434777 931063 772924 643812 784826 1020133 819249 476555 797638
983 797638 1051928 879186 455814 811351 923974 871128 773438 974809 930131 764524
973 764524 804221 1125403 1081522 713507 547273 527358 673792 682437 616735 563277 775460
962 775460 658257 77589 279916 670895 689894 452678 591524 849581 881270 646493
952 646493 770746 1040442 809204 414309 734788 1135574 962329 973696 1093644 952850
942 952850 738928 737177 1124944 910926 494518 759820 926722 509821 339128 573000
932 573000 669082 793736 526285 318615 417458 361306 348732 819462 775487 447291 407321
921 407321 604645 737860 729069 549709 609070 391855 659123 1116986 986594 883560
911 883560 868081 897772 633575 791763 802610 1266487 1190971 966718 875405 899287 1015388
900 1015388 1013899 1144544 1010122 814703 635758 539173 564507 807678 880900 921254 825848
889 825848 791633 587822 519528 702667 668975 341192 162340 366554 649164 845758
879 845758 562056 703001 756272 772984 850311 850437 532422 349900 892286 850313 664469
868 664469 690909 1267863 1251251 749702 459715 736373 682171 585053 558143 690697 515550
857 515550 285997 284714 414194 282017 399024 759780 608543 307614 442482 1029119
847 1029119 997645 702226 891525 1201734 1293243 1036670 914523 928231 1088128 786367
837 786367 835571 989886 874129 910122 962116 1155801 930000 442015 370918 661047 874585
826 874585 261743 268083 592794 594223 337021 188173 721468 640313 432927 391433 684883
815 684883 749184 662373 671554 877154 756313 303206 806084 1460730 982767 618526 684017
804 684017 976539 798774 352299 833055 1090242 501873 317779 855519 1086760 526978
794 526978 373734 726678 845629 561186 328717 358426 617889 438439 558022 815719
784 815719 678240 237644 429021 591994 799100 527741 159701 379930 674683 619321
774 619321 920255 1058091 925147 674368 583453 657138 747721 580577 764985 959616
764 959616 1013680 366750 364619 807842 1013337 692525 647608 1255265 878643 287113 322194
753 322194 936348 552270 129413 446133 1022832 721159 686097 826668 960134 876139
743 876139 341949 706828 1013513 439488 236366 472217 737978 843074 646829 917427
733 917427 1092094 753907 604532 1040870 1214777 570930 398484 768206 736331 631338
723 631338 423865 383640 1061484 873853 527499 710320 890784 694361 827174 879805
713 879805 1014665 917106 745098 653282 824538 465530 367436 896847 1096459 698722
703 698722 378424 576647 939244 716435 313601 418109 566347 516402 708081 752243
693 752243 929216 742129 635268 744548 717395 662777 515147 599318 727441 513411
683 513411 540883 726500 788713 840651 485439 749426 1078790 618455 482814 721888
673 721888 991217 877859 648648 713801 980853 1156886 816085 350949 541876 801690
663 801690 742748 936472 854939 537509 463048 835186 429558 353883 342878 493589 709861
652 709861 632527 501276 801596 756640 398780 563754 609938 523176 567672 595018 632199
641 632199 663521 739844 609324 682318 994886 743599 743918 884258 711294 539529 626316
630 626316 719680 699735 416757 216382 473296 601189 591183 483313 571421 866569 766405
619 766405 676455 676823 301867 362360 823761 741762 622697 631982 819386 992487 894375
608 894375 473129 713422 790143 848864 499815 412122 856581 828542 753953 463608 634604
597 634604 550181 640029 853144 553682 510781 627582 477191 665474 535452 385433
587 385433 544038 722911 583858 632948 589443 734124 791394 565445 393303 461802 550496
576 550496 843008 836905 794073 732357 784374 702471 820147 614118 494506 679232 488131
565 488131 537388 811022 860271 914645 656807 441047 538636 665132 732371 509740 468000
554 468000 515621 800754 719476 672659 781233 901930 860897 749929 729757 822145 788960
543 788960 896817 953938 745773 568618 680056 802412 611675 521135 770769 1130448
533 1130448 1225800 723178 487755 810303 920045 802447 408542 281404 560125 563929
523 563929 275784 221253 204473 184370 536972 555297 366948 48746 213674 444699 607885
512 607885 249927 305915 809294 602390 561885 614172 897001 821761 602451 640676 899667
501 899667 1020368 621927 569898 662508 799925 550883 448012 439216 400162 455696 617734
490 617734 678496 559697 398228 372664 543605 453568 147052 328262 585714 505297 76297
479 76297 281865 637519 598373 392593 458162 659923 584161 690545 964466 872298 700612
468 700612 753767 804340 653973 707236 817725 789430 885271 897062 771910 571916 618429
457 618429 553631 457378 688487 495151 201396 324118 281857 450524 604206 579354 521787
446 521787 354985 513323 575127 604480 697051 433299 631830 856017 705655 860025
436 860025 974672 1141070 1041075 641821 501840 743009 952016 809349 579402 662326
426 662326 602804 660927 641806 567730 514023 544295 811300 790241 758888 471599 425668
415 425668 314755 570156 615588 477865 548008 636175 577099 419792 414166 929024 913224
404 913224 979002 1063714 1065329 995437 765868 526819 660938 838301 714819 717114 1022459
393 1022459 818433 391552 570284 771118 323777 110342 244565 679385 452556 197547
383 197547 567994 588708 300210 341585 659678 580788 290588 565802 737210 824837 752207
372 752207 467376 1006817 898279 700144 807318 1034645 805662 960710 904488 853731
362 853731 1003319 937515 667604 756449 768695 600167 611817 530099 560790 493411 415084
351 415084 161489 174088 323173 270738 318096 476555 329682 298770 359520 172986 42178
340 42178 242663 326309 325339 532214 656481 845375 963395 696525 909837 1208236 1017296
329 1017296 748548 957651 831898 346022 157134 535135 853550 696719 485799 484410
319 484410 574155 492675 213113 138873 303363 345016 385574 499122 429429 120075 345800
308 345800 518935 511098 562385 567939 490162 533525 727693 642262 582859 732412 436634
297 436634 389911 525864 981856 903990 491260 332375 554375 586411 683647 584524 608622
286 608622 425691 134527 349850 323319 450706 460457 536155 220409 363678 418514 509843
275 509843 659883 697211 375085 503075 784114 665163 660543 522695 676705 835107
265 835107 643221 578599 651610 927520 1168879 689371 671945 812614 642523 324693
255 324693 692834 697636 711278 474403 705297 437483 -125441 68630 314453 483426
245 483426 213104 328845 381273 499828 586883 507561 647952 639090 372378 442536 541615
234 541615 291352 445167 583306 802540 717630 580385 572821 759015 868847 551198
224 551198 419055 445347 654374 544092 310110 596193 733666 447953 405082 438277
214 438277 545445 385192 236628 123121 428337 392191 138641 520019 310111 153797
204 153797 406459 606207 681562 510027 561321 749456 791304 484966 528484 660737 432498
193 432498 229107 740989 779652 711309 476464 658548 502876 257272 268448 574446
183 574446 570716 283444 379746 348513 448264 283892 -21147 -4116 364374 464793 499221
172 499221 633081 495619 674596 494785 270150 532340 630393 708044 596415 614866
162 614866 620158 598783 690500 597574 293511 75716 437587 773807 434305 346629 449499
151 449499 527466 260750 36390 212839 496894 365527 230510 415390 387301 296664
141 296664 99325 234418 492206 289336 205718 451544 662580 188425 286520 691368
131 691368 636960 473624 475690 438960 682877 544521 253720 236410 361238 614578 534228
120 534228 610431 591054 314580 94695 198874 135232 92908 5806 338643 327576 10855
109 10855 -209686 87903 395159 257731 292620 281938 397535 263083 311191 527397 452822
98 452822 192287 89144 349185 343489 186845 223379 508019 163567 -77583 135917 224471
87 224471 335639 31503 -32957 447266 281731 -127762 69037 332208 187006 29807
77 29807 120058 220719 355239 -93214 -96521 114415 36177 -89750 102150 213409 15458
66 15458 6451 304283 376139 256889 188549 135787 272890 62216 -49961 62884 220678
55 220678 90498 -91684 27411 52881 -67688 -153726 3977 257511 128034 -233106
45 -233106 -297873 -129298 -171756 -165185 -34556 -7579 -130780 -13049 514120 368177 184765
34 184765 137944 281111 400706 95692 -88170 192730 -52735 -138568 -159981 -56388 -89970
23 -89970 -290735 -181259 7978 -170316 -189563 -395355 -151531 -89342 -30390 -177825 -269651
12 -269651 -172949 -249845 -449962 -500774 -197037 -297019 -171501 -261380 -172886 -304368 -115425
1 -115425 -116710
0 -116710
$$ Imaginary data points
##PAGE= N=2
##DATA TABLE= (X++(I..I)), XYDATA
16383 -2534248 -2277466 -2182124 -2405574 -2517227 -2409958 -2234101 -2229386 -2188266 -2311056 -2363433
16373 -2363433 -2257511 -2040793 -1963027 -1850088 -1780300 -1973888 -1949458 -1759918 -1644262 -1770709
16363 -1770709 -1794560 -1754002 -1646429 -1529855 -1527364 -1442447 -1482107 -1674351 -1600607 -1334389 -1308444
16352 -1308444 -1307454 -1325593 -1194807 -1097509 -985481 -1079670 -991688 -906420 -889803 -1010301 -1035172
16341 -1035172 -1015798 -948456 -1017135 -1074090 -916891 -678550 -480531 -460674 -675104 -688638
16331 -688638 -613111 -624968 -508324 -435418 -409247 -414869 -347544 -297529 -347025 -352179 -303127 -192194
16319 -192194 -228616 -418422 -224066 66805 325760 295335 -32438 -153693 -29555 -61258
16309 -61258 -229145 -172792 -26757 -21481 -12110 -62632 41743 65825 173850 230961 91498
16298 91498 213730 381638 453074 428167 480751 533412 892914 940032 772890 650708 686126
16287 686126 824282 1033634 920047 650745 772406 1196607 1088005 907490 818280 791840
16277 791840 945029 668755 747218 1005434 1250027 1270602 1090860 931134 1187592 1545348
16267 1545348 1407608 1250374 1328383 1435730 1431089 1508952 1280366 1456467 1405992 1419473
16257 1419473 1526616 1405612 1345722 1437470 1551961 1574799 1583401 1501666 1641680 1844662
16247 1844662 1761971 1585313 1670085 1673306 1724692 1610390 1583573 1599545 1716799 1823729 1922708
16236 1922708 1869841 1304808 1526672 1833301 1764887 1606445 1798806 2021214 1761878 1851558
16226 1851558 1908586 1952708 1911725 2130074 2179362 2371732 2310519 2347647 2355025 2424565 2178682
16215 2178682 2428919 2656812 2383858 2150128 2166548 2527706 2560573 2626421 2539474 2525411
16205 2525411 2544592 2395134 2031581 2218428 2295817 2210607 2320908 2400239 2412946 2493582
16195 2493582 2328066 2397837 2351909 2549239 2538465 2493385 2716003 2659467 2703157 2710418 2547251
16184 2547251 2343901 2563217 2793460 2811547 2754883 2849275 2860787 2776210 2906787 2657560
16174 2657560 2776523 2635127 2518355 2987372 3144191 2695286 2236247 2720204 2721363 2559248
16164 2559248 2546415 2758623 2774417 2565021 2637144 2713613 2387805 2522950 2833169 2837762
16154 2837762 2585102 2535586 2560864 2843757 2994093 2828131 2965790 3030060 3123492 3000878
16144 3000878 2934796 2971789 3052624 2986665 2801449 3129875 3276151 3142802 3374074 3197082
16134 3197082 3105348 3033764 3333161 3287257 3448934 3165884 3229700 3316197 3057000 2757845
16124 2757845 2912457 3119662 2811540 2959530 3076787 3113019 3038187 3094251 3256490 3244522
16114 3244522 2806677 2868959 3273648 3282255 3055753 3059734 3376845 3457568 3322030 3384492 3202608
16103 3202608 3258612 2920179 2684877 3009513 2869489 2761082 2993384 3093236 3138078 3052184
16093 3052184 3269476 3070074 2919518 2770045 2986500 3028972 2967868 2809823 2827589 2996338
16083 2996338 2964726 2883901 2905498 3202321 3101691 3135665 3160245 3295554 3276422 2999360
16073 2999360 3067861 3211151 3067144 3030102 3453501 3713028 3257248 3014409 3424660 3334023
16063 3334023 2852075 2691416 3268410 3592042 3253719 3068998 3119524 2968791 2765719 3053040
16053 3053040 3369416 3140986 2839687 2823282 3242018 3016728 2675296 3041638 3483959 3384167
16043 3384167 3344779 3413723 3362237 3161497 3094753 3020390 3189971 3367224 3322527 3586096
16033 3586096 3441623 3397873 3173525 3228210 3290250 3063338 2842763 3118742 3361316 3517645
16023 3517645 3244804 2918640 3178784 3432806 2944921 2837893 3140597 3047261 2850079 3010564
16013 3010564 3091421 3100281 3125685 3475419 3581436 3366603 3382087 3557395 3247838 2983482
16003 2983482 3159757 3375188 3309579 3244560 3109338 3080893 3278381 3236294 3120299 3270592
15993 3270592 3003746 2834872 3115016 3275102 2875026 2895373 3201146 3340134 3364681 3302606
15983 3302606 3386487 3031292 3214585 3345914 3344892 3385958 3718608 3834384 3494362 3400313
15973 3400313 3510010 3878178 3420865 2967395 3001411 3070590 2929525 3072473 2848292 2992431
15963 2992431 3184058 3170125 3293157 3175953 3126819 3268955 3136437 2936832 2615672 2601259
15953 2601259 3352504 3141607 2775127 2487734 2978722 3421827 3214981 2906624 2891111 3188161
15943 3188161 3377690 3328559 3177819 3434787 3597078 3550277 3607142 3742115 3698825 3712365
15933 3712365 3850421 3720465 3453265 3293802 3542949 3573106 3359493 3128313 3387054 3650133
15923 3650133 3307336 3021461 3324841 2972906 2942376 3055047 3147091 3263542 3023795 3229857
15913 3229857 3506094 3438896 3544842 3687887 3988308 3622751 3231264 3235192 3250207 3203380
15903 3203380 3153749 3021991 3586152 3264390 3349312 3247698 3015979 3279702 3388628 3292689
15893 3292689 3125971 3301294 3320154 3279916 3293448 2853228 2620305 3156277 3664818 3432184
15883 3432184 2849247 3012380 3318131 3429495 2841037 2934181 3793739 3657857 3190586 3371228
15873 3371228 3783207 3481678 3361425 3533504 3529496 3281759 2937560 3275871 3493426 3103412
15863 3103412 2966552 3437772 3556502 3162155 3055009 3291683 3521498 3507956 2759888 2983389
15853 2983389 3142946 3162988 3137220 2986469 3090992 3275622 3400052 3397386 3024791 3088008
15843 3088008 2877491 2899218 3407881 3602451 3218370 3341055 3560712 3502194 2812703 3143368
15833 3143368 3685754 3506957 3284353 3539918 3604346 3627480 3280267 3322599 3439721 3030674
15823 3030674 2863593 3166501 3395670 3078621 3204533 3382664 3331489 2897759 3124777 3279286
15813 3279286 3379067 3362949 3036319 2965868 3032443 2981437 3155712 3363901 3321809 3258377 3253874
15802 3253874 3287491 3163697 3322362 3526732 3573880 3453193 3226165 3456847 3584129 3457373
15792 3457373 3341332 2999228 3102612 3443349 2993912 2926904 3021911 2968542 2827298 2711522
15782 2711522 3229843 3239927 2911841 3129666 3559284 3334651 2858428 3219588 3663356 3462492
15772 3462492 3050131 3189416 3637741 3533474 3055431 3291271 3721813 3621652 3330204
15763 3330204 3174247 3126131 3458963 3375837 3390575 3325708 3154939 3076493 3141153 3162165 3325750
15752 3325750 3150908 3162953 3370182 3292766 2947564 3307041 3403124 3206665 2781004 2748476
15742 2748476 3105024 3085259 3066801 3244094 3469817 3371492 3056820 3129577 3840105 3627780
15732 3627780 3209765 3249034 3740115 3648591 3270926 3454820 3666476 3222523 2962127 3339207
15722 3339207 3554022 3052680 2952733 3431422 3578750 3414375 3164452 3307519 3332624 3133413
15712 3133413 3245699 3407295 3321040 3115100 3212959 3326273 3353823 3021052 3059788 3138152
15702 3138152 3281897 3221995 3354586 3479932 3421875 3791652 3741579 3654707 3362691 3192586
15692 3192586 3066475 3347114 3459485 3474439 3272856 3360104 3529860 3464139 3015191 3071753
15682 3071753 3434255 3390921 3275221 3106138 3345634 3260903 3253617 3301367 3509299 3081172
15672 3081172 2901080 3098502 3168590 3372757 3207950 3283826 3247499 2843314 2883809 3159811
15662 3159811 3242065 3569212 3309504 3136006 3491969 3561013 3361483 3375663 3615872 3481011
15652 3481011 3294835 3450384 3512383 3036408 3274163 3462022 3408755 3423284 3287190 3316464
15642 3316464 3507018 3458683 3166104 3254173 3651772 3358772 3035546 3096333 3387370 3358012
15632 3358012 3283463 3533851 3737448 3560118 3147845 3380560 3429888 3095153 3095905 3390047
15622 3390047 3257336 2722633 2892162 3231609 3253192 3163826 3021855 3560897 3397398 3150652
15612 3150652 2987106 3087514 3482939 3596233 3145181 3074263 3253315 3432930 3411581 3339463
15602 3339463 3594241 3294792 3289402 3656809 3670117 3442506 3254128 3153264 3888687 3491630
15592 3491630 3049848 3123929 3562230 3422293 3052414 3072591 3321680 3448035 3161629 3372543
15582 3372543 3399222 3462875 3329879 3417802 3354029 3440050 3233942 3310841 3789285 3784735 3853292
15571 3853292 4031984 4029581 3448543 3336434 3303567 3731562 3689786 3305544 3420020 3670423
15561 3670423 3330146 3148556 3233890 3432260 3670519 3526244 3339763 3092196 3116795 3127012
15551 3127012 3373842 3397309 3150148 2957784 3181679 3450194 3089907 2907160 3362650 3766850
15541 3766850 3325787 3424797 3913914 3840006 3496371 3197081 3457172 3643208 3536314 3371913
15531 3371913 3606211 3350901 3151478 3225848 3661535 3250382 2754750 3045628 3494027 3257011
15521 3257011 2982400 2974854 3225280 3495247 3146212 2996158 3149860 3527106 3373709 3292581
15511 3292581 3473493 3580237 3450809 3563169 3853029 3726947 3543789 3528204 3796122 3280886
15501 3280886 2997645 3341773 3983826 3857957 3144779 3290409 3750608 3689064 3154426 3220577
15491 3220577 3482139 3129886 2740658 2929121 3076785 2969322 3019834 3596290 3612115 3096950
15481 3096950 3027935 3337065 3600172 3393252 3013808 3217816 3334862 3196634 3083832 3122039
15471 3122039 3563077 3209911 3155849 3312713 3531859 3387368 3125128 3434155 3542127 3538042
15461 3538042 3501111 3704299 3685761 3334437 3285455 3373672 3417027 3520957 3541364 3682305
15451 3682305 3359479 2937674 3066573 3515574 3502131 3494067 3364889 3267679 3281771 3337171
15441 3337171 3586713 3462158 3593819 3436476 3405298 3618493 3308019 3392909 3515072 3721721
15431 3721721 3358972 3404202 3517434 3781276 3705851 3664060 3681896 3378230 3571734 3323625
15421 3323625 3453957 3345736 3425316 3507761 3448064 3490578 3250743 3230334 3367585 3393599
15411 3393599 3072470 2927749 3207971 3358014 3272174 3328192 3125193 3514581 3828491 3698841
15401 3698841 3448017 3319937 3530751 3605397 3471616 3386513 3440031 3353869 3419765 3059535
15391 3059535 3013512 3194556 3485850 3370800 3097573 3143770 3438483 3605907 3125852 3296023
15381 3296023 3371395 3464045 3678009 3535014 3292713 3234325 3652109 3628770 3463752 3413769
15371 3413769 3513796 3583094 3665867 3640511 3544092 3250993 3350282 3477563 3448937 3513074 3733707
15360 3733707 3735353 3582678 3387795 3535969 3594144 3479048 3311164 2865052 2870261 3079951
15350 3079951 3074258 2817281 2708294 3139676 3511229 3281091 3217706 3196188 3446467 3652039
15340 3652039 3612735 3420630 3464852 3630590 3586859 3368092 3388529 3435079 3742866 3633272
15330 3633272 3506140 3173616 3222677 3660242 3546755 3389693 3392521 3501104 3372712 3318358
15320 3318358 3393495 3334735 3297805 3301425 3204881 3117802 3111416 3496098 3336643 3544155 3670103
15309 3670103 3446717 3349523 3614422 3511009 3306841 3380786 3663154 3860020 3352970 3420423
15299 3420423 3651938 3946526 3612028 3466703 3476611 3790101 3456991 3245873 3452436 3411163
15289 3411163 3276027 3046715 3643279 3489642 3054069 3137857 3731137 3473274 2911985 3140032
15279 3140032 3763749 3973651 3517337 3441295 3572576 3560782 3461936 3560084 3601105 3546058
15269 3546058 3330765 3084159 3396875 3408071 3330436 3639186 3543553 3106051 2911763 3239834
15259 3239834 3924315 3556253 3154154 3188537 3355546 3661833 3798554 3545755 3657245 3613936
15249 3613936 3191085 3220172 3667510 3681457 3534694 3723070 3657470 3582934 3298129 3632738
15239 3632738 3659779 3387026 3311561 3364762 3750289 3449931 3421817 3785816 3956061 3850465
15229 3850465 3780421 3665484 3679279 3383752 3410748 3412792 3239153 3098938 3025499 3190794
15219 3190794 3318487 3361683 3443336 3639030 3425936 3418694 3588545 3575578 3496083 3596007 3414150
15208 3414150 3531089 3948802 3913219 3460127 3499543 3398404 3588625 3790407 3637669 3365322
15198 3365322 3609693 3809866 3685308 3824322 3625482 3369353 3504466 3443570 3515127 3451850
15188 3451850 3522999 3263335 3174220 3404009 3399537 3283308 3434031 3402329 3367139 3322836 3116374
15177 3116374 3090261 3201079 3362134 3491708 3683427 3566945 3403618 3551961 3425281 3207928
15167 3207928 3244562 3393394 3639895 3530277 3368783 3429115 3393997 3393956 3696962 3746645 3488064
15156 3488064 3244283 3373220 3497439 3179990 2967887 3546344 3371104 3060162 3032417 3463444
15146 3463444 3347609 2990320 3033566 3597572 3841448 3812755 3706250 3725406 3675390 3422926
15136 3422926 3150348 3391992 3534161 3466371 3754527 3658977 3546245 3513142 3309933 3644723
15126 3644723 3873387 3629020 3389366 3742672 3890852 3253037 3038956 3295965 3595948
15117 3595948 3122990 2854744 3318117 3515867 3280903 3366691 3462576 3414796 3184494 3589419
15107 3589419 3936329 3818332 3506161 3702372 3946503 3910453 3625791 3602035 3785429 3631152
15097 3631152 3219316 3642132 3957799 3621271 3308989 3384426 3331349 3534048 3381990 3255410
15087 3255410 3374906 3223229 3207686 3606768 3860837 3277221 3254723 3296524 3752920 3615802
15077 3615802 3515921 3400689 3435530 3621967 3386704 3499813 3894037 3850014 3545880 3405591
15067 3405591 3691994 3634673 3481888 3570155 3718409 3428881 3415834 4120038 3755559 3445122
15057 3445122 3279630 3491855 3560608 3163863 2831765 2984709 3279852 3294743 3492344 3527860
15047 3527860 3567877 3640692 3652695 3423890 3226612 3412796 3510178 3506407 3576992 3917477 3914493
15036 3914493 3867891 3817451 3476599 3595876 3863230 3755419 3840414 3826444 3662050 3923084
15026 3923084 4161108 3826082 3479135 3522019 3672863 3859996 3473387 3507629 3597979 3752022
15016 3752022 3725924 3521340 3420509 3377730 3514630 3647005 3336897 3222131 3434378 3714484
15006 3714484 3730622 3615689 3688603 3647182 3579261 3551465 3678454 3778954 3882168 3824795
14996 3824795 3865535 3579782 3434175 3478644 3369939 3548485 3519567 3270943 3307959 3398320
14986 3398320 3485389 3263585 3409979 3709148 3337697 2818794 3104686 3566188 3692622 3136437
14976 3136437 3041380 3453433 3377693 3378736 3388200 3382473 3483217 3426276 3616037 3972141 3820602
14965 3820602 3655957 3552612 3792776 3613601 3215449 3329530 3722251 3507821 3282996
14956 3282996 3476596 3801432 3568995 3193711 3491552 3552189 3503265 3459156 3558962 3373830
14946 3373830 3258877 3446322 3581819 3633370 3608561 3570048 3656292 3460070 3290496 3363693
14936 3363693 3434174 3614817 3765639 3717516 3607336 3998668 3671422 3352004 3660739 3604939
14926 3604939 3574312 3406975 3536767 3633192 3732513 4012976 3895880 3971680 3431911 3172017
14916 3172017 3599709 3680205 3237188 3149058 3533183 3670802 3374698 3216787 3535574 3691048
14906 3691048 3463254 3254280 3512103 3793674 3686246 3590586 3501178 3272326 3612353 3696149
14896 3696149 3718576 3552340 3359574 3862755 4116087 3934635 3730199 3634416 3734340 4051851
14886 4051851 3819485 3448478 3303461 3243067 3106901 2967629 3344511 3809928 3690258 3690870
14876 3690870 3842605 3673734 3484938 3580398 3645424 3543205 2994164 2997771 3401326 3423711
14866 3423711 3502662 3309126 3611033 3795602 3703462 3604044 3758865 3650298 3582867 3485733
14856 3485733 3759007 3671543 3152418 3501216 3772444 3474227 3481258 3654891 3702648 3686307
14846 3686307 3375634 3471733 3482581 3557855 3480894 3314377 3495901 3603452 3649494 3552227
14836 3552227 3593267 3730416 3862029 3631744 3561183 3745916 3439672 3734319 3822350 3556025
14826 3556025 3557385 3470534 3726334 3591083 3383032 3300004 3646599 3586842 3537093 3817953
14816 3817953 3986015 3686359 3385148 3456516 3638110 3528294 3523986 3684902 3640175 3449698
14806 3449698 3542684 3717583 3617871 3413715 3338454 3612526 3805774 3829958 3522589 3408361
14796 3408361 3350813 3709209 3598284 3299267 3659791 3907151 3827037 3485748 3389417 3719732
14786 3719732 3710136 3515273 3682558 3515727 3602879 3627899 3689825 3844747 3511614 3434486
14776 3434486 3505230 3638887 3390164 3287815 3475920 3649913 3506200 3390850 3196930 3443798
14766 3443798 3504090 3329995 3312214 3484029 3648897 3796942 3697798 3880062 3715371 3627994
14756 3627994 3600666 3649504 3452310 3330743 3754461 3875177 3781552 3650700 3486054 3698015
14746 3698015 3644978 3594332 3502050 3681707 3601238 3060641 3361857 3538077 3355195 3578843
14736 3578843 3415751 3473366 3414407 3813618 4194389 3975298 3290079 3326685 3738741 4078633
14726 4078633 3739766 3382728 3884071 4079878 3941810 3431234 3735754 3800444 3650263 3815058
14716 3815058 4091982 3986968 3867676 3757805 4166222 4090691 4003687 3889964 4015458 3722830
14706 3722830 3657427 3626153 3804646 3759415 3450515 3569221 3780600 4048251 3605458 3337426
14696 3337426 3578345 3604771 3463888 3635927 3933910 3621505 3538198 3479633 3938247 3594784
14686 3594784 3435946 3802520 4190742 3723576 3431202 3470218 3934184 3663146 3345078 3773908
14676 3773908 3841639 3722809 3488223 3527408 3892615 3746292 3580963 3743664 3523199 3233787
14666 3233787 3318409 3453485 3535226 3369278 3205042 3502298 3933812 3852601 3507387 3753617
14656 3753617 3740783 3370561 3070123 3657207 3526685 3586201 3767432 3857555 3729006 3661634
14646 3661634 3774106 3636707 3426016 3387392 3348793 3289549 3637576 3716361 3678230 3883941
14636 3883941 3859621 3859078 3515379 3621290 4012737 3773393 3648645 3791854 3705240 3808292
14626 3808292 3769708 3970900 3562317 3598394 3749894 3599781 3619064 3558210 3673056 3915594
14616 3915594 4060865 3815000 3732482 3535037 3946180 4062031 3888086 3958165 3919070 3752146
14606 3752146 3472567 3668776 3573194 3871990 3886715 3753649 4016590 3974311 3446894 3617682
14596 3617682 3687223 3804651 3718411 3902321 4056145 3874423 3901042 3687647 3674632 3699066
14586 3699066 3571338 3717177 3818488 3942149 3806798 3524180 3705839 3391021 3260935
14577 3260935 3733663 3957189 3805076 3703175 3413971 3440474 3428801 3545077 3745301 3778879
14567 3778879 3557799 3394555 3449737 3726436 3749950 3716669 3825990 3988255 3751681 3687447
14557 3687447 4059332 4006055 3752509 3886114 4151780 3973166 3928142 3717354 3677522 3878851
14547 3878851 3696533 3444883 3647867 3765390 3424329 3296206 3726258 3868361 3775645 3540808
14537 3540808 3812518 4186893 3692809 3736617 4070992 3886164 3444538 3340755 3636745 3910654
14527 3910654 3633905 3732364 4258610 3729627 3358104 3716590 3674485 3916064 3707725 3607815
14517 3607815 3837775 3565449 3732777 3832367 3767091 3794616 3610263 3892998 3942121 3783883
14507 3783883 3775450 4121490 4318259 3792751 3438574 3700840 4021114 4046995 3728732 3988615
14497 3988615 3887603 3876685 3933796 3825600 3766133 3671265 3837308 3907195 4158927 4253467
14487 4253467 3903575 3900262 4222632 4023994 3656955 3831991 3861859 3806451 3546997 3686277
14477 3686277 3813671 3727216 3497538 3453077 3657816 3594078 3600891 3721715 3458131 3293941
14467 3293941 3759420 4008318 3930271 3644808 3618573 3924378 4000856 3727498 3738630 3756511
14457 3756511 3589647 3846923 3746539 3678149 3451656 3608772 3860014 3823356 3947351 3967876
14447 3967876 4282100 3877635 3785376 4194217 4251550 3803304 3791264 4021280 3963803 3828809
14437 3828809 4015119 4018067 3837512 3792308 4002905 3948522 3572340 3623441 3835028 3994657
14427 3994657 3538757 3461020 3394465 3461636 3628070 3670463 3513404 3509623 4015944 4066151 4121378
14416 4121378 3682075 3849188 3934117 3969818 3919402 4147718 3772833 4005991 4227009 3887732
14406 3887732 3473394 3640107 4038704 3927753 3621630 3720261 3998650 4056217 3789948 3732146
14396 3732146 3925423 3872042 3849256 4030379 4132619 3836168 3793323 3899052 3943675 3448824
14386 3448824 3261849 3929641 4119805 3803448 3457037 3722138 3950400 3741958 3559956
14377 3559956 3901408 4027549 3792648 4305928 3938271 3822363 3815900 3941173 3909446 3950120
14367 3950120 4073519 3913893 4014752 4025712 3727051 3586666 3807852 3877731 3615414 3342477
14357 3342477 3591026 3800253 3410664 3089410 3414031 3550639 3513169 3226381 3328468 3555914
14347 3555914 3331430 3563946 3789367 4057088 3833403 3850616 4060483 4126035 3478871 3581034
14337 3581034 4368421 4228200 3939650 3929472 4464804 4453460 3991983 4045248 3978553 3931863
14327 3931863 3715338 3522915 3462195 3232413 3187550 3544268 3824980 3802965 3801595 4011350
14317 4011350 4064938 4023731 3651870 3755599 3996296 4035493 3921914 3856280 3972201 4118605
14307 4118605 3924523 3688592 4129497 4150018 3744267 3988149 4153160 3801291 3669616 4207503
14297 4207503 4282999 3630617 3637699 3947675 4039119 3569007 3474263 4003799 4155126 3873760
14287 3873760 3671018 3991148 3831771 3593483 3833967 4042163 3794440 3476486 3733186
14278 3733186 4093537 3752714 3359256 3938005 4330723 4162421 3693222 4130231 4258687
14269 4258687 3864267 4040576 4362461 4226537 3903402 4157307 4167456 3890559 3910277 4347717
14259 4347717 4374870 3916025 3689925 3594907 4003209 3932525 4021939 4159910 4062959 4019497
14249 4019497 3638475 3414398 3647148 3718697 3684992 3584564 3665625 3895918 3965573 3857222
14239 3857222 3484887 3520729 3699542 3925772 4017005 3722542 3677738 3987479 4308960 4170882
14229 4170882 3803723 3855619 4006205 3791831 3759482 3873853 4075472 4155993 3870084 3774781
14219 3774781 3704460 3510249 3709430 4124485 4029641 3581646 3675282 4004421 3575510 3218106
14209 3218106 3402532 3765780 3812396 3674423 3950448 3972872 3869434 4052770 4364120 4343547
14199 4343547 3765384 3999047 4103736 4043387 3956931 4266535 4475175 4195729 3904907 3754085
14189 3754085 4078006 4217311 3969739 3809740 3766918 3898670 4011944 3908093 3759307 3680554
14179 3680554 3837535 3840636 3871263 3880408 3947608 3791907 3750365 3904274 3625514 3792061 4061714
14168 4061714 3995293 3935548 3838259 4264822 4287776 4120339 3893720 4178358 4224705 4077377
14158 4077377 3926914 3891350 3997158 3943764 4277222 4191156 3942870 4387446 4438113 3992409
14148 3992409 3740519 3761497 4291366 4011275 3611120 3723564 3993615 3720557 3271645 3581065
14138 3581065 4002456 3923594 3715704 4093489 4276823 4156011 4028136 4225834 4016139 4000966
14128 4000966 4104046 4118357 4274111 4003916 3814612 4016936 4018515 3825676 3902814 4226288
14118 4226288 4130323 3974255 4026816 4050378 4031293 4049013 3964097 3793331 3979835 3722117
14108 3722117 3711569 3848224 3720323 3668040 3997101 4210273 4043678 3593747 3653723 4041549
14098 4041549 3996625 3819524 3935137 4013052 4038243 3921638 4174532 4027184 3276182 3546371
14088 3546371 4277839 4629067 4050792 3604445 3960027 4100745 3433426 3131187 3859133
14079 3859133 4180037 3815658 3629399 4096655 3962289 3401015 3499875 3837484 3616296 3301000
14069 3301000 3466979 4082679 3369991 3208041 3563127 3919332 3780907 3525368 4138922
14060 4138922 4386515 4240139 3863431 4075894 4245400 4179380 4218632 4173043 4011894 3835296
14050 3835296 3879681 4041712 4075168 3772018 3526965 3899074 4202538 3906259 3868925 4033578
14040 4033578 4068307 3895335 3311779 3538404 4140371 4347259 3903489 3901604 4004385 3899590
14030 3899590 3554890 3787397 3980234 3958429 4032630 4612861 4405494 3626603 3912474 4009914
14020 4009914 4149806 3908819 3901973 4259561 4447992 4149259 4094220 4244125 4128129 3940907
14010 3940907 3485453 3573670 3646388 3551697 3648061 3837983 3897966 3990360 4221963 4081092
14000 4081092 3705871 3656678 4023573 4349574 4238412 3995822 3909827 4217635 4264000 3688219
13990 3688219 3683654 3846823 4332997 4108631 3541212 3803140 4132258 3755219 3600080 3949398
13980 3949398 3973168 3707538 3773306 4097513 3824400 3610882 3847674 4148980 3887309 3581604
13970 3581604 3779371 4120956 3691189 3585466 3649978 3900427 4154182 3805215 3971868 4397757
13960 4397757 4430700 4065710 4144636 4338485 3795847 3819246 3888840 4133996 3941922 3866671
13950 3866671 4085119 4525709 4264080 3901359 3993735 4134838 4310493 3826828 3642055 3956564
13940 3956564 3797399 3608764 3942004 3817559 3971077 3888934 4063590 3734844 3270665 3366728
13930 3366728 4102211 4106536 3469910 3430002 3942599 4381964 3987941 3634941 4047290 4562461
13920 4562461 4156463 3862247 4190444 4357296 4160989 3975588 4233029 4209700 4001798 4040425
13910 4040425 4086318 3855490 3581064 3655385 3993749 3784216 3433121 3409064 3890362 4134617
13900 4134617 3707200 3846264 3983977 4426807 4227046 4088879 4338919 4395207 4303140 4072875
13890 4072875 4317342 4266407 3778026 4160851 4638554 4088664 3682669 3703022 4155639 3914578
13880 3914578 3498487 3752294 4098782 3979924 3435391 3528278 4035426 4082312 3749324 3911266
13870 3911266 4032521 3708006 3514515 3868835 4082894 3707128 3652167 3995266 4119816 3915414
13860 3915414 3778451 3853055 4171387 3993404 3923802 4004099 4170603 4099508 3799506 3717786
13850 3717786 4321115 4362415 4335431 4037901 3787466 3881053 3910274 3887341 3852064 3812243 3722137
13839 3722137 4195675 4031067 3739021 3808313 4131927 4419496 4074195 3683590 4063709 4552301
13829 4552301 4403622 4077207 4216007 4290258 4338250 4234153 4197101 4085449 4237664 4266418
13819 4266418 4337009 4046397 3764984 4026866 4095057 3854690 3707771 3691605 4133589 4168078
13809 4168078 3956727 3759189 4054638 4348028 4187144 3853957 3710823 3914975 4043207
13800 4043207 4062340 4011483 4037230 4072373 4274160 4010413 3815477 3757760 3914608 4257698
13790 4257698 4320198 4346431 4441184 4483387 4451797 4030493 3841121 3978085 3817940 3592874
13780 3592874 3763936 4059439 4194923 4009422 4117735 3988476 3867870 3752384 3941131
13771 3941131 4060798 3681301 3461077 3765266 4211518 4075306 3728249 3651047 3886498 4098936
13761 4098936 3844115 3878447 3961814 4041499 4345456 4346816 4387988 4584375 4420345 4098127
13751 4098127 4127768 4169617 4107742 4446395 4373377 4161612 3897567 4090402 4360856 4033935
13741 4033935 3580617 3997718 4258580 3914956 3694965 3561663 3836277 3803402 3985415 3818252
13731 3818252 3924939 4076094 4141717 4219573 4108457 3981888 4142883 4135059 4252841 4086638
13721 4086638 3923977 4318500 4366185 4125214 4226869 4177787 4235672 4231443 4166496 4273565
13711 4273565 4244035 3959552 4139840 4020587 3763244 3601917 3946759 3823313 3688541 3778849
13701 3778849 3907303 4447037 4186449 3644489 3695077 4137181 4343927 4227484 3929300 3946088
13691 3946088 4095218 4265027 4142036 4312192 4432533 4258022 4362944 4224808 4081643
13682 4081643 4356011 4469568 4099628 3903595 3892580 4052221 4353856 4202222 4025459 3933685
13672 3933685 4018199 3867924 3989973 3965822 3789092 4046456 3970855 4002345 4225622 4077245
13662 4077245 4347828 4456926 4125026 3922420 4068974 4572006 4538763 4165873 4156401 4407415
13652 4407415 4585831 4396618 4191610 4330440 4095155 4103646 4259379 4101167 4317259 4109782
13642 4109782 3891243 3821408 3957650 4064377 4303625 4261004 3967270 3567945 4089416 4460187
13632 4460187 4325452 4051492 4355196 4416022 4193451 4398910 3954122 4106450 4256819 4210242
13622 4210242 4184098 4003178 4160863 4330479 4560109 4379733 4062128 4399287 4510779 4381156
13612 4381156 4059687 3957439 4037680 3866299 3982766 3771244 3685243 3943821 4120370 4064198
13602 4064198 3728663 4051951 4201586 4163897 3875015 3798525 4128979 4551948 4435461 4355902
$$ [...]
##END NTUPLES=NMR SPECTRUM
##END=
