##TITLE=1H_DE-80H_X3
 200.13MHz, d2o
 8 sc
 
 19ns.26.2.2025
##JCAMPDX= 6.0         $$ Bruker NMR JCAMP-DX V2.0
##DATA TYPE= NMR SPECTRUM
##DATA CLASS= NTUPLES
##ORIGIN= UXNMR, Bruker Analytische Messtechnik GmbH
##OWNER= pz
$$ XWIN-NMR		Version 3.5
$$ Fri Jul 17 12:04:01 2026 Russian Standard Time (UT+4h)  Yarkov@DPX200
##.OBSERVE FREQUENCY= 200.1313
##.OBSERVE NUCLEUS= ^1H
##.ACQUISITION MODE= SIMULTANEOUS
##.ACQUISITION SCHEME= undefined
##.AVERAGES= 8
##.DIGITISER RES= 18
##SPECTROMETER/DATA SYSTEM= spect
##.PULSE SEQUENCE= zg30
##.SOLVENT NAME= DMSO
##.SHIFT REFERENCE= (INTERNAL, DMSO, 0, 15.4913)
##AUDIT TRAIL= $$ (NUMBER, WHEN, WHO, WHERE, WHAT)
$$ ##TITLE= Audit trail, XWIN-NMR		Version 3.5
$$ ##JCAMPDX= 5.01
$$ ##ORIGIN= Bruker BioSpin GmbH
$$ ##OWNER= Yarkov
$$ C:/Bruker/XWIN-NMR/data/yarkov2/nmr/H-C/1/pdata/1/auditp.txt
$$ ##AUDIT TRAIL=  $$ (NUMBER, WHEN, WHO, WHERE, WHAT)
(   1,<2026-07-17 12:03:16.54 +0400>,<Yarkov>,<DPX200>,
      <created by zg, POWCHK disabled, PULCHK disabled
       configuration hash MD5:
       00 E9 B6 7A A2 85 ED C7 34 08 36 98 17 FE 4E 26
       data hash MD5: 16K
       B7 40 ED 31 BC 60 CF A8 1E 57 23 15 8D 4F 02 2D>)
(   2,<2026-07-17 12:03:23.70 +0400>,<Yarkov>,<DPX200>,
      <Start of raw data processing
       efp BC_mod = 2 LB = 0.25 FT_mod = 6 PKNL = 1 PHC0 = -7255.922 PHC1 = 7.421964 SI = 16K 
       data hash MD5: 16K
       EC AD D7 6A 49 28 86 E1 D2 01 7A D7 B6 2B 58 8C>)
$$ ##END=
$$ 
$$ hash MD5
$$ C5 13 61 00 21 45 9A 8F AB AD 18 2B 95 7A 3C 46
##$RELAX= 
##$RELAX= 
##$RELAX= 
##$RELAX= 
##$RELAX= 
##$RELAX= 
$$ Bruker specific parameters
$$ --------------------------
##$DU= <C:/Bruker/XWIN-NMR>
##$EXPNO= 1
##$NAME= <H-C>
##$PROCNO= 1
##$TYPE= <nmr>
##$USER= <yarkov2>
##$AMP= (0..31)
100 100 100 100 100 100 100 100 100 100 100 100 100 100 100 100 100 100 
100 100 100 100 100 100 100 100 100 100 100 100 100 100 
##$AQSEQ= 0
##$AQ_mod= 1
##$AUNM= <au_zg>
##$AUTOPOS= <>
##$BF1= 200.13
##$BF2= 200.13
##$BF3= 200.13
##$BF4= 200.13
##$BF5= 200.13
##$BF6= 200.13
##$BF7= 200.13
##$BF8= 200.13
##$BYTORDA= 1
##$CFDGTYP= 0
##$CFRGTYP= 5
##$CHEMSTR= <none>
##$CNST= (0..31)
1 1 145 1 1 1 1 1 1 1 1 1 1 1 1 1 1 1 1 1 1 1 1 1 1 1 1 1 1 1 1 1 
##$CPDPRG= <>
##$CPDPRG1= <>
##$CPDPRG2= <>
##$CPDPRG3= <>
##$CPDPRG4= <mlev>
##$CPDPRG5= <mlev>
##$CPDPRG6= <mlev>
##$CPDPRG7= <mlev>
##$CPDPRG8= <mlev>
##$CPDPRGB= <>
##$CPDPRGT= <>
##$D= (0..31)
0 0.7 0 0 0 0 0 0 0 0 0 0.03 0 0 0 0 0 0 0 0 0 0 0 0 0 0 0 0 0 0 0 0 
##$DATE= 1784275395
##$DBL= (0..7)
120 120 120 120 120 120 120 120 
##$DBP= (0..7)
150 150 150 150 150 150 150 150 
##$DBP07= 0
##$DBPNAM0= <>
##$DBPNAM1= <>
##$DBPNAM2= <>
##$DBPNAM3= <>
##$DBPNAM4= <>
##$DBPNAM5= <>
##$DBPNAM6= <>
##$DBPNAM7= <>
##$DBPOAL= (0..7)
0.5 0.5 0.5 0.5 0.5 0.5 0.5 0.5 
##$DBPOFFS= (0..7)
0 0 0 0 0 0 0 0 
##$DE= 6
##$DECBNUC= <off>
##$DECIM= 32
##$DECNUC= <off>
##$DECSTAT= 4
##$DIGMOD= 1
##$DIGTYP= 9
##$DL= (0..7)
0 120 120 120 120 120 120 120 
##$DP= (0..7)
$$ [...]
##$SUBNAM2= <"">
##$SUBNAM3= <"">
##$SUBNAM4= <"">
##$SUBNAM5= <"">
##$SUBNAM6= <"">
##$SUBNAM7= <"">
##$SUBNAM8= <"">
##$SUBNAM9= <"">
##$SW= 18.0517328524113
##$SWIBOX= (0..15)
0 0 2 0 0 0 0 0 0 0 0 0 0 0 0 0 
##$SW_h= 3612.71676300578
##$TD= 16384
##$TD0= 1
##$TE= 0
##$TE2= 300
##$TE3= 300
##$TEG= 300
##$TL= (0..7)
0 120 120 120 120 120 120 120 
##$TP= (0..7)
150 150 150 150 150 150 150 150 
##$TP07= 0
##$TPNAME0= <>
##$TPNAME1= <>
##$TPNAME2= <>
##$TPNAME3= <>
##$TPNAME4= <>
##$TPNAME5= <>
##$TPNAME6= <>
##$TPNAME7= <>
##$TPOAL= (0..7)
0.5 0.5 0.5 0.5 0.5 0.5 0.5 0.5 
##$TPOFFS= (0..7)
0 0 0 0 0 0 0 0 
##$TUNHIN= 0
##$TUNHOUT= 0
##$TUNXOUT= 0
##$USERA1= <user>
##$USERA2= <user>
##$USERA3= <user>
##$USERA4= <user>
##$USERA5= <user>
##$V9= 5
##$VALIST= <valist>
##$VCLIST= <CCCCCCCCCCCCCCC>
##$VD= 0
##$VDLIST= <DDDDDDDDDDDDDDD>
##$VPLIST= <PPPPPPPPPPPPPPP>
##$VTLIST= <TTTTTTTTTTTTTTT>
##$WBST= 1024
##$WBSW= 4
##$XGAIN= (0..3)
0 0 0 0 
##$XL= 0
##$YL= 0
##$YMAX_a= 62896
##$YMIN_a= -110942
##$ZGOPTNS= <>
##$ZL1= 120
##$ZL2= 120
##$ZL3= 120
##$ZL4= 120
##$ABSF1= 0
##$ABSF2= 0
##$ABSG= 0
##$ABSL= 0
##$ALPHA= 0
##$AQORDER= 0
##$ASSFAC= 0
##$ASSFACI= 0
##$ASSFACX= 0
##$ASSWID= 0
##$AUNMP= <proc_1d>
##$AZFE= 0.1
##$AZFW= 0.1
##$BCFW= 0
##$BC_mod= 2
##$BYTORDP= 0
##$COROFFS= 0
##$CY= -3
##$DATMOD= 1
##$DC= 0
##$DFILT= <>
##$DTYPP= 0
##$F1P= 0
##$F2P= 0
##$FCOR= 1
##$FTSIZE= 16384
##$FT_mod= 6
##$GAMMA= 0
##$GB= 0
##$INTBC= 1
##$INTSCL= 3.241238e-09
##$ISEN= 128
##$LB= 0.25
##$LEV0= 0
##$LPBIN= 0
##$MAXI= 10000
##$MC2= 0
##$MEAN= 0
##$ME_mod= 0
##$MI= 1.114404
##$NCOEF= 0
##$NC_proc= -8
##$NLEV= 6
##$NOISF1= 3.799351
##$NOISF2= 2.8
##$NSP= 0
##$NTH_PI= 0
##$NZP= 0
##$OFFSET= 15.49127
##$PC= 1
##$PHC0= -7255.922
##$PHC1= 7.421964
##$PH_mod= 1
##$PKNL= yes
##$PPARMOD= 0
##$PSCAL= 0
##$PSIGN= 0
##$REVERSE= no
##$SF= 200.130006090476
##$SI= 16384
##$SIGF1= 3
##$SIGF2= 2
##$SINO= 0.751879
##$SIOLD= 32768
##$SREGLST= <19F.Aceton>
##$SSB= 0
##$STSI= 16384
##$STSR= 0
##$SW_p= 3612.71676300578
##$SYMM= 0
##$S_DEV= 0
##$TDeff= 16384
##$TDoff= 0
##$TI= <>
##$TILT= no
##$TM1= 0
##$TM2= 0
##$TOPLEV= 0
##$USERP1= <user>
##$USERP2= <user>
##$USERP3= <user>
##$USERP4= <user>
##$USERP5= <user>
##$WDW= 1
##$XDIM= 16384
##$YMAX_p= 315961205
##$YMIN_p= -1404709
$$ End of Bruker specific parameters
$$ ---------------------------------
##NTUPLES= NMR SPECTRUM
##VAR_NAME=  FREQUENCY,     SPECTRUM/REAL,   SPECTRUM/IMAG
##SYMBOL=    X,             R,               I
##VAR_TYPE=  INDEPENDENT,   DEPENDENT,       DEPENDENT
##VAR_FORM=  AFFN,          ASDF,            ASDF
##VAR_DIM=   16384,         16384,           16384
##UNITS=     HZ,            ARBITRARY UNITS, ARBITRARY UNITS
##FACTOR=    0.220516191357247, 1,           1
##FIRST=     3100.26797251922, 0,            0
##LAST=      -512.448790486558, 0,           0
##MIN=       -512.448790486558, -1404709,    0
##MAX=       3100.26797251922, 315961205,    0
$$ Real data points
##PAGE= N=1
##DATA TABLE= (X++(R..R)), XYDATA
$$ [...]
$$ plain form
5201 11682918 11696341 11716159 11513399 11227098 11261897 10829133 10380777 10327145 10149270 10171824
5191 10171824 10528822 10379803 10745843 11154712 11433784 11868180 11953090 12270084 12551274 12833464
5181 12833464 13062257 12912249 12595760 12222741 11897013 11719844 11144229 10644894 10516563
5172 10516563 10460055 9645367 9513394 9487023 9165083 9139559 8883557 8621824 8552918 8516630
5162 8516630 8400084 8550958 8523439 8818752 8606239 8430721 8558096 8537857 8570437 8777493
5152 8777493 9080493 9207705 9540304 9522737 9494080 9791902 9715746 9202149 9087225 8943620
5142 8943620 8707295 8403758 8312811 8009703 8024840 7771534 7631409 7549591 7378080 7405749
5132 7405749 7388114 7374097 7281860 7469281 7114705 7170619 7136124 7130863 7008740 6859358 6964258
$$ packed form
5201A1682918J3423J9818k02760k86301L4799m32764m48356n3632j77875K2554
5191A0171824L56998j49019L66040M08869K79072M34396Q4910L16994K81190K82190
5181A2833464K28793j50008l16489l73019l25728j77169n75615m99335j28331
5172A0516563n6508q14688j31973k6371l21940k5524k56002k61733o8906l6288
5162H516630j16546J50874k7519K95313k12513j75518J27375k0239L2580K07056
5152H777493L03000J27212L32599j7567k8657K97822p6156n13597j14924j43605
5142H943620k36325l03537r0947l03108J5137k53306j40125q1818j71511K7669
5132G405749j7635j4017r2237J87421l54576N5914l4495n261j22123j49382J04900
$$ plain form
5121 6964258 7017005 6700113 6787366 6931091 6769043 6772125 6846996 6893991 6808244 6808243 6767235 6754021
5109 6754021 6814779 6645894 6645509 6487327 6381201 6393909 6453715 6454804 6398434 6482786 6442521
5098 6442521 6254635 6085911 5913640 6012714 5919495 6037007 6403427 6517533 6254195 6211193
5088 6211193 6445984 6433592 6212688 6008961 6325297 6270331 6082524 6023335 6220130 6728142
5078 6728142 6881747 6440580 6329725 6365101 6517197 6731721 6693900 6555541 6441046 6463963
5068 6463963 6433044 6443588 6719339 6906868 6747948 6781259 6824055 6908912 6990606 6852690 6622339
5057 6622339 6660365 6669453 6791676 7041879 6954519 6962624 7174747 7075565 6907640 7144208 7238352
5046 7238352 7236379 7458060 7512509 7791918 7670997 7291733 7598097 7572985 7394439 7381989
$$ packed form
5121F964258N2747l16892Q7253J43725j62048L082P4871M6995q5747jm1008j3214
5109F754021O0758j68885l85j58182j06126J2708N9806J089n6370Q4352m0265
5098F442521j87886j68724j72271R9074r3219J17512L66420J14106k63338m3002
5088F211193K34791j2392k20904k03727L16336n4966j87807n9189J96795N08012
5078F728142J53605m41167j10855L5376J52096K14524l7821j38359j14495K2917
5068F463963l0919J0544K75751J87529j58920L3311M2796Q4857Q1694j37916k30351
5057F622339L8026R088J22223K50203q7360Q105K12123r9182j67925K36568R4144
5046G238352j973K21681N4449K79409j20921l79264L06364k5112j78546j2450
$$ plain form
5036 7381989 7599859 7785490 8174471 8315649 8458655 8502929 8346579 8465992 8426034 8426310
5026 8426310 8257921 8155979 8209731 8112968 8289180 8578995 8490878 8343601 8294494 8305516
5016 8305516 8264725 8620619 8590023 8376199 8403087 8554814 8610286 8703759 8794345 9180331 9132836
5005 9132836 8977462 9349484 9793121 10203850 10488985 10884067 11144288 11411528 11604022 11697132
4995 11697132 11670731 11642391 11380167 11135345 10746909 10591584 10101666 9662568 9379814 9357696
4985 9357696 9244848 9427691 9520364 9360008 9087859 9233006 9233824 9267284 9553534 9748212
4975 9748212 9594918 9697816 9830689 10151789 10390638 10725170 10858133 10864967 11400082 11345493
4965 11345493 11506171 11532476 11123354 10605587 10534772 10524008 10235013 10138011 9950557 10067782
$$ packed form
5036G381989K17870J85631L88981J41178J43006M4274j56350J19413l9958K76
5026H426310j68389j01942N3752r6763J76212K89815q8117j47277m9107J1022
5016H305516m0791L55894l0596k13824K6888J51727N5472R3473R0586L85986m7495
5005I132836j55374L72022M43637M10729K85135L95082K60221K67240J92494R3110
4995A1697132k6401k8340k62224k44822l88436j55325m89918m39098k82754k2118
4985I357696j12848J82843R2673j60356k72149J45147Q18L3460K86250J94678
4975I748212j53294J02898J32873L21100K38849L34532J32963O834N35115n4589
4965A1345493J60678K6305m09122n17767p0815j0764k88995r7002j87454J17225
$$ plain form
4955 10067782 10107031 10004619 9977672 9558124 9600196 9578397 9388595 9021451 9313053 9234911
4945 9234911 9515577 9413703 9163840 9257802 9580817 9834418 10069595 10398820 10500923 10571895
4935 10571895 10596041 10543533 10085428 10130102 10273923 9910150 9501279 9404560 9217619 9177055
4925 9177055 9164844 9195401 9216483 8914383 8782353 8743566 8592155 8771812 8943510 8746567
4915 8746567 8792350 8817751 8910280 8894778 8872331 9154105 8946453 8934442 9425372 9718498 9665453
4904 9665453 9578639 9695021 9558739 9770472 9701841 9540179 9526970 9533965 9335167 9356048 9640404
4893 9640404 9385339 9461949 9667851 9770905 9855809 9855737 9795523 9650590 9874351 9991739 9865922
4882 9865922 10038735 10233383 10373522 10406637 10600804 10453472 10552204 10840187 11114064 11300774
$$ packed form
4955A0067782L9249j02412k6947m19548M2072k1799j89802l67144K91602p8142
4945I234911K80666j01874k49863R3962L23015K53601K35177L29225J02103P0972
4935A0571895K4146n2508m58105M4674J43821l63773m08871r6719j86941m0564
4925I177055j2211L0557K1082l02100j32030l8787j51411J79657J71698j96943
4915H746567M5783K5401R2529j5502k2447K81774k07652j2011M90930K93126n3045
4904I665453q6814J16382j36282K11733o8631j61662j3209O995j98798K0881K84356
4893I640404k55065P6610K05902J03054Q4904p2o0214j44933K23761J17388j25817
4882I865922J72813J94648J40139L3115J94167j47332R8732K87983K73877J86710
$$ plain form
4872 11300774 11028836 10984059 11213729 11493496 11629832 11761132 11976547 12259535 12400430 12627654
4862 12627654 12937027 12958719 13221411 13768279 14078870 14211825 14224543 14223733 14322179 14252855 14395505
4851 14395505 14290187 14183771 14129377 14170941 14370220 14709370 15198371 15496930 15906164 16213937
4841 16213937 16764309 17403793 17918519 18668701 19773006 21036296 22488411 24857926 28674249
4832 28674249 34478869 42220541 51009724 60671828 70067684 72757928 68961918 62058743
4824 62058743 53938744 46586873 40624072 35691274 32023957 29284499 27169655 25931373
4816 25931373 25007639 24471995 23641929 23055941 22761192 22529792 22048629 21992313 21621030 21670746
4806 21670746 21645307 21407754 21658972 21846117 21999707 22084463 22410487 22606658 22841817 23133062
$$ packed form
4872A1300774k71938m4777K29670K79767J36336J31300K15415K82988J40895K27224
4862A2627654L09373K1692K62692N46868L10591J32955J2718q10R8446o9324J42650
4851A4395505j05318j06416n4394M1564J99279L39150M89001K98559M09234L07773
4841A6213937N50372O39484N14726P50182J104305J263290J452115K369515L816323
4832B8674249N804620P741672Q789183R662104R395856K690244l796010o903175
4824F2058743q119999p351871n962801m932798l667317k739458k114844j238282
4816B5931373r23734n35644q30066n85988k94749k31400m81163n6316l71283M9716
4806B1670746k5439k37553K51218J87145J53590Q4756L26024J96171K35159K91245
$$ plain form
4796 23133062 23212325 23148676 23033415 23012108 23188337 23374491 23549612 23383644 23372858 23258929
4786 23258929 23198964 23080261 23014591 23186462 23057593 23075587 22975182 22975163 22875794 22948957 22887925
4775 22887925 22684370 22671520 23081743 23401733 23156937 23244586 23098156 22744426 22810359 23011081
4765 23011081 22818236 22793991 22649272 22648519 22683946 22376891 22011198 21815389 21523415 21500835
4755 21500835 21448900 20994329 21139717 21133213 21293302 21111066 21009503 21323849 21478595 21502211
4745 21502211 21593068 21959588 22112973 22128158 22034834 22272818 22858817 22679592 22506716 22728336
4735 22728336 22950063 23460396 23805210 23608047 23974659 24444699 24604755 24694631 24802803 25069689
4725 25069689 25310230 25385271 25505023 25675993 25772615 25963054 26077397 26230685 26268255 26476884
$$ packed form
4796B3133062P9263o3649j15261k1307J76229J86154J75121j65968j0786j13929
4786B3258929n9965j18703o5670J71871j28869J7994j00405j9r9369P3163o1032
4775B2887925k03555j2850M10223L19990k44796Q7649j46430l53730O5933K00722
4765B3011081j92845k4245j44719p53L5427l07055l65693j95809k91974k2580
4755B1500835n1935m54571J45388o504J60089j82236j01563L14346J54746K3616
4745B1502211R0857L66520J53385J5185r3324K37984N85999j79225j72876K21620
4735B2728336K21727N10333L44814j97163L66612M70040J60056Q9876J08172K66886
4725B5069689K40541P5041J19752J70970R6622J90439J14343J53288L7570K08629
$$ plain form
4715 26476884 26661760 27152407 27329633 27654657 27973854 28041458 28317537 28673578 29280238 29729742
4705 29729742 29960636 30007986 30336387 30648077 30650367 30935896 31353605 31511756 31723115 31628056
4695 31628056 31329969 30787649 30802241 30513869 29847723 29378985 29176341 28886311 28510390 28167340
4685 28167340 27564590 27289327 26742858 26128756 25704675 25490936 24893835 24557778 24299393
4676 24299393 24015944 23653556 23148966 22777301 22277296 21760771 21290556 20693393 20436545
4667 20436545 19984500 19490500 19443701 18848230 18165982 17696325 17263604 16902617 16525792 15843010
4657 15843010 15499846 15382366 14926578 14627339 14577694 14302134 13944987 13891197 13788111 13715518
4647 13715518 13448233 13134332 12867905 12756589 12796346 12490677 12374507 12582261 12594463 12322236
$$ packed form
4715B6476884J84876M90647J77226L25024L19197O7604K76079L56041O06660M49504
4705B9729742K30894M7350L28401L11690K290K85529M17709J58151K11359r5059
4695C1628056k98087n42320J4592k88372o66146m68738k02644k90030l75921l43050
4685B8167340o02750k75263n46469o14102m24081k13739n97101l36057k58385
4676B4299393k83449l62388n04590l71665n00005n16525m70215n97163k56848
4667B0436545m52045m94000m6799n95471o82248m69657m32721l60987l76825o82782
4657A5843010l43164j17480m55788k99239m9645k75560l57147n3790j03086p2593
4647A3715518k67285l13901k66427j11316L9757l05669j16170K07754J2202k72227
$$ plain form
4637 12322236 12570944 12527880 12757058 13021890 13312398 13588863 13789664 14734468 15898975
4628 15898975 17596406 19309282 21227138 23536292 25203065 25204945 23902078 22094021 20314169
4619 20314169 19100024 17974700 16664580 16128450 15916607 15974866 16500660 16785380 17316230
4610 17316230 18216432 19362493 20695465 21933690 23060225 23649144 24343871 25555248 26704904
4601 26704904 28375804 30376427 32165467 33669265 34487481 34923065 34952927 35390474 36668035
4592 36668035 38273134 39821840 41035763 41341818 40425244 38951807 37604162 36426247
4584 36426247 35458959 34936623 34799346 34240941 32681184 30679983 28990752 27244769 25661521
4575 25661521 24276894 23114415 22337963 21409166 20135867 18628154 16887969 15380986
$$ packed form
4637A2322236K48708m3064K29178K64832K90508K76465K00801R44804J164507
4628A5898975J697431J712876J917856K309154J666773J880j302867j808057j779852
4619B0314169j214145j125324j310120n36130k11843N8259N25794K84720N30850
4610A7316230R00202J146061J332972J238225J126535N88919O94727J211377J149656
4601B6704904J670900K000623J789040J503798Q18216M35584K9862M37547J277561
4592C6668035J605099J548706J213923L06055r16574j473437j347645j177915
4584C6426247r67288n22336j37277n58405j559757k001201j689231j745983j583248
4575B5661521j384627j162479p76452r28797j273299j507713j740185j506983
$$ plain form
4567 15380986 13734135 12662300 12199915 11429893 10579386 9935798 9693065 9450468 9148848
4558 9148848 8815443 8419563 8426329 8251152 8131665 7914041 7714895 7595849 7535843 7134576
4548 7134576 6885130 7087824 6757897 6756593 6699646 6727924 6506128 6555776 6355017 6288021 6223495
4537 6223495 6165218 6309766 6392973 6433725 6219931 6058583 6178907 6308175 6142866 5923896
4527 5923896 5932437 6057791 6158245 5944810 5690793 5837710 5856070 5624027 5574249 5430492
4517 5430492 5339326 5538060 5431022 5056836 5291230 5158212 5123185 5247142 5207001 4895448
4507 4895448 4638303 4497196 4812573 4848506 4376002 4577856 4388093 4529659 4473762 4375720
4497 4375720 4463286 4374070 4397234 4097668 4473321 4455238 4284740 4304322 4381239 4388637 4208485
$$ packed form
4567A5380986j646851j071835m62385p70022q50507o43588k42733k42597l01620
4558I148848l33405l95880O766j75177j19487k17624j99146j19046o0006m01267
4548G134576k49446K02694l29927j304n6947K8278k21796M9648k00759o6996o4526
4537F223495n8277J44548Q3207M0752k13794j61348J20324J29268j65309k18970
4527E923896Q541J25354J00454k13435k54017J46917J8360k32043m9778j43757
4517E430492r1166J98734j07038l74186K34394j33018l5027J23957m0141l11553
4507D895448k57145j41107L15377L5933m72504K01854j89763J41566n5897r8042
4497D375720Q7566q9216K3164k99566L75653j8083j70498J9582P6917P398j80152
$$ plain form
4486 4208485 4357840 4174465 4351456 4310142 4177074 4004572 4139305 4036759 4182093 4288915
4476 4288915 4274184 4112164 4245227 4133472 4084915 3970797 3818449 3598229 3811534 4075431
4466 4075431 4119368 4141760 3928237 3929091 3747648 4075177 4115848 4065384 3887497 3929698 4205089
4455 4205089 4296496 3994969 4334884 4333179 4347252 4470539 4269195 4202311 4315967 4394684 4299565
4444 4299565 4151757 4126497 4148470 4496579 4613424 4463771 4307555 4414748 4550577 4654418
4434 4654418 4830838 4684928 4401899 4355709 4643137 4430149 4546164 4556955 4388530 4424800
4424 4424800 4644138 4936558 4955088 4978511 4829132 4945202 4755413 4576937 4602259 4744631
4414 4744631 4797304 4852103 4808794 4771001 4849473 4861544 5142557 5115163 5003686 4885127 5173254
$$ packed form
4486D208485J49355j83375J76991m1314j33068j72502J34733j02546J45334J06822
4476D288915j4731j62020J33063j11755m8557j14118j52348k20220K13305K63897
4466D075431M3937K2392k13523Q54j81443L27529M0671n0464j77887M2201K75391
4455D205089R1407l01527L39915j705J4073J23287k01344o6884J13656P8717r5119
4444D299565j47808k5260K1973L48109J16845j49653j56216J07193J35829J03841
4434D654418J76420j45910k83029m6190K87428k12988J16015J0791j68425L6270
4424D424800K19338K92420J8530K3423j49379J16070j89789j78476K5322J42372
4414D744631N2673N4799m3309l7793P8472J2071K81013k7394j11477j18559K88127
$$ plain form
4403 5173254 5144693 5148514 5315648 5360371 5496824 5470817 5406472 5377379 5507879 5555618 5614475
4392 5614475 5679660 5318660 5441805 5772329 5968858 5685062 5697888 5647401 5629203 5740354
4382 5740354 6145899 6053709 6178126 6223174 6283506 6231413 6296232 6409294 6416107 6429604 6581852
4371 6581852 6380656 6500399 7004329 6911540 6887134 6953241 7348626 7395879 7406431 7801941
4361 7801941 8107483 8106675 8306662 8543176 8446381 8506841 8632794 8686291 8835726 8921098 9199910
4350 9199910 9498487 9563765 9564832 9972136 9828366 10158099 10337588 10643855 11015211 11399886
4340 11399886 11409180 11635290 11915441 12481344 12907537 13255641 13436742 13727107 14187231 14701287
4330 14701287 15155174 15493861 16371303 16824327 17575705 18208781 18672816 19493233 20282510
$$ packed form
4403E173254k8561L821J67134M4723J36453k6007o4345k9093J30500M7739N8857
4392E614475O5185l61000J23145L30524J96529k83796J2826n0487j8198J11151
4382E740354M05545r2190J24417M5048O0332n2093O4819J13062O813J3497J52248
4371F581852k01196J19743N03930r2789k4406O6107L95385M7253J0552L95510
4361G801941L05542q08J99987K36514r6795O0460J25953N3497J49435Q5372K78812
4350I199910K98577O5278J067M07304j43770L29733J79489L06267L71356L84675
4340A1399886R294K26110K80151N65903M26193L48104J81101K90365M60124N14056
4330A4701287M53887L38687Q77442M53024P51378O33076M64035Q20417P89277
$$ plain form
4321 20282510 20987786 21715600 22656234 23464492 24393124 25454178 26277254 27226811 28462222
4312 28462222 29708214 30783166 31921885 32761337 33714899 35023664 35972632 37023007 38360741
4303 38360741 39835176 40786752 41784735 43158266 44399152 45459159 46447046 47392882 48286120
4294 48286120 49525484 50772692 51791786 52800434 53524883 54341378 55146535 55758272 56371960
4285 56371960 56802559 57236650 57655695 57661813 57493609 57787352 58110528 58133071 57896720 57742167
4275 57742167 57149624 56832342 56866699 56345283 55666764 55312275 54727186 54059222 53233842 52278946
4265 52278946 51755742 50897521 49845744 49268684 48694710 48016576 46845908 46131473 45487187
4256 45487187 44873291 44005517 42827963 42232956 41554006 41141496 40482009 39761505 39195584
$$ packed form
4321B0282510P05276P27814R40634Q08258R28632J061054Q23076R49557J235411
4312B8462222J245992J074952J138719Q39452R53562J308765R48968J050375J337734
4303C8360741J474435R51576R97983J373531J240886J060007R87887R45836Q93238
4294D8286120J239364J247208J019094J008648P24449Q16495Q05157O11737O13688
4285E6371960M30599M34091M19045O118j68204K93743L23176K2543k36351j54553
4275E7742167n92543l17282L4357n21416o78519l54489n85089o67964q25380r54896
4265E2278946n23204q58221j051777n77060n73974o78134j170668p14435o44286
4256D5487187o13896q67774j177554n95007o78950m12510o59487p20504n65921
$$ plain form
4247 39195584 38099109 37523948 37070202 36427793 35746905 35131834 34654903 34199071 33595673
4238 33595673 32835107 32550303 32268136 31807355 31505353 31120024 30791564 30617742 30654712 30331712
4228 30331712 29509558 28785903 28283748 28146587 27711065 27342839 26788178 26416682 26018392
4219 26018392 25777602 25521139 25043185 24659412 24800518 24635562 24308328 23996466 23709985
4210 23709985 23582349 23444655 23390218 23169303 23139716 22713986 22672597 22730728 22882471 22840134
4200 22840134 22425057 22383707 22599540 22621006 22695162 22395367 22368399 22398705 22673665 22644424
4190 22644424 22571881 22397170 22532820 22895119 22877877 23119761 23213415 23792042 23956533 24058728
4180 24058728 24424864 24585733 24749343 25309697 25288061 25628259 25851354 26030671 26202839 26285883
$$ packed form
4247C9195584j096475n75161m53746o42409o80888o15071m76931m55832o03398
4238C3595673p60566k84804k82167m60781l02002l85329l28460j73822L6970l23000
4228C0331712q22154p23655n02155j37161m35522l68226n54661l71496l98290
4219B6018392k40790k56463m77954l83773J41106j64956l27234l11862k86481
4210B3709985j27636j37694n4437k20915k9587m25730m1389N8131J51743m2337
4200B2840134m15077m1350K15833K1466P4156k99795k6968L0306K74960k9241
4190B2644424p2543j74711J35650L62299j7242K41884R3654N78627J64491J02195
4180B4058728L66136J60869J63610N60354k1636L40198K23095J79317J72168Q3044
$$ plain form
4170 26285883 26736601 27022654 27118157 27383897 27804087 27948398 27961155 28158260 28375186 28136105
4160 28136105 28332900 28408689 28405354 28706377 28714322 28885006 29265847 29534913 29694485 29900083
4150 29900083 30186425 30262560 30426810 30553369 31006500 31009771 31107875 31253184 31932100 32261802
4140 32261802 32658263 33205075 33764385 34572463 35389248 36354527 37174198 37932185 38737607
4131 38737607 40082718 41477631 42801515 44002263 45119775 46461218 47647533 49239997
4123 49239997 50518700 51547528 52628500 53983200 55339361 56253791 57587198 58527848
4115 58527848 59525813 60360587 61138505 61778726 62223795 62495890 62618510 63018471 63250997
4106 63250997 62955372 63190079 63574657 63710933 63528412 63332257 63007938 62668669 62531970
$$ packed form
4170B6285883M50718K86053R5503K65740M20190J44311J2757J97105K16926k39081
4160B8136105J96795P5789l335L01023P945J70684L80841K69066J59572K05598
4150B9900083K86342P6135J64250J26559M53131L271R8104J45309O78916L29702
4140C2261802L96461N46812N59310Q08078Q16785R65279Q19671P57987Q05422
4131C8737607J345111J394913J323884J200748J117512J341443J186315J592464
4123D9239997J278703J028828J080972J354700J356161R14430J333407R40650
4115E8527848R97965Q34774P77918O40221M45069K72095J22620L99961K32526
4106F3250997k95625K34707L84578J36276j82521j96155l24319l39269j36699
$$ plain form
4097 62531970 62423482 61961186 61962194 61817506 61771061 61650967 61621190 61958245 62262873 62665532
4087 62665532 62819984 62754684 63294740 63688405 64415703 65073751 65193086 65433552 65437783 65870424
4077 65870424 66060862 66068626 66293224 66768399 66657945 67136215 67375755 67344036 67839391 67975579
4067 67975579 67955884 67647353 67492835 67528685 67462828 67066226 66699481 66493400 66659822 66844516
4057 66844516 66935875 67064914 67326226 67841505 67945330 67384566 66523982 65804884 65467419 64628352
4047 64628352 63677646 63171108 62887872 62673036 62565886 62978965 63003203 63042453 63086519 63088751
4037 63088751 63672091 63991613 64063015 64334508 64721184 64855168 65211563 65121444 65232372 65536081
4027 65536081 65686302 65524572 65376093 65515451 65430673 65421446 65167471 65212776 65182844 64621964
$$ packed form
4097F2531970j08488m62296J008j44688m6445j20094k9777L37055L04628M02659
4087F2665532J54452o5300N40056L93665P27298O58048J19335K40466M231M32641
4077F5870424J90438P764K24598M75175j10454M78270K39540l1719M95355J36188
4067F7975579j9695l08531j54518L5850o5857l96602l66745k06081J66422J84694
4057F6844516R1359J29039K61312N15279J03825n60764q60584p19098l37465q39067
4047F4628352r50706n06538k83236k14836j07150M13079K4238L9250M4066K232
4037F3088751N83340L19522P1402K71493L86676J33984L56395r0119J10928L03709
4027F5536081J50221j61730j48479J39358q4778r227k53975M5305k9932n60880
$$ plain form
4017 64621964 64221145 64281473 64064350 63955403 63203612 62621406 62338169 61583203 60838981 60453103
4007 60453103 59934555 59213747 58567661 57728407 57092253 56742474 55873285 55055301 54247277
3998 54247277 53693808 53160484 52386785 51476441 50689007 50218301 49669596 48781012 48057921
3989 48057921 47610014 47018822 46639863 45904027 45137099 44618586 44185957 43673316 43397858
3980 43397858 43140175 42875709 42649987 42106193 41988503 41912689 41648476 41271706 40718254 40331440
3970 40331440 40125395 39992776 39854470 39498665 39047084 38767868 38773302 38648253 38565007 38481000
3960 38481000 38789889 39445704 40234257 41297946 42680839 43576750 43077913 42248914 40974334
3951 40974334 39348161 38080740 36893653 36007961 35196418 34802490 34540345 34284553 34066372
$$ packed form
4017F4621964m00819O0328k17123j08947p51791n82206k83237p54966p44222l85878
4007F0453103n18548p20808o46086q39254o36154l49779q69189q17984q08024
3998E4247277n53469n33324p73699r10344p87434m70706n48705q88584p23091
3989D8057921m47907n91192l78959p35836p66928n18513m32629n12641k75458
3980D3397858k57683k64466k25722n43794j17690p5814k64213l76770n53452l86814
3970D0331440k06045j32619j38306l55805m51581k79216N434j25049q3246q4007
3960C8481000L08889O55815P88553J063689J382893Q95911m98837q28999j274580
3951D0974334j626173j267421j187087q85692q11543l93928k62145k55792k18181
$$ plain form
3942 34066372 34191725 34319143 33974714 33781184 33523186 33702233 33793950 33846193 34120239 34051518
3932 34051518 34245372 34827758 35532908 36423511 37058495 38124696 39846510 41118443 42213582
3923 42213582 42422305 41727122 40594283 39380887 38295435 37235664 36400696 35705509 35436703
3914 35436703 35106436 34898102 34598520 34392043 34127037 34408587 34451109 34468932 34943224 35005353
3904 35005353 35064217 35083268 35415316 35464285 35619402 36288845 36475516 36877967 37202018 37632997
3894 37632997 38208453 38442493 39234052 40086836 40782697 41541460 42260530 43327431 44237658
3885 44237658 44940160 45974632 47206840 48425355 49453750 50865581 52225521 53542020
3877 53542020 55200867 56873738 58491673 60265383 62163811 64084530 65932726 67942234
$$ packed form
3942C4066372J25353J27418l44429j93530k57998J79047R1717N2243K74046o8721
3932C4051518J93854N82386P05150Q90603O34984J066201J721814J271933J095139
3923D2213582K08723o95183j132839j213396j085452j059771q34968o95187k68806
3914C5436703l30267k08334k99582k06477k65006K81550M2522J7823M74292O2129
3904C5005353N8864J9051L32048M8969J55117O69443J86671M02451L24051M30979
3894C7632997N75456K34040P91559Q52784O95861P58763P19070J066901R10227
3885D4237658P02502J034472J232208J218515J028395J411831J359940J316499
3877E3542020J658847J672871J617935J773710J898428J920719J848196K009508
$$ plain form
3869 67942234 70334063 72663368 75336665 78141421 80909219 84016734 87031363 90122661
3861 90122661 93411749 96630445 99873532 102328168 104862792 107805715 110434404 112872787
3853 112872787 115591350 118064328 120332019 123132887 125627962 127610304 129527920 130894158
3845 130894158 131576609 132087901 132144486 131827438 131126671 129913499 128812418 127458118 126349056
3836 126349056 124905307 123302690 121464676 119385118 117468804 115138093 112360310 109473806
3828 109473806 106427569 103265873 100116921 97174963 94047083 91225614 88725626 86224832
3820 86224832 83515070 81133552 78742547 76758858 74723344 72519276 70291224 68317797
3812 68317797 66482488 64407808 63017256 61903939 60501761 58918995 57724546 56606668
$$ packed form
3869F7942234K391829K329305K673297K804756K767798L107515L014629L091298
3861I0122661L289088L218696L243087K454636K534624K942923K628689K438383
3853A12872787K718563K472978K267691K800868K495075J982342J917616J366238
3845A30894158O82451N11292N6585l17048p00767j213172j101081j354300j109062
3836A26349056j443749j602617j838014k079558j916314k330711k777783k886504
3828A09473806l046237l161696l148952k941958l127880k821469k499988k500794
3820H6224832k709762k381518k391005j983689k035514k204068k228052j973427
3812F8317797j835309k074680j390552j113317j402178j582766j194449j117878
$$ plain form
3804 56606668 55411158 54042524 52885136 52000930 51192475 49983341 48835004 47908231 47380685
3795 47380685 46414919 45578348 44821737 44109028 43375980 42588439 41611018 40855743 40219368
3786 40219368 39733261 38962993 38192760 37520373 36541918 35890606 35232500 34953757 34259662
3777 34259662 33496221 32843629 32023514 31560847 30849680 30173722 29659715 29262922 28774632
3768 28774632 27979743 27595497 27758635 27344472 26970141 26277107 25836653 25674210 25268371
3759 25268371 24812641 24135318 23546871 23447859 23221055 23037123 22450719 22146745 21938875 21632820
3749 21632820 21378350 21099805 20547367 19975726 19755126 19497169 19245874 19040206 18787157
3740 18787157 18265991 18380209 17987876 17601190 17378279 17348254 16981812 16634593 16507782 16222971
$$ packed form
3804E6606668j195510j368634j157388q84206q08455j209134j148337r26773n27546
3795D7380685r65766q36571p56611p12709p33048p87541r77421p55275o36375
3786D0219368m86107p70268p70233o72387r78455o51312o58106k78743o94095
3777C4259662p63441o52592q20115m62667p11167o75958n14007l96793m88290
3768B8774632p94889l84246J63138m14163l74331o93034m40454j62443m05839
3759B5268371m55730o77323n88447r9012k26804j83932n86404l03974k07870l06055
3749B1632820k54470k78545n52438n71641k20600k57957k51295k05668k53049
3740A8787157n21166J14218l92333l86686k22911l0025l66442l47219j26811k84811
$$ plain form
3730 16222971 15985544 15625137 15579835 15453292 15401741 15259085 14963707 14311737 14070779 14000872
3720 14000872 13725626 13729339 13373900 13281565 13186724 12626988 12737873 12841042 12796305 12294551
3710 12294551 12320046 12204118 11871177 11907668 11543073 11341632 11417313 11756354 11544904 11123702
3700 11123702 10957396 11099914 11105734 10725517 10979426 10873591 10751744 10871655 10653788 10815792
3690 10815792 10970890 10799898 10384400 10546940 10455342 10166138 10190840 10074387 9954627 10134743
3680 10134743 10040285 10104390 10041326 10288214 10053315 9913467 10219499 10284085 9864206 9653259
3670 9653259 9762765 9877113 9674328 9587498 9458316 9498000 9313550 9289556 9214465 8947445
3660 8947445 9135240 9527083 9402953 9476105 9274929 9150628 9304554 9052066 9043973 8843012
$$ packed form
3730A6222971k37427l60407m5302j26543n1551j42656k95378o51970k40958o9907
3720A4000872k75246L713l55439r2335r4841n59736J10885J03169m4737n01754
3710A2294551K5495j15928l32941L6491l64595k01441P5681L39041k11450m21202
3700A1123702j66306J42518N820l80217K53909j05835j21847J19911k17867J62004
3690A0815792J55098j70992m15498J62540r1598k89204K4702j16453j19760J80116
3680A0134743r4458O4105o3064K46888k34899j39848L06032O4586m19879k10947
3670I653259J09506J14348k02785q6830j29182L9684j84450k3994p5091k67020
3660H947445J87795L91843j24130P3152k01176j24301J53926k52488q093k00961
$$ plain form
3650 8843012 8495576 8474049 8764739 8721465 8358058 8347763 8623319 8348786 8082393 8007671
3640 8007671 8053208 8168224 8013266 7882721 8010972 7695360 7713987 7581842 7402241 7683060
3630 7683060 7673822 7434260 7252486 7381290 7191329 7084347 7275925 7056403 7080493 6868544
3620 6868544 6982857 7170864 7080857 7139903 7001603 6650349 6578352 6707316 6728641 6715232
3610 6715232 6404696 6453148 6462804 6262862 6259889 6303056 6051455 6199548 6365256 6297052 6317191
3599 6317191 5983113 6216488 6294496 6057204 6279853 6390378 6041472 5973113 6037914 6028965
3589 6028965 5932998 5996070 5786125 5809726 6193881 6148874 6010927 6022460 6084291 6262697 6242134
3578 6242134 5881032 5970917 5908339 5792183 5711434 5648350 5795161 6170731 6326223 6044119
$$ packed form
3650H843012l47436k1527K90690m3274l63407j0295K75556k74533k66393p4722
3640H007671M5537J15016j54958j30545J28251l15612J8627j32145j79601K80819
3630G683060r238k39562j81774J28804j89961j06982J91578k19522K4090k11949
3620F868544J14313J88007r0007N9046j38300l51254p1997J28964K1325j3409
3610F715232l10536M8452R656j99942k973M3167k51601J48093J65708o8204K0139
3599F317191l34078K33375P8008k37292K22649J10525l48906o8359O4801q949
3589F028965r5967O3072k09945K3601L84155m5007j37947J1533O1831J78406k0563
3578F242134l61102Q9885o2578j16156q0749o3084J46811L75570J55492k82104
$$ plain form
3568 6044119 5967654 5979255 6232972 6042184 6017012 6004303 5948529 5951561 6054979 6178134 6077440
3557 6077440 5750123 5974441 6081859 5973057 5844208 5890521 5885362 6002954 6156288 6273802
3547 6273802 6159922 5958412 6066023 5973166 5972401 6180491 6284802 6373104 6215432 6281981 6259584
3536 6259584 6197884 6296502 6089753 6189635 6277501 6570006 6385476 6361059 6526344 6521591 6556656
3525 6556656 6842568 6867053 6472358 6273415 6499637 6786875 6900039 6841603 6660484 6788401
3515 6788401 7132713 7178836 7195455 6873051 6761750 6979510 7315547 7652178 7464182 7609759
3505 7609759 7651911 7707276 8073167 8185843 8270738 8495003 8632409 8937742 9476196 9617383
3495 9617383 9851802 10142239 10473506 10760237 11228535 11352216 11673581 12492983 12731977 12927529
$$ packed form
3568F044119p6465J1601K53717j90788k5172j2709n5774L032J03418J23155j00694
3557F077440l27317K24318J07418j08802j28849M6313n159J17592J53334J17514
3547F273802j13880k01510J07611r2857p65K08090J04311Q8302j57672O6549k2397
3536F259584o1700R8618k06749R9882Q7866K92505j84530k4417J65285m753L5065
3525F556656K85912K4485l94695j98943K26222K87238J13164n8436j81119J27917
3515F788401L44312M6123J6619l22404j11301K17760L36037L36631j87996J45577
3505G609759M2152N5365L65891J12676Q4895K24265J37406L05333N38454J41187
3495I617383K34419K90437L31267K86731M68298J23681L21365Q19402K38994J95552
$$ plain form
3485 12927529 12370175 12042918 11788824 11908849 11989837 11972047 11926587 11866803 12000996 11959706
3475 11959706 12151720 12388452 12680549 12708056 12608488 12797829 13346412 13477770 14005023 14281594
3465 14281594 14491655 14865977 15575327 16352703 17208075 17761079 18564882 19358889 20141757
3456 20141757 21335281 21750354 21990607 21995347 21597979 21244800 20667589 20339213 19833058 19255900
3446 19255900 18741976 18090472 17694364 17106255 16597546 16193694 16159489 16036131 16068766 15905710
3436 15905710 15518337 15876392 16001997 15989418 16210563 16355517 16879194 17103401 16923003 16901341
3426 16901341 17218698 17380153 17681655 18170950 18337129 18361043 18221249 18100906 18007285 17940909
3416 17940909 17986240 18101433 18373369 18386738 18508508 19040410 19491640 20095060 20490880 20963137
$$ packed form
3485A2927529n57354l27257k54094J20025Q0988j7790m5460n9784J34193m1290
3475A1959706J92014K36732K92097K7507r9568J89341N48583J31358N27253K76571
3465A4281594K10061L74322P09350P77376Q55372N53004Q03803P94007P82868
3456B0141757J193524M15073K40253M740l97368l53179n77211l28376n06155n77158
3446A9255900n13924o51504l96108n88109n08709m03852l4205j23358L2635j63056
3436A5905710l87373L58055J25605j2579K21145J44954N23677K24207j80398k1662
3426A6901341L17357J61455L01502M89295J66179K3914j39794j20343r3621o6376
3416A7940909M5331J15193K71936J3369J21770N31902M51230O03420L95820M72257
$$ plain form
3406 20963137 21785925 22696626 23378958 24499600 25187469 25646555 26077822 27175384 28183132
3397 28183132 28894239 30406367 31843680 33370385 35097315 37123393 39327469 41826579
3389 41826579 43844159 45352501 46944713 48107667 48467380 47927784 47137675 46135532 44852216
3380 44852216 43348047 42162078 41054039 40309462 39629150 39616538 40064732 40735234 41447268
3371 41447268 41780836 41938378 42188064 42353302 43059230 44105449 45156772 47033962 49037200
3362 49037200 51972855 55603007 59736252 64429862 69307703 73867428 78000188 80526699
3354 80526699 82024298 81765523 79584183 75971086 72055073 67494161 62888416 58693523
3346 58693523 55165321 52537739 50104617 48002992 46366927 45247504 43960873 42435964
$$ packed form
3406B0963137Q22788R10701O82332J120642O87869M59086M31267J097562J007748
3397B8183132P11107J512128J437313J526705J726930K026078K204076K499110
3389D1826579K017580J508342J592212J162954L59713n39596p90109j002143j283316
3380D4852216j504169j185969j108039p44577o80312j2612M48194O70502P12034
3371D1447268L33568J57542K49686J65238P05928J046219J051323J877190K003238
3362D9037200K935655L630152M133245M693610M877841M559725M132760K526511
3354H0526699J497599k58775k181340l613097l916013m560912m605745m194893
3346E8693523l528202k627582k433122k101625j636065j119423j286631j524909
$$ plain form
3338 42435964 41322710 40088335 39401972 38958458 38360412 37958433 38187961 38568374 39231766
3329 39231766 40553501 41824281 43125327 44229091 45462289 46735892 47402339 47568042
3321 47568042 47145121 46163179 44707442 42526481 40173300 38036577 36116035 34330956
3313 34330956 32900072 31492488 30364152 29514655 28517133 27499258 26437491 25124013
3305 25124013 23872594 22726577 21988600 20865475 19762671 19346219 18775959 18553760 18242216
3296 18242216 17899115 17585304 17102891 16744788 16568241 16199398 15759924 15370883 15045204
3287 15045204 14465564 14444269 14208057 14060029 14070523 13908591 13790313 13788450 14030298 13763437
3277 13763437 13553466 13550126 13461157 13135806 12840550 12467703 12361931 12192120 12098516 11785587
$$ packed form
3338D2435964j113254j234375o86363m43514n98046m01979K29528L80413O63392
3329C9231766J321735J270780J301046J103764J233198J273603O66447J65703
3321D7568042m22921r81942j455737k180961k353181k136723j920542j785079
3313C4330956j430884j407584j128336q49497r97522j017875j061767j313478
3305B5124013j251419j146017p37977j123125j102804m16452n70260k22199l11544
3296A8242216l43101l13811m82413l58103j76547l68843m39474l89041l25679
3287A5045204n79640k1295k36212j48028J0494j61932j18278j863K41848k66861
3277A3763437k09971l340q8969l25351k95256l72847j05772j69811r3604l12929
$$ plain form
3267 11785587 11645152 11731685 11773728 11771014 11648817 11201865 10928922 10595963 10319711 10256370
3257 10256370 10159666 9637983 9319767 9330255 9139722 8992344 8602791 8652921 8760086 8851301
3247 8851301 8607171 8389736 8399290 8058814 8125610 8336467 8444225 8624082 8472297 8661730
3237 8661730 8991895 8824941 8937212 9137628 9589951 9641586 9483112 9515380 9224331 8672627
3227 8672627 8389203 8332499 8355302 8280645 8145311 8094380 7906759 7303224 7189676 6980742
3217 6980742 6709794 6682979 6969740 6898041 6428912 6279102 6200443 6309462 6368595 6464792
3207 6464792 6645215 6551640 6716437 6611866 6719509 6783858 7128480 6976374 6877777 6866128
3197 6866128 6786900 6712483 6568869 6813089 6453564 6378968 6209771 5898467 5723443 5803773
$$ packed form
3267A1785587j40435Q6533M2043k714j22197m46952k72943l32959k76252o3341
3257A0256370r6704n21683l18216J0488j90533j47378l89553N0130J07165R1215
3247H851301k44130k17435R554l40476O6796K10857J07758J79857j51785J89433
3237H661730L30165j66954J12271K00416M52323N1635j58474L2268k91049n51704
3227H672627k83424n6704K2803p4657j35334n0931j87621o03535j13548k08934
3217F980742k70948k6815K86761p1699m69129j49810p8659J09019N9133R6197
3207F464792J80423r3575J64797j04571J07643O4349L44622j52106r8597j1649
3197F866128p9228p4417j43614K44220l59525p4596j69197l11304j75024Q0330
$$ plain form
3187 5803773 5930570 5676163 5767879 5963930 5779799 5831955 5529939 5352275 5221956 5362877
3177 5362877 5320898 4960611 5074447 5378454 5280654 5101515 5271735 5389703 5354052 5301328
3167 5301328 5206067 4995975 5200635 5458232 5273383 5093582 5209650 4975614 4907862 4714857
3157 4714857 4369303 4268618 4215191 4347752 4231769 4365957 4105229 4058448 3904602 3884897
3147 3884897 4033139 4090341 4008596 4058628 3896963 3910195 3896282 3722757 3736195 3841127 3904235
3136 3904235 3864240 3959854 3934165 3885505 3931441 3921532 3685394 3429853 3633910 3608258 3397536
3125 3397536 3487330 3651248 3662402 3481322 3410568 3626295 3342201 3204785 2927477 2845741
3115 2845741 2997571 3093052 3057340 3097846 2887214 2701981 2622432 2408724 2710293 2786939
$$ packed form
3187E803773J26797k54407R1716J96051j84131N2156l02016j77664j30319J40921
3177E362877m1979l60287J13836L04007r7800j79139J70220J17968l5651n2724
3167E301328r5261k10092K04660K57597j84849j79801J16068k34036o7752j93005
3157D714857l45554j00685n3427J32561j15983J34188k60728m6781j53846j9705
3147C884897J48242N7202q1745N0032j61665J3232j3913j73525J3438J04932O3108
3136C904235l9995R5614k5689m8660M5936r909k36138k55541K04057k5652k10722
3125C397536Q9794J63918J1154j81080p0754K15727k84094j37416k77308q1736
3115B845741J51830R5481l5712M0506k10632j85233p9549k13708L01569P6646
$$ plain form
3105 2786939 2555302 2658471 2619167 2492685 2567583 2546073 2640040 2646007 2747758 2572874 2569858
3094 2569858 2758283 2607493 2468068 2292147 2170654 2110710 2365852 2543064 2568649 2554662
3084 2554662 2540628 2451014 2420923 2612530 2289148 2393483 2331180 2415969 2205287 1996442
3074 1996442 1984322 2129040 2159725 2046540 2037326 1929058 1974291 2016742 2107466 1901953 1803218
3063 1803218 1960275 1891311 1771239 1784716 1815685 1806765 1605514 1529630 1473546 1465805 1531310
3052 1531310 1621738 1800261 1585353 1361042 1236130 1181701 1235187 1152087 1058176 1198611
3042 1198611 1200940 1065690 1124586 982481 912502 1104848 1054056 1051353 1129460 1253522 1519252
3031 1519252 1380978 983764 1223517 1119195 1099243 1536896 1648245 1454686 1555603 1320461
$$ packed form
3105B786939k31637J03169l9304j26482P4898k1510R3967N967J01751j74884l016
3094B569858J88425j50790j39425j75921j21493n9944K55142J77212K5585j3987
3084B554662j4034q9614l0091J91607l23382J04335o2303Q4789k10682k08845
3074A996442j2120J44718L0685j13185r214j08268M5233M2451R0724k05513r8735
3063A803218J57057o8964j20072J3477L0969q920k01251p5884n6084p741O5505
3052A531310R0428J78523k14908k24311j24912n4429N3486q3100r3911J40435
3042A198611K329j35250N8896j42105o9979J92346n0792k703P8107J24062K65730
3031A519252j38274l97214K39753j04322j9952M37653J11349j93559J00917k35142
$$ plain form
3021 1320461 1202131 1214237 1200400 1203557 1291139 1458721 1318867 998454 1147552 1178156 1022632
3010 1022632 997841 937713 703040 522714 807653 889647 1077487 1067733 1065288 1096313 995599
2999 995599 1080266 835451 853155 932454 969854 936228 907681 775075 711455 732916 604753
2988 604753 782189 814431 870397 751150 929156 905991 783770 797632 722019 539322 392093
2977 392093 520150 275350 529175 744916 519551 475404 701086 785688 886240 709466
2967 709466 779252 925767 739694 643754 672443 1028107 849958 671142 198298 392087
2957 392087 628445 483307 816724 890885 469504 518795 483779 537429 571519 486713 554939
2946 554939 730992 737318 778248 776536 730105 761268 897383 709679 369790 294642 306582
$$ packed form
3021A320461j18330J2106j3837L157Q7582J67582j39854l20413J49098L0604j55524
3010A022632k4791o0128k34673j80326K84939Q1994J87840r754k445L1025j00714
2999I95599Q4667k44815J7704P9299L7400l3626k8547j32606o3620K1461j28163
2988F04753J77436L2242N5966j19247J78006k3165j22221J3862p5613j82697j47229
2977C92093J28057k44800K53825K15741k25365m4147K25682Q4602J00552j76774
2967G09466O9786J46515j86073r5940K8689L55664j78149j78816m72844J93789
2957C92087K36358j45138L33417P4161m21381M9291l5016N3650L4090q4806O8226
2946E54939J76053O326M0930j712m6431L1163J36115j87704l39889p5148J1940
$$ plain form
2935 306582 391764 43277 21717 201080 380617 433382 601139 819054 489709 313512
2925 313512 656000 822145 606171 485129 675052 672997 466027 496809 476929 525248 453827
2914 453827 635447 789830 685854 732967 794893 593936 592173 714268 304108 289976 543184
2903 543184 486700 624337 697768 923910 725242 446166 336036 386906 440935 198461
2893 198461 255438 190388 322070 537719 580334 622779 446794 293624 380589 195670 377582
2882 377582 543103 195286 287983 375151 411610 215321 398960 454687 332207 215723
2872 215723 34009 447304 506751 287138 419836 602101 432016 262041 239721 441735
2862 441735 592507 514017 420978 217303 176284 362947 221975 379109 496820 327303
$$ packed form
2935C06582Q5182l48487k1560J79363J79537N2765J67757K17915l29345j76197
2925C13512L42488J66145k15974j21042J89923k055k06970L0782j9880M8319p1421
2914D53827J81620J54383j03976M7113O1926k00957j763J22095m10160j4132K53208
2903E43184n6484J37637P3431K26142j98668k79076j10130N0870N4029k42474
2893A98461N6977o5050J31682K15649M2615M2445j75985j53170Q6965j84919J81912
2882C77582J65521l47817R2697Q7168L6459j96289J83639N5727j22480j16484
2872B15723j81714M13295N9447k19613J32698J82265j70085j69975k2320K02014
2862D41735J50772p8490r3039k03675m1019J86663j40972J57134J17711j69517
$$ plain form
2852 327303 187031 301173 448676 305112 419701 461542 265134 335264 578650 547484
2842 547484 481899 303291 102015 352829 360796 579793 405550 67382 374614 494473
2832 494473 325323 247598 392276 455581 278595 221730 291214 478324 238053 185864 373554
2821 373554 430021 382777 310606 405507 662074 623016 545705 611432 535617 472560 480607 721533
2809 721533 760694 387246 282818 548087 501850 113330 368410 434257 539541 468139
2799 468139 322114 507290 547817 480924 307336 252044 189510 410557 455338 349029 659596
2788 659596 518404 383017 557032 513568 387813 329199 539420 584022 509079 191114
2778 191114 129575 415208 457027 -67680 -9524 162556 157783 264629 602606 583395 516576
$$ packed form
2852C27303j40272J14142J47503j43564J14589M1841j96408P0130K43386l1166
2842E47484o5585j78608k01276K50814P967K18997j74243l38168L07232J19859
2832D94473j69150p7725J44678O3305j76986n6865O9484J87110k40271n2189J87690
2821C73554N6467m7244p2171R4901K56567l9058p7311O5727p5815o3057Q047K40926
2809G21533L9161l73448j04428K65269m6237l88520K55080O5847J05284p1402
2799D68139j46025J85176M0527o6893j73588n5292o2534K21047M4781j06309L10567
2788F59596j41192j35387J74015m3464j25755n8614K10221M4602p4943l17965
2778A91114o1539K85633M1819n24707N8156J72080m773J06846L37977j9211o6819
$$ plain form
2767 516576 316478 260117 311911 272885 371759 446066 352367 71462 38624 601382 550841
2756 550841 315876 357090 263823 413519 278017 338450 416006 895103 828711 616746 426331
2745 426331 456527 410961 323843 529835 406426 336358 637011 713680 688292 472063 483679
2734 483679 532781 569187 794088 517425 444274 417959 580921 394076 341294 274429 178107
2723 178107 352932 464339 332818 90509 345769 532067 251953 201405 320034 329504
2713 329504 302088 167438 217307 273566 463064 416345 350883 328671 310728 126558 277261
2702 277261 463744 323998 265353 154148 188194 136990 138309 105011 240931 308671 292532
2691 292532 86031 83822 -34264 61883 234883 226622 -12677 -228730 52192 296122 546355
$$ packed form
2767E16576k00098n6361N1794l9026R8874P4307r3699k80905l2838N62758n0541
2756E50841k34965M1214r3267J49696j35502O0433P7556M79097o6392k11965j90415
2745D26331L0196m5566q7118K05992j23409p0068L00653P6669k5388k16229J1616
2734D83679M9102L6406K24901k76663p3151k6315J62962j86845n2782o6865r6322
2723A78107J74825J11407j31521k42309K55260J86298k80114n0548J18629R470
2713C29504k7416j34650M9869N6259J89498m6719o5462k2212j7943j84170J50703
2702B77261J86483j39746n8645j11205L4046n1204J319l3298J35920O7740j6139
2691B92532k06501k209j18086R6147J73000q261k39299k16053K80922K43930K50233
$$ plain form
2680 546355 451227 362868 475492 273142 305689 75168 20220 338472 481219 75109
2670 75109 119756 35799 65309 54939 -30170 42786 252887 177352 -220490 -786 357617
2659 357617 269083 -1304 179826 -23226 -65011 87168 270739 -3902 -27384 -121394
2649 -121394 -185962 -308589 -34957 57141 183807 458313 149117 161461 182538 243661 103237
2638 103237 293242 233626 434955 593375 552463 483083 327400 362253 388841 716372 450857
2627 450857 569885 416390 617490 650043 319530 368447 457220 534788 55553 -20853 160310
2616 160310 229358 354651 508300 310148 17388 179430 350164 520098 458176 421864
2606 421864 466891 675241 780499 712385 645374 724413 680556 772953 807410 783649 884122
$$ packed form
2680E46355r5128q8359J12624k02350L2547k30521n4948L18252J42747m06110
2670G5109M4647q3957K9510j0370q5109P2956K10101p5535l97842K19704L58403
2659C57617q8534k70387J81130k03052m1785J52179J83571k74641k3482r4010
2649a21394o4568j22627K73632R2098J26666K74506l09196J2344K1077O1123j40424
2638A03237J90005n9616K01329J58420m0912o9380j55683L4853K6588L27531k65515
2627D50857J19028j53495K01100L2553l30513M8917Q8773P7568m79235p6406J81163
2616A60310O9048J25293J53649j98152k92760J62042J70734J69934o1922l6312
2606D21864M5027K08350J05258o8114o7011P9039m3857R2397L4457k3761J00473
$$ plain form
2595 884122 1003224 1509881 1598489 1849478 1960009 1953210 1775038 1560796 1534199 1384016
2585 1384016 1121760 810620 506047 436065 589125 747482 889074 875930 800847 670837
2575 670837 643731 395866 356851 331417 435091 450524 -6403 -34998 239939 221931 396622
2564 396622 394923 269425 511821 352015 288446 537646 596502 624781 598463 425916 347385
2553 347385 434995 615129 536256 348962 266349 272661 303167 245313 108960 289351 381641
2542 381641 147208 -87545 219044 519489 474688 292073 437691 680705 592169 318838
2532 318838 -23698 -126138 42812 285212 397498 359203 264036 210238 -62922 -44991
2522 -44991 187421 109687 188587 102453 -120761 481139 660703 594228 622589 288794 490196
$$ packed form
2595H84122J19102N06657Q8608K50989J10531o799j78172k14242k6597j50183
2585A384016k62256l11140l04573o9982J53060J58357J41592j3144p5083j30010
2575F70837k7106k47865l9015k5434J03674J5433m56927k8595K74937j8008J74691
2564C96622j699j25498K42396j59806o3569K49200N8856K8279k6318j72547p8531
2553C47385Q7610J80134p8873j87294q2613O312L0506n7854j36353J80391R2290
2542C81641k34433k34753L06589L00445m4801j82615J45618K43014q8536k73331
2532C18838l42536j02440J68950K42400J12286l8295r5167n3798k73160J7931
2522d4991K32412p7734P8900q6134k23214O01900J79564o6475K8361l33795K01402
$$ plain form
2511 490196 513307 866224 972621 558742 445822 402816 585742 423907 523711 553413
2501 553413 608694 523609 424722 465282 460620 406142 649372 625176 580497 442224 377982
2490 377982 337844 143745 519721 762930 694347 508509 688583 754240 405821 378519
2480 378519 751182 645717 476742 523515 547915 847886 962652 985040 970819 926519 988981
2469 988981 910046 957593 855491 864545 555798 566779 747222 775378 704725 688918 513383
2458 513383 759388 916939 1028240 935223 969118 1103863 1043953 1031788 928211 1137131
2448 1137131 1113968 1324377 1108075 1072526 1176973 1250514 1400112 1371651 1330585 1148523
2438 1148523 1205246 1450204 1188966 1239996 1449728 1526869 1466254 1605556 1394756 1259965
$$ packed form
2511D90196K3111L52917J06397m13879j12920m3006J82926j61835R9804K9702
2501E53413N5281q5085r8887M0560m662n4478K43230k4196m4679j38273o4242
2490C77982m0138j94099L75976K43209o8583j85838J80074O5657l48419k7302
2480C78519L72663j05465j68975M6773K4400K99971J14766K2388j4221m4300O2462
2469I88981p8935M7547j02102R054l08747J0981J80443K8156p0653j5807j75535
2458E13383K46005J57551J11301r3017L3895J34745n9910j2165j03577K08920
2448A137131k3163K10409k16302l5549J04447P3541J49598k8461m1066j82062
2438A148523N6723K44958k61238N1030K09732P7141o0615J39302k10800j34791
$$ plain form
2428 1259965 1352454 1248160 1290064 1256596 1451300 1283648 1309914 1276860 1356736 1660237 1809893
2417 1809893 1823120 1668454 1763861 1675141 1553547 1470056 1551450 1716305 1503172 1718811
2407 1718811 1827659 1973372 1855586 1711258 1930082 2335933 2191877 2247653 2639057 2723474
2397 2723474 2219542 2035553 2231842 2492052 2784944 2912967 2764343 2766437 2685293 2229981
2387 2229981 2292341 2332812 2555420 2936040 3205763 3124947 3011703 2919432 2956262 2887940 3067613
2376 3067613 3400763 3819001 4147646 4233892 4656772 4784200 4899802 5084798 5285168 5673743
2366 5673743 5860875 6077197 6215299 6070121 6190493 6604110 6707770 7044740 7274314 7682071
2356 7682071 8021725 8167419 8983072 9628481 10199044 10903062 11165661 12027895 12882420 13761910
$$ packed form
2428A259965R2489j04294M1904l3468J94704j67652K6266l3054P9876L03501J49656
2417A809893J3227j54666R5407q8720j21594q3491Q1394J64855k13133K15639
2407A718811J08848J45713j17786j44328K18824M05851j44056N5776L91404Q4417
2397B723474n03932j83989J96289K60210K92892J28023j48624K094q1144m55312
2387B229981O2360M0471K22608L80620K69723q0816j13244r2271L6830o8322J79673
2376C067613L33150M18238L28645Q6246M22880J27428J15602J84996K00370L88575
2366E673743J87132K16322J38102j45178J20372M13617J03660L36970K29574M07757
2356G682071L39654J45694Q15653O45409N70563P04018K62599Q62234Q54525Q79490
$$ plain form
2346 13761910 14793026 15871098 17488236 19499768 21726937 24284655 27376438 29574758
2338 29574758 31053011 32481587 34306304 37182242 41149589 47258221 55585522 67211778
2330 67211778 84235955 111667323 149378232 195970492 245481046 294346856 315961205
2323 315961205 301686678 268127252 223865230 183391751 148451917 118640905 95575616
2316 95575616 78278542 65329307 56481031 49848230 45011344 41327742 38609986 35857872
2308 35857872 32777567 29439103 26336973 23530265 21144804 18914482 17299717 15900215
2300 15900215 14903124 13908753 12854939 12209388 11389332 10706023 10521340 10178955 9629598
2291 9629598 9103049 8713538 8171636 7712741 7276771 7087132 6873979 6551236 6227670 6015252
$$ packed form
2346A3761910J031116J078072J617138K011532K227169K557718L091783K198320
2338B9574758J478253J428576J824717K875938L967347O108632Q327301J1626256
2330F7211778J7024177K7431368L7710909M6592260M9510554M8865810K1614349
2323C15961205j4274527l3559426m4262022m0473479l4939834k9811012k3065289
2316I5575616j7297074j2949235q848276o632801m836886l683602k717756k752114
2308C5857872l080305l338464l102130k806708k385461k230322j614765j399502
2300A5900215r97091r94371j053814o45551q20056o83309j84683l42385n49357
2291I629598n26549l89511n41902m58895m35970j89639k13153l22743l23566k12418
$$ plain form
2281 6015252 5945074 5969843 6173465 6370287 5909167 5840842 5748946 5822763 5618516 5654897 5626179
2270 5626179 5390539 5267006 4889331 4428135 4557917 4518900 4329931 4319634 3982502 3953983
2260 3953983 3856123 3907265 3739337 3452333 3239832 3167135 2881420 2693685 2688920 2807581
2250 2807581 2701630 2289179 2256534 2441715 2514046 2233923 1999378 1906236 1957197 2212265
2240 2212265 2412267 2250241 1996996 1970348 2120908 1646129 1512385 1856210 1569958 1621952
2230 1621952 1907252 1985771 2060989 2058014 2058387 1903434 1773699 1989577 2072746 1859379 1563747
2219 1563747 1420036 1036074 1194926 978574 1000959 1158063 1203155 1438796 1382265 1230492
2209 1230492 1255644 1252813 1152007 861527 1035974 1139570 918020 707970 910666 909014
$$ packed form
2281F015252p0178K4769K03622J96822m61120o8325r1896P3817k04247L6381k8718
2270E626179k35640j23533l77675m61196J29782l9017j88969j0297l37132k8519
2260C953983r7860N1142j67928k87004k12501p2697k85715j87735m765J18661
2250B807581j05951m12451l2645J85181P2331k80123k34545r3142N0961K55068
2240B212265K00002j62026k53245k6648J50560m74779j33744L43825k86252N1994
2230A621952K85300P8519P5218k975L73j54953j29735K15878Q3169k13367k95632
2219A563747j43711l83962J58852k16352K2385J57104M5092K35641n6531j51773
2209A230492K5152k831j00806k90480J74447J03596k21550k10050K02696j652
$$ plain form
2199 909014 597429 252719 122313 40213 -28702 391000 469832 386957 575100 459583
2189 459583 359524 606021 590368 563748 598826 640968 775846 336192 258834 235592 160663
2178 160663 373764 707825 551659 220245 369643 540600 656278 712981 694618 678771
2168 678771 745056 1042738 994273 751587 607766 433868 329057 498618 599141 588227
2158 588227 808554 672281 517357 264375 535958 818299 622910 477996 681613 675690
2148 675690 422045 390831 305783 411606 215664 107551 -18184 -15086 164605 253168 378777
2137 378777 483596 455137 452203 556176 231805 189435 275840 376446 376119 373196 517800
2126 517800 673184 526741 275987 426126 526355 555293 504138 686142 879310 386174
$$ packed form
2199I09014l11585l44710j30406q2100o8915M19702P8832q2875J88143j15517
2189D59583j00059K46497j5653k6620L5078M2142J34878m39654p7358k3242p4929
2178A60663K13101L34061j56166l31414J49398J70957J15678N6703j8363j5847
2168F78771O6285K97682m8465k42686j43821j73898j04811J69561J00523j0914
2158E88227K20327j36273j54924k52982K71583K82341j95389j44914K03617n923
2148F75690k53645l1214q5048J05823j95942j08113j25735L098J79691Q8563J25609
2137C78777J04819k8459k934J03973l24371m2370Q6405J00606l27k923J44604
2126E17800J55384j46443k50754J50139J00229K8938n1155J82004J93168m93136
$$ plain form
2116 386174 453137 565995 311433 162615 240516 303915 473730 529694 519858 302333 326876
2105 326876 310756 300994 162 174480 168716 262386 298985 108843 41088 161863 172006
2094 172006 186626 210918 141909 245163 359740 309512 156394 173312 269873 340985 115558
2083 115558 32027 -95768 -67247 62617 -59997 -516580 59945 213157 4916 -103989
2073 -103989 272459 296996 315496 440627 304985 488035 463540 219214 72523 178027
2063 178027 503054 750823 617196 661288 679544 887251 1190865 1374106 1472980 1619600
2053 1619600 1573062 1349348 1111292 801980 659443 726943 640113 554303 264538 4603
2043 4603 64401 108747 295810 124267 74896 423625 231810 -214923 21188 326136 361261
$$ packed form
2116C86174O6963J12858k54562j48818P7901O3399J69815N5964r836k17525K4543
2105C26876j6120r762l00832J74318n764R3670L6599j90142o7755J20775J0143
2094A72006J4620K4292o9009J03254J14577n0228j53118J6918R6561P1112k25427
2083A15558q3531j27795K8521J29864j22614m56583N76525J53212k08241j08905
2073a03989L76448K4537J8500J25131j35642J83050k4495k44326j46691J05504
2063A78027L25027K47769j33627M4092J8256K07707L03614J83241R8874J46620
2053A619600m6538k23714k38056l09312j42537O7500q6830q5810k89765k59935
2043D603N9798M4346J87063j71543m9371L48729j91815m46733K36111L04948L5125
$$ plain form
2032 361261 518335 539850 -43491 66741 77390 95144 45898 -12862 168920 406707 304582
2021 304582 147568 318382 411915 285122 56163 -18 47987 39458 -54335 24920 -47301
2010 -47301 -604 -223585 -321979 -210226 12723 189909 100700 168476 151870 119185 206213
1999 206213 -108327 -115836 331994 257418 191534 404848 174806 154265 -58502 96591 58551
1988 58551 -129287 -64541 -209401 49631 257692 273527 365109 251173 -66306 -130469 119474
1977 119474 114633 -88606 -124679 138328 153177 -37054 -147448 -49198 -24254 18929 54485
1966 54485 -128941 -497316 -447486 -143167 -191299 -79270 60992 -79594 -97609 -62076 -160645
1955 -160645 -38024 -130388 -101323 48701 -107165 -295692 -378093 -271881 -240630 -193608 46884
$$ packed form
2032C61261J57074K1515n83341J10232J0649J7754m9246n8760J81782K37787j02125
2021C04582j57014J70814R3533j26793k28959n6181M8005q529r3793P9255p2221
2010d7301M6697k22981r8394J11753K22949J77186q9209O7776j6606l2685Q7028
1999B06213l14540p509M47830p4576o5884K13314k30042k0541k12767J55093l8040
1988E8551j87838O4746j44860K59032K08061J5835R1582j13936l17479o4163K49943
1977A19474m841k03239l6073K63007J4849j90231j10394R8250K4944M3183L5556
1966E4485j83426l68375M9830L04319m8132J12029J40262j40586j8015L5533r8569
1955a60645J22621r2364K9065J50024j55866j88527q2401J06212L1251M7022K40492
$$ plain form
1944 46884 208540 118155 130710 -49890 75504 17390 -56293 232209 80021 103892 -18433
1933 -18433 216419 232279 66564 248061 479242 140718 324950 356330 101754 18766
1923 18766 6649 60608 -128356 -19224 100511 -171356 35740 146111 280151 140856
1913 140856 -9819 -79037 -67084 -98682 -175452 -11704 100483 316757 390656 171012 110492
1902 110492 443518 309812 -15238 107028 291230 36859 124793 260924 114130 -46862
1892 -46862 60815 15026 119100 -23527 -50949 201660 27292 235881 296708 317310 240767
1881 240767 28456 54672 90845 428157 94486 222836 416272 -178994 -163980 227087
1871 227087 258439 373554 318583 279664 220991 492596 121705 247992 205005 123384 112146
$$ packed form
1944D6884J61656r0385J2555j80600J25394n8114p3683K88502j52188K3871j22325
1933a8433K34852J5860j65715J81497K31181l38524J84232L1380k54576q2988
1923A8766j2117N3959j88964J09132J19735k71867K07096J10371J34040j39295
1913A40856j50675o9218J1953l1598p6770J63748J12187K16274P3899k19644o0520
1902A10492L33026j33706l25050J22266J84202k54371Q7934J36131j46794j60992
1892d6862J07677m5789J04074j42627k7422K52609j74368K08589O0827K0602p6543
1881B40767k12311K6216L6173L37312l33671J28350J93436n95266J5014L91067
1871B27087L1352J15115n4971l8919n8673K71605l70891J26287m2987q1621j1238
$$ plain form
1860 112146 145859 315244 213998 176227 97846 238100 172327 470128 316490 2636
1850 2636 -92777 211421 181741 -30566 50827 -319681 -297235 -168445 -175708 -74920 188145
1839 188145 106226 -89682 38366 -109850 59185 117888 52122 -45225 -110278 -18038 255454
1828 255454 9874 -28004 -194240 104454 109830 -349079 -401651 -145523 214032 141136 128055
1817 128055 167043 -51778 -121760 -67312 -43747 -184238 -169806 93849 164731 4088 68296
1806 68296 -1251 122830 38694 -142356 -313060 -338267 -212537 -353100 128697 373969
1796 373969 197288 -51546 -237307 -359864 -113069 -93171 -80971 -154738 -294284 -208345
1786 -208345 74077 253922 251547 14531 -116128 -211731 27832 344233 324260 197823
$$ packed form
1860A12146L3713J69385j01246l7771p8381J40254o5773K97801j53638l13854
1850B636r5413L04198k9680k12307Q1393l70508K2446J28790p263J00788K63065
1839A88145q1919j95908J28048j48216J69035N8703o5766r7347o5053R2240K73492
1828B55454k45580l7878j66236K98694N376m58909n2572K56128L59555p2896j3081
1817A28055L8988k18821o9982N4448K3565j40491J4432K63655P0882j60643O4208
1806F8296o9547J24081q4136j81050j70704k5207J25730j40563M81797K45272
1796C73969j76681k48834j85761j22557K46795J9898J2200p3767j39546Q5939
1786b08345K82422J79845k375k37016j30659r5603K39563L16401j9973j26437
$$ plain form
1776 197823 135717 84532 -61443 36002 203445 146174 109417 184956 168089 268780 356481
1765 356481 217026 193999 241169 391731 212124 57892 22434 95009 41853 109009 -143055
1754 -143055 -24825 114788 123120 -15189 -99693 50136 135498 67340 -208397 60978 110754
1743 110754 99799 94209 138976 175151 180423 29113 152029 26480 99171 97450 33201 202565
1731 202565 467948 87875 24168 -50879 8938 321716 381259 406658 291829 27907 96356
1720 96356 262466 199932 116628 124789 177041 -161151 -235043 -219485 -227679 -187994 -3791 213532
1708 213532 109125 -751 158998 36645 10136 98302 99595 96168 -213453 46471 -34293
1697 -34293 -159842 -75526 133565 301544 170047 135644 347127 236952 114912 54313
$$ packed form
1776A97823o2106n1185j45975R7445J67443n7271l6757P5539j6867J00691Q7701
1765C56481j39455k3027M7170J50562j79607j54232l5458P2575n3156O7156k52064
1754a43055J18230J39613Q332j38309q4504J49829Q5362o8158k75737K69375M9776
1743A10754j0955n590M4767L6175N272j51310J22916j25549P2691j721o4249J69364
1731B02565K65383l80073o3707p5047N9817L12778N9543K5399j14829k63922O8449
1720I6356J66110o2534q3304Q161N2252l38192p3892J5558q194L9685J84203K17323
1708B13532j04407j09876J59749j22353k6509Q8166J293l427l09621K59924q0764
1697c4293j25549Q4316K09091J67979j31497l4403K11483j10175j22040o0599
$$ plain form
1687 54313 163693 226996 133285 -211013 -188575 5784 -95842 -171334 -322391 -164664 343940
1676 343940 359517 -55156 165245 9940 -65895 54010 76675 -82375 183099 128778
1666 128778 73659 -94032 102501 286358 172463 -32953 -269734 -332997 -48926 21008
1656 21008 -151020 -184041 -151498 -300985 -185540 13019 123507 -39080 -78479 127458
1646 127458 196174 -138052 -217540 -272920 -337830 -478506 -652984 -153718 -68747 -95530 -59760
1635 -59760 -177293 -182083 -175375 -191115 111101 99040 25967 343263 144426 -165843 -424
1624 -424 -83811 -178723 36090 20504 78569 236334 127240 -238884 -71500 36943 -16608
1613 -16608 176203 256484 147172 243171 325784 272310 406423 61524 -46886 220278 172403
$$ packed form
1687E4313J09380O3303r3711l44298K2438J94359j01626p5492j51057J57727N08604
1676C43940J5577m14673K20401j55305p5835J19905K2665j59050K65474n4321
1666A28778n5119j67691J96533J83857j13895k05416k36781o3263K84071O9934
1656B1008j72028l3021L2543j49487J15445J98559J10488j62587l9399K05937
1646A27458O8716l34226p9488n5380o4910j40676j74478M99266Q4971k6783L5770
1635e9760j17533m790O708j5740L02216j2061p3073L17296j98837l10269J65419
1624d24q3387r4912K14813j5586N8065J57765j09094l66124J67384J08443n3551
1613a6608J92811Q0281j09312R5999Q2613n3474J34113l44899j08410K67164m7875
$$ plain form
1602 172403 -162656 -43805 133761 -62613 -149580 72802 -2189 -187390 -181591 -5112
1592 -5112 79619 -37456 -69680 50722 254594 371397 141502 -10483 -121322 58529
1582 58529 206917 141767 112185 17530 103508 124073 80146 151879 104789 272276 257432
1571 257432 406774 124896 59034 -117877 -31644 69491 157407 46030 -113545 -25617
1561 -25617 113871 30611 -235876 -109995 -115536 146506 -6701 -89309 -78329 -175467 -86531
1550 -86531 92629 153332 -226360 -291128 -123506 -194887 -157329 -91646 -104379 49585 -28600
1539 -28600 253229 40950 -155960 -169928 -557901 -268286 -69242 184243 24661 -71878
1529 -71878 76979 130711 5414 -177874 -152991 199386 228596 2181 -399493 -261902
$$ packed form
1602A72403l35059J18851J77566j96374q6967K22382p4991j85201N799J76479
1592e112Q4731j17075l2224J20402K03872J16803k29895j51985j10839J79851
1582E8529J48388o5150k9582r4655Q5978K0565m3927P1733m7090J67487j4844
1571B57432J49342k81878o5862j76911Q6233J01135Q7916j11377j59575Q7928
1561b5617J39488q3260k66487J25881n541K62042j53207q2608J0980r7138Q8936
1550h6531J79160O0703l79692o4768J67622p1381L7558O5683j2733J53964p8185
1539b8600K81829k12279j96910j3968l87973K89615J99044K53485j59582r6539
1529g1878J48857N3732j25297j83288K4883L52377K9210k26415m01674J37591
$$ plain form
1519 -261902 -81808 57655 120468 225551 414698 64553 109659 132916 -75305 -140233
1509 -140233 -173979 273305 205804 -18010 166928 15407 225225 217945 277700 181542 66895
1498 66895 118209 226417 22330 -318786 143920 171202 -46668 75728 125281 153448 37188
1487 37188 112080 202209 213051 107985 -216327 -258379 -185206 -194604 137956 150094 -101716
1476 -101716 36417 -195692 -72763 -10222 -35942 133520 404842 115649 -55248 -175269
1466 -175269 -242582 -249034 -80066 -7255 -169524 -40861 359071 210838 -121715 -44652 15819
1455 15819 81824 -3274 -35322 -183492 -234182 -131053 -197411 -366159 -436318 -288809 -436358
1444 -436358 -214770 -80230 -231920 -191542 -146989 -165323 -284166 -82410 3081 -59950 -86670
$$ packed form
1519b61902J80094J39463O2813J05083J89147l50145M5106K3257k08221o4928
1509a40233l3746M47284o7501k23814J84938j51521K09818p280N9755r6158j14647
1498F6895N1314J08208k04087l41116M62706K7282k17870J22396M9553K8167j16260
1487C7188P4892R0129J0842j05066l24312m2052P3173r398L32560J2138k51810
1476a01716J38133k32109J22929O2541k5720J69462K71322k89193j70897j20021
1466a75269o7313o452J68968P2811j62269J28663L99932j48233l32553P7063O0471
1455A5819O6005q5098l2048j48170n0690J03129o6358j68748p0159J47509j47549
1444d36358K21588J34540j51690M0378M4553j8334j18843K01756Q5491o3031k6720
$$ plain form
1433 -86670 -333749 -131551 -40059 -72201 126594 270793 304648 -60379 53415 335524
1423 335524 445673 359108 119008 236664 149250 -20272 103186 87591 137342 -196938
1413 -196938 -109358 -100674 124879 71387 55744 51624 -1741 -102856 -34400 129118 128247 24939
1401 24939 59651 160086 49390 175558 296670 242308 -2252 -172329 294019 308868
1391 308868 163523 277735 134592 -96883 -233021 -305045 -122859 276148 100484 -73084
1381 -73084 -97911 -98204 58628 100248 -87301 -145074 -134250 16786 -70874 151491 322744
1370 322744 155559 308181 199385 -141198 -72061 18799 -68954 114186 14846 2970 310470
1359 310470 111322 74970 26684 -34871 74670 43670 97941 -85471 -22744 -93067 138745
$$ packed form
1433h6670k47079K02198R1492l2142J98795J44199L3855l65027J13794K82109
1423C35524J10149q6565k40100J17656q7414j69522J23458j5595M9751l34280
1413a96938Q7580Q684K25553n3492j5643m120n3365j01115O8456J63518q71j03308
1401B4939L4712J00435j10696J26168J21112n4362k44560j70077M66348J4849
1391C08868j45345J14212j43143k31475j36138p2024J82186L99007j75664j73568
1381g3084k4827k93J56832M1620j87549n7773J0824J51036q7660K22365J71253
1370C22744j67185J52622j08796l40583O9137R0860q7753J83140r9340j1876L07500
1359C10470j99148l6352m8286o1555J09541l1000N4271j83412O2727p0323K31812
$$ plain form
1348 138745 287846 -10592 -200627 -222199 -219968 -86079 -304706 174420 284829 -62429
1338 -62429 50293 79587 327059 203657 -182106 -80778 39369 128653 198158 -71748
1328 -71748 -227995 -26688 85834 -61151 199320 118430 -123100 -209125 -43031 87843
1318 87843 286523 431895 280889 425800 205892 101610 184189 -85286 218627 -108432
1308 -108432 -105625 428 37833 -293511 -131386 125213 133607 -18504 58681 227117 133673
1297 133673 55254 260341 82959 159364 2659 -423574 -155961 -80665 77750 -34874
1287 -34874 79849 191811 -135945 -99448 -38478 -20934 -50358 126321 143690 -194343 -81535
1276 -81535 -140493 -15400 303875 11487 11846 96155 199651 340738 138146 56210 -109809
$$ packed form
1348A38745J49101k98438j90035k1572K231J33889k18627M79126J10409l47258
1338f2429J12722K9294K47472j23402l85763J01328J20147Q9284O9505k69906
1328g1748j56247K01307J12522j46985K60471q0890k41530q6025J66094J30874
1318H7843J98680J45372j51006J44911k19908j04282Q2579k69475L03913l27059
1308a08432K807J06053L7405l31344J62125K56599Q394j52111P7185J68436r3444
1297A33673p8419K05087j77382P6405j56705m26233K67613P5296J58415j12624
1287c4874J14723J11962l27756L6497O0970J7544k9424J76679J7369l38033J12808
1276h1535n8958J25093L19275k92388L59Q4309J03496J41087k02592q1936j66019
$$ plain form
1265 -109809 -36032 -112289 -160450 26714 11375 -126757 -84708 -49084 49113 -111978 -236052
1254 -236052 -89518 166833 133869 183709 25270 -187773 -178488 -302232 -288723 -262887 -173306
1243 -173306 13071 -4280 -27467 -24388 37977 -48990 -36341 99396 -30671 69303 46032
1232 46032 76370 -17029 10736 85597 134373 -20254 -185072 -21635 -77837 -45677 -110355
1221 -110355 -1087 79839 298358 -31598 -192160 -81285 48510 -180 85052 106978
1211 106978 171098 193181 19287 -63937 183668 136249 130306 18831 -53262 189777 480747
1200 480747 420505 275713 298713 317894 130391 18999 109242 -187918 -107679 -56409 82877
1189 82877 157978 272583 -76614 -234676 -28517 -47689 -33893 313966 252833 16785 -8970
$$ packed form
1265a09809P3777p6257m8161J87164j5339j38132M2049L5624R8197j61091j24074
1254b36052J46534K56351l2964M9840j58439k13043R285j23744J3509K5836Q9581
1243a73306J86377j7351k3187L079O2365q6967J2649J35737j30067R9974k3271
1232D6032L0338r3399K7765P4861M8776j54627j64818J63437n6202L2160o4678
1221a10355J09268Q0926K18519l29956j60562J10875J29795m8690Q5232K1926
1211A06978O4120K2083j73894q3224K47605m7419n943j11475p2093K43039K90970
1200D80747o0242j44792K3000J9181j87503j11392R0243k97160Q0239N1270J39286
1189H2877P5101J14605l49197j58062K06159j9172J3796L47859o1133k36048k5755
$$ plain form
1178 -8970 20049 84477 185788 166596 63553 262740 204558 252241 72890 -220858 -307125
1167 -307125 -244705 -274496 -206308 -178363 16509 44151 72336 -72499 -246938 -246650 -346476
1156 -346476 -85273 -123797 45143 184949 -144624 -193108 -7580 -94732 7523 -81039
1146 -81039 101022 50964 -251702 -134761 -68070 10476 2293 240134 2573 -315069 -149775
1135 -149775 -195939 138006 145232 205160 40846 -61494 -47506 -161832 161757 209940 139665
1124 139665 -158122 34650 197158 313718 337802 6170 154398 -38398 -400698 -421785
1114 -421785 -108640 145770 349725 326081 86158 -217174 -126866 -53417 117204 -111075
1104 -111075 -252605 -47745 260971 67883 97464 240010 254318 128801 276173 252352
$$ packed form
1178h970K9019O4428J01311j9192j03043J99187n8182M7683j79351k93748q6267
1167c07125O2420k9791O8188K7945J94872K7642K8185j44835j74439K88r9826
1156c46476K61203l8524J68940J39806l29573m8484J85528q7152J02255q8562
1146h1039J82061n0058l02666J16941O6691P8546q183K37841k37561l17642J65294
1135a49775m6164L33945P226N9928j64314j02340J3988j14326L23589M8183p0275
1124A39665k97787J92772J62508J16560K4084l31632J48228j92796l62300k1087
1114d21785L13145K54410K03955k3644k39923l03332R0308P3449J70621k28279
1104a11075j41530K04860L08716j93088K9581J42546J4308j25517J47372k3821
$$ plain form
1094 252352 330303 307552 309046 -121316 -408474 -79314 -160353 -12556 19941 -288908 -207605
1083 -207605 39092 186258 63157 48320 50562 27979 279619 163557 187662 -22656 -107174
1072 -107174 61846 118393 278841 323125 -3886 91408 -183203 31276 142094 1513
1062 1513 -169851 219425 148519 -87863 -209513 -63149 -185643 -74790 -21801 97780
1052 97780 -84432 -202705 -140992 -226834 31962 -196509 16119 143081 -183624 -109074
1042 -109074 40637 -24438 -207831 -134529 -95841 206197 89923 39911 247781 66926
1032 66926 -122845 -199802 -198448 -412074 -135310 -11756 20638 106629 34335 -145789 12165
1021 12165 200229 132265 -75541 -194023 -284444 -309804 -198192 -32761 -28013 -191397 -258238
$$ packed form
1094B52352P7951k2751J494m30362k87158L29160q1039J47797L2497l08849Q1303
1083b07605K46697J47166j23101j4837K242k2583K51640j16062K4105k10318q4518
1072a07174J69020N6547J60448M4284l27011R5294k74611K14479J10818j40581
1062A513j71364L89276p0906k36382j21650J46364j22494J10853N2989J19581
1052I7780j82212j18273O1713q5842K58796k28471K12628J26962l26705P4550
1042a09074J49711o5075j83393P3302L8688L02038j16274n0012K07870j80855
1032F6926j89771p6957J354k13626K76764J23554L2394Q5991p2294j80124J57954
1021A2165J88064o7964k07806j18482r0421k5360J11612J65431M748j63384o6841
$$ plain form
1010 -258238 -33421 -161661 -227433 -48029 -299933 -291254 55865 12218 -72098 37351 -53921
999 -53921 105762 45448 -82252 210693 115083 -168983 40132 124957 115937 144802 -60687
988 -60687 -67029 -4670 -38774 -309705 -334580 -220424 19717 108085 122442 -57421 28422
977 28422 146817 307925 219827 -51877 -271325 -107291 -174824 -218209 -86785 23998 330832
966 330832 125877 139339 137784 -47897 -148444 -33067 139619 214780 -108857 -223288 -24504
955 -24504 -112893 -217303 56563 76472 9854 19634 127041 -27798 59220 -44560 -198546
944 -198546 -17773 -148040 -62116 -171492 -404517 -599792 -480221 -154320 -125413 -142672
934 -142672 -80700 -179582 -45414 -46586 56003 343053 -1034 -150262 -135985 -56321 118251
$$ packed form
1010b58238K24817j28240o5772J79404k51904Q679L47119m3647q4316J09449r1272
999e3921J59683o0314j27700K92945r5610k84066K09115Q4825r020K8865k05489
988f0687o342O2359l4104k70931k4875J14156K40141Q8368J4357j79863Q5843
977B8422J18395J61108q8098k71704k19448J64034o7533m3385J31424J10783L06834
966C30832k04955J3462j555j85681j00547J15377J72686P5161l23637j14431J98784
955b4504q8389j04410K73866J9909o6618R780J07407j54839Q7018j03780j53986
944a98546J80773j30267Q5924j09376k33025j95275J19571L25901K8907j7259
934a42672O1972r8882J34168j172J02589K87050l44087j49228J4277P9664J74572
$$ plain form
923 118251 148350 465461 371173 80332 189597 -50136 -149163 -124578 -108558 -8565 90783
912 90783 3690 -97283 -103691 -203063 -5082 -119194 -229128 -330037 -22004 25503 -29008
901 -29008 -73050 49730 -59361 -95253 -192468 -217821 -64014 -74522 -14882 238465 174354
890 174354 118805 74940 70579 -128402 -128544 -241589 -174314 35613 -186175 -66923 -9016
879 -9016 20846 -10125 192365 -109414 -184190 -209445 -168910 25095 269559 -22675 -246110
868 -246110 -227114 -204269 -227589 44209 -193629 -124136 70989 -86573 -369169 -189560 -126559
857 -126559 -5600 12992 171738 190273 -18327 -154221 -247067 -56461 -75156 19032 240583
846 240583 205723 60682 21659 -115675 14938 -158363 -7627 -84802 -253221 -210778 -361189
$$ packed form
923A18251L0099L17111r4288k90841J09265k39733r9027K4585J6020R9993R9348
912I0783q7093j00973o408r9372J97981j14112j09934j00909L08033M7507n4511
901b9008m4042J22780j09091l5892r7215k5353J53807j0508N9640K53347o4111
890A74354n5549m3865m361j98981j42j13045O7275K09927k21788J19252N7907
879i016K9862l0971K02490l01779p4776k5255M0535J94005K44464k92234k23435
868b46110J8996K2845k3320K71798k37838O9493J95125j57562k82596J79609O3001
857a26559J20959J8592J58746J8535k08600j35894r2846J90606j8695R4188K21551
846B40583l4860j45041l9023j37334J30613j73301J50736p7175j68419M2443j50411
$$ plain form
835 -361189 -358005 -116738 -68397 -290683 -259533 171891 72248 69515 56847 -14773 35009 123400
823 123400 109046 104515 296144 288875 291113 191045 235496 100245 40693 14963 -13461 -85017
811 -85017 38826 -124480 -171068 141158 111752 194564 2133 -15881 322911 369698 53953
800 53953 5716 -153394 -145728 -19352 67518 -15185 -29707 -41971 -20117 -10574 124233 259879
788 259879 -381815 -429215 35417 148606 78801 -18353 -76846 58312 118238 4437 -20122
777 -20122 -162209 -195856 -23906 155548 117108 95223 184212 128197 -54745 -53591 -175941
766 -175941 -218112 -117251 -257587 26274 105187 83453 37565 -89312 -84800 -294502 -148069
755 -148069 -117301 9356 231547 29693 292067 140233 -180338 -73294 85627 -110856
$$ packed form
835c61189L184K41267M8341k22286L1150M31424r9643k733j2668p1620M9782Q8391
823A23400j4354m531J91629p269K238j00068M4451j35251n9552k5730k8424p1556
811h5017J23843j63306m6588L12226k9406Q2812j92431j8014L38792M6787l15745
800E3953m8237j59110P666J26376Q6870q2703j4522j2264K1854R543J34807J35646
788B59879o41694m7400M64632J13189o9805r7154n8493J35158N9926j13801k4559
777b0122j42087l3647J71950J79454l8440k1885Q8989n6015j82942J154j22350
766a75941m2171J00861j40336K83861P8913k1734m5888j26877M512k09702J46433
755a48069L0768J26657K22191k01854K62374j51834l20571J07044J58921j96483
$$ plain form
745 -110856 -288798 56920 219733 -73924 -189282 59311 92546 64493 -87609 -109226
735 -109226 -112913 -30460 289299 389353 222516 209018 182638 115839 -91134 6515 235415
724 235415 108215 -87709 -219087 -249524 -170309 -290090 -214505 -21854 14640 155540 103944
713 103944 196592 -129611 -131134 -16268 -137208 -281188 -115667 8174 -187848 22122
703 22122 86481 -97784 -76554 141863 -176461 -67341 113597 37356 172694 174414 47521
692 47521 143249 125266 -35211 -67878 -8873 109403 109121 22582 160673 190377 262622 198814
680 198814 75810 42909 215582 -74513 -258589 -91877 -26113 -169575 -317185 -133751
670 -133751 53558 146842 155991 110295 -329134 -478642 -402553 169445 225457 143449 -4905
$$ packed form
745a10856j77942L45718J62813k93657j15358K48593L3235k8053j52102k1617
735a09226l687Q2453L19759J00054j66837j3498k6380o6799k06973R7649K28900
724B35415j27200j95924j31378l0437P9215j19781P5585J92651L6494J40900n1596
713A03944R2648l26203j523J14866j20940j43980J65521J23841j96022K09970
703B2122O4359j84265K1230K18417l18324J09120J80938p6241J35338J720j26893
692D7521R5728j7983j60477l2667N9005J18276k82q6539J38091K9704P2245o3808
680A98814j23004l2901J72673k90095j84076J66712O5764j43462j47610J83434
670a33751J87309R3284R149m5696m39429j49508P6089N71998N6012q2008j48354
$$ plain form
659 -4905 -21303 133906 85264 -276879 -100199 -211146 -485576 -69676 137914 9524 -182410
648 -182410 94337 360581 225891 333623 227387 -177153 -190990 -5701 554 -59690 -25195
637 -25195 -97972 -227318 -212195 -209114 -329356 -169837 37909 -154806 -33096 -5318 -171813
626 -171813 -344602 -317734 -181059 34078 -17594 -84917 175177 -130610 -21125 77496 -47112
615 -47112 55466 68814 226162 312816 -40804 193824 5722 -148497 -89903 -201718 -367904
604 -367904 -242879 -42551 -102150 -160380 -164062 93631 -86941 -110931 -58503 -148020 -125177
593 -125177 58838 29382 -201996 -181959 -213874 -69011 -192237 34219 193113 240219 241698
582 241698 268594 -18482 -360838 -235786 -171390 -273880 -162563 169734 147434 271895
$$ packed form
659d905j6398J55209m8642l62143J76680j10947k74430M15900K07590j28390j91934
648a82410K76747K66244j34690J07732j06236m04540j3837J85289O255o0244L4495
637b5195p2777j29346J5123L081j20242J59519K07746j92715J21710K7778j66495
626a71813j72789K6868J36675K15137n1672o7323K60094l05787J09485R8621j24608
615d7112J02578J3348J57348Q6654l53620K34628j88102j54219N8594j11815j66186
604c67904J25025K00328n9599n8230l682K57693j80572k3990N2428q9517K2843
593a25177J84015k9456k31378K0037l1915J44863j23226K26456J58894M7106J479
582B41698K6896k87076l42356J25052O4396j02490J11317L32297k2300J24461
$$ plain form
572 271895 118092 56076 132182 -88467 -264117 -280802 -144081 16347 -130619 -175568 -63590
561 -63590 132646 311666 249035 -6713 -4974 -1362 -91 -185429 82085 142148 94843 45527
549 45527 -22651 188779 430866 303453 28780 67646 94797 488676 280938 216295 308297
538 308297 363081 69421 -39320 161893 63144 -249226 -73480 -64277 -295812 -83231 23583
527 23583 159930 -1604 -6928 -16555 -194253 -305051 -115826 -87201 3465 -21710 -144450
516 -144450 -118343 -91713 -95194 -85268 94296 167833 262189 416957 339756 252589 64750 -241469
504 -241469 -223985 104697 35744 -15382 125309 57285 33040 102151 -157753 -165821 51525
493 51525 193399 207836 206690 -120821 -211194 -81074 -176588 -283591 -376721 -188991 -74594
$$ packed form
572B71895j53803o2016P6106k20649j75650j6685J36721J60428j46966m4949J11978
561f3590J96236J79020o2631k55748J739L612J271j85338K67514O0063m7305m9316
549D5527o8178K11430K42087j27413k74673L8866K7151L93879k07738o4643R2002
538C08297N4784k93660j08741K01213r8749l12370J75746R203k31535K12581J06814
527B3583J36347j61534n324r627j77698j10798J89225K8625R0666k5175j22740
516a44450K6107K6630l481R926J79564P3537R4356J54768p7201q7167j87839l06219
504b41469J7484L28682o8953n1126J40691o8024k4245O9111k59904q068K17346
493E1525J41874J4437j146l27511r0373J30120r5514j07003r3130J87730J14397
$$ plain form
482 -74594 18486 -233378 -98127 4841 -175032 -459847 -274573 -68701 -79805 -157381 2866
471 2866 14641 -214604 -165410 -491012 -277705 -105274 -136191 -112036 -44831 -324555 -355162
460 -355162 31129 47980 330676 130727 -14851 -272486 -94950 35163 104069 -210043
450 -210043 -481893 -249766 -127898 -19739 13856 100021 397692 82243 -60491 29243
440 29243 -44405 -35100 -209628 -181018 -246223 -144809 128657 176924 -7888 -370347 -404634
429 -404634 -266787 -387213 -352772 -168057 -332039 -230319 39692 -209565 116067 114973
419 114973 109934 17546 -114178 -224150 -459367 -356563 -375344 -378160 -373336 35609 184717
408 184717 -73134 198655 104874 6723 23087 257037 148609 90636 175108 76231 27442
$$ packed form
482g4594R3080k51864J35251J02968j79873k84815J85274K05872j1104p7576J60247
471B866J1775k29245M9194l25602K13307J72431l0917K4155O7205k79724l0607
460c55162L86291J6851K82696j99949j45578k57635J77536J30113O8906l14112
450b10043k71850K32127J21868J08159L3595Q6165K97671l15449j42734Q9734
440B9243p3648R305j74528K8610o5205J01414K73466M8267j84812l62459l4287
429d04634J37847j20426L4441J84715j63982J01720K70011k49257L25632j094
419A14973n039r2388j31724j09972k35217J02804j8781k816M824M08945J49108
408A84717k57851K71789r3781r8151J6364K33950j08428n7973Q4472r8877m8789
$$ plain form
397 27442 78727 120540 -26676 175661 232214 163906 201413 280724 327214 229874 12418
386 12418 -84022 173170 144247 -51165 47308 102403 -197472 160928 226757 94181 23183
375 23183 -181875 -267861 -163124 -228787 -181551 -70206 -26231 -176506 -270742 -95582 -185910
364 -185910 117424 301775 179747 139954 251549 82679 -47282 -96683 -18047 -249974
354 -249974 -85303 72912 -73052 -74785 -71659 7556 4930 36205 -36868 -93830 281619 433874
342 433874 154016 56936 124013 68879 -32517 -105112 -341947 -22648 -43563 30616 -106717
331 -106717 -299063 -96105 230099 177080 17172 -129427 -368521 -326521 -328099 -315234 -20857
320 -20857 141405 -117226 -35945 -125201 -82843 -127392 -82545 -246932 -278489 125288 88001
$$ packed form
397B7442N1285M1813j47216K02337N6553o8308L7507P9311M6490r7340k17456
386A2418r6440K57192k8923j95412R8473N5095k99875L58400O5829j32576p0998
375B3183k05058q5986J04737o5663M7236J11345M3975j50275r4236J75160r0328
364a85910L03334J84351j22028l9793J11595j68870j29961m9401P8636k31927
354b49974J64671J58215j45964j733L126P9215k626L1275p3073n6962L75449J52255
342D33874k79858r7080O7077n5134j01396p2595k36835L19299k0915P4179j37333
331a06717j92346K02958L26204n3019j59908j46599k39094M2000j578J2865K94377
320b0857J62262k58631Q1281q9256M2358m4549M4847j64387l1557M03777l7287
$$ plain form
309 88001 -79117 -32561 -137611 -128815 -31809 81522 -198372 226655 372223 -28584 -290411
298 -290411 -325520 -69142 -36303 63335 158967 -176456 -164622 -221773 -35231 52008 152691
287 152691 252158 84954 48878 -115378 -207196 -283646 -87349 35729 -12509 136728 133244
276 133244 -78804 -220237 -173344 68256 93075 94674 66460 198563 104101 -126908 -38098
265 -38098 43595 56651 66683 94564 -210178 -279320 -225058 -471477 -365599 -147883 -129520
254 -129520 -44511 -210664 -101861 20954 58356 115668 92055 151613 192431 174508 -127530
243 -127530 -96948 -95612 -242219 -393291 -58429 -80651 -224622 -189898 -181739 -428647 -376920
232 -376920 -286491 -268468 -371469 -260334 -465543 -581149 -266961 -296605 -96230 22740
$$ packed form
309H8001j67118M6556j05050Q796R7006J13331k79894M25027J45568m00807k61827
298b90411l5109K56378L2839R9638R5632l35423J1834n7151J86542Q7239J00683
287A52691R9467j67204l6076j64256r1818p6450J96297J23078m8238J49237l484
276A33244k12048j41433M6893K41600K4819J599k8214J32103r4462k31009Q8810
265c8098Q1693J3056J0032K7881l04742o9142N4262k46419J05878K17716J8363
254a29520Q5009j66153J08803J22815L7402N7312k3613N9558M0818j7923l02038
243a27530L0582J336j46607j51072L34862k2222j43971L4724Q159k46908N1727
232c76920R0429J8023j03001J11135k05209j15606L14188k9644K00375J18970
$$ plain form
222 22740 -39909 183997 239730 31422 -43254 246538 104858 -332037 -291037 -129003 -111886
211 -111886 -65748 -148718 74046 254329 254496 31149 187269 249926 147762 -46652 -43271
200 -43271 -15230 47316 104198 70450 -229670 -296272 -67849 -15493 70063 236628 332711
189 332711 409239 173199 25689 127797 -99485 -41414 -21233 118293 -108459 -3374
179 -3374 -116289 -11951 140117 300018 349278 259840 -48215 174378 230491 213992 176530
168 176530 234154 10093 -106705 -74609 -263493 -229584 -331320 -16876 46283 168648 190545
157 190545 -107905 -75350 -108674 101171 63444 26805 -132603 -23368 -3024 12052 273509
146 273509 -42469 -134923 33630 -86991 -206041 -207379 -234130 -271588 -37415 10512 -170109
$$ packed form
222B2740o2649K23906N5733k08308p4676K89792j41680m36895M1000J62034J7117
211a11886M6138q2970K22764J80283J67k23347J56120O2657j02164j94414L381
200d3271K8041O2546N6882l3748l00120o6602K28423N2356Q5556J66565R6083
189C32711P6528k36040j47510J02108k27282N8071K0181J39526k26752J05085
179c374j12915J04338J52068J59901M9260q9438l08055K22593N6113j6499l7462
168A76530N7624k24061j16798L2096j88884L3909j01736L14444O3159J22365K1897
157A90545k98450L2555l3324K09845l7727l6639j59408J09235K0344J5076K61457
146B73509l15978r2454J68553j20621j19050j338k6751l7458K34173M7927j80621
$$ plain form
135 -170109 -369089 -647729 -324700 -44385 -103712 -90189 -28716 -167096 -160575 -218926 -211131
124 -211131 -154819 -196980 26988 65946 9564 -192503 25330 203711 92846 -1624 -85774
113 -85774 -52413 119764 22527 -98747 -19064 -100164 -151966 -267029 -141398 -131552 -216273
102 -216273 -469363 -378890 -490130 -419372 -120286 -269419 -171413 -130692 -235382 -33992 43925
91 43925 -93480 -69716 -97467 -147453 -19825 -188859 -94114 -287984 -426627 -306604 -242697
80 -242697 -168090 -157389 -192193 -153675 -286939 -276321 -298238 -234336 -170391 -84242 -50047 -165379
68 -165379 -147235 -37043 -251928 -246206 -77807 -123901 -50867 -56905 -119523 47384 29676 -109083
56 -109083 -281902 -391731 -401189 -55219 123054 -215679 -343403 -239444 -140548 -174896 -210895
$$ packed form
135a70109j98980k78640L23029K80315n9327J3523O1473j38380O521n8351P795
124b11131N6312m2161K23968L8958n6382k02067K17833J78381j10865r4470q4150
113h5774L3361J72177r7237j21274P9683q1100n1802j15063J25631R846q4721
102b16273k53090R0473j11240P0758K99086j49133R8006M0721j04690K01390P7917
91D3925j37405K3764k7751m9986J27628j69034R4745j93870j38643J20023O3907
80b42697P4607J0701l4804L8518j33264J0618k1917O3902O3945Q6149L4195j15332
68a65379J8144J10192k14885N722J68399m6094P3034o038o2618J66907j7708j38759
56a09083j72819j09829r458L45970J78273l38733j27724J03959R8896l4348l5999
$$ plain form
45 -210895 -397609 -357171 -182812 -216388 -290483 -337526 -411563 -492318 -266832 -216326 -355653
34 -355653 -454442 -410286 -303916 -254881 -259632 -431965 -317613 -131221 -117889 -331160 -273512
23 -273512 -270343 -240311 -225395 -180559 -213820 -354620 -440728 -364344 -538795 -666720 -591516 -500242
11 -500242 -441047 -459894 -459856 -399379 -443133 -348941 -408050 -276694 -214753 -232536 -272419
0 -272419
$$ packed form
45b10895j86714M0438J74359l3576p4095m7043p4037q0755K25486N0506j39327
34c55653r8789M4156J06370M9035m751j72333J14352J86392J3332k13271N7648
23b73512L169L0032J4916M4836l3261j40800q6108P6384j74451j27925P5204R1274
11e00242N9195j8847L8O0477m3754R4192n9109J31356O1941j7783l9883
0b72419
$$ Imaginary data points
##PAGE= N=2
##DATA TABLE= (X++(I..I)), XYDATA
$$ plain form
16383 -1579804 -1674936 -1579733 -1596506 -1460665 -1406750 -1394078 -1327350 -1176295 -1118217 -1259515 -1268155
16372 -1268155 -1157276 -1133492 -1161112 -1031826 -1062039 -1157955 -1127729 -1222511 -1135949 -1173990 -865158
16361 -865158 -904407 -817436 -876525 -1078576 -1098677 -980673 -916651 -914720 -862114 -834864 -967519
16350 -967519 -1057484 -829868 -844619 -928791 -863526 -936167 -919990 -911999 -719565 -532841 -487164
16339 -487164 -354712 -413582 -405710 -265603 -211992 -338005 -229134 -233287 -391484 -200839 -164061
16328 -164061 -124627 -178306 -108225 -78171 -18454 -181343 -208067 -176758 -197073 -142796 25977
16317 25977 50719 -45697 84786 -6873 95706 303756 211930 260198 133644 154633 145037
16306 145037 268227 222922 132323 301342 312673 289250 249573 340683 445989 629440 750802
$$ packed form
16383a579804r5132R5203j6773J35841N3915J2672O6728J51055N8078j41298q640
16372a268155J10879K3784k7620J29286l0213r5916L0226r4782Q6562l8041L08832
16361h65158l9249Q6971n9089k02051k0101J18004O4022J931N2606K7250j32655
16350i67519q9965K27616j4751q4172O5265p2641J6177P991J92434J86724M5677
16339d87164J32452n8870P872J40107N3611j26013J08871m153j58197J90645L6778
16328a64061L9434n3679P0081L0054N9717j62889k6724L1309k0315N4277J68773
16317B5977K4742r6416J30483r1659J02579K08050r1826M8268j26554K0989r596
16306A45037J23190m5305r0599J69019J1331k3423l9677R1110J05306J83451J21362
$$ plain form
16295 750802 753047 714538 703221 696359 626637 577190 539416 362982 451059 433494 476951 787012
16283 787012 982878 748497 980476 1033651 917370 752202 578044 611811 837060 1155951
16273 1155951 1241033 1302222 976835 981489 1189681 767312 735504 999051 1239750 1230208 1123301
16262 1123301 1128655 1128844 1255295 1262715 1194820 1244567 1097679 1223158 1222686 1333924 1406483 1356064
16250 1356064 1314622 1496876 1273949 1384775 1340511 1166409 1413761 1373012 1486049 1551796
16240 1551796 1495114 1529383 1663847 1693143 1798539 1567069 1383642 1150983 1647853 1696986
16230 1696986 1622230 1781364 1524565 1248896 1404272 1601572 1446441 1429231 1488317 1459264
16220 1459264 1715395 1813767 1430093 1630044 1847179 1861044 1913798 2122411 2107401 1774122
$$ packed form
16295G50802K245l8509j1317o862o9722m9447l7774j76434Q8077j7565M3457L10061
16283G87012J95866k34381K31979N3175j16281j65168j74158L3767K25249L18891
16273A155951Q5082O1189l25387M654K08192m22369l1808K63547K40699r542j06907
16262A123301N354J89J26451P420o7895M9747j46888J25479m72J11238P2559n0419
16250A356064m1442J82254k22927J10826m4264j74102K47352m0749J13037O5747
16240A551796n6682L4269J34464K9296J05396k31470j83427k32659M96870M9133
16230A696986p4756J59134k56799k75669J55376J97300j55131j7210N9086k9053
16220A459264K56131R8372l83674J99951K17135J3865N2754K08613j5010l33279
$$ plain form
16210 1774122 1856425 1988176 1967305 1841817 1876933 1833186 1878209 1849825 1784387 1960569 1987215
16199 1987215 2124676 1988930 1954130 2109902 2382170 2238558 2119341 2039224 1932479 1935694
16189 1935694 1777512 1859301 2281631 2037594 1953854 2053991 2058364 2183406 2173500 2053312
16179 2053312 2174406 2160643 1912727 1995423 1965661 1870538 2014726 2093393 2207773 2371394
16169 2371394 2343532 2369339 2383762 2248194 2225500 2240684 2417549 2248603 2250734 2250754 1993119
16158 1993119 2348387 2417353 2522516 2636932 2562780 2565220 2571880 2297300 2302828 2172069 2104779
16147 2104779 2498619 2570662 2482343 2353332 1969731 2186568 2560196 2452485 2362081 2179788
16137 2179788 1940133 2180426 2267207 2248503 2019800 2011194 1943505 2258373 2351728 2409957 2134495
$$ packed form
16210A774122Q2303J31751k0871j25488L5116m3747M5023k8384o5438J76182K6646
16199A987215J37461j35746l4800J55772K72268j43612j19217q0117j06745L215
16189A935694j58182Q1789M22330k44037q3740J00137M373J25042r906j20188
16179B053312J21094j3763k47916Q2696k9762r5123J44188P8667J14380J63621
16169B371394k7862K5807J4423j35568k2694J5184J76865j68946K131K0k57635
16158A993119L55268O8966J05163J14416p4152K440O660k74580N528j30759o7290
16147B104779L93840P2043q8319j29011l83601K16837L73628j07711r0404j82293
16137B179788k39655K40293Q6781j8704k28703q606o7689L14868R3355N8229k75462
$$ plain form
16126 2134495 2160425 2383260 2373159 2241044 2663929 2884289 2774913 2838777 2435755 2298290
16116 2298290 2214154 2149055 2090274 2501081 2603330 2589049 2680981 2593745 2348747 2218648
16106 2218648 2463743 2614901 2379668 2203829 2150051 2250583 2518823 2457474 2607468 2529827
16096 2529827 2459437 2556221 2560150 2693726 2953242 2646970 2610213 2648639 2509411 2506225 2478991
16085 2478991 2719087 2531369 2649559 2627786 2521956 2398449 2401538 2401118 2445311 2623155 2525544
16074 2525544 2474660 2710202 2687108 2394086 2282483 2313966 2589767 2769646 2480553 2356032
16064 2356032 2397813 2302584 2171590 2035599 2104866 2466087 2423440 2575098 2548004 2760196
16054 2760196 2626544 2902087 3027110 2864565 2702360 2589756 2644481 2647947 2461323 2557099
$$ packed form
16126B134495K5930K22835j0101j32115M22885K20360j09376O3864m03022j37465
16116B298290q4136o5099n8781M10807J02249j4281R1932q7236k44998j30099
16106B218648K45095J51158k35233j75839n3778J00532K68240o1349J49994p7641
16096B529827p0390R6784L929J33576K59516l06272l6757L8426j39228l186k7234
16085B478991K40096j87718J18190k1773j05830j23507L089m20M4193J77844r7611
16074B525544n0884K35542k3094k93022j11603L1483K75801J79879k89093j24521
16064B356032M1781r5229j30994j35991O9267L61221m2647J51658k7094K12192
16054B760196j33652K75543J25023j62545j62205j12604N4725L466j86624R5776
$$ plain form
16044 2557099 2612195 2350916 2419442 2723369 2810161 2603705 2570435 2511192 2604516 2449476
16034 2449476 2654449 2393655 2460917 2616675 2595702 2643100 2438545 2730780 2730657 2681511 2657105
16023 2657105 2573577 2518487 2536572 2453565 2198384 2247111 2498066 2267922 2126796 2315320
16013 2315320 2260994 2345835 2637660 2409318 2407573 2415474 2140974 2198522 2022498 2283849 2204194
16002 2204194 2162122 2369951 2565373 2612936 2308303 2494232 2831418 2930536 2687834 2584701
15992 2584701 2575846 2512565 2498428 2598877 2462017 2457147 2677511 2658687 2656518 2422124 2298523
15981 2298523 2358705 2127350 2302644 2195494 2381948 2506462 2545067 2548036 2406797 2614334
15971 2614334 2417845 2556284 2729708 2596509 2587076 2750991 2519877 2612987 2620209 2624216 2589155
$$ packed form
16044B557099N5096k61279O8526L03927Q6792k06456l3270n9243R3324j55040
16034B449476K04973k60794O7262J55758k0973M7398k04555K92235j23m9146k4406
16023B657105q3528n5090J8085q3007k55181M8727K50955k30144j41126J88524
16013B315320n4326Q4841K91825k28342j745P901k74500N7548j76024K61351p9655
16002B204194m2072K07829J95422M7563l04633J85929L37186R9118k42702j03133
15992B584701q855o3281j4137J00449j36860m870K20364j8824k169k34394j23601
15981B298523O0182k31355J75294j07150J86454J24514L8605K969j41239K07537
15971B614334j96489J38439J73424j33199r433J63915k31114R3110P222M007l5061
$$ plain form
15960 2589155 2570091 2557379 2762735 2539239 2429939 2681742 2717406 2493223 2494993 2540137
15950 2540137 2389264 2373259 2528489 2554897 2606396 2530352 2390144 2462965 2575866 2628181
15940 2628181 2564882 2478190 2446494 2234288 2042328 2185047 2194836 2398709 2474812 2611017
15930 2611017 2477207 2475042 2704783 2618467 2635537 2503918 2519794 2456891 2374958 2483707 2524675
15919 2524675 2375550 2619328 2638578 2364474 2189820 2020190 1905499 2260273 2347601 2465545
15909 2465545 2364029 2038346 2380727 2456297 2622956 2546830 2520271 2485813 2560978 2608616
15899 2608616 2827275 2717462 2629382 2550701 2563230 2719979 2845839 2642796 2500731 2737978
15889 2737978 2720285 2850451 2681394 2606708 2611902 2561853 2520414 2743656 2763001 2533408 2507455
$$ packed form
15960B589155j9064j2712K05356k23496j09300K51803L5664k24183J770M5144
15950B540137j50873j6005J55230K6408N1499p6044j40208P2821J12901N2315
15940B628181o3299q6692l1696k12206j91960J42719R789K03873P6103J36205
15930B611017j33810k165K29741q6316J7070j31619J5876o2903q1933J08749M0968
15919B524675j49125K43778J9250k74104j74654j69630j14691L54774Q7328J17944
15909B465545j01516l25683L42381P5570J66659p6126k6559l4458P5165M7638
15899B608616K18659j09813q8080p8681J2529J56749J25860k03043j42065K37247
15889B737978j7693J30166j69057p4686N194n0049m1439K23242J9345k29593k5953
$$ plain form
15878 2507455 2496645 2658808 2760033 2712821 2696316 2661532 2516201 2421565 2582004 2675069
15868 2675069 3038351 2876784 2669952 2569283 2529331 2693132 2533185 2712587 2695919 2647970
15858 2647970 2392774 2503161 2538062 2719018 2279106 2146717 2335821 2067484 2160612 2342804
15848 2342804 2421164 2382353 2381344 2492793 2511730 2416401 2511832 2428634 2224554 2508325 2559408
15837 2559408 2418947 2512115 2410666 2545491 2609748 2509263 2379011 2562391 2841860 2642571
15827 2642571 2542174 2529294 2548545 2404562 2253388 2661436 2595568 2351923 2243152 2494482
15817 2494482 2754571 2704187 2535678 2477201 2431202 2618536 2456366 2470578 2730890 2607894
15807 2607894 2585491 2468094 2398586 2391666 2289593 2252745 2295159 2183952 2550515 2537276 2325456
$$ packed form
15878B507455j0810J62163J01225m7212j6505l4784j45331r4636J60439R3065
15868B675069L63282j61567k06832j00669l9952J63801j59947J79402j6668m7949
15858B647970k55196J10387L4901J80956m39912j32389J89104k68337R3128J82192
15848B342804P8360l8811j009J11449J8937r5329R5431q3198k04080K83771N1083
15837B559408j40461R3168j01449J34825O4257j00485j30252J83380K79469j99289
15827B642571j00397j2880J9251j43983j51174M08048o5868k43645j08771K51330
15817B494482K60089n0384j68509n8477m5999J87334j62170J4212K60312j22996
15807B607894k2403j17397o9508o920j02073l6848M2414j11207L66563j3239k11820
$$ plain form
15796 2325456 2315746 2471528 2577667 2560747 2715502 2780301 2719738 2664767 2676426 2850946 2838919
15785 2838919 2827270 2697249 2641733 2351106 2364801 2508776 2700442 2700857 2602719 2671270 2496396
15774 2496396 2515699 2354949 2535106 2518297 2184907 2167941 2330671 2418164 2347963 2244102
15764 2244102 2623494 2641836 2610459 2577908 2499979 2568774 2623374 2589737 2481501 2251907 2325880
15753 2325880 2462141 2698893 2685366 2562782 2547251 2454169 2627025 2661080 2694071 2522675
15743 2522675 2674408 2709545 2498417 2289611 2341240 2660354 2804702 2643067 2651342 2718919
15733 2718919 2757987 2764275 2905411 2868512 2691310 2819020 2867543 2773753 2725836 2660573 2601159
15722 2601159 2445789 2331801 2214774 2293156 2518415 2316662 2639204 2681377 2785428 2520405
$$ packed form
15796B325456r710J55782J06139j6920J54755O4799o0563n4971J1659J74520j2027
15785B838919j1649j30021n5516k90627J3695J43975J91666M15r8138O8551j74874
15774B496396J9303j60750J80157j6809l33390j6966J62730Q7493p0201j03861
15764B244102L79392J8342l1377l2551p7929O8795N4600l3637j08236k29594P3973
15753B325880J36261K36752j3527j22584j5531r3082J72856L4055L2991j71396
15743B522675J51733L5137k11128k08806N1629L19114J44348j61635Q275O7577
15733B718919L9068O288J41136l6899j77202J27710M8523r3790m7917o5263n9414
15722B601159j55370j13988j17027P8382K25259k01753L22542M2173J04051k65023
$$ plain form
15712 2520405 2568381 2396343 2670506 2784965 2527652 2475975 2616881 2720056 2552867 2565415
15702 2565415 2503188 2380831 2106303 2207003 2457247 2516043 2533403 2717864 2544539 2392783
15692 2392783 2276908 2606355 2696953 2326803 2636304 2808905 2420350 2325579 2678324 2781389
15682 2781389 2765761 2722140 2344708 2426990 2289856 2378013 2329696 2374007 2648260 2528071
15672 2528071 2509988 2626289 2492558 2449214 2487266 2582713 2636777 2526099 2351683 2407445
15662 2407445 2421545 2602913 2533433 2745445 2629071 2473944 2638557 2610144 2152712 2248803
15652 2248803 2621322 2611859 2800009 2535215 2365546 2427592 2606699 2636930 2817476 2771488
15642 2771488 2850669 2749436 2821536 2713372 2629741 2564749 2664117 2642393 2563833 2526669 2581362
$$ packed form
15712B520405M7976j72038K74163J14459k57313n1677J40906J03175j67189J2548
15702B565415o2227j22357k74528J00700K50244N8796J7360J84461j73325j51756
15692B392783j15875L29447R0598l70150L09501J72601l88555r4771L52745J03065
15682B781389j5628m3621l77432Q2282j37134Q8157m8317M4311K74253j20189
15672B528071j8083J16301j33731m3344L8052R5447N4064j10678j74416N5762
15662B407445J4100J81368o9480K12012j16374j55127J64613k8413m57432R6091
15652B248803L72519r463J88150k64794j69669O2046J79107L0231J80546m5988
15642B771488P9181j01233P2100j08164q3631o4992R9368k1724p8560l7164N4693
$$ [...]
##END NTUPLES=NMR SPECTRUM
##END=
