##TITLE=1H_DE-80H_X3
 200.13MHz, d2o
 8 sc
 
 19ns.26.2.2025
##JCAMPDX= 6.0         $$ Bruker NMR JCAMP-DX V2.0
##DATA TYPE= NMR SPECTRUM
##DATA CLASS= NTUPLES
##ORIGIN= UXNMR, Bruker Analytische Messtechnik GmbH
##OWNER= pz
$$ XWIN-NMR		Version 3.5
$$ Fri Jul 17 10:40:24 2026 Russian Standard Time (UT+4h)  Yarkov@DPX200
##.OBSERVE FREQUENCY= 200.1313
##.OBSERVE NUCLEUS= ^1H
##.ACQUISITION MODE= SIMULTANEOUS
##.ACQUISITION SCHEME= undefined
##.AVERAGES= 8
##.DIGITISER RES= 18
##SPECTROMETER/DATA SYSTEM= spect
##.PULSE SEQUENCE= zg30
##.SOLVENT NAME= DMSO
##.SHIFT REFERENCE= (INTERNAL, DMSO, 0, 15.4869)
##AUDIT TRAIL= $$ (NUMBER, WHEN, WHO, WHERE, WHAT)
$$ ##TITLE= Audit trail, XWIN-NMR		Version 3.5
$$ ##JCAMPDX= 5.01
$$ ##ORIGIN= Bruker BioSpin GmbH
$$ ##OWNER= Yarkov
$$ C:/Bruker/XWIN-NMR/data/yarkov2/nmr/H-C/1/pdata/1/auditp.txt
$$ ##AUDIT TRAIL=  $$ (NUMBER, WHEN, WHO, WHERE, WHAT)
(   1,<2026-07-17 10:39:27.20 +0400>,<Yarkov>,<DPX200>,
      <created by zg, POWCHK disabled, PULCHK disabled
       configuration hash MD5:
       00 E9 B6 7A A2 85 ED C7 34 08 36 98 17 FE 4E 26
       data hash MD5: 16K
       CE DD B4 28 31 43 D7 19 FA 58 74 D1 9F 7B 21 D0>)
(   2,<2026-07-17 10:39:45.65 +0400>,<Yarkov>,<DPX200>,
      <Start of raw data processing
       efp BC_mod = 2 LB = 0.25 FT_mod = 6 PKNL = 1 PHC0 = -7255.922 PHC1 = 7.421964 SI = 16K 
       data hash MD5: 16K
       5E FB 89 01 52 16 2A EF 52 CC F5 7E D2 A8 26 93>)
$$ ##END=
$$ 
$$ hash MD5
$$ 77 15 98 5F 3F 53 02 D9 6F D4 54 C7 80 89 2B 0E
##$RELAX= 
##$RELAX= 
##$RELAX= 
##$RELAX= 
##$RELAX= 
##$RELAX= 
$$ Bruker specific parameters
$$ --------------------------
##$DU= <C:/Bruker/XWIN-NMR>
##$EXPNO= 1
##$NAME= <H-C>
##$PROCNO= 1
##$TYPE= <nmr>
##$USER= <yarkov2>
##$AMP= (0..31)
100 100 100 100 100 100 100 100 100 100 100 100 100 100 100 100 100 100 
100 100 100 100 100 100 100 100 100 100 100 100 100 100 
##$AQSEQ= 0
##$AQ_mod= 1
##$AUNM= <au_zg>
##$AUTOPOS= <>
##$BF1= 200.13
##$BF2= 200.13
##$BF3= 200.13
##$BF4= 200.13
##$BF5= 200.13
##$BF6= 200.13
##$BF7= 200.13
##$BF8= 200.13
##$BYTORDA= 1
##$CFDGTYP= 0
##$CFRGTYP= 5
##$CHEMSTR= <none>
##$CNST= (0..31)
1 1 145 1 1 1 1 1 1 1 1 1 1 1 1 1 1 1 1 1 1 1 1 1 1 1 1 1 1 1 1 1 
##$CPDPRG= <>
##$CPDPRG1= <>
##$CPDPRG2= <>
##$CPDPRG3= <>
##$CPDPRG4= <mlev>
##$CPDPRG5= <mlev>
##$CPDPRG6= <mlev>
##$CPDPRG7= <mlev>
##$CPDPRG8= <mlev>
##$CPDPRGB= <>
##$CPDPRGT= <>
##$D= (0..31)
0 0.7 0 0 0 0 0 0 0 0 0 0.03 0 0 0 0 0 0 0 0 0 0 0 0 0 0 0 0 0 0 0 0 
##$DATE= 1784270366
##$DBL= (0..7)
120 120 120 120 120 120 120 120 
##$DBP= (0..7)
150 150 150 150 150 150 150 150 
##$DBP07= 0
##$DBPNAM0= <>
##$DBPNAM1= <>
##$DBPNAM2= <>
##$DBPNAM3= <>
##$DBPNAM4= <>
##$DBPNAM5= <>
##$DBPNAM6= <>
##$DBPNAM7= <>
##$DBPOAL= (0..7)
0.5 0.5 0.5 0.5 0.5 0.5 0.5 0.5 
##$DBPOFFS= (0..7)
0 0 0 0 0 0 0 0 
##$DE= 6
##$DECBNUC= <off>
##$DECIM= 32
##$DECNUC= <off>
##$DECSTAT= 4
##$DIGMOD= 1
##$DIGTYP= 9
##$DL= (0..7)
0 120 120 120 120 120 120 120 
##$DP= (0..7)
$$ [...]
##$SUBNAM2= <"">
##$SUBNAM3= <"">
##$SUBNAM4= <"">
##$SUBNAM5= <"">
##$SUBNAM6= <"">
##$SUBNAM7= <"">
##$SUBNAM8= <"">
##$SUBNAM9= <"">
##$SW= 18.0517328524113
##$SWIBOX= (0..15)
0 0 2 0 0 0 0 0 0 0 0 0 0 0 0 0 
##$SW_h= 3612.71676300578
##$TD= 16384
##$TD0= 1
##$TE= 0
##$TE2= 300
##$TE3= 300
##$TEG= 300
##$TL= (0..7)
0 120 120 120 120 120 120 120 
##$TP= (0..7)
150 150 150 150 150 150 150 150 
##$TP07= 0
##$TPNAME0= <>
##$TPNAME1= <>
##$TPNAME2= <>
##$TPNAME3= <>
##$TPNAME4= <>
##$TPNAME5= <>
##$TPNAME6= <>
##$TPNAME7= <>
##$TPOAL= (0..7)
0.5 0.5 0.5 0.5 0.5 0.5 0.5 0.5 
##$TPOFFS= (0..7)
0 0 0 0 0 0 0 0 
##$TUNHIN= 0
##$TUNHOUT= 0
##$TUNXOUT= 0
##$USERA1= <user>
##$USERA2= <user>
##$USERA3= <user>
##$USERA4= <user>
##$USERA5= <user>
##$V9= 5
##$VALIST= <valist>
##$VCLIST= <CCCCCCCCCCCCCCC>
##$VD= 0
##$VDLIST= <DDDDDDDDDDDDDDD>
##$VPLIST= <PPPPPPPPPPPPPPP>
##$VTLIST= <TTTTTTTTTTTTTTT>
##$WBST= 1024
##$WBSW= 4
##$XGAIN= (0..3)
0 0 0 0 
##$XL= 0
##$YL= 0
##$YMAX_a= 249864
##$YMIN_a= -398124
##$ZGOPTNS= <>
##$ZL1= 120
##$ZL2= 120
##$ZL3= 120
##$ZL4= 120
##$ABSF1= 0
##$ABSF2= 0
##$ABSG= 0
##$ABSL= 0
##$ALPHA= 0
##$AQORDER= 0
##$ASSFAC= 0
##$ASSFACI= 0
##$ASSFACX= 0
##$ASSWID= 0
##$AUNMP= <proc_1d>
##$AZFE= 0.1
##$AZFW= 0.1
##$BCFW= 0
##$BC_mod= 2
##$BYTORDP= 0
##$COROFFS= 0
##$CY= -3
##$DATMOD= 1
##$DC= 0
##$DFILT= <>
##$DTYPP= 0
##$F1P= 0
##$F2P= 0
##$FCOR= 1
##$FTSIZE= 16384
##$FT_mod= 6
##$GAMMA= 0
##$GB= 0
##$INTBC= 1
##$INTSCL= 3.241238e-09
##$ISEN= 128
##$LB= 0.25
##$LEV0= 0
##$LPBIN= 0
##$MAXI= 10000
##$MC2= 0
##$MEAN= 0
##$ME_mod= 0
##$MI= 1.114404
##$NCOEF= 0
##$NC_proc= -6
##$NLEV= 6
##$NOISF1= 3.799351
##$NOISF2= 2.8
##$NSP= 0
##$NTH_PI= 0
##$NZP= 0
##$OFFSET= 15.48687
##$PC= 1
##$PHC0= -7255.922
##$PHC1= 7.421964
##$PH_mod= 1
##$PKNL= yes
##$PPARMOD= 0
##$PSCAL= 0
##$PSIGN= 0
##$REVERSE= no
##$SF= 200.130006971044
##$SI= 16384
##$SIGF1= 3
##$SIGF2= 2
##$SINO= 0.751879
##$SIOLD= 32768
##$SREGLST= <19F.Aceton>
##$SSB= 0
##$STSI= 16384
##$STSR= 0
##$SW_p= 3612.71676300578
##$SYMM= 0
##$S_DEV= 0
##$TDeff= 16384
##$TDoff= 0
##$TI= <>
##$TILT= no
##$TM1= 0
##$TM2= 0
##$TOPLEV= 0
##$USERP1= <user>
##$USERP2= <user>
##$USERP3= <user>
##$USERP4= <user>
##$USERP5= <user>
##$WDW= 1
##$XDIM= 16384
##$YMAX_p= 313024812
##$YMIN_p= -636419
$$ End of Bruker specific parameters
$$ ---------------------------------
##NTUPLES= NMR SPECTRUM
##VAR_NAME=  FREQUENCY,     SPECTRUM/REAL,   SPECTRUM/IMAG
##SYMBOL=    X,             R,               I
##VAR_TYPE=  INDEPENDENT,   DEPENDENT,       DEPENDENT
##VAR_FORM=  AFFN,          ASDF,            ASDF
##VAR_DIM=   16384,         16384,           16384
##UNITS=     HZ,            ARBITRARY UNITS, ARBITRARY UNITS
##FACTOR=    0.220516191357247, 1,           1
##FIRST=     3099.38736343756, 0,            0
##LAST=      -513.329399568224, 0,           0
##MIN=       -513.329399568224, -636419,     0
##MAX=       3099.38736343756, 313024812,    0
$$ Real data points
##PAGE= N=1
##DATA TABLE= (X++(R..R)), XYDATA
$$ [...]
9054D6344N290l690P010N3072j15984m5169J6187j2410j4840L3640J7052n312
$$ 46344 51634 47944 54954 108026 -7958 -53127 -36940 -49350 -64190 -30550 -13498 -18810
9042a8810J7543k872l6585o4574k1450j2245J3983O3843r182J1881N0604K7540
$$ -18810 -1267 -4139 -40724 -105298 -126748 -138993 -125010 -61167 -70349 -58468 -7864 19676
9030A9676m6988J7376L5671J222o4295Q835O09K631J5725o062o649k975j4177
$$ 19676 -27312 -9936 25735 26957 -37338 -28503 -27894 -25263 -9538 -15600 -22249 -25224 -39401
9017c9401J6369n936J1153O3922J4302m1976k9655j3760K2728O0135o1199L0373
$$ -39401 -23032 -28968 -17815 46107 60409 18433 -11222 -24982 -2254 57881 -3318 27055
9005B7055m3611l3999L1545M8406m8353K6089O9713k4845M6977o414l9744M2565
$$ 27055 -16556 -50555 -19010 29396 -18957 7132 76845 52000 98977 92563 52819 95384
8993I5384M174N208k6009j8203j3947n556l7294k0371M7827n6382m5251Q0128
$$ 95384 99558 104766 78757 60554 46607 41051 3757 -16614 31213 -25169 -70420 9708
8981I708q590N4638P869l5089l9856J045N0849N4185n6992k1815J9560o6214Q8418
$$ 9708 1118 55756 63625 28536 -11320 -10275 40574 94759 37767 15952 35512 -30702 57716
8968E7716O8048j9212j6820o076o0955M886R509o02P5695n1447n0884O0572m499
$$ 57716 125764 106552 89732 83656 22701 27587 37096 36494 112189 60742 9858 70430 65931
8955F5931J6281M6412q498j0283L2868L7677l7840o4531K6976L3364K5200P74
$$ 65931 82212 128624 120126 109843 142711 180388 142548 78017 104993 138357 163557 164331
8943A64331O1736k1875q4557K1979l0807k3283J5538N9160n5135K7939J495k0297
$$ 164331 226067 204192 119635 141614 110807 87524 103062 162222 107087 135026 136521 116224
8931A16224m0811N0929R876J3726N1911j6020o2821k0201K8858J6801j0658J2008
$$ 116224 75413 126342 136218 149944 201855 185835 123014 102813 131671 148472 137814 149822
8919A49822N721L365K0234r445J24844o3464O530l5319m1011J0781j9544J1517
$$ 149822 155543 158908 179142 169697 294541 231077 237607 202288 161277 172058 152514 164031
8907A64031M8380J3064M683r1595l1579O8156K0327j6553N4880O2374j15577k7831
$$ 164031 212411 225475 230158 138563 106984 175140 195467 178914 233794 296168 180591 152760
8895A52760j0580N3685P7679K5026m7794M814o058j1462L8050j5910O2052k7617
$$ 152760 142180 195865 273544 298570 250776 255590 249532 238070 276120 260210 322262 294645
8883B94645o8881M9044k6930J10265O4112o7252m5164K7000o89L742o6189O6322
$$ 294645 225764 274808 247878 358143 422255 355003 309839 336839 336150 339892 273703 340025
8871C40025l609m0202K4543m6022M2131K60l5484N504L4170n0710k4920o6836
$$ 340025 336416 296214 320757 274735 316866 317126 281642 287146 321316 270606 245686 178850
8859A78850J17933J2572m64P8000n6173o4518K3840J9292M9407J1401R8371l5033
$$ 178850 296783 309355 308891 386891 330718 266200 290040 309332 358739 370140 468511 433478
8847D33478m2968j0976K4270L2873m7223Q6776j0555K9591n476r4488j090M6052
$$ 433478 390510 379534 403804 436677 389454 476230 465675 495266 489790 395302 394212 440264
8835D40264L1629p5235O6231K1144j390m515L4417l1987L3969M1427m6073M6904
$$ 440264 471893 396658 462889 484033 482643 478128 512545 480558 514527 555954 509881 556785
8823E56785J33840K4170q2278k1939K1954J8808m4679J052N5599L6288m8968Q2500
$$ 556785 690625 714795 632517 610578 632532 651340 606661 607713 663312 699600 650632 733132
8811G33132L478j9673l3438L0062M1556j742m825L7921o74o893P1763k775p1019
$$ 733132 736610 716937 683499 713561 755117 753375 748550 786471 785797 778904 850667 847892 776873
8798G76873L4526N3764M8175n0997P1737M7937L9310k5975P355N5368l6418P8930
$$ 776873 811399 865163 913338 862341 934078 982015 1021325 995350 1002705 1058073 1021655 1100585
8786A100585L6232N3432j3362L1406L4791K4886L0222P3642J791J8211K9439J14310
$$ 1100585 1136817 1190249 1176887 1208293 1243084 1267970 1298192 1371834 1373625 1391836 1421275 1535585
8774A535585M5662n730O1926O8379l7923M8425J12546K8755L9028Q3798M1981
$$ 1535585 1581247 1575517 1637443 1705822 1667899 1716324 1828870 1857625 1896653 1980451 2022432
8763B022432L4251Q436J34246J26937K5447J01152J30471J17396L4555J01183
$$ 2022432 2056683 2065119 2199365 2326302 2351749 2452901 2583372 2700768 2735323 2836506
8753B836506J32391R6503J38020K02471J74363J42062J92597J30174J16940L02874
$$ 2836506 2968897 3065400 3203420 3405891 3580254 3722316 3914913 4045087 4162027 4464901
8743D464901K49073K30989J68585K53652L17492L99672L93595L54028M74924M40989
$$ 4464901 4713974 4944963 5113548 5367200 5684692 6084364 6477959 6831987 7306911 7747900
8733G747900M60919N12728M35688N00156M43532L86899M85600N30130N32802N39998
$$ 7747900 8208819 8721547 9157235 9657391 10100923 10487822 10973422 11503552 12036354 12576352
8723A2576352N47035N99729N55699N62338N13595L90060L70065M18189L32090
$$ 12576352 13123387 13723116 14278815 14841153 15354748 15744808 16114873 16533062 16865152
8714A6865152J21720O3765j1579j72997k60336l34576l47662m81413m67696m76870
$$ 16865152 16986872 17050637 17039058 16866061 16605725 16271149 15923487 15442074 14974378 14497508
8704A4497508n79628o84848n47859n45292m99273m70365n42659m90794m91836
$$ 14497508 13917880 13233032 12685173 12139881 11640608 11170243 10627584 10136790 9644954
8695I644954m01479l97636m48678l90156l07685k59569k40161k30142j48378j66326
$$ 9644954 9243475 8845839 8397161 8007005 7699320 7439751 7199590 6969448 6821070 6654744
8685F654744k43440k03482j52528j54714k34022k48171k96248k53727k72344k76626
$$ 6654744 6411304 6207822 6055294 5900580 5666558 5418387 5122139 4868412 4596068 4319442
8675D319442j88765j49794j43461j35338j34145j32840j49370j04356j11722l3940
$$ 4319442 4130677 3980883 3837422 3702084 3567939 3435099 3285729 3181373 3069651 3035711
8665C035711m6322j77228j6689J8652j4346O0929Q4998M4102O4569j5603J9337
$$ 3035711 2989389 2812161 2795472 2814124 2799778 2860707 2945705 2989807 3054376 3038773 3058110
8654C058110j05775j60634j57262j46962k38263j31434j04500m9361k19420q4599
$$ 3058110 2952335 2791701 2634439 2487477 2249214 2117780 2013280 1963919 1744499 1659900
8644A659900k5775r4186o570n4605n9053j0798j4657o6876L252n5607j04880k348
$$ 1659900 1634125 1539939 1533369 1478764 1419711 1408913 1394256 1327380 1330632 1275025 1170145 1167797
8632A167797J9785r130O891J4292q1830q2704J6651r69l3380j3071L5203j8524
$$ 1167797 1187582 1178452 1185343 1199635 1117805 1035101 1051752 1050783 1017403 1004332 1039535 1021011
8620A021011J9739l0368k2012l491M8601l348j5062R4520M0286J29795J12984
$$ 1021011 1040750 1010382 988370 984879 1033480 1030132 1015070 1109590 1149876 1279671 1392655
8609A392655J49209J79379k6610j06346k2185j07317j77588n9747j03131q7956
$$ 1392655 1541864 1721243 1694633 1588287 1566102 1458785 1281197 1221450 1118319 1030363
8599A030363p8925j03167k202m2350j55614l9482L8397q4118K1293l3115m4370
$$ 1030363 951438 848271 846069 803719 648105 608623 647020 562902 584195 551080 506710
8588E06710J5269l1681R558J6701L5218l7055n2719j56563j65382L01434P0158
$$ 506710 521979 490298 499856 516557 551775 514720 462001 305438 140056 441490 511648
8577E11648j2242P1395l9460l4106j2256J6793l7375L847m8981O8334J0334j12881
$$ 511648 499406 570801 531341 497235 484979 501772 464397 468244 419263 487597 497931 385050
8565C85050m2224N3160N0970L7049j05802M575J02766K8713l6726Q2215K9523
$$ 385050 342826 395986 446956 484005 378203 382778 485544 514257 477531 559746 589269
8554E89269J4163L2666K5288M4988K1388N2509R2408J39008J49195K67953M66185
$$ 589269 603432 636098 661386 706374 727762 780271 872679 1011687 1160882 1428835 1895020
8543A895020N76320P30150Q05901N91380J05585l04026l95738m94324n80389n16578
$$ 1895020 2471340 3201490 4007391 4598771 4704356 4400330 4004592 3510268 2929879 2413301
8533B413301m42540l19850l09292k27151j56096j65134p6482n2647q3037J7646
$$ 2413301 1970761 1650911 1341619 1114468 958372 793238 716756 664109 581072 598718
8523E98718r4202m3843N095l5905J5321j6889m0075k7805R9634o3575l9347K0484
$$ 598718 504516 460673 465768 429863 445184 428295 388220 360415 460049 396474 357127 377611
8511C77611O874L6626k6920l1599L6102n417m4099l8518j2752J9726m9990q0217
$$ 377611 384485 421111 394191 362592 398694 393277 349178 310660 297908 317634 267644 187427
8499A87427p474k7L1949m2904l9656m768M5303M936p659m3336j5187k1878m279
$$ 187427 179953 179926 211875 168971 129315 124547 169850 174786 167127 123791 108604 86726 82447
8486H2447J1645J0973J4080j9909P5765k9159n6693O8220L3941j26348N48O1036
$$ 82447 94092 105065 119145 99236 175001 145842 89149 157369 191310 64962 65510 126546
8474A26546J6940N036L3580q8123q3664R186K8822P963R6553l6889J3008L943
$$ 126546 143486 148522 182102 93979 10315 19501 48323 56286 152839 115950 128958 132901
8462A32901J2281J0253o4100K6607j1984o1505l7139M0850J3541l3970M1053J655
$$ 132901 145182 155435 91335 117942 105958 44453 7314 48164 61705 27735 68788 70443
8450G0443J4967K023L418K0037p341l622r8144J9324m8194n6474J27944O9036
$$ 70443 85410 87433 90851 110888 103547 99925 1781 21105 -27089 -83563 44381 113417
8438A13417n1298r2960M4956N2961r1820J8107J9433K7143J4196M339l2104k0537
$$ 113417 62119 -30841 14115 67076 -24744 -6637 12796 39939 54135 58474 26370 5833
8426E833n0598J7839L0089j2945K55O8633K578K2289k4961o5544j3269K9826J0356
$$ 5833 -44765 -26926 3163 -9782 -9527 59106 61684 83973 59012 -6532 -19801 10025 20381
8413B0381N1575n113j07646j249j4459L085P1330j2184l6817l583m234P171Q266
$$ 20381 71956 66843 -40803 -42052 -56511 -53426 17904 5720 -31097 -34680 -38914 -31743 -23477
8400b3477O1433J6905j8269j2715k1298j5538m1835R058R5641L1145q4558m1622
$$ -23477 37956 54861 36592 23877 2579 -12959 -54794 -45736 49905 81050 -3508 -45130
8388d5130J0368p675J7825J4242j7005J0665J9595m7481N6319l6161K6430J8307
$$ -45130 -34762 -42437 -24612 -10370 -27375 -16710 2885 -44596 11723 -24438 1992 20299
8376B0299l6256k9262k1751P9677J7195o631q0568j4342L3725o3324k0292k3624
$$ 20299 -15957 -45219 -66970 12707 29902 23271 -57297 -71639 -37914 -101238 -121530 -145154
8364a45154J6116P1823K6663l5737k74k724M3482K4131m8301K583M253K2m9379
$$ -145154 -129038 -57215 -30552 -66289 -66563 -69287 -25805 -1674 -49975 -47392 -43139 -43117 -92496
8351i2496O5308J6314m1371R896l6333k7662N1981k0212Q137j5402n7280L0735
$$ -92496 -27188 -10874 -52245 -42349 -78682 -106344 -54363 -74575 -66438 -81840 -139120 -108385
8339a08385L1400o7169J06488P714l9271j6470J7396J1402j3388j5206K8547J293
$$ -108385 -76985 -144154 -37666 -29952 -69223 -85693 -68297 -56895 -70283 -85489 -56942 -55649
8327e5649j6143P0856l0742o1670K3725N6276L5415L031K6829Q6791n8143m2557
$$ -55649 -71792 -936 -31678 -93348 -69623 -13347 22068 25099 51928 138719 80576 38019
8315C8019j13417P2815K2724J1818q3301r758k184P6623O6191O760J2178M0662
$$ 38019 -75398 -2583 20141 31959 -51342 -61100 -63284 13339 79530 86290 98468 139130
8303A39130l007m6045P3023l9120M1245j4848J0825O868q347K781L7085J0418
$$ 139130 136123 90078 163101 123981 165226 150378 161203 168071 159724 162505 199590 210008
8291B10008K0292N1982p5011n0435Q172n8944n4954o967j1488J4072Q737n6605
$$ 210008 230300 282282 207271 156836 165008 106064 51110 44143 32655 46727 55464 -1141
8279a141M9347m3910k6300M3464n405J2197m0751L1742L1964o2498Q448K6617
$$ -1141 48206 4296 -22004 21460 16055 28252 -12499 19243 51207 -11291 -2843 23774
8267B3774m6957L0451k4358K4740L8597R555l7893n6972O848m3734Q919K4781
$$ 23774 -23183 7268 -17090 7650 46247 55802 17909 -39063 -32215 -75949 -67030 -42249
8255d2249K2044K8330k6077L6159J9449j8177L5633j1407m9227m9316k1012L5985
$$ -42249 -20205 8125 -17952 18207 37656 19479 55112 43705 -5522 -54838 -75850 -39865
8243c9865p801J8991j7404j0833J9153L2074l4713k7822r208l7784L6110L7555
$$ -39865 -47666 -28675 -46079 -56912 -37759 -5685 -40398 -68220 -77428 -115212 -79102 -41547
8231d1547k7895N9783j0547q4096J7400K3265O3473O845p1885m030l3865l0876
$$ -41547 -69442 -9659 -20206 -104302 -86902 -63637 -164 6681 -65204 -69234 -103099 -133975
8219a33975P5886M9268j7407m6921L6028M611o8977N5269Q8818J4898P992j0083
$$ -133975 -58089 -8821 -26228 -73149 -37121 -32510 -101487 -46218 42600 57498 65490 55407
8207E5407j01968l8538K1252J0033L6829N1378q108O825L3544p4138J05104N6854
$$ 55407 -46561 -85099 -63847 -53814 -16985 34393 26285 33110 66654 -7484 97620 154474
8195A54474L3433k3300J57991n68983j52762L33425j22034R3054J836Q675n0865
$$ 154474 187907 164607 322598 -246385 -399147 -65722 -187756 -94702 -92866 -84191 -135056
8184a35056M3816J4488J4515P3477M0223m586l4339l2213P130m7995l3812K6947
$$ -135056 -91240 -76752 -62237 11240 51463 46877 12538 -19675 -12545 -60540 -94352 -67405
8172f7405O1858R766m0658j4438L7148p0399L3714J5869O785K0558N288R9294
$$ -67405 -5547 4219 -36439 -50877 -13729 -84128 -50414 -34545 -27760 -7202 -1914 97380
8160I7380J6701q4009j9081r443K5960M1070J1150M793O7613M1801J7890L2709
$$ 97380 114081 30072 10991 1548 27508 68578 79728 84521 152134 193935 211825 244534
8148B44534K8627O999J20966J99874J18817J14472J41286Q7400r126l8582l7278
$$ 244534 273161 280160 401126 601000 719817 834289 975575 1062975 1053849 1015267 977989
8137I77989j14954p0249N5490k3106J3917R8435J67645O1577l810j01723q4068
$$ 977989 863035 792786 848276 825170 839087 937522 1105167 1166744 1162934 1061211 977143
8126I77143j45346q7832k06923m8417p4225r4002q9967j0622M6936j2696j22972
$$ 977143 831797 743965 537042 488625 414400 320398 230431 219809 266745 254049 131077
8115A31077K0517J2375n9085M5336J6739L9133m3971q4078p4233K5083L0648K6569
$$ 131077 151594 163969 104884 150220 166959 206092 162121 78043 3810 28893 59541 86110
8103H6110m1705n7133j940P1759k2019N2954M5911l3432k8194M5722j9539J6704
$$ 86110 44405 -12728 -14668 57091 35072 88026 133937 100505 72311 118033 98494 115198
8091A15198o109j7294m6186J5550R371O0788K9510j2864k4885O627J2332j221
$$ 115198 109089 91795 45609 61159 70530 131318 160828 147964 123079 129706 142038 140817
8079A40817N6106k0866k8162K7191M9827O6060R1437L1633R4377J09436R1998
$$ 140817 196923 176057 147895 175086 224913 290973 382410 414043 508420 617856 709854
8068G09854R5110J73624P0102P0965K5736j06158j22457n1346q342o969L064l9790
$$ 709854 804964 978588 1048690 1119655 1145391 1039233 916776 865430 857088 850119 853183 813393
8056H13393N7281O4501O5791p015o3737j46929l5752j08237j03074n6668o1379
$$ 813393 870674 935175 1000966 993951 930214 783285 747533 639296 536222 479554 418175
8045D18175k610q0742n6382o2201k8654o0720k8412R238o1223r3952P5803M8559
$$ 418175 415565 334823 278441 216240 187586 126866 98454 107692 46469 -47483 28320 76879
8033G6879J5881J7423n1766o1002K3616K563m7121j632K7401J4274O69O7071q6845
$$ 76879 92760 110183 58417 -2585 21031 23594 -23527 -25159 2242 16516 17185 84256 -2589
8020b589k0022R1847l8699P10l8369k5440N6845m1942k5701O2147M0718j5989
$$ -2589 -22611 69236 30537 31247 -7122 -32562 24283 -17659 -43360 18787 59505 43516
8008D3516J4523r004l4067l1660L1091M5945l3206k0783r978r0784L0512J5635
$$ 43516 58039 49035 14968 -16692 14399 60344 27138 6355 -3623 -94407 -63895 -48260
7996d8260O3982K3540J7221r3716K5949k1410m8967j616L9582L8301k2276L4080
$$ -48260 15722 39262 56483 -37233 -11284 -32694 -81661 -83277 -43695 -5394 -27670 6410
7984F410L515L7067k7899k3362J0944N8813j0054j6398K6551J5248p383J3032
$$ 6410 9925 46992 19093 -4269 6675 65488 55434 39036 65587 80835 73452 86484
7972H6484l0071J12898N7499K4867O4355K8944J06452P7889k8377J07720N3285
$$ 86484 56413 169311 226810 251677 316032 344976 451428 529317 500940 608660 661945
7961F61945O0902j1419l5507J8875K1630Q266N6866M2984q8383r0804l1752j05113
$$ 661945 722847 711428 675921 694796 716426 724692 781558 824542 736159 645355 613603 508490
7949E08490o1489m1290J008p8840q7324P8469l6883j11764n0291J3081o3997k6238
$$ 508490 447001 405711 406719 327879 240555 319024 282141 170377 120086 133167 69170 42932
7937D2932l661R0777K2563p3734k8909J3478l0429O7219q933o2073L4394m0573
$$ 42932 39271 130048 152611 78877 49968 63446 33017 100236 91303 29230 63624 23051
7925B3051L8995K6389l2293q7995m6901N9023M5981n2363J7805q0865N3886O133
$$ 23051 62046 88435 56142 -31853 -78754 -19731 26250 -26113 -8308 -89173 -35287 -29154
7913b9154P4566R652k406K3276p3963J14n5894k2421Q4513L331K066K0088p9184
$$ -29154 45412 55064 52658 75934 1971 2085 -53809 -76230 8283 11614 13680 33768 -45416
7900d5416m4893k3876N3599p9406m5659M5720R5212l5900K7962Q887K5250n2069
$$ -45416 -90309 -114185 -60586 -139992 -185651 -139931 -44719 -80619 -52657 -43770 -18520 -70589
7888g0589K6672N0712j3199J4245j8495o9036K6129Q8372k3998m8539M3298j4272
$$ -70589 -43917 6795 -6404 7841 -10654 -79690 -53561 34811 10813 -37726 5572 -8700
7876h700n1493P4893m8322r172K0072N1210n9713o5759K0719J6275M7643K2350
$$ -8700 -60193 14700 -33622 -42794 -22722 28488 -31225 -96984 -76265 -59990 -12347 10003
7864A0003J3921k8256o4833L7206l6842K8977L0587m3227R398m2612k75J4919
$$ 10003 23924 -4332 -69165 -31959 -68801 -39824 -9237 -52464 -43066 -85678 -85953 -71034
7852g1034N6231M5188q3285K6698K0284K0095J905m8752k7643n1073N0465K1494
$$ -71034 -14803 30385 -52900 -26202 -5918 14177 16082 -32670 -60313 -111386 -60921 -39427
7840c9427j0478k6321K8472J4585K4566l0911l602j7533m3501R379M4364P6844
$$ -39427 -49905 -76226 -47754 -33169 -8603 -39514 -43116 -60649 -104150 -94771 -50407 26437
7828B6437K8097p8326l3409J8687k4564L4221L606L3968k7608q552M0566o188
$$ 26437 54534 -23792 -57201 -38514 -63078 -28857 -25251 8717 -18891 -27443 13123 6935
7816F935o0008J1869l9033j8092O6700L0482O0282m6344j0959J3912K9937R1628
$$ 6935 -53073 -41204 -80237 -98329 -31629 -1147 59135 12791 1832 15744 45681 137309
7804A37309l8737m3778j1946j1476O938K604J9032J3900L4129n0450K5065m859
$$ 137309 98572 54794 42848 31372 38310 40914 59946 73846 107975 57525 82590 77731
7792G7731k5384k7304L8457J17314J8305q3769P1J0121l0814m7722l3964J747
$$ 77731 52347 25043 63500 180814 199119 115350 115421 125542 94728 47006 13042 14789
7780A4789M2690K8459N6645O0571K6046K8433l9365l2053K5984r3271j6718K8383
$$ 14789 57479 85938 142583 203154 229200 257633 218268 186215 212199 118928 102210 130593
7768A30593k2374n5980j477n673j6198J772j0216n4801m964K4341Q916L2530P6334
$$ 130593 108219 52239 50762 45089 28891 30663 20447 -34354 -39318 -14977 -6061 26469 102803
7755A02803j7144m9725P0354Q1300k1584m8629j8684k9563J09000R3740J14938
$$ 102803 85659 35934 106288 187588 166004 117375 98691 69128 178128 271868 386806
7744C86806R1224K6528m2411j4126q0554q1928o4291P8896p6289o0137P0957m1894
$$ 386806 478030 504558 462147 448021 367467 285539 221248 300144 223855 163718 234675 192781
7732A92781n9377o2559j1423K2815n502J3216o7883K2797M1235k7126O1188J9712
$$ 192781 133404 70845 59422 82237 76735 89951 22068 44865 86100 58974 120162 139874
7720A39874n1037L3532N8698J0735R7960J23047O7145L9224R2392M13o1909K4713
$$ 139874 88837 122369 181067 191802 289762 412809 479954 519178 611570 611983 550074 574787
7708E74787o264m2342m5272j3421p1119m5990o3513j7046M409j02587o3959L3116
$$ 574787 568523 526181 480909 467488 396369 350379 286866 269820 274229 171642 107683 140799
7696A40799m0432R937J55l389K9907P9410O6778j4676j4525L0881M5277O411m8311
$$ 140799 100367 110304 110459 107070 136977 216387 283165 268489 253964 284845 330122 336533 288222
7683B88222M3266J1187J9094P5659J9808l5200n0775j02491j2779M510o2389l49
$$ 288222 331488 342675 361769 437428 457236 422036 371261 268770 255991 260501 198112 197763
7671A97763o8126l36j2362j6372K4586j4547k7163R354K5416L500n5703M2585
$$ 197763 129637 129301 116939 100567 125153 110606 83443 92797 118213 121713 66010 108595
7659A08595K738J4769K3587Q5150n602p7614j1075k1169K7356r6308m4210J16264
$$ 108595 111333 126102 149689 234839 229237 151623 140548 119379 146735 50427 6217 122481
7647A22481K2185n7036p227P570j1240n5194M7972J6169o8369J6228L6058n855
$$ 122481 144666 87630 80403 87973 76733 21539 69511 85680 17311 33539 69597 63742
7635F3742n4330j8068l3589k356M9027l6768L3663O5271o2055M322j6776j8787
$$ 63742 9412 -8656 -42245 -44601 4426 -32342 1321 66592 4537 8859 -7917 -26704
7623b6704j6601K9368l2433j2658M2782L9738m3729k9356K785n4511L342K4407
$$ -26704 -43305 -13937 -46370 -59028 -16246 23492 -20237 -49593 -46808 -101319 -97977 -73570
7611g3570J9950J628J19370R168k4748j7112r8525K1714K5372O4743j5544m5378
$$ -73570 -53620 -51992 67378 76546 51798 34686 -63839 -42125 -16753 47990 32446 -12932
7599a2932o895n667l1866M7617p207L3752k7080m1271q0081K764j7863L8115Q530
$$ -12932 -19827 -25494 -57360 -9743 -16950 16802 -10278 -51549 -131630 -128866 -146729 -108614 -100084
7586a00084L2978j0329J7612L2167J1572J1035l7775O1717N7834j2595n7786k2451
$$ -100084 -67106 -77435 -59823 -27656 -16084 -5049 -42824 18893 76727 64132 6346 -16105
7574a6105k4264L436j7119R1813J3034J5076k4825l0420j5866j121j5114L3243
$$ -16105 -40369 -36933 -54052 37761 50795 65871 41046 10626 -5240 -6361 -21475 11768
7562A1768m432J7935r11J422l9770M4041m0605l6150K7942q985J7372K1220q4328
$$ 11768 7336 25271 24360 25782 -13988 30053 -10552 -46702 -18760 -27745 -10373 10847 -73481
7549g3481L0486j091k2780K1724Q5941L6451q4458l6365J8751M7414m5996K5730
$$ -73481 -42995 -44086 -66866 -45142 40799 77250 -7208 -43573 -24822 22592 -23404 2326
7537B326J3203N0644L2330n2278k2876j7236N2781J7594j6596l016p822K6030
$$ 2326 15529 66173 98503 46225 23349 6113 58894 76488 59892 56876 49054 75084
7525G5084l8349p207n0888k0718N2604J6893J9616j3161j6267L731j3897P539
$$ 75084 36735 29528 -21360 -42078 10526 27419 47035 33874 17607 21338 7441 14980
7513A4980n7478N5888K7445r8226N578O1374j3591n8032l8217O7779K3516O084
$$ 14980 -42498 13390 40835 -57391 -51813 9561 -4030 -62062 -100279 -32500 -8984 -2900
7501b900N8443N957k1290k0771L1271k6303k8742k5683l5494P8680K7655o0838
$$ -2900 55543 61500 40210 19439 50710 24407 -4335 -30018 -65512 13168 40823 -20015
7489b0015o913N7436M4381o1702L9841j9850j2194L1500J5634o4926M7702L8602
$$ -20015 -26928 30508 74889 13187 53028 33178 20984 52484 68118 3192 50894 89496
7477H9496r17o3523J6238J9108L742k4404o2832J17195l1268R379j7276j7964
$$ 89496 88579 25056 41294 60402 64144 39740 -23092 94103 62835 72214 54938 36974
7465C6974J3257N3825K9369k6814K9668m6672K4490L5255p0775q5j2862n2777
$$ 36974 50231 104056 133425 106611 136279 89607 114097 149352 78577 78492 65630 12853
7453A2853L3902K3069l4311p967P221M779l075k5647k4954P8916L5888k1454J5951
$$ 12853 46755 69824 35513 27546 34767 39546 36471 10824 -14130 64786 100674 79220 95171
7440I5171J04536Q3217l7153l8426O0876J4753k4621j0260k6105L3223K8347o9810
$$ 95171 199707 282924 245771 207345 268221 282974 258353 248093 221988 255211 283558 213748
7428B13748q104L4662j9586l0056J8838K4520J7793r192j8244m7988N9849l0824
$$ 213748 205644 240306 220720 190664 209502 234022 251815 242623 224379 176391 236240 205416
7416B05416o3953Q7014K6177O1195L0859r409Q9863O4039N7388N4197N435K3494
$$ 205416 141463 228477 254654 315849 346708 337299 427162 491201 548589 602786 608221 631715
7404F31715p6184N695j6797l4635j2718M5934j3718K72M5552M7664K5312J15541
$$ 631715 555531 561226 544429 509794 497076 543010 529292 529564 575116 622780 648092 763633
7392G63633J4144j04913O0343m3738l1942K7673m2049m0774j9630m1104m3005
$$ 763633 777777 672864 733207 689469 657527 685200 643151 602377 582747 541643 498638
7381D98638M0888J5216J3957P0639j4951N919k7115n4680m7983M0334K4852Q19
$$ 498638 539526 554742 568699 639338 624387 630306 603191 548511 500528 540862 565714 566533
7369E66533j14807P5986R1866J6207J00105n9496j18485R3307N3772p7200o1100
$$ 566533 451726 527712 619578 635785 735890 676394 557909 651216 704988 627788 566688
7358E66688J688J5828n4565l2504P717R8037l8912K4180j6010j7024J1962K19
$$ 566688 568376 584204 529639 497135 504852 602889 563977 588157 572147 555123 567085 567304
7346E67304O4549O4315O2890k7316n128j647n8194J292J1771j788j9404J0858
$$ 567304 631853 696168 759058 731742 726614 724967 666773 668065 679836 678048 658644 669502
7334F69502N7169O6357M4279j2260j2628R150J8830J7946J54608P9034J61229
$$ 669502 726671 793028 837307 825047 812419 821569 840399 858345 1012953 1091987 1253216
7323A253216J79469O7108M1040J86623J83595K64737K41517K57440M25734M20276
$$ 1253216 1432685 1499793 1540833 1727456 1911051 2175788 2417305 2674745 3100479 3520755
7313C520755L15686M76526O53566O60065R64980J363378J976356L290081M778354
$$ 3520755 3836441 4312967 4966533 5626598 6591578 7954956 9931312 13221393 17999747
7304A7999747N800689O893978O647120K762107j506412k928702m027140n066991
$$ 17999747 23800436 30694414 37341534 40103641 38597229 35668527 31641387 26574396
7296B6574396n041044m019874l290964k826084k212735j557076j090160q15975
$$ 26574396 21533352 17513478 14222514 11396430 9183695 7626619 6536459 5720484
7288E720484o26461m69173k19337j17801J2956p888k5123j8490j49744j29126
$$ 5720484 5094023 4624850 4405513 4287712 4300668 4292780 4267657 4249167 4099423 3970297
7278C970297j13210k10429j86740j47129j20274p9193n2526L5248N330L1604k3030
$$ 3970297 3857087 3646658 3459918 3312789 3192515 3113322 3060796 3096044 3101374 3132978 3109948
7267C109948p9282j65419j53077r2621j46570j28571j12109j00179l4499K1459
$$ 3109948 3030666 2865247 2712170 2619549 2472979 2344408 2232299 2132120 2097621 2119080
7257B119080l6987m0753n1286j09255j26931r1060l4694k1625j27912j28647l815
$$ 2119080 2082093 2041340 1990054 1880799 1753868 1662808 1628114 1606489 1478577 1349930 1346115
7246A346115r6892j47988j24163q8290n1965n9436k6057L0431l6599k9378K8386
$$ 1346115 1249223 1101235 977072 888782 836817 777381 751324 781755 745156 715778 744164
7235G44164K1450P701l2820l6095N912k0703P8137L5084K8412Q5314J60850J16297
$$ 744164 765614 773315 740495 704400 710312 689609 767746 802830 831242 916556 1077406 1193703
7223A193703N9877R4583P7955J01815J4555o0004r3642r7832j10736q9174n188
$$ 1193703 1253580 1348163 1426118 1527933 1542488 1482484 1388842 1291010 1180274 1091100 1085912
7212A085912J4809N6887J51339J0802j24759j5176m6798p7955q3728j04119N008
$$ 1085912 1100721 1157608 1308947 1319749 1194990 1179814 1133016 1055061 971333 867214 872222
7201H72222j56553j32011p0796J307n5230l5414M6967J8700p0218o6926q238m0462
$$ 872222 715669 583658 512862 514169 458939 423525 470492 489192 418974 352048 343810 303348
7189C03348N879J1844K0341O441p647J3208m8966O8796K3792j2902P4497o350
$$ 303348 309227 321071 341412 347853 340206 353414 304448 373244 397036 384134 458631 452281
7177D52281m9482O7941K6197m424J15371J85974J76981J53047R1431P0565L7797
$$ 452281 402799 470740 496937 492513 607884 793858 970839 1123886 1215317 1285882 1323679
7166A323679J4941J03063k4380l3652L851j55910m7568q5843j49698j47502p1171
$$ 1323679 1338620 1441683 1417303 1383651 1387502 1231592 1184024 1098181 948483 800981 729810
7155G29810p4216j50654p6297K010l9172k1458m8228n7203K5267p6434k4027M5311
$$ 729810 655594 504940 428643 430653 391481 370023 321795 264592 289859 213425 189398 234709
7143B34709k7583k9335M1622j2117l6730K0323P247k0695J3035o2226q013l7036
$$ 234709 207126 177791 219413 207296 170566 190889 198136 177441 190476 128250 120237 83201
7131H3201Q5485j016r9711M7000l2387L8193k2493j8504R54J669Q3878p1662q116
$$ 83201 168686 167670 67959 114959 82572 120765 98272 79768 80722 82391 166269 94607 86491
7118H6491K4824J3631n4718j6607L5184j4131r611P3011N6377q2939J2667j3892
$$ 86491 111315 124946 70228 53621 88805 74674 65063 138074 194451 111512 124179 110287
7106A10287k1205q605Q9448j0892L343j1476m5803l5312L1928j5537k5206M837
$$ 110287 89082 80477 169925 159033 162376 150900 105097 69785 101713 86176 60970 65807
7094F5807N2362M6881l5772K3472n6995j4114q5135M755O0938K2693n5328K6607
$$ 65807 118169 165050 129278 152750 95755 81641 -3494 1261 62199 84892 29564 56171
7082E6171P0614N345K298o0369j4639k90J9534l7892m4725O6642Q60n5776m4879
$$ 56171 126785 132130 134428 74059 59420 59130 78664 40772 -3953 62689 63549 7773 -37106
7069c7106K0821R9053N885p8381l7818N2446l468l7448j2619M0091K9108N5942
$$ -37106 -16285 82768 88653 10272 -27546 24900 21432 -16016 -28635 11456 40564 96506
7057I6506o6531j5676l9965j7674Q9083l2216P1869L0625n2432m6503M374P728
$$ 96506 29975 14299 -25666 -43340 45743 13527 85396 116021 63589 17086 21460 29188
7045B9188K1359K5051J3187r3023K6247k6259L6524L0575k2684l6280J5400k2820
$$ 29188 50547 75598 88785 -4238 22009 -4250 32274 62849 40165 3885 19285 -3535
7033c535N0375m1894L6976L1400R1744l2274p0918L386J0616n2000O193K154K1899
$$ -3535 46840 4946 41922 73322 165066 132792 61874 65260 75876 23876 30069 32223 54122
7020E4122Q9807k5162j1862l0715K4801M598J1107p0343L3325N6020m4591J1372
$$ 54122 143929 118767 106905 76190 100991 105589 116696 46353 79678 135698 91107 102479
7008A02479K8178k3525n6679n4726Q9957r06O1071p5263k4304m2641J2941J0867
$$ 102479 130657 107132 50453 -4273 85684 84778 145849 70586 46282 3641 16582 27449
6996B7449M8558K8840p015r2601L2862R7685k9333R549J3560K9833n1459P3278
$$ 27449 76007 104847 97832 5231 38093 135778 106445 115994 129554 159387 107928 181206
6984A81206l6102m6988j623o496J30405j04234l8800R4224n6420n9628N0334N1806
$$ 181206 145104 98116 96493 89997 220402 116168 77368 171592 115172 55544 105878 157684
6972A57684k9149m2193K7897L3196L0685N4852m4621P321r096n2389o141o8008
$$ 157684 128535 86342 114239 147435 178120 232972 188351 195672 186576 134187 128046 60038
6960F0038j8023l5034L8340l8230j5496M1787J5893j2783l8937j7781k9350j4600
$$ 60038 42015 6981 45321 7091 -8405 33382 49275 36492 -2445 -20226 -49576 -64176
6948f4176N0206k9526P196K071P1603l0212J5891Q4282K2267j2272q7490q569
$$ -64176 -13970 -43496 -36300 -34229 37374 7162 23053 107335 129602 117330 29840 21271
6936B1271j4912K4159J9340L8806l7308K2506L906K5769o4921K5525J2603p5951
$$ 21271 6359 30518 49858 88664 51356 73862 77768 103537 38616 64141 76744 793
6924G93j6067R436M10K5590l113o062j1222L1598N3013l0688o245M5808N057Q678
$$ 793 -15274 -5838 -5428 20162 17049 10987 -235 31363 84376 53688 47443 93251 98308 106986
6910A06986k8448n687m4587K7653L8021L8659p8241o3468K4982J2224K9916l222
$$ 106986 78538 72851 28264 55917 93938 132597 54356 -9112 15870 28094 58010 54788
6898E4788l333K0405R4347K011j7879M7723Q5336l6358N559J5283n0957m342l5306
$$ 54788 51455 71860 166207 168218 150339 198062 283398 247040 252599 267882 216925 212583 177277
6885A77277p4305K0146j7441o0235j7057j1044k5070N8957J553N3416K6857o9921
$$ 177277 102972 123118 105677 45442 28385 17341 -7729 51228 52781 106197 133054 63133
6873F3133K823K9727k2505J9479K8944j8460l8241k1027K7757j1534M5736L9949
$$ 63133 65956 95683 73178 92657 121601 103141 64900 43873 71630 60096 105832 145781
6861A45781k1486J5978l3540l9495K4492P81J1285j2691j5337j6714M0541M2403
$$ 145781 124295 140273 106733 67238 91730 92511 103796 91105 75768 59054 99595 141998
6849A41998n3569p1255L6900R673o1907L1956m557l1027K8091m1840L7386k588
$$ 141998 88429 17174 54074 63747 1840 33796 29239 -1788 26303 -15537 21849 19261
6837A9261j4618l084m3456Q7190L3402m125p2156k5041L8036m1017J7005P4816
$$ 19261 4643 1559 -41897 45293 78695 74570 2414 -22627 15409 -25608 -8603 66213
6825F6213M2925m3283J946q5091J9891P9863L9643J7952o6990j7527l0646Q5673
$$ 66213 109138 65855 67801 -17290 2601 82464 122107 140059 73069 55542 24896 110569
6813A10569k7698k6542K1048m0106l6079M0413M8412k1700P943J1424p9867j2174
$$ 110569 82871 56329 77377 37271 1192 41605 90017 68317 76260 87684 7817 -4357
6801d357J9264o6202J4314j246P8354n420n745K9158K2797n4886J05644l3115
$$ -4357 14907 -51295 -36981 -38227 40127 34707 28962 58120 80917 26031 131675 98560
6789I8560j04207K1224K5201q501N8342P177n4667O4010k3854n4397O1245o8224
$$ 98560 -5647 15577 40778 32277 90619 97796 43129 107139 83285 28888 90133 21909
6777B1909j4913l6690k533K8030J4484R7995J7859L9517k6234j0392o5415P854
$$ 21909 6996 -29694 -32227 -4197 10287 108282 126141 165658 139424 129032 63617 71471
6765G1471P1313Q9623O1628M7302Q2389M4503l4755j0315k4154J8333J4074J7063
$$ 71471 142784 232407 294035 341337 423726 468229 433474 423159 399005 417338 431412 448475
6753D48475n532N6681m0847o1972j3993p2103p7952j0325l9927q5931K1601P9817
$$ 448475 442943 499624 458777 396805 382812 310709 232757 222432 182505 96574 118175 197992
6741A97992j6127m3774J4341J2006N7188j0909K6501J20508j5999J9590l5871
$$ 197992 181865 138091 152432 164438 221626 210717 237218 357726 341727 361317 325446
6730C25446N1383L2604M9383O2532P675l6283o5828k1659m8217l4126o6690j46196
$$ 325446 376829 409433 458816 521348 529023 492740 426912 405253 357036 322910 256220 110024
6718A10024l2479P5509N484l5590p8589N2277n0431j1406k9158L1537N7652j5661
$$ 110024 77545 153054 158538 122948 44359 96636 46205 34799 5641 37178 94830 79169
6706G9169K1217K1023M1766r131K1188n8575Q054j2507O3139o1184J570l7724
$$ 79169 100386 121409 163175 154044 175232 116657 124711 112204 175343 114159 115729 78005
6694G8005M7509M0085j34082q029N5556O3782N8476q343l33k3007p935N9634q967
$$ 78005 125514 165599 31517 23488 79044 142826 201302 192959 192626 169619 161684 221318 212351
6681B12351Q56N6839K52p3803J1126M1705k6143L6904N6165j1721K6508M9689
$$ 212351 213207 270046 270298 196495 207621 249326 223183 260087 316252 304531 331039 380728
6669C80728P1050m5459k4523q5200j3345k2931l5731p0746N3749k4926P077N9793
$$ 380728 451778 406319 381796 296596 283251 260320 224589 153843 207592 182666 189743 249536
6657B49536K8196n938j29439j17387N4030O9419m2329J727M298m7063J0680j555
$$ 249536 277732 271794 142355 24968 78998 148417 106088 107815 112113 65050 75730 74175
6645G4175O33J1490m4101N0840N651l9914N241k8007k7994J0892L9463L2131p856
$$ 74175 74808 86298 42197 93037 98688 58774 64015 36008 8014 18906 58369 90500 82644
6632H2644l9475l5777K3725R5173n5457j0467L7980J1425l4448L2585k9563k8101
$$ 82644 43169 7392 31117 126290 70833 60366 98346 109771 75323 107908 78345 50244
6620E0244Q3514j0279k4280J4802P3737K5468m1464l7346j3635k8482n085L7066
$$ 50244 133758 123479 99199 114001 187738 213206 171742 134396 120761 92279 87194 124260
6608A24260k1339j3197M7075o7544N801L8715l2398K221k4441r056M1759J1516
$$ 124260 102921 89724 136799 69255 75056 113771 81373 83594 59153 50097 91856 103372
6596A03372J0829j9695l4871K1349J5549n8951l3071L6921r254M9504l4825m898
$$ 103372 114201 94506 59635 80984 96533 37582 4511 41432 32178 81682 46857 41959
6584D1959M7137K1330j926j12563L4408O2536k4955r3722N5928K3050J0658p4406
$$ 41959 89096 110426 108500 -4063 30345 92881 67926 -25796 30132 53182 63840 -10566
6572a0566M0392L0349j7620K2250n5124M3473k1318j00720q370J13917M8591l7150
$$ -10566 29826 60175 42555 64805 9681 53154 31836 -68884 -77254 36663 85254 48104
6560D8104J1593R4855k6188k0561o573o6289Q8555K5063m4623L7278j3421k3844
$$ 48104 59697 154552 128364 107803 101230 34941 123496 148559 103936 141214 127793 103949
6548A03949q100m0201l6938J00574K6186k6409n587o5117j3326r526O34K2248
$$ 103949 95849 55648 18710 119284 145470 119061 113474 48357 35031 25505 26139 48387
6536D8387k0577M1486P0950m0629n0729P1554M5815n3539M9553k9072J979o2494
$$ 48387 27810 69296 140246 99617 48888 120442 166257 112718 162271 133199 135178 72684
6524G2684l9531R7363m1042L0804k1372k9400p273j7193L243n8057N6807M4814
$$ 72684 33153 130516 89474 120278 98906 69506 62233 45040 48283 -9774 47033 91847
6512I1847j6257q5606l2482J5531K1658J4333J536J9169K3102l315L6128k4353
$$ 91847 75590 -10016 -42498 -26967 -5309 9024 10560 29729 52831 49516 85644 61291
6500F1291M7199p442l8177j2279J6144M8432o784N973r1764k5546L582k113k536
$$ 61291 108490 101048 62871 50592 66736 115168 108384 114357 22593 -2953 629 -1484 -4020
6487d020L1789L7949m8725m3553J5775p085J5871K8709P3243k0182J1532o4255
$$ -4020 27769 65718 16993 -26560 -10785 -17870 -1999 26710 99953 79771 91303 27048
6475B7048L9491N1571j1368k1492n961J6578l5988l4958M3920l2005j7571k5142
$$ 27048 66539 118110 106742 85250 79289 95867 59879 24921 68841 36836 19265 -5877
6463e877N44L5354j437l7204J0376J7705k9164N2718J382k5215o1081O8551P344
$$ -5877 -5333 30021 28584 -8620 1756 19461 -9703 43015 44397 19182 -41899 26652 33996
6450C3996p935K7948M6062o0647q836O9544P0910p2124l0008p7059K3855N8941
$$ 33996 26061 54009 100071 39424 30588 100132 171042 98918 68910 -8149 15706 74647
6438G4647m5758O6778Q969M762j5491l1401N0032j8801n251n2418q5895N4025
$$ 74647 28889 95667 104636 109398 93907 62506 112538 93737 88486 36068 -49827 4198
6426D198r222l6455k794M5780P8914K0482k0183k3864j3010m5551R8758K7147
$$ 4198 -5024 -41479 -44273 1507 80421 100903 80720 56856 43846 -1705 97053 124200
6414A24200o313r182l5344k3465K9226k0746l7041O5115L3225J0498L2245J7576
$$ 124200 117887 108705 73361 49896 79122 58376 21335 86450 119675 130173 162418 179994
6402A79994j28041N6638j0562Q4889K5655o9596o030q1039k0149N5423l7952j1765
$$ 179994 51953 108591 98029 182918 208573 138977 132947 51908 31759 87182 49230 37465
6390C7465K9318N3082k6981k7498M2445m7732j4822L8344o3047j1223M682o848
$$ 37465 66783 119865 92884 65386 107831 60099 45277 83621 20574 9351 14033 7185
6378G185m2230K093K0305L4945p1811R5123L9021L791O7909l1623j26322O294
$$ 7185 -35045 -32952 -12647 22298 -49513 45610 84631 88422 156331 124708 -1614 4680
6366D680R8234N5443l4902m0090j7671j4005P8728O0935k9124p4635M2206M0162
$$ 4680 102914 158357 123455 83365 65694 51689 130417 191352 162228 87593 129799 169961
6354A69961m188j502L7456j042K7057k3844J1216m2500J3481k9295J0355l7262
$$ 169961 165773 164271 201727 200685 227742 203898 215114 172614 186095 156800 167155 129893
6342A29893p693N1408M779L3909J9904k7488M6143J2565l0461O232M3671k63p2756
$$ 129893 122200 173608 178387 212296 232200 204712 250855 263420 232959 239191 282862 282599 209843
6329B09843P2596J6257J5266K3531q3082m7871K8417M6202k2782m0611k0932K4984
$$ 209843 282439 298696 313962 337493 254411 206540 234957 281159 258377 217766 196834 221818
6317B21818J6215O8554m7570J7851Q3613l7607l7531J9916k032m8214L6508N169
$$ 221818 238033 306587 259017 276868 360481 322874 285343 305259 303227 255013 291521 296690
6305B96690R817J7942J2134L2246n3611p0798L3060J15399k2395K619l6540n439
$$ 296690 306507 324449 336583 368829 315218 244420 277480 392879 370484 373103 336563 331124
6293C31124L9351j7538P9240J7950n6786l4398j6411K8107M9155j7307J9051r638
$$ 331124 370475 352937 432177 450127 393341 358943 342532 370639 419794 402487 421538 411900
6281D11900J694M7964j993K8114O460M0855j2685K9080q8661O0236O1418q781
$$ 411900 413594 461558 459565 487679 494139 534994 522309 551389 462728 522964 584382 575601
6269E75601N6045J0729j1493K3275k8876O0353M0032j5408N9557L6382k9110L4991
$$ 575601 631646 642375 630882 654157 625281 685634 725666 710258 769815 806197 777087 812078
6257H12078P20n5134P772q601l4081J54Q8070q012J8520n7454M6541Q6446M4505
$$ 812078 812798 757664 765436 756835 722754 722908 810978 802966 821486 764032 810573 897019 941524
6244I41524J00499R7958R027O6328K5484L2854l602n3490j22489K102J7555N92
$$ 941524 1042023 1139981 1149008 1215336 1240820 1273674 1270072 1216582 1094093 1096195 1113750 1114342
6232A114342K8091K7644m9598P1487n7925j05951p3744j03841j04244l0463n9072
$$ 1114342 1142433 1170077 1120479 1191966 1134041 1028090 954346 850505 746261 715798 656726
6221F56726l0411n8002m1463R2536M1829K2722J8436l9915o8893r183k614K6016
$$ 656726 626315 568313 526850 619386 661215 683937 702373 662458 593565 584382 581768 607784
6209F07784k8340m120m3183q1291K4641J10051n1978p7788j0110m6753l8749J01946
$$ 607784 579444 575324 532141 450850 475491 585542 533564 455776 445666 398913 360164 462110
6197D62110Q5442J5134o014n7153j7175l06m090M920N3416P5039P3039J754Q0575
$$ 462110 547552 562686 556672 499519 482344 482038 477948 482868 536284 611323 684362 686116 766691
6184G66691R0055j2495L0522j3754N5005O310m9567L2796k605o246M0629O534
$$ 766691 856746 844251 874773 861019 916024 922334 872767 905563 902958 896712 937341 943875
6172I43875M7426Q287l7573j59322p7790j525j1821M1813k0640n245K0340J2767
$$ 943875 991301 999588 962015 802693 724903 723378 711557 753370 732730 727485 747825 760592
6160G60592L21n6869R5741L7374l8952L9273N2987K7968Q4509Q7111L2009K2356
$$ 760592 760913 704044 799785 837159 798207 837480 890467 918435 1002944 1090055 1122064 1144420
6148A144420P8012N261p8866k0654K1188J1092O415J4071J0123o69k1437L6805
$$ 1144420 1222432 1227693 1148827 1128173 1149361 1160453 1166868 1180939 1191062 1190393 1168956 1205761
6136A205761P755r790p2674L7235L4207l7967J8046Q558O3545J7810o392O2702
$$ 1205761 1213516 1203726 1131052 1168287 1202494 1164527 1182573 1191131 1254676 1272486 1266094 1328796
6124A328796L9107J3504M3497Q8161Q694R6804P4752Q3860J4771L6561K17453
$$ 1328796 1367903 1381407 1424904 1513065 1521759 1618563 1693315 1777175 1791946 1828507 2045960
6113B045960J06106J34271K25373J71605J43293Q0134L564k4776j19831j76031
$$ 2045960 2152066 2286337 2511710 2683315 2826608 2906742 2910306 2885530 2765699 2589668
6103B589668j62747j49919j19416j28117p6896L248R862j449k8376j24724L7087
$$ 2589668 2426921 2277002 2157586 2029469 1952573 1955821 1965683 1964234 1935858 1811134 1848221
6092A848221M8034m5716p7038n5376K5000M5177L1607J0542K1717J8466L7441
$$ 1848221 1896255 1850539 1773501 1718125 1743125 1788302 1819909 1830451 1852168 1870634 1908075
6081A908075K8602P9579R8598J05000Q3328J09277N9840L0721K2003o1822j34554
$$ 1908075 1936677 2016256 2114854 2219854 2303182 2412459 2472299 2503020 2525023 2463201 2328647
6070B328647j61728p0908o6537j28730n5151q3118o2622Q920o3462k4196N0543
$$ 2328647 2166919 2096011 2029474 1900744 1845593 1762475 1699853 1708773 1645311 1621115 1671658
6059A671658l0109R7541M5288M2995l0125J1787L1999o1474O818Q5951n3079k1318
$$ 1671658 1641549 1739090 1784378 1827373 1797248 1809035 1841034 1779560 1786378 1872329 1819250 1797932
6047A797932K2270m326K0265N221P8151N9452l864L8655O6629O337J06041J32539
$$ 1797932 1820202 1815876 1836141 1841362 1919513 1978965 1975101 2013756 2080385 2086722 2192763 2325302
6035B325302L8703J3733J24434P9822J08466J14199Q5674L1315l8995K4316M7592
$$ 2325302 2364005 2377738 2502172 2581994 2690460 2804659 2890333 2921648 2882653 2906969 2954561
6024B954561k688J5898k8229n4360l2844N6294O5975P6887K6634o431Q7715K1018
$$ 2954561 2951873 2967771 2939542 2885182 2852338 2908632 2974607 3051494 3078128 3071697 3159412 3180430
6012C180430J206P0713J03862L4581R1054J73577J01870N8103J35040Q4666m7209
$$ 3180430 3181636 3252349 3356211 3390792 3481846 3655423 3757293 3815396 3950436 4035102 3987893
6001C987893n0762m8263p4503M9274J01651m0902n3531k844J41280J28209P5698
$$ 3987893 3937131 3888868 3814365 3863639 3965290 3924388 3870857 3868013 4009293 4137502 4213200
5990D213200J20354J13106M0013M7072J25978J91656M9440J56191K03197J70756
$$ 4213200 4333554 4446660 4486673 4533745 4659723 4851379 4900819 5057010 5260207 5430963
5980E430963K48958J68908K77470K17928J81198J77498K08152K88084K47534L96323
$$ 5430963 5679921 5848829 6126299 6344227 6525425 6702923 6911075 7199159 7446693 7843016
5970G843016N09473N34524N00575O41721P60404R03907J160100J379139J712232
$$ 7843016 8352489 8887013 9387588 10029309 10789713 11693620 12853720 14232859 15945091
5961A5945091J913643K066504J863016J376676N30673k018k36658l86792k46496
$$ 15945091 17858734 19925238 21788254 23164930 23695603 23693585 23456927 23070135 22823639
5952B2823639J34913O25411J073985J332733J321926R62688K58709k13394n00819
$$ 22823639 22958552 23583963 24657948 25990681 27312607 28275295 28534004 28320610 27819791
5943B7819791o72320o35087l31576p7775L73160Q05727J273090J873803K475310
$$ 27819791 27147471 26512384 26180808 26103033 26476193 27281920 28555010 30428813 32904123
5934C2904123L149524L603279L733205L565853L355808L252841L622952M374141
$$ 32904123 36053647 39656926 43390131 46955984 50311792 53564633 57187585 61561726
5926F1561726N683541P725550J0415961J3301782J5783262J6966367J5762375
$$ 61561726 67245267 74970817 85386778 98688560 114471822 131438189 147200564
5919A47200564J1829670O157133O56380l518458n696526n726946l783084o95942
$$ 147200564 159030234 165187367 165843747 162325289 156628763 150901817 147118733 146422791
5911A46422791K669985M896534N393729L123903j317217o124945j0152886j2891135
$$ 146422791 149092776 153989310 159383039 162506942 161189725 155064780 144911894 132020759
5903A32020759j4089323j3969328j2957178j1511191r848873q302525o906756
$$ 132020759 117931436 103962108 91004930 79493739 69644866 61342341 54435585
5896E4435585n618396m699403l878959l304348k651938k313580j952561j628903
$$ 54435585 48817189 44117786 40238827 36934479 34282541 31968961 30016400 28387497
5888B8387497j492651j229651j050046q61288r08190q21643p29567p93892p38144
$$ 28387497 26894846 25665195 24615149 23753861 22845671 22024028 21294461 20500569 19762425
5879A9762425o70055o09761n97464n15243m17841l66290l57546k80342l77256
$$ 19762425 19092370 18482609 17885145 17369902 16952061 16585771 16228225 15947883 15570627
5870A5570627m21408m54290m27031l92676l68538l98776l70505k40346j72191
$$ 15570627 15149219 14694929 14267898 13875222 13506684 13107908 12737403 12497057 12324866
5861A2324866p9713j34255p409r1106j79972j45361k18943j78172j98406j11533
$$ 12324866 12245153 12110898 12103489 12012383 11832411 11687050 11468107 11289935 11091529 10979996
5851A0979996K8670Q9395J2631O0935J11835J16784J39798J94725K81075L85307
$$ 10979996 11008666 11098061 11110692 11171627 11283462 11400246 11540044 11734769 12015844 12401151
5841A2401151L49120L63000L84094L78756L04979L56973L15732L07479L05109
$$ 12401151 12750271 13113271 13497365 13876121 14181100 14538073 14853805 15161284 15466393
5832A5466393L49944J95532p7703j88061k56134k97551k70281k78257j59899j40419
$$ 15466393 15816337 16011869 15934166 15746105 15489971 15192420 14922139 14643882 14483983 14343564
5822A4343564n1194K4956O9601J30858R2474J10107J82289K33222K76065L47052
$$ 14343564 14292370 14317326 14386927 14517785 14610259 14720366 14902655 15135877 15411942 15758994
5812A5758994L18715L47181M22871M59192M72468N89188O47644N69259M52938
$$ 15758994 16077709 16424890 16847761 17306953 17779421 18368609 19016253 19585512 20038450
5803B0038450M63400N98347N46210P74807R23435J097277J463909J825996K177539
$$ 20038450 20501850 21100197 21646407 22421214 23344649 24441926 25905835 27731831 29909370
5794B9909370K583590L074872L472810L990256M605455N387704O402113P540671
$$ 29909370 32492960 35567832 39040642 43030898 47636353 53024057 59426170 66966841
5786F6966841R221310J2298066J7338191K3965615K9953113L5187249L8018877
$$ 66966841 76188151 88486217 105824408 129790023 159743136 194930385 232949262
5779B32949262L2784796K1996215J5333037R961502j905540j7342926k5706436
$$ 232949262 265734058 287730273 303063310 313024812 311119272 293776346 268069910
5772B68069910k8525642l1089402l1032178k6975340k1908171j8240582j4904178
$$ 268069910 239544268 208454866 177422688 150447348 128539177 110298595 95394417
5765I5394417j1433456q484767o161682m328475k934232j497392m29771N05368
$$ 95394417 83960961 75476194 69314512 64986037 62051805 60554413 60124642 60630010
5757F0630010J291616K401049L805080N630979P912459J0522683J4214945J8945178
$$ 60630010 61921626 64322675 68127755 73758734 81671193 92193876 106408821 125353999
5749A25353999K3243991K6722491K9439791K7734793J5691015j847118j3248240
$$ 125353999 148597990 175320481 204760272 232495065 248186080 246338962 233090722
5742B33090722j9833237k5089281k6987176k4343564k0751034j8051149j5144103
$$ 233090722 213257485 188168204 161181028 136837464 116086430 98035281 82891178
5735H2891178j1987594r129995p188186n810282m621767l557683k828399k223993
$$ 82891178 70903584 61773589 54585403 48775121 44153354 40595671 37767272 35543279
5727C5543279j839577j296794j088178q04967n79692m53222m36399n33143m51765
$$ 35543279 33703702 32406908 31318730 30513763 29934071 29480849 29044450 28511307 28059542
5718B8059542m48055m21896j86013M2099K92140M35093N54150P05002R12911J256433
$$ 28059542 27611487 27189591 27003578 27045677 27337817 27772910 28327060 29032062 29944973 31201406
5708C1201406J670943K194056K986352M516985O962552R832054J2293719J3680141
$$ 31201406 32872349 35066405 38052757 42569742 49532294 59364348 71658067 85338208
5700H5338208J2919341P208292m72273n061774p766034r893444j0352637q905515
$$ 85338208 98257549 105465841 104993568 99931794 92165760 82272316 71919679 63014164
5692F3014164p289483o039412m854051l373201k113763j160525j09602P75336
$$ 63014164 55724681 49685269 44831218 41458017 39344254 38183729 38074127 38849463
5684C8849463K124650M069691O751311R813307J2082171J3388977J1811767N161391
$$ 38849463 40974113 45043804 51795115 61608422 73690593 87079570 98891337 104052728
5676A04052728k100664o139544q790235j0932598j0972954r467026q023185p091955
$$ 104052728 101952064 95812520 87022285 76089687 65116733 55649707 47626522 40534567
5668D0534567n794723m445029l477923k789382k374972j921425j606591j325718
$$ 40534567 34739844 30294815 26816892 24027510 21652538 19731113 18124522 16798804
5660A6798804j051123r75523q24774o90109n79746m26365m36639m01600m13308
$$ 16798804 15747681 14772158 13947384 13257275 12677529 12251164 11814525 11412925 10999617
5651A0999617l40354k88530l16385k75536k82498j69471j29989k04829j63413
$$ 10999617 10659263 10370733 10054348 9778812 9496314 9326843 9196854 8992025 8828612
5642H828612k41573k27540k83401k39791k76853k88430k30444k69287j15167o5813
$$ 8828612 8587039 8359499 8076098 7836307 7559454 7271024 7040580 6771293 6656126 6590313
5632F590313l8371o9894l7198l0123J204J4324j32617j08699m3781o1301j89594
$$ 6590313 6551942 6482048 6444850 6414727 6415931 6430255 6297638 6188939 6145158 6083857 5894263
5621E894263j78418j86486k61890k47698k52667k05689j17812l6932q2820j65519
$$ 5894263 5715845 5529359 5267469 5019771 4767104 4561415 4443603 4406671 4323851 4158332
5611D158332o7837n5795j35j13230j34680P110k9961n7436p7419k3167Q2673K3042
$$ 4158332 4090495 4034700 4034565 3921335 3786655 3793765 3763804 3706368 3628949 3605782 3688455 3711497
5599C711497M5592r218k5452k4435q2140j07856o6000j0058n292j04063j29371
$$ 3711497 3757089 3747871 3722419 3697984 3615844 3507988 3441988 3431930 3426638 3322575 3193204
5588C193204k4890o9216r7355p9688j1289O5238o6551k7088M0982O4586J6442
$$ 3193204 3168314 3099098 3001743 2922055 2910766 2976004 2909453 2882365 2923347 2987933 3004375
5577C004375j00853p7254q1222o6821j51146j03235k1086l7810r2812o1391q8056
$$ 3004375 2903522 2826268 2745046 2678225 2527079 2423844 2402758 2364948 2272136 2210745 2122689
5566B122689m3496m3142j6040n3645K2628o5330k0820J13911Q331P5907J44769
$$ 2122689 2079193 2036051 2020011 1966366 1988994 1923664 1902844 2016755 2025086 2100993 2245762
5555B245762J84598Q9613k6918q0312j28700q7506j2591n5565j39828o1767p5719
$$ 2245762 2430360 2519973 2493055 2412743 2284043 2196537 2183946 2128381 1988553 1926786 1851067
5544A851067M4587p6424q8008m0646j17124k6062l3763l5688J2448K858j06195
$$ 1851067 1895654 1819230 1731222 1690576 1573452 1547390 1513627 1477939 1490387 1493245 1387050
5533A387050K1800M401n6815l131l9886n5202k5910l5487o161j59409o0892K0801
$$ 1387050 1408850 1413251 1356436 1353305 1313419 1258217 1232307 1196820 1190659 1031250 970358 991159
5521I91159J6093m6702l3586Q4607K2475q9566m1497O3189J6483p1048M3626k2348
$$ 991159 1007252 960550 926964 1011571 1034046 944480 902983 966172 982655 911607 955233 932885
5509I32885J0861N2797k1952k3050K1622l5588o1222J3788K9403L7849O5301l5791
$$ 932885 943746 996543 974591 951541 973163 937575 876353 890141 919544 957393 1022694 986903
5497I86903Q487J2317L5027l8605J7600L5846o7677O2802M8753r3771L6961J08048
$$ 986903 995390 1007707 1042734 1004129 1021729 1057575 989898 1052700 1101453 1007682 1044643 1152691
5485A152691o2430K66Q4M8040r894l0018m2933l0773m3609l5631k1111Q367o4632
$$ 1152691 1090261 1090527 1090611 1138651 1128757 1098739 1055806 1025033 981424 945793 924682 933049 868417
5472H68417o7432l7996N8462O3390m6296o2852K4903P827O9537O207m3892l5295
$$ 868417 800985 762989 821451 884841 838545 775693 800596 808423 877960 884167 840275 804980
5460H04980m354P7110L1371p5764M1915M1166m1203K4149K9557P2160R8583R9137
$$ 804980 800626 877736 909107 833343 875258 916424 875221 899370 928927 1001087 1099670 1198807
5448A198807J11172J33147J16275J36109Q2867J27582J37713N3366P822n5832
$$ 1198807 1309979 1443126 1559401 1695510 1778377 1905959 2043672 2097038 2104860 2049028
5438B049028k3457j00324j71423j63930j66218p9059j49054j42475l5501n5204
$$ 2049028 2025571 1925247 1753824 1589894 1423676 1344617 1195563 1053088 1017587 962383
5428I62383m175p336o0260j04645o3403j9285M2786M3939l353k2395P6778J55450
$$ 962383 958208 950872 890612 785967 722564 703279 746065 790004 786651 764256 841034 996484
5416I96484O4538J34250K04015J48202J24100J62391J00834N0117N1587K2579
$$ 996484 1061022 1195272 1399287 1547489 1671589 1833980 1934814 1984931 2036518 2059097
5406B059097m0675k4268m3410r6713j12639j44532j43493j25932j60380j42961
$$ 2059097 2018422 1994154 1950744 1854031 1741392 1596860 1453367 1327435 1167055 1024094
5396A024094j09285m1533o3701m1591q2317m5929L2058j27l9154n3357M3220M1795
$$ 1024094 914809 873276 809575 767984 685667 639738 671796 671669 632515 579158 622378 664173
5384F64173j4196r0739n2164K6728m5646n305M8996L8217K2734N808n5641q665
$$ 664173 649977 559238 507074 533802 488156 482851 531847 570064 592798 598606 542965 534300
5372E34300l5771K9421J16630q801l577J73950K2058M4071O5313m9161n8078m6744
$$ 534300 498529 527950 644580 635779 632202 806152 828210 872281 937594 888433 830355 783611
5360G83611Q8202j2585N393M644j2817L5785J4823k0570J45539K2325P4068P7933
$$ 783611 871813 859228 864621 869265 856448 892233 907056 886486 1032025 1054350 1128418 1206351
5348A206351J47194J41393J67293J09611M2463m2613j33877j85740j33434j07988
$$ 1206351 1353545 1494938 1662231 1771842 1814305 1771692 1637815 1452075 1318641 1210653
5338A210653j98878j48209l075O5463m4101m1946J0228n9847q2827n4125l4864
$$ 1210653 1011775 863566 860491 925954 881853 839907 850135 790288 707461 653336 618472
5327F18472M3176l3702J3423n9186n6218K7499j0957N814K8930j071j8731l9547
$$ 618472 661648 627946 641369 582183 525965 553464 542507 548321 577251 576180 557449 517902
5315E17902K8030m089N4217n4262q606J9396J1738K4400J1356N31n3565k184J4016
$$ 517902 545932 541843 596060 541798 533192 552588 564326 588726 600082 600613 547048 544864 558880
5302E58880J8102j2317l1256L6902p334M3076q2433r234J035M767l3342m611J2938
$$ 558880 576982 564665 533409 570311 562977 606053 523620 514386 515421 520188 486846 482235 495173
5289D95173N3671K5436r689M4216K9754N8900l7828K5321J056L5492k5454j5221
$$ 495173 548844 574280 564591 608807 638561 697461 659633 684954 686010 721502 696048 680827
5277F80827J50548O7043L9792K2191P4835L5137J0972l7868j7164N6669J6410
$$ 680827 831375 898418 938210 960401 1035236 1070373 1081345 1043477 1026313 1082982 1099392
5266A099392K2960J9945K6834O0071M2577j4319N6714r6634p7159P889L1429k5027
$$ 1099392 1122352 1142297 1169131 1229202 1271779 1257460 1314174 1217540 1140381 1148270 1179699 1154672
5254A154672p5359n8564m4463m6332Q0937M1202l4345N6790L466l4768L5789j1661
$$ 1154672 1079313 1020749 976286 929954 1010891 1052093 1017748 1074538 1078004 1043236 1079025 1067364
5242A067364k0312k0196l6378m9790j8501j982n5417n2280L5870K3428L9148j8122
$$ 1067364 1047052 1026856 990478 940688 922187 920205 864788 812508 848378 871806 910954 892832
5230H92832k6810J5317J3164j35064l0992j2071l3557j8753L5487J6276l5213
$$ 892832 866022 881339 894503 759439 728447 716376 682819 664066 699553 715829 680616
5219F80616k6862n2331M2606R370K0658P142m0657P9500l0719l2985m320k7740
$$ 680616 653754 601423 644029 653399 674057 681199 640542 720042 689323 656338 652018 624278
5207F24278K1655n7117R1697N2947R231m4295j4443k7883J4113j409k3938J4776
$$ 624278 645933 588816 680513 733460 742691 698396 683953 656070 670183 668774 644836 659612
5195F59612L4659k4000r685j9156m7029K9440j6916l739L8742j1898j7099j0842
$$ 659612 694271 670271 660586 641430 594401 623841 606925 603186 641928 630030 612931 602089
5183F02089Q893L1678J3112L9876O315O8970N7559l2058m2192K7536k800P2071
$$ 602089 610982 642660 655772 695648 701963 770933 828492 796434 754242 781778 778978 851049
5171H51049K3667r80l3024K4697N9785j03736l6956m7896n2049J2480K9242P8078
$$ 851049 874716 873736 840712 865409 925194 821458 784502 736606 684557 697037 726279 804357
5159H04357n851L3717N6189K4355j6263j1224j1358Q9107K1416j9697k766p6583
$$ 804357 798506 832223 888412 912767 896504 885280 873922 963029 984445 964748 961982 885399
5147H85399N1311O6150M2432m3075L3159M4306N1940O334N232j73j738J9020J1840
$$ 885399 936710 1002860 1045292 1002217 1035376 1079682 1131622 1137956 1143188 1143015 1141277 1160297 1172137
5134A172137J222j020j8251R6383k110k7J8181P9681R6120o856l1128m4576K7516
$$ 1172137 1173359 1172339 1154088 1250471 1248361 1248334 1266515 1346196 1442316 1435460 1404332 1359756 1387272
5121A387272P2859M8257j2815N28K6180j9902J1444M7388L0652O9713N5967J7617
$$ 1387272 1460131 1508388 1495573 1496101 1522281 1502379 1513823 1561211 1591863 1661576 1717543 1735160
5109A735160M0991R0975m0211L8118J0547J118P2352L7834N1562L0322M0797M9632
$$ 1735160 1776151 1867126 1826915 1865033 1875580 1876698 1949050 1986884 2038446 2068768 2109565 2159197
5097B159197N6015M1621N2736Q281J09590J4887R2538J18694j9807N3321J14270
$$ 2159197 2215212 2256833 2309569 2317850 2427440 2442327 2534865 2653559 2633752 2687073 2801343
5086B801343R5220K0399J17844O5753J08780J13789O8065Q2209J48786J09860
$$ 2801343 2896563 2916962 3034806 3100559 3209339 3323128 3391193 3473402 3622188 3732048
5076C732048J09193J00297K19338K12022J65210K12735K11946J86088K33524J66268
$$ 3732048 3841241 3941538 4160876 4372898 4538108 4750843 4962789 5148877 5382401 5548669
5066E548669J41062K42282J98429K59666L07401K75278K73176K72125J97033K23743
$$ 5548669 5689731 5932013 6130442 6390108 6697509 6972787 7245963 7518088 7715121 7938864
5056G938864K07102K66056J34189J20800J19640M1116J06163K8242Q6301J0671
$$ 7938864 8145966 8412022 8546211 8667011 8786651 8827767 8933930 8962172 9048473 9059144
5046I059144j22280j569k1747o2676l8647j68317k68066k37236k12921j57822
$$ 9059144 8936864 8935295 8913548 8850872 8812225 8643908 8375842 8138606 7925685 7767863
5036G767863k54033k05362k37207j93297j64176k27802k03617j40306k27497j40243
$$ 7767863 7513830 7308468 7071261 6877964 6713788 6485986 6282369 6142063 5914566 5774323
5026E774323j23954j97306j51764r9803j18786j13543j62757j52199j21851j03979
$$ 5774323 5650369 5453063 5301299 5201496 5082710 4969167 4806410 4654211 4532360 4428381
5016D428381q2712l7396j45413p7214j0714j43769l7124q3265r3595o5247l2018
$$ 4428381 4345669 4308273 4162860 4085646 4074932 3931163 3894039 3810774 3717179 3651932 3619914
5005C619914j0183l407o9174L1842M3633o1391p4898L5102P356L7142J36875Q4419
$$ 3619914 3609731 3606324 3537150 3568992 3612625 3551234 3476336 3511438 3518794 3555936 3692811 3777230
4993C777230j4499K5533O5995K0833j11244r3959k8926n8448k9095n4535o8065
$$ 3777230 3762731 3788264 3854259 3875092 3763848 3669889 3640963 3582515 3553420 3498885 3430820
4982C430820L2530k829k6981j06539j01560j55791j01382j01684m6160j0257j4342
$$ 3430820 3463350 3460521 3433540 3327001 3225441 3069650 2968268 2866584 2820424 2810167 2795825
4971B795825n4082o2749m6556J1846k9077K4487q38o7021n6941k252J1931J2080
$$ 2795825 2741743 2678994 2632438 2644284 2615207 2639694 2638856 2571835 2514894 2512642 2524573 2536653
4959B536653l062J9144L2951N6594j4090j6296l0566J647j9407m2246J4973L1963
$$ 2536653 2533591 2552735 2585686 2642280 2628190 2611894 2581328 2582975 2563568 2521322 2536295 2568258
4947B568258M6259M1752R061L2432K7477k0594P4626O5428P5819J5558J04498
$$ 2568258 2614517 2656269 2665330 2697762 2725239 2704645 2779271 2844699 2920518 2936076 3040574
4936C040574M7159l1832L0810J08718N4729K6714L8178P2037J08047J08304k1617
$$ 3040574 3087733 3055901 3086711 3195429 3250158 3276872 3315050 3387087 3495134 3603438 3581821
4925C581821K6465P7930J0154N0864R9798O1672Q2150Q7147p500L9467J25480
$$ 3581821 3608286 3686216 3696370 3747234 3847032 3908704 3990854 4078001 4070501 4109968 4235448
4914D235448Q3020L2045J20719J19464O9926P7117N4161J59693O3475N0808P3236
$$ 4235448 4318468 4350513 4471232 4590696 4660622 4737739 4791900 4951593 5015068 5065876 5139112
4903E139112J08598k2031O1259j6j4966m212L6865p2832o0942j4355K49K8374
$$ 5139112 5247710 5225679 5286938 5286922 5271956 5267744 5304609 5231777 5170835 5156480 5156729 5185103
4891E185103m516j3371n1803O0558k4684m0418k9359O719J3340K2640L8849k6428
$$ 5185103 5180587 5167216 5115413 5175971 5151287 5110869 5081510 5088229 5101569 5124209 5163058 5136630
4879E136630j887m236P5933k892j9934m0553l1091P4295K2503j22914K1047O5328
$$ 5136630 5134743 5130507 5206440 5203548 5183614 5143061 5111970 5186265 5208768 5085854 5106901 5172229
4867E172229K6679k899Q856J00220O8374O2077N8500R6360J40447J40599J45064
$$ 5172229 5198908 5196009 5204865 5305085 5373459 5435536 5494036 5590396 5730843 5871442 6016506
4856F016506J36681L6133N5619J12814R0357K9775J37687J51718P0485O2897J26666
$$ 6016506 6153187 6189320 6244939 6357753 6448110 6477885 6615572 6767290 6837775 6900672 7027338
4845G027338K29292K14192K16462K62820K15879K58327K44320L52857L11804L06209
$$ 7027338 7256630 7470822 7687284 7950104 8165983 8424310 8668630 9021487 9333291 9639500
4835I639500K57718K59108K55551K39719L63475N40956O44535Q92850J380251
$$ 9639500 9897218 10156326 10411877 10651596 11015071 11556027 12200562 13093412 14473663
4826A4473663J936116K219912K471473K044242N82256m70424p77805j167771j456863
$$ 14473663 16409779 18629691 21101164 23145406 23727662 23257238 22479433 21311662 19854799
4817A9854799j249092r18505o95314m48763k74081j9403J20962K32009M81670
$$ 19854799 18605707 17687202 16991888 16543125 16269044 16249641 16370603 16602612 17084282
4808A7084282M32532N69658P11942P47180R50426J139042J174524J382580J529029
$$ 17084282 17516814 18086472 18798414 19545594 20496020 21635062 22809586 24192166 25721195
4799B5721195J725577J918495K087029K528233L128298L769782M654724N417659
$$ 25721195 27446772 29365267 31452296 33980529 37108827 40878609 45533333 50950992
4791E0950992N698889N593073M793084L503390K232116J418965J202343J696774
$$ 50950992 56649881 62242954 67036038 70539428 72771544 74190509 75392852 77089626
4783G7089626L056708N113497O999299Q353596Q317715N836744J704506j458102
$$ 77089626 80146334 85259831 92259130 100612726 108930441 114767185 116471691 115013589
4775A15013589l295856m439520m601733l384124j798743n75343L65208R23244
$$ 115013589 111717733 107278213 102676480 99292356 97493613 96918270 97283478 98206722
4767I8206722M87628n35114j502267k246822k768518k859507k687783k306630
$$ 98206722 98694350 98159236 96656969 94410147 91641629 88782122 86094339 83787709
4759H3787709j945624j516213j049441o00286m55854j69516j04648j12137l7248
$$ 83787709 81842085 80325872 79276431 78676145 78220291 78050775 77946127 77833990 77796742
4750G7796742R483J80185K19920M35903P40679J125222J516060J888035K095921
$$ 77796742 77806225 77986410 78206330 78642233 79382912 80508134 82024194 83912229 86008150
4741H6008150K002835J669127J623601J590581J631182J799089K376995L133248
$$ 86008150 88010985 89680112 91303713 92894294 94525476 96324565 98701560 101834808
4733A01834808L813411M256182M714144M208536K817256J704116R78159J86840
$$ 101834808 105648219 109904401 114618545 118827081 121644337 123348453 124326612 124513452
4725A24513452l12482n00079j74454k41156j31730K4747J30931k95741o41097
$$ 124513452 124200970 123700891 123526437 123285281 123153551 123178298 123309229 123013488 122372391
4716A22372391o46041o47273l78373k56278n4912K36937M93865N27306N33929
$$ 122372391 121726350 121079077 120700704 120444426 120389514 120626451 121120316 121647622 122181551
4707A22181551O10518O59239N02540L40536J33323k73904m84814p51421j089005
$$ 122181551 122792069 123451308 123953848 124294384 124427707 124153803 123668989 122917568 121828563
4698A21828563j415727j702171j860648j975877k080722k019770j980915j739821
$$ 121828563 120412836 118710665 116850017 114874140 112793418 110773648 108792733 107052912
4690A07052912j572604j465843j395062j452688j514942j714261j727236j769562
$$ 107052912 105480308 104014465 102619403 101166715 99651773 97937512 96210276 94440714
4682I4440714j700435j620441j756895j878548j910313k319107k450349k483214
$$ 94440714 92740279 91119838 89362943 87484395 85574082 83254975 80804626 78321412
4674G8321412k698429k618464k489792k356831k076331j940324j715961j621435
$$ 78321412 75622983 73004519 70514727 68157896 66081565 64141241 62425280 60803845
4666F0803845j441098j449711j441380j460425j485698j557236j565317j702088
$$ 60803845 59362747 57913036 56471656 55011231 53525533 51968297 50402980 48700892
4658D8700892j620113j519768j611843j487655j426944j344689j249564j215235
$$ 48700892 47080779 45561011 43949168 42461513 41034569 39689880 38440316 37225081
4650C7225081j195878j198370j067786r09669q30730p78976o09906n30089o35454
$$ 37225081 36029203 34830833 33763047 32853378 32022648 31243672 30633766 30103677 29468223
4641B9468223m31157l80330l46959l59530k87587k94033l92263l26290k60665
$$ 29468223 29037066 28656736 28309777 27950247 27662660 27368627 26976364 26650074 26389409
4632B6389409k01784p5296L4558J68199L81688N36826O62658O31928L16281J00787
$$ 26389409 26187625 26112329 26146887 26315086 26696774 27233600 27896258 28528186 28844467 28945254
4622B8945254M8140l7104l0205J5976j7068p1914j68590j68657j96831k37059
$$ 28945254 28993394 28956290 28926085 28942061 28924993 28853079 28684489 28515832 28319001 28081942
4612B8081942k71211l92778k70417k90463m21637m93765m92176m55241m23089
$$ 28081942 27810731 27417953 27147536 26857073 26435436 25941671 25449495 24994254 24571165
4603B4571165k82544j91686o3789P7432Q4505Q4537n7254j1357N6285K07532L19979
$$ 24571165 24288621 24096935 24033146 24110578 24195083 24279620 24222366 24211009 24267294 24474826 24794805
4592B4794805L19017K72388j7066k41200l57459n07296n32634n39745m26461l57730
$$ 24794805 25113822 25386210 25369144 25127944 24770485 24263189 23730555 23190810 22764349 22406619
4582B2406619m56084m96513o36065o20293o06712m24255l16828k79020k61127
$$ 22406619 21950535 21454022 20817957 20197664 19590952 19166697 18849869 18570849 18309722
4573A8309722k14130k24177k37856j02348j00431P0847P8539L2756J82118J95805
$$ 18309722 18095592 17871415 17633559 17531211 17430780 17501627 17580166 17612922 17795040 17990845
4563A7990845K52750K73124J65327J81139J79826K35428K81703L73921N59864
$$ 17990845 18243595 18516719 18682046 18863185 19043011 19278439 19560142 19934063 20493927
4554B0493927Q42554J155924J303741J425105J573842J292027Q43410N64319J12995
$$ 20493927 21336481 22492405 23796146 25221251 26795093 28087120 28930530 29494849 29607844
4545B9607844l41722n75561o37262p61495q10135p30466o77954o98952p01133
$$ 29607844 29266122 28690561 28053299 27291804 26481669 25751203 25073249 24374297 23673164
4536B3673164o85065o56973o79214o88501p04111p08503p44230p86119p53380
$$ 23673164 22988099 22331126 21651912 20963411 20259300 19550797 18806567 18020448 17267068
4527A7267068p32131o13210m86400m64096l14542j75815k46847j05158n1483j11462
$$ 17267068 16534937 15921727 15435327 14971231 14656689 14480874 14234027 14128869 14077386 13965924
4517A3965924r8663m2774p5547k05300l28741l16832k94173m09341m08661l33835
$$ 13965924 13867261 13824487 13748940 13543640 13214899 12898067 12603894 12194553 11785892 11452057
4507A1452057l96758m01388m07597l98747m15400m76569m06920m72032m12366
$$ 11452057 11055299 10653911 10246314 9847567 9432167 8955598 8548678 8076646 7664280
4498G664280m04754l14188k49877k93173l16775k04703j40367j86294k07887j53247
$$ 7664280 7259526 6945338 6695461 6402288 6085513 5880810 5740443 5554149 5346262 5193015
4488E193015j49413j10415p8218r1327j47859n0515m7216j51365n7023n3522m9855
$$ 5193015 5043602 4933187 4854969 4763642 4615783 4565268 4518052 4366687 4309664 4256142 4206287
4477D206287l0959j06320j11466n720l8081m2589m5106n8432m7490k1435J2795
$$ 4206287 4175328 4069008 3957542 3951822 3913741 3871152 3826046 3767614 3720124 3698689 3711484
4466C711484q0789p7166k1530P423K4462k5935O045k6537m8632m2576n7533k7648
$$ 3711484 3630695 3553529 3531999 3539422 3563884 3537949 3543994 3517457 3468825 3426249 3368716 3341068
4454C341068K5864P571k25R8204k2655K6536l1132J4474k6144j05012j8218m9348
$$ 3341068 3366932 3374503 3374278 3472482 3449827 3476363 3445231 3459705 3433561 3328549 3310331 3260983
4442C260983N2931O8764L4380q9950j24L6222K7603l5868R1293L3670m5538M4992
$$ 3260983 3313914 3382678 3417058 3327108 3326984 3363206 3390809 3354941 3446234 3479904 3434366 3479358
4430C479358Q932L2002p5527q951M7401O3206o4186j4458J9813j0727N441j04075
$$ 3479358 3488290 3520292 3444765 3435814 3483215 3546421 3482235 3467777 3487590 3476863 3482304 3378229
4418C378229l3570l9811j9721n5591L5377l5885q9029K9063k6544r725l2792n7190
$$ 3378229 3344659 3304848 3285127 3229536 3264913 3229028 3139999 3169062 3142518 3132793 3100001 3042811
4406C042811n9612o5311j8394l9068m4701q059L0066k6542m4015k0756M8100n7619
$$ 3042811 2983199 2917888 2899494 2860426 2815725 2807666 2837732 2811190 2767175 2746419 2794519 2736900
4394B736900j23121j4521j4417r0554m9508Q449l8069J1510m3474k9625l201m2676
$$ 2736900 2613779 2599258 2584841 2494287 2444779 2453228 2415159 2426669 2383195 2353570 2350369 2307693
4382B307693m7623j5390p3686J0771o9100p4965j382N137N6582L0407k6818m4190
$$ 2307693 2260070 2244680 2170994 2181765 2112665 2037700 2036318 2041455 2098037 2128444 2101626 2057436
4370B057436n2924j5739K7462N294r4298k6208O6312n7252O3830j64k140p2130
$$ 2057436 2004512 1988773 2016235 2021529 1927231 1901023 1967335 1910083 1973913 1973749 1971609 1899479
4358A899479O1430J25144K1321J09395R1628k3631N0372j9554m7880k0221q076
$$ 1899479 1960909 2086053 2107374 2216769 2308397 2284766 2335138 2315584 2267704 2247483 2239407
4347B239407m2110r9378J7927m7139l6456P6289m324n6050k220L8226m112o009
$$ 2239407 2197297 2097919 2115846 2068707 2032251 2108540 2104216 2048166 2045946 2084172 2080060 2074051
4335B074051m1854n3659M9113m2235L8124Q3496n04j113l2792r3231m5313J01155
$$ 2074051 2032197 1978538 2027651 1985416 2023540 2107036 2106532 2105419 2072627 1979396 1934083 2035238
4323B035238J05127K1069R911l0130O4144L38j2221l1611M627n4088m1696k926
$$ 2035238 2140365 2161434 2171345 2141215 2205359 2205697 2193476 2161865 2166492 2112404 2070708 2067782
4311B067782L3713l7222K8563l2738o4385M5095o382J7034M1096R1028j26803
$$ 2067782 2101495 2064273 2092836 2060098 1995713 2040808 2034426 2051460 2092556 2183584 2056781
4300B056781K5567m7295j07950l0380R7920k3245k435L7939k6416N2880M3255
$$ 2056781 2082348 2035053 1927103 1896723 1994643 1971398 1968963 2006902 1980486 2033366 2076621
4289B076621K9183J7164j0311J11095J03500L8628R4776J72695K58937K50107
$$ 2076621 2105804 2122968 2112657 2223752 2327252 2365880 2460656 2633351 2892288 3142395
4279C142395L29941L43793L13421K63573J07673Q8725M8266Q0277L0209p1562
$$ 3142395 3472336 3816129 4129550 4393123 4500796 4589521 4637787 4718064 4748273 4676711
4269D676711j28876k08833k36289l62683l18345k56726j43845j51285j67154j27196
$$ 4676711 4547835 4339002 4102713 3740030 3421685 3164959 3021114 2869829 2702675 2575479
4259B575479n4221n6625m6158p1840r738j6982k7854p3794J6246L5483K1976J6526
$$ 2575479 2521258 2464633 2418475 2346635 2336897 2319915 2292061 2218267 2234513 2269996 2291972 2308498
4247B308498O1927j8925M82l2342J6578K1456j1700M0345J1025J5869p9315P1948
$$ 2308498 2370425 2351500 2351982 2319640 2336218 2357674 2345974 2386319 2397344 2413213 2333898 2405846
4235B405846N0688n4744J8709K512N6999O0544P2935J7167L7182k8857J4672N7822
$$ 2405846 2456534 2401790 2420499 2423011 2480010 2540554 2613489 2630656 2667838 2638981 2653653 2711475
4223B711475l0443K914J3702J0994K9328k5295N6895l442J360L3995l15O8383
$$ 2711475 2681032 2683946 2697648 2708642 2737970 2712675 2769570 2766128 2767488 2801483 2801168 2869551
4211B869551N5704N9763L3907Q9483j242K6928l2420p0154r2654p965j7244n0772
$$ 2869551 2925255 2985018 3018925 3108408 3107166 3134094 3101674 3031520 2938866 2930901 2913657 2862885
4199B862885m3365K1645m9644l3518N8368o575l5863J1903m9236J4562o9614J2416
$$ 2862885 2819520 2841165 2791521 2758003 2816371 2809796 2773933 2785836 2736600 2751162 2681548 2693964
4187B693964k1682m5316L340l691P5363m9677N8158N6112k4400K1500L3091R1488
$$ 2693964 2672282 2626966 2630306 2626615 2701978 2652301 2710459 2766571 2742171 2763671 2796762 2888250
4175B888250N8473L7882L2471k7813P1835L3945m915l3147n0927l0156j20876
$$ 2888250 2946723 2984605 3017076 2989263 3061098 3095043 3090128 3056981 3006054 2975898 2855022
4164B855022n4751m0161N062O422O6111O5604k84J16287Q4970P1570J07502J20533
$$ 2855022 2800271 2760110 2765172 2771594 2837705 2903309 2903025 3019312 3104282 3175852 3283354 3403887
4152C403887N3022N7486J54778J30769K9097j52125r2343j27666n5472p9536j07432
$$ 3403887 3456909 3514395 3669173 3799942 3829039 3676914 3584571 3456905 3401433 3321897 3214465
4141C214465j44095j39973M2198o9551N0741k2320J451k7382J2531J5048m2057
$$ 3214465 3070370 2930397 2972595 2903044 2953785 2931465 2932916 2905534 2918065 2933113 2891056
4130B891056L7129J4352L3179J7237QO3231Q9538l4131k9490O8197Q2464J8900
$$ 2891056 2928185 2942537 2975716 2992953 2992961 3056192 3145730 3111599 3082109 3150306 3232770 3251670
4118C251670L720N6096L9603N468J6080O5950J21674J13618R3842P3317O9511
$$ 3251670 3255390 3311486 3351089 3356557 3372637 3438587 3560261 3673879 3767721 3841038 3910549
4107C910549Q8819P4120J38508J62719l6944L6120Q0204J04647J21264O1921R2004
$$ 3910549 3999368 4073488 4211996 4374715 4337771 4373891 4454095 4558742 4680006 4741927 4833931
4096D833931M9183Q9997J12817R5082J65348J65296J40971J93826K01501J43457
$$ 4833931 4883114 4973111 5085928 5181010 5346358 5511654 5652625 5846451 6047952 6191409
4086F191409J23539P6931J06861O9360K3723J22123J12460J16197J91425J13232
$$ 6191409 6314948 6391879 6498740 6568100 6591823 6713946 6826406 6942603 7134028 7247260
4076G247260O3193J19813J39934J50950K49K4507Q3740k4882L3050K1059R8784
$$ 7247260 7310453 7430266 7570200 7721150 7721399 7745906 7829646 7804764 7837814 7858873 7957657
4065G957657j6311j3319R2846J45574R3593J86267J73940Q2790L1212q575r8543
$$ 7957657 7941346 7928027 8020873 8166447 8260040 8446307 8620247 8703037 8734249 8725674 8627131
4054H627131k50905j04365j25613j12272j18244j5085l5702M302K8407O902o649
$$ 8627131 8376226 8271861 8146248 8033976 7915732 7900647 7864945 7869247 7897654 7904556 7897907
4043G897907J10550N6218R5268M0751N2525M8145Q8230L2274J02298l907J09698
$$ 7897907 8008457 8064675 8159943 8200694 8253219 8301364 8389594 8421868 8524166 8520259 8629957
4032H629957J18379J03474J93341J62515J35785J92534J28769J85932K84571K84076
$$ 8629957 8748336 8851810 9045151 9207666 9343451 9535985 9664754 9850686 10135257 10419333
4022A0419333L59950L40860L27693K96251L71802M02163M79430M78919M61461
$$ 10419333 10779283 11120143 11447836 11744087 12115889 12518052 12997482 13476401 13937862
4013A3937862M24401N17968M22707M62502M48774M99499M53406M33026M88748
$$ 13937862 14362263 14880231 15302938 15765440 16214214 16713713 17167119 17600145 18088893
4004A8088893N31156N69481N46065N48710M90708N31870N49728M92334N33722
$$ 18088893 18620049 19189530 19735595 20284305 20775013 21306883 21856611 22348945 22882667
3995B2882667N76905N49776N38345P04979P01784Q02053Q54038Q59895R09246
$$ 22882667 23459572 24009348 24547693 25252672 25954456 26756509 27610547 28470442 29379688
3986B9379688R09529R12306Q91316R01841Q53998R42198R37761R61202J225357
$$ 29379688 30289217 31201523 32092839 32994680 33848678 34790876 35728637 36689839 37915196
3977C7915196J234882J374532J426854J602035J627930J564321J596140J492077
$$ 37915196 39150078 40524610 41951464 43553499 45181429 46745750 48341890 49833967
3969D9833967J476510J579823J563883J640116J771833J942858K033073K182863
$$ 49833967 51310477 52890300 54454183 56094299 57866132 59808990 61842063 64024926
3961F4024926K329309K368837K618375K618755K720120K738610K911271L099207
$$ 64024926 66354235 68723072 71341447 73960202 76680322 79418932 82330203 85429410
3953H5429410L218990L466528L580240L744685L881364L736537L340435L117476
$$ 85429410 88648400 92114928 95695168 99439853 103321217 107057754 110398189 113515665
3945A13515665L062144K902588K809741K732307K499228K241768J864459J456700
$$ 113515665 116577809 119480397 122290138 125022445 127521673 129763441 131627900 133084600
3937A33084600J108793R08444P46235P59157R58693J135656J207863J295367J460779
$$ 133084600 134193393 135101837 135848072 136607229 137565922 138701578 139909441 141204808 142665587
3928A42665587J501624J387460J303104J198875R42198P11887M28529K12109l7674
$$ 142665587 144167211 145554671 146857775 148056650 148998848 149710735 150139264 150351373 150313699
3919A50313699l54275p16346j028499j429848j700158j899297k073697k286829
$$ 150313699 149959424 149243078 148214579 146784731 145084573 143185276 141111579 138824750
3911A38824750k567131k753408k915866k969642k862145k651578k311400j944091
$$ 138824750 136257619 133504211 130588345 127618703 124756558 122104980 119793580 117849489
3903A17849489j746343j397851j216858j115601j155817j293871j315755j339081
$$ 117849489 116103146 114705295 113488437 112372836 111217019 109923148 108607393 107268312
3895A07268312j345835j337024j350802j396818j575464j673501j820953k005347
$$ 107268312 105922477 104585453 103234651 101837833 100262369 98588868 96767915 94762568
3887I4762568k287860k437876k530838k676313k535743k451768k408830k277646
$$ 94762568 92474708 90036832 87505994 84829681 82293938 79842170 77433340 75155694
3879G5155694k035211j831950j610571j459481j398421j409035j372320j435381
$$ 75155694 73120483 71288533 69677962 68218481 66820060 65411025 64038705 62603324
3871F2603324j578837j707241j691471j743129j741479j745087j625079j501885
$$ 62603324 61024487 59317246 57625775 55882646 54141167 52396080 50771001 49269116
3863D9269116j459578j362861j391454j427515j380757j262712j196021j145462
$$ 49269116 47809538 46446677 45055223 43627708 42246951 40984239 39788218 38642756
3855C8642756j139891j042008r28237j027321j010366r36140r08831q70182q91822
$$ 38642756 37502865 36460857 35532620 34505299 33494933 32558793 31649962 30779780 29887958
3846B9887958q88705q64173r37356r82759q47024q28705p85373o85519o86882
$$ 29887958 28999253 28135080 27197724 26214965 25367941 24539236 23753863 23068344 22381462
3837B2381462o82138o80836o63150p26540o51082o32845o33907n56465m96859
$$ 22381462 21699324 21018488 20355338 19628798 18977716 18344871 17710964 17154499 16657640
3828A6657640m65683n08842l43913k79702l50524l11644l23139k53778k58541
$$ 16657640 16191957 15683115 15339202 15059500 14708976 14397332 14074193 13820415 13561874
3819A3561874l10243l19629k78734l20801l96310l53772k85958k85606l25770
$$ 13561874 13251631 12932002 12653268 12332467 11936157 11582385 11296427 11010821 10685051
3810A0685051l60107k74892k67749l56610l36573j89510k47912k17346j16133
$$ 10685051 10324944 10050052 9782303 9425693 9089120 8899610 8651698 8434352 8318219
3801H318219k37169k28152j81137k42753j60544j96602l01235j86807j55388q3097
$$ 8318219 8081050 7852898 7671761 7429008 7268464 7071862 6770627 6583820 6428432 6345335
3791F345335j22236j55590o5781j05141k00114j45328l1032j37811o4371j25079
$$ 6345335 6223099 6067509 6001728 5896587 5696473 5551145 5520113 5382302 5317931 5192852
3781E192852j09779j17378j02833q582r5099j69993j02734j7476j43063q1927
$$ 5192852 5083073 4965695 4862862 4854280 4759181 4589188 4486454 4468978 4325915 4243988
3771D243988l8177n0422j73633J330m7533j63180j35255j0852k082n0448q4616
$$ 4243988 4205811 4155389 3981756 3983086 3935553 3772373 3637118 3626266 3624184 3573736 3489120
3760C489120n8082j6277j26084l4395l9079m4723o3849n2048p693q3518r0305
$$ 3489120 3431038 3414761 3288677 3254282 3215203 3170480 3106631 3054583 3046890 2963372 2873067
3749B873067m9671j8897o5685l5811j17603N538n516p0440o7731n7260m3822m107
$$ 2873067 2823396 2804499 2738814 2703003 2585400 2590938 2585422 2514982 2447251 2389991 2346169 2342062
3737B342062k2568r2508n2260K2863k274l6674k3750l8787q7187m6243J8918j2935
$$ 2342062 2319494 2226986 2174726 2197589 2195315 2158641 2134891 2096104 2008917 1962674 1981592 1968657
3725A968657j8134J6279m4172n3005p177n0498q1964j8905l0734J5746k5821Q266
$$ 1968657 1950523 1966802 1922630 1869625 1862448 1811950 1729986 1711081 1680347 1696093 1670272 1678538
3713A678538l5088k3071L8946M4289j5082k153j4248o1807J4907n9728l6719J739
$$ 1678538 1643450 1620379 1659325 1703614 1688532 1686379 1672131 1610324 1625231 1565503 1528784 1530523
3701A530523J4257m9997k8161p59L0975o4581l3299J6121L8277n1536j2341P3748
$$ 1530523 1544780 1494783 1466622 1465863 1496838 1432257 1398958 1415079 1453356 1401820 1389479 1463227
3689A463227k4833r647N531k1803J5887m1401N22r805M559N2226m5113p542K7847
$$ 1463227 1438394 1428747 1434278 1412475 1428362 1386961 1387483 1377678 1382237 1434463 1389350 1381808 1409655
3676A409655J4599J1478n8773l7863L9335J2562p3002R235O884r811j9365M2908
$$ 1409655 1424254 1435732 1376959 1339096 1378431 1390993 1317991 1327226 1334110 1324299 1304934 1347842
3664A347842l0612J2047k1793j0477K16J8109p519J5811M0030l0915k567L3711
$$ 1347842 1317230 1329277 1307484 1297007 1297223 1315332 1307813 1323624 1363654 1332739 1330172 1363883
3652A363883k0493l1023K6008Q6658k5489N851J006l0878l5927o894M0506l9223
$$ 1363883 1343390 1312367 1338375 1425033 1399544 1405395 1406401 1375523 1339596 1332702 1373208 1333985
3640A333985r071k6317M3592K0820p1012k930j2317n8333M3631P2896l3282M0955
$$ 1333985 1324914 1298597 1342189 1363009 1291997 1289067 1276750 1218417 1262048 1334944 1301662 1342617
3628A342617l0162n8695J8140M773q146N928K5621j5290L2083p4096p655n6897
$$ 1342617 1312455 1253760 1271900 1276673 1268527 1274455 1300076 1284786 1316869 1242773 1235118 1178221
3616A178221O417K632K6293k5678M961l8381n5333j1131p336l5105L902j9664
$$ 1178221 1184638 1187270 1213563 1187885 1192846 1154465 1099132 1088001 1080665 1045560 1049462 1029798
3604A029798J4755k2037n8468l1994M5178J0031o8969m5578J9355K9532K5175
$$ 1029798 1044553 1022516 964048 932054 977232 987263 918294 872716 892071 921603 946778
3593I46778m7700k6399L8645L6210m3353k2771L1172N5816L7272n3906K1818K738
$$ 946778 899078 872679 911324 947534 904181 881410 912582 968398 1005670 951764 973582 976320
3581I76320o027p8482N0501L2418j939J8236M8759m8786q1191J3401n050o0289
$$ 976320 970293 891811 942312 974730 972791 991027 1039786 991000 909809 923210 918160 857871
3569H57871o3118N0k4378n9854O4888l32o590j671k255k284R328K4198L6124J4020
$$ 857871 794753 794803 770425 710571 775459 775127 768537 766866 764611 762327 771655 795853 831977 845997
3555H45997P3349O4814N6080K1958M6385K2850K7320R5026J8395M5806J06162
$$ 845997 919346 984160 1040240 1062198 1108583 1131433 1158753 1253779 1272174 1317980 1424142
3544A424142O7856j5478p445j5828o5301k4879p2128k03479q5838k7022l7671
$$ 1424142 1491998 1476520 1469075 1453247 1387946 1363067 1290939 1087460 1001622 974600 936929
3533I36929k2375L6020J9582K4237j2012l5523o4640P110O2383M5296n351j5263
$$ 936929 914554 950574 970156 994393 982381 946858 882218 889328 951711 997007 991656 976393
3521I76393Q4991Q3294q7270L0642J08348L5496P7846K109N1890O9778J01845
$$ 976393 1061384 1144678 1057408 1088050 1196398 1231894 1309740 1311849 1363739 1433517 1535362
3510A535362P2357k7826K6281n600r711q2073o9463k2976j3675m2572r0784n3884
$$ 1535362 1607719 1579893 1606174 1600574 1590863 1508790 1439327 1416351 1402676 1360104 1269320 1215436
3498A215436m0637n5912l6758P049k0435P0346K0987j8125j5766m9423P8611M9470
$$ 1215436 1174799 1118887 1082129 1089178 1068743 1139089 1160076 1141951 1126185 1076762 1155373 1204843
3486A204843M2394L9603Q7661J9543P2209P8470M9772J97422J17038Q3134J11508
$$ 1204843 1247237 1286840 1374501 1394044 1466253 1544723 1594495 1791917 1908955 1992089 2103597
3475B103597N0065J02224J03410j7828l1077p987R4J5006K2059J1895J12377K7026
$$ 2103597 2153662 2255886 2359296 2341468 2310391 2302404 2302498 2317504 2339563 2351458 2463835 2490861
3463B490861M963j265j5656J08323J06973Q3943J93926J36180J00797L7873Q3343
$$ 2490861 2495824 2494559 2478903 2587226 2694199 2778142 2972068 3108248 3209045 3246918 3330261
3452C330261K1213p1506j26704j31841k60537k80764k06041j99249j14876k16499
$$ 3330261 3351474 3279968 3153264 3021423 2760886 2480122 2274081 2074832 1959956 1743457
3442A743457j50332j53694k8629r3611j52486p2403r4125K5834q0797j36460J7543
$$ 1743457 1593125 1439431 1410802 1317191 1164705 1092302 998177 1024011 943214 806754 824297
3431H24297q8052k2199m5857o0430N8236j2965o3146k3830J1194J5931j8656m5104
$$ 824297 736245 714046 668189 607759 665995 653030 589884 566054 577248 593179 574523 529419
3419E29419L7215J7901j7642J225n6327n3789K0248n4433o6807o656L6186j6403
$$ 529419 566634 584535 566893 568118 511791 458002 478250 423817 357010 350354 386540 370137
3407C70137p5215k85N3943j8305K747m5485K5398K6161k7530l9400k3326O0300
$$ 370137 294922 294637 348580 330275 333022 287537 312935 339096 311566 272166 248840 309140
3395C09140j1165j846j7156L9904l9625m8298L710M922J2147L7368J5653j03443
$$ 309140 297975 296129 278973 318877 279252 230954 234664 239586 251733 289101 304754 201311
3383B01311l1778k5987J5762J1333K6412K7084r012q916J976L5298n637N4242
$$ 201311 169533 143546 159308 170641 197053 224137 215125 206209 208185 243483 237846 292088
3371B92088l9822P867j3502p3477Q830O9238J4967J4599o881p1283n8403O7120
$$ 292088 252266 260133 246631 173154 181984 251222 266189 280788 273907 202624 144221 211341
3359B11341k9137p6763O1035m169j4752n5650m1637q567M1456k7742O2942K4662
$$ 211341 182204 105441 166476 162307 147555 91905 50268 41701 83157 55415 118357 143019
3347A43019p6773K2097K4805l3740l8545M0338m5612k4357J76386J3744L6806
$$ 143019 66246 88343 113148 79408 40863 81201 35589 11232 187618 201362 238168
3336B38168j8727P8027J9099p1132j2765k8800R067p1120L6771J3008r8190j586
$$ 238168 219441 297468 316567 245435 232670 203870 212937 141817 178588 191596 93406 91820
3324I1820j0433M9289k1089l0103O930j3247R042N5263j7927j819N4953K0047
$$ 91820 81387 130676 109587 79484 86414 73167 82209 137472 119545 117726 172679 192726
3312A92726m3334n1681J0816k2913j5973J810K768N7555J197k1990J16741l5972
$$ 192726 149392 97711 108527 85614 69641 71451 74219 131774 132971 110981 227722 191750
3300A91750m9624J5506J0336p4686J7105r099k9601O7942Q564l9657o817k5707
$$ 191750 142126 157632 167968 93282 110387 101288 71687 139629 148193 108536 101719 76012
3288G6012j6421k0555J3364j7624K7111l1861N6757k7688j3182p97J6022k4784
$$ 76012 59591 39036 52400 34776 61887 30026 86783 59095 45913 45116 61138 36354
3276C6354L0960k8828n5660J19512q899q817J7419q535j7030K8280K4596j6005
$$ 36354 67314 38486 -17174 102338 93439 84622 102041 93506 76476 104756 129352 113347
3264A13347O8536n8304n2250k9723O67J3738K3434m0466o977p288J09252o3943
$$ 113347 181883 123579 71329 41606 42273 56011 79445 38979 32002 24714 133966 70023
3252G0023k0678M7572o7132O476O518n957K4384P9954p814k7389k2647M8561o217
$$ 70023 49345 96917 29785 36261 42779 36822 61206 141160 133346 105957 83310 131871 125654
3239A25654J5529q2113j8582N5251P4898n5171l0037j4667K2548m798r245o9116
$$ 125654 141183 59070 40488 95739 170637 115466 85429 70762 93310 88512 79267 10151
3227A0151L6721j3592m684q890M0383J440M813l0599l203R8302L8381o237J7714
$$ 10151 46872 33280 28596 19706 60089 61529 66342 35743 32540 130842 169223 162986 180700
3214A80700L4803j2599n491L9772K332j8536R657m3936l8007J1176j6980n3897
$$ 180700 215503 202904 197413 237185 239517 220981 230638 186702 148695 159871 142891 88994
3202H8994J6175P3479o777n1944p470J0003n5173q773K8197M2256K6338K8273
$$ 88994 105169 178648 171871 119927 112457 122460 67287 58514 86711 128967 155305 183578
3190A83578L7572j989o4353q118P0745M9872l991m7969m969k0081J01323L0926
$$ 183578 221150 219161 154808 146690 217435 267307 263316 215347 210378 190297 291620 322546
3178C22546q0938M182L5235n089p3285J482L5147J251M2997q9161k0491J01452
$$ 322546 241608 245790 281025 275936 202651 204133 239280 240531 283528 194367 173876 275328
3166B75328P3662p1293O7049O9037k980N5008l5205L3357M1436J1200P0874K522
$$ 275328 348990 277697 344746 413783 410803 465811 430606 463963 505399 516599 587473 589995
3154E89995j7756R9812J8971p6456J8714M5057J1561n6637M1975M5247m7746K8408
$$ 589995 572239 672051 691022 614566 633280 678337 689898 633261 675236 720483 672737 701145
3142G01145j8507k7449J2181M89O3827M269P674J1923O8839R9700O5777Q2486
$$ 701145 682638 655189 667370 667859 731686 735955 743629 755552 824391 924091 989868 1072354
3130A072354K2873M0268P7773o0031m2892J4382q0142n1490l4792p7823k5080
$$ 1072354 1095227 1135495 1213268 1153237 1110345 1124727 1044585 993095 958303 880480 855400
3119H55400l8974m4212j19436o3298O1683j3406m8449Q684O0268o5088r3953L963
$$ 855400 816426 772214 652778 589480 651163 637757 589308 597992 658260 593172 499219 503182
3107E03182J1539J2805J8905j6572N3673L8072Q518l626P4651r601j0319O661
$$ 503182 514721 527526 546431 529859 583532 621604 630122 626496 701147 691546 681227 687888
3095F87888o0000l4876l749L1542o7896p6853m9730m4596K0839J485l2332m180
$$ 687888 627888 593012 589263 620805 552909 476056 426326 381730 402569 404054 371722 367542
3083C67542n6726J6365J9259j828j6197P930K2020l0137n5460J1362O901o6829
$$ 367542 310816 327181 346440 344612 328415 336345 358365 328228 272768 284130 291031 224202
3071B24202N839k3487j8061k3845Q5021k7994o3518j6699m4791N47K9211M8032
$$ 224202 230041 206554 188493 164648 249669 221675 158157 141458 96667 97214 126425 174457
3059A74457k0307L1344o5878k163m790r156P262l2651J2445k2375l586j8501o1540
$$ 174457 154150 185494 119616 117453 112663 103507 110769 78118 90563 68188 64602 46101 -15439
3046a5439O0452o616k1416Lk8919k260L0923n5635K9376k634K8209q941M3549
$$ -15439 45013 38397 16981 16984 -11935 -14195 16728 -38907 -9531 -12165 16044 7103 50652
3033E0652O937p1662k3617l0704M27n702M1234J0220l0135K5245M0175J7333J1195
$$ 50652 57589 -14073 -37690 -68394 -67967 -73669 -32435 -22215 -52350 -27105 13070 30403 41598
3020D1598j9438M5469p1735k5142j0116O950M8285j4419l9340L8895J8829j4294
$$ 41598 22160 67629 -4106 -29248 -39364 -32414 15871 1452 -37888 1007 19836 5542
3008E542k9085O7039L071k5600J5836J4496m7307p5922M905K0498N1878J0928
$$ 5542 -23543 43496 46567 20967 36803 51299 3992 -71930 -67025 -46527 5351 16279
2996A6279l5691n073n0100L9705l2176O894l0835m2431R725m5013M2540N7959
$$ 16279 -19412 -24485 -74585 -34880 -67056 -60162 -90997 -133428 -123703 -168716 -126176 -68217
2984f8217N6944j4348n6066m709K0185P124o1141n447p0175L5350P0300j1456
$$ -68217 -11273 -25621 -81687 -86396 -66211 -59087 -120228 -125675 -195850 -160500 -90200 -101656
2972a01656O3008K2614m2563J1221k6633P1273j0519q4219J2786K5987L3761o7135
$$ -101656 -38648 -16034 -58597 -47376 -74009 -2736 -13255 -97474 -84688 -58701 -24940 -92075
2960i2075j481K4624m5528M5110l0991K5995P7353n1091l1339j28477P3095Q4972
$$ -92075 -93556 -68932 -114460 -69350 -100341 -74346 3007 -48084 -79423 -207900 -134805 -49833
2948d9833K5717m2695J0989N0661O360O483p6504m3183M0058l50J624p8809K2885
$$ -49833 -24116 -66811 -55822 -5161 1199 7682 -68822 -112005 -71947 -72297 -70673 -149482 -126597
2935a26597P7832k5426M8447m2795j3762m5365M094M9080m3781M7598j577k6997
$$ -126597 -48765 -74191 -25744 -68539 -82301 -127666 -123572 -74492 -118273 -70675 -72252 -99249
2923i9249M7459O1114j8022k951L055J086l2799Q582j0384o5222M0612N7802l7811
$$ -99249 -51790 9324 -8698 -11649 -8594 -7508 -40307 -31725 -42109 -107331 -66719 -8917 -46728
2910d6728k6840j6136K0096M1429o5919p1982O2754n1095K0702O867N82K1560
$$ -46728 -73568 -89704 -69608 -28179 -94098 -166080 -103326 -154421 -133719 -126852 -126270 -104710
2898a04710J1873O9363m6206l3098K9965P3841q9044l8922N9157k5537L6979o032
$$ -104710 -92837 -23474 -69680 -102778 -72813 1028 -88016 -126938 -67781 -93318 -56339 -62371
2886f2371j7224j5083m7187j5380M1022j6810L1823o299n5462K3524K1578M4352
$$ -62371 -79595 -94678 -141865 -157245 -116223 -133033 -101210 -107509 -162971 -139447 -117869 -73517
2874g3517N188m9079r491J5833l0612N2294l5119J3522n6273L1088P672J5966
$$ -73517 -68329 -117408 -126899 -111066 -141678 -89384 -124503 -110981 -167254 -136166 -128494 -112528
2862a12528K6982l933j3886o5729O1596P6909n0841j9877j2977k3071K2793k0629
$$ -112528 -85546 -89479 -103365 -169094 -107498 -30589 -81430 -101307 -114284 -137355 -114562 -135191
2850a35191J06692K4013o3593n783j6859o46j6314l0445J8764P5475j2813M7294
$$ -135191 -28499 -4486 -68079 -73862 -90721 -91367 -107681 -138126 -119362 -43887 -56700 -9406
2838i406L8074o0851k1450m249n7084j3076L1149j2257j1266M0375k0432L7361
$$ -9406 28668 -32183 -53633 -57882 -114966 -128042 -96893 -109150 -120416 -80041 -100473 -63112
2826f3112J6345o3447K018l8897J7032l298J08011o9626m1915l2146J3761M1720
$$ -63112 -46767 -110214 -108196 -147093 -130061 -133359 -25348 -94974 -136889 -169035 -155274 -113554
2814a13554R514K4503n4725K0723O1958k3902l3867J0284J7906J0723m0419O337
$$ -113554 -104040 -79537 -134262 -113539 -51581 -75483 -109350 -99066 -81160 -70437 -110856 -104519
2802a04519J6592L538K3811j05724M2089N6566J4533j5233r118o376j3772M9804
$$ -104519 -87927 -84389 -60578 -166302 -124213 -67647 -53114 -68347 -77465 -83841 -97613 -47809
2790d7809j5558k7127J929M679j10289m4916j0803L7410M7046J7369O6392N4084
$$ -47809 -63367 -90494 -88565 -83886 -194175 -239091 -249894 -212484 -165438 -148069 -81677 -27593
2778b7593r1966L0144m8212l2529j7197j815J1862J7505o06j5700J2018L243K3464
$$ -27593 -119559 -89415 -137627 -170156 -187353 -189168 -177306 -159801 -160407 -176107 -164089 -160846 -137382
2765a37382M0186R0070k1832j990J4595o8543j5672m487J3651J5448L8606m3808
$$ -137382 -97196 -7126 -28958 -30948 -16353 -84896 -100568 -105055 -91404 -75956 -37350 -81158
2753h1158j02931J9056L3650M4017L1507o5807L7618P7297o6619n0234k4083Q3351
$$ -81158 -184089 -165033 -131383 -87366 -55859 -121666 -84048 -6751 -73370 -123604 -147687 -64336
2741f4336n229p2438n1941j1903P6327L6217l01L495j924k3536K0970j7416k058
$$ -64336 -69565 -142003 -193944 -205847 -129520 -93303 -93604 -90109 -92033 -115569 -94599 -112015 -114073
2728a14073l0393M8677J0871j0552R212K9716L7281j0771l1746k2521k1483j6374
$$ -114073 -144466 -95789 -84918 -95470 -86258 -56542 -19261 -30032 -61778 -84299 -105782 -122156
2716a22156l9314J5256O2382k6805K1382p012J8591l3385N8525n0525n951J4111
$$ -122156 -161470 -146214 -83832 -110637 -89255 -96267 -77676 -111061 -52536 -103061 -109012 -94901
2704i4901k1517k0894K2475M1805O8820o6929o5211o239L7093R359m6091N6671
$$ -94901 -116418 -137312 -114837 -73032 -4212 -71141 -136352 -142591 -105498 -96139 -142230 -85559
2692h5559M3936j5938o2756L816N7502k7155j8256R930J1749J0552l4239J6713
$$ -85559 -41623 -57561 -120317 -116501 -58999 -86154 -104410 -94480 -82731 -72179 -106418 -89705
$$ [...]
##END NTUPLES=NMR SPECTRUM
##END=
