##TITLE=1H_DE-80H_X3
 200.13MHz, d2o
 8 sc
 
 19ns.26.2.2025
##JCAMPDX= 6.0         $$ Bruker NMR JCAMP-DX V2.0
##DATA TYPE= NMR SPECTRUM
##DATA CLASS= NTUPLES
##ORIGIN= UXNMR, Bruker Analytische Messtechnik GmbH
##OWNER= pz
$$ XWIN-NMR		Version 3.5
$$ Fri Jul 17 10:34:34 2026 Russian Standard Time (UT+4h)  Yarkov@DPX200
##.OBSERVE FREQUENCY= 200.1313
##.OBSERVE NUCLEUS= ^1H
##.ACQUISITION MODE= SIMULTANEOUS
##.ACQUISITION SCHEME= undefined
##.AVERAGES= 8
##.DIGITISER RES= 18
##SPECTROMETER/DATA SYSTEM= spect
##.PULSE SEQUENCE= zg30
##.SOLVENT NAME= DMSO
##.SHIFT REFERENCE= (INTERNAL, DMSO, 0, 15.4869)
##AUDIT TRAIL= $$ (NUMBER, WHEN, WHO, WHERE, WHAT)
$$ ##TITLE= Audit trail, XWIN-NMR		Version 3.5
$$ ##JCAMPDX= 5.01
$$ ##ORIGIN= Bruker BioSpin GmbH
$$ ##OWNER= Yarkov
$$ C:/Bruker/XWIN-NMR/data/yarkov2/nmr/H-C/1/pdata/1/auditp.txt
$$ ##AUDIT TRAIL=  $$ (NUMBER, WHEN, WHO, WHERE, WHAT)
(   1,<2026-07-17 10:33:48.56 +0400>,<Yarkov>,<DPX200>,
      <created by zg, POWCHK disabled, PULCHK disabled
       configuration hash MD5:
       00 E9 B6 7A A2 85 ED C7 34 08 36 98 17 FE 4E 26
       data hash MD5: 16K
       FF 52 D8 2A 00 9C 96 7B 84 D1 82 83 B9 A5 62 15>)
(   2,<2026-07-17 10:34:00.78 +0400>,<Yarkov>,<DPX200>,
      <Start of raw data processing
       efp BC_mod = 2 LB = 0.25 FT_mod = 6 PKNL = 1 PHC0 = -7255.922 PHC1 = 7.421964 SI = 16K 
       data hash MD5: 16K
       17 89 80 FD 07 08 E1 A8 75 04 BF 52 A3 85 46 1C>)
$$ ##END=
$$ 
$$ hash MD5
$$ ED C4 ED 64 07 92 C1 4D C6 84 4C AD 77 03 4F DE
##$RELAX= 
##$RELAX= 
##$RELAX= 
##$RELAX= 
##$RELAX= 
##$RELAX= 
$$ Bruker specific parameters
$$ --------------------------
##$DU= <C:/Bruker/XWIN-NMR>
##$EXPNO= 1
##$NAME= <H-C>
##$PROCNO= 1
##$TYPE= <nmr>
##$USER= <yarkov2>
##$AMP= (0..31)
100 100 100 100 100 100 100 100 100 100 100 100 100 100 100 100 100 100 
100 100 100 100 100 100 100 100 100 100 100 100 100 100 
##$AQSEQ= 0
##$AQ_mod= 1
##$AUNM= <au_zg>
##$AUTOPOS= <>
##$BF1= 200.13
##$BF2= 200.13
##$BF3= 200.13
##$BF4= 200.13
##$BF5= 200.13
##$BF6= 200.13
##$BF7= 200.13
##$BF8= 200.13
##$BYTORDA= 1
##$CFDGTYP= 0
##$CFRGTYP= 5
##$CHEMSTR= <none>
##$CNST= (0..31)
1 1 145 1 1 1 1 1 1 1 1 1 1 1 1 1 1 1 1 1 1 1 1 1 1 1 1 1 1 1 1 1 
##$CPDPRG= <>
##$CPDPRG1= <>
##$CPDPRG2= <>
##$CPDPRG3= <>
##$CPDPRG4= <mlev>
##$CPDPRG5= <mlev>
##$CPDPRG6= <mlev>
##$CPDPRG7= <mlev>
##$CPDPRG8= <mlev>
##$CPDPRGB= <>
##$CPDPRGT= <>
##$D= (0..31)
0 0.7 0 0 0 0 0 0 0 0 0 0.03 0 0 0 0 0 0 0 0 0 0 0 0 0 0 0 0 0 0 0 0 
##$DATE= 1784270028
##$DBL= (0..7)
120 120 120 120 120 120 120 120 
##$DBP= (0..7)
150 150 150 150 150 150 150 150 
##$DBP07= 0
##$DBPNAM0= <>
##$DBPNAM1= <>
##$DBPNAM2= <>
##$DBPNAM3= <>
##$DBPNAM4= <>
##$DBPNAM5= <>
##$DBPNAM6= <>
##$DBPNAM7= <>
##$DBPOAL= (0..7)
0.5 0.5 0.5 0.5 0.5 0.5 0.5 0.5 
##$DBPOFFS= (0..7)
0 0 0 0 0 0 0 0 
##$DE= 6
##$DECBNUC= <off>
##$DECIM= 32
##$DECNUC= <off>
##$DECSTAT= 4
##$DIGMOD= 1
##$DIGTYP= 9
##$DL= (0..7)
0 120 120 120 120 120 120 120 
##$DP= (0..7)
$$ [...]
##$SUBNAM2= <"">
##$SUBNAM3= <"">
##$SUBNAM4= <"">
##$SUBNAM5= <"">
##$SUBNAM6= <"">
##$SUBNAM7= <"">
##$SUBNAM8= <"">
##$SUBNAM9= <"">
##$SW= 18.0517328524113
##$SWIBOX= (0..15)
0 0 2 0 0 0 0 0 0 0 0 0 0 0 0 0 
##$SW_h= 3612.71676300578
##$TD= 16384
##$TD0= 1
##$TE= 0
##$TE2= 300
##$TE3= 300
##$TEG= 300
##$TL= (0..7)
0 120 120 120 120 120 120 120 
##$TP= (0..7)
150 150 150 150 150 150 150 150 
##$TP07= 0
##$TPNAME0= <>
##$TPNAME1= <>
##$TPNAME2= <>
##$TPNAME3= <>
##$TPNAME4= <>
##$TPNAME5= <>
##$TPNAME6= <>
##$TPNAME7= <>
##$TPOAL= (0..7)
0.5 0.5 0.5 0.5 0.5 0.5 0.5 0.5 
##$TPOFFS= (0..7)
0 0 0 0 0 0 0 0 
##$TUNHIN= 0
##$TUNHOUT= 0
##$TUNXOUT= 0
##$USERA1= <user>
##$USERA2= <user>
##$USERA3= <user>
##$USERA4= <user>
##$USERA5= <user>
##$V9= 5
##$VALIST= <valist>
##$VCLIST= <CCCCCCCCCCCCCCC>
##$VD= 0
##$VDLIST= <DDDDDDDDDDDDDDD>
##$VPLIST= <PPPPPPPPPPPPPPP>
##$VTLIST= <TTTTTTTTTTTTTTT>
##$WBST= 1024
##$WBSW= 4
##$XGAIN= (0..3)
0 0 0 0 
##$XL= 0
##$YL= 0
##$YMAX_a= 321684
##$YMIN_a= -531225
##$ZGOPTNS= <>
##$ZL1= 120
##$ZL2= 120
##$ZL3= 120
##$ZL4= 120
##$ABSF1= 0
##$ABSF2= 0
##$ABSG= 0
##$ABSL= 0
##$ALPHA= 0
##$AQORDER= 0
##$ASSFAC= 0
##$ASSFACI= 0
##$ASSFACX= 0
##$ASSWID= 0
##$AUNMP= <proc_1d>
##$AZFE= 0.1
##$AZFW= 0.1
##$BCFW= 0
##$BC_mod= 2
##$BYTORDP= 0
##$COROFFS= 0
##$CY= -3
##$DATMOD= 1
##$DC= 0
##$DFILT= <>
##$DTYPP= 0
##$F1P= 0
##$F2P= 0
##$FCOR= 1
##$FTSIZE= 16384
##$FT_mod= 6
##$GAMMA= 0
##$GB= 0
##$INTBC= 1
##$INTSCL= 3.241238e-09
##$ISEN= 128
##$LB= 0.25
##$LEV0= 0
##$LPBIN= 0
##$MAXI= 10000
##$MC2= 0
##$MEAN= 0
##$ME_mod= 0
##$MI= 1.114404
##$NCOEF= 0
##$NC_proc= -7
##$NLEV= 6
##$NOISF1= 3.799351
##$NOISF2= 2.8
##$NSP= 0
##$NTH_PI= 0
##$NZP= 0
##$OFFSET= 15.48687
##$PC= 1
##$PHC0= -7255.922
##$PHC1= 7.421964
##$PH_mod= 1
##$PKNL= yes
##$PPARMOD= 0
##$PSCAL= 0
##$PSIGN= 0
##$REVERSE= no
##$SF= 200.130006971043
##$SI= 16384
##$SIGF1= 3
##$SIGF2= 2
##$SINO= 0.751879
##$SIOLD= 32768
##$SREGLST= <19F.Aceton>
##$SSB= 0
##$STSI= 16384
##$STSR= 0
##$SW_p= 3612.71676300578
##$SYMM= 0
##$S_DEV= 0
##$TDeff= 16384
##$TDoff= 0
##$TI= <>
##$TILT= no
##$TM1= 0
##$TM2= 0
##$TOPLEV= 0
##$USERP1= <user>
##$USERP2= <user>
##$USERP3= <user>
##$USERP4= <user>
##$USERP5= <user>
##$WDW= 1
##$XDIM= 16384
##$YMAX_p= 353450932
##$YMIN_p= -1788415
$$ End of Bruker specific parameters
$$ ---------------------------------
##NTUPLES= NMR SPECTRUM
##VAR_NAME=  FREQUENCY,     SPECTRUM/REAL,   SPECTRUM/IMAG
##SYMBOL=    X,             R,               I
##VAR_TYPE=  INDEPENDENT,   DEPENDENT,       DEPENDENT
##VAR_FORM=  AFFN,          ASDF,            ASDF
##VAR_DIM=   16384,         16384,           16384
##UNITS=     HZ,            ARBITRARY UNITS, ARBITRARY UNITS
##FACTOR=    0.220516191357247, 1,           1
##FIRST=     3099.38736343754, 0,            0
##LAST=      -513.329399568239, 0,           0
##MIN=       -513.329399568239, -1788415,    0
##MAX=       3099.38736343754, 353450932,    0
$$ Real data points
##PAGE= N=1
##DATA TABLE= (X++(R..R)), XYDATA
$$ [...]
8760B25147N3614q2733R8354Q2212R3124l9269j62423m4000o7943k9565L01684
8749D28202J72156R1040J00237o6275R0194k8639J14257K32457K17288J83351
8739A534268L48722L19119M85970N20499N1152K3680j49691j72018k80378l90956
8729B290367l09718j67594k78197k33595l6283k87885n3466M6034j30438j49115
8719F90110p6678L3499o3512J77563Q2940O000k0488j7348j15425k6539K00529
8708H70651P5857j39842O935R7778n3568n8636K08617O1696R5260K41687K14822
8697A621257M3245J20866R5583L13843K95640K09371J58532K46661M24068N27426
8687D056492L56734J00314j1463j84546k72093k47680l23527n82157k67929l13806
$$ y = [225147, 278761, 196028, 294382, 376594, 469718, 430449, 268026, 224026, 156083, 126518, 428202, 600358, 691398, 791635, 725360, 815554, 786915, 901172, 1133629, 1350917, 1534268, 1882990, 2202109, 2688079, 3208578, 3259730, 3283410, 3133719, 2961701, 2681323, 2290367, 1980649, 1813055, 1534858, 1301263, 1264980, 977095, 923629, 969663, 839225, 690110, 613432, 646931, 583419, 760982, 843922, 849922, 829434, 812086, 696661, 670122, 870651, 946508, 806666, 813601, 911379, 857811, 799175, 1007792, 1069488, 1164748, 1406435, 1621257, 1664502, 1785368, 1880951, 2194794, 2490434, 2699805, 2858337, 3104998, 3529066, 4056492, 4413226, 4513540, 4502077, 4317531, 4045438, 3797758, 3474231, 2892074, 2624145, 2310339]
8677B310339k77469k53024r0864p9369j80281J27455L2257j19202J4424J11382
8667A595648J26119K10121K42545L22542K37628M10355N74080L88848K90273R9146
8657D497305k30233l36509l01376m75507m14350l83224m52674k87235j01724k82456
8647A232017j57445j82800q3559Q406q0969m0716r9324k7979J07710r33q2580
8636E91828j53574J09630R0292K2663r3635r6159o3813J2497P4744l7389L2257
8625D89341K7482J15250O4219R4451J29463J92115R4732K11636K98648J86109
8615A903446K93890N11332M61310N06010M51029J05241j48973j90357l19258l89170
8605C184500m57962n29863m09354k29853k77427k89390r2467M3191M2064l27814
$$ y = [2310339, 2032870, 1779846, 1688982, 1609613, 1429332, 1556787, 1589044, 1469842, 1484266, 1595648, 1721767, 1931888, 2174433, 2496975, 2734603, 3144958, 3719038, 4107886, 4398159, 4497305, 4267072, 3930563, 3629187, 3153680, 2739330, 2356106, 1903432, 1616197, 1514473, 1232017, 1074572, 891772, 808213, 816619, 735650, 694934, 595610, 567631, 675341, 674408, 591828, 438254, 547884, 638176, 660839, 567204, 471045, 407232, 419729, 494473, 457084, 489341, 516823, 632073, 696292, 790743, 920206, 1112321, 1207053, 1418689, 1717337, 1903446, 2197336, 2708668, 3169978, 3675988, 4127017, 4232258, 4083285, 3892928, 3573670, 3184500, 2726538, 2196675, 1787321, 1557468, 1280041, 990651, 898184, 941375, 983439, 655625]
8595F55625j13090q1J0472M2146o9658q6912J27712n8991r6860r3312L5802J27198
8583D80051j10803m2829L8142k8947o585l48227P3501M86283n6916n8343m2447
8572C82880j2934N3638M6367R7842n3532Q7139J551j28675j05615J68891J11691
8561F49243L864p3522m8191m8273O9073J35811O1406m5109j59292R0802P3896
8550G09708R1112O8377J30025N3604J82112J02961K10054K09699K88082L99906
8540B445640P39741Q32229J147906J236365J255649N49911K9829m50716o94866
8531G091688r01790j098599r26971q40901p03474o08681l62832l26724k01510
8522A120206j54341n979k38084q4735m9712j7212Q3097r196m4122j00107J3511
$$ y = [655625, 542535, 542454, 552926, 595072, 525414, 438502, 566214, 507223, 410363, 317051, 352853, 480051, 369248, 326419, 364561, 335614, 329029, -19198, 54303, 540586, 483670, 425327, 382880, 369946, 423584, 469951, 567793, 514261, 601400, 602951, 474276, 368661, 537552, 649243, 653107, 579585, 531394, 483121, 552194, 688005, 749411, 704302, 545010, 635812, 709708, 800820, 869197, 999222, 1052826, 1234938, 1337899, 1547953, 1757652, 2045734, 2445640, 3185381, 4017610, 5165516, 6401881, 7657530, 8207441, 8237270, 7786554, 7091688, 6189898, 5091299, 4164328, 3323427, 2619953, 2011272, 1648440, 1321716, 1120206, 965865, 959886, 721802, 637067, 587355, 570143, 653240, 644044, 599922, 499815, 513326]
8511E13326l4774j68750M7110j35164o8729k1796K0697L8228M6903k2385L0910
8500B45576P8738o4088n6202P518N8276j30739j3392N4854L6936n9947l6133L8667
8488A60064J16073j33323J44738k9964j81865L9979R024r3485J864O5778k37186
8477a38303J10928K21460p5994j83310K9025J05366O8520j07422p1461K7938L346
8466i907N0470O2357p9442k6493o7148P5576R2063L6406o9659k0133l0186M3608
8454E7512N9791N3860k5247o7137j7323n3417n624M4433P6822l2204J36279o0026
8442A67719l6274r8789L8853j3512K7538K6591k11446J38367J49398n9026L638
8431A33057P2085k0189r4823j03273o6054L9498k1838n0350K7581L9034J47402
$$ y = [513326, 478552, 309802, 356912, 221748, 153019, 131223, 151920, 190148, 237051, 214666, 245576, 324314, 260226, 204024, 211542, 269818, 139079, 125687, 180541, 217477, 157530, 121397, 160064, 276137, 142814, 287552, 257588, 75723, 115702, 124726, 31241, 33105, 98883, -138303, -27375, 194085, 118091, -65219, -36194, 69172, 137692, 30270, -41191, -13253, -9907, 40563, 102920, 23478, -3015, -70163, 5413, 97476, 133882, 64223, 44090, 13904, 57512, 117303, 171163, 145916, 78779, 61456, 8039, 2415, 46848, 123670, 91466, 227745, 167719, 131445, 32656, 71509, 57997, 85535, 112126, -99320, 39047, 188445, 129419, 133057, 205142, 184953, 90130, -13143, -79197, -39699, -61537, -111887, -84306, -45272, 102130]
8420A02130N9976j79753r3559J24704O0880k7875O9895k7152j08269r2524m2603
8409a54150O4895R406J58052l269q9928q5592j8092k0840J25375J66705k05657
8398e3095j51424l8621J03739n636R1102N275O7014J43219q4687j47067J46687
8387G6506k9602M4831k9583J03596n0644j23346l2289o1274r6416J21008j04959
8376a82172N6993J31873L1829J21514j30309J17358o6166J02631j34876L7769
8366H6444J00233J73529k5844K0151N8989p9169N7032M2600m2512j3281M5314
8355D23486J90440k6375j65579o3288N9450Q9958L4509k12370j07926q7540q5736
8344D9029Q3132J62693M0674j79513m1358m5588r695j56829O8228O1020m3333
$$ y = [102130, 162106, -17647, -111206, 13498, 74378, 46503, 116398, 89246, -19023, -111547, -154150, -89255, -79849, 78203, 74934, -14994, -100586, -118678, -139518, -14143, 152562, -53095, -204519, -243140, -139401, -145037, -53935, -48660, 18354, 161573, 76886, -70181, 76506, 46904, 91735, 62152, 165748, 115104, -8242, -40531, -101805, -198221, -77213, -182172, -125179, 6694, 38523, 160037, 29728, 147086, 80920, 183551, 48675, 86444, 186677, 360206, 334362, 354513, 413502, 334333, 391365, 433965, 391453, 378172, 423486, 613926, 587551, 421972, 358684, 418134, 508092, 542601, 330231, 222305, 134765, 49029, 132161, 294854, 335528, 156015, 114657, 69069, 59374, -97455, -29227, 31793, -11540]
8333a1540Q1892M2624n0722L5007m371j5404O30J08965o9688r2293J73352o9087
8321A29365P1222o7599M7860R9804m9060r44l6118o3034O5173m2923l1933M1379
8309A63192L6038l6765l8024L1077M9837M6282R074q728L7068M1309K4584j22537
8297B32407p4165j24883K2398J29970j1185j252R2467j0322j04617p828m9607
8286I3383l485j20002J1479J06122K9413R1201Q1290j36636m5517j02893O6423
8275G0778Q2284k1078r337M404m2018q0790k1085L7945M0800P070L8753p8492
8263B9234j54618m4316J47559J41236Q4990k6162j55885J46348j00354O8844p401
8252A29475o8839N1385o3780n7761M2931L3148p8672m6904m613P6541j03139k3467
$$ y = [-11540, 70352, 112976, 62254, 97261, 92890, 77486, 78116, 187081, 117393, 25100, 198452, 129365, 200587, 132988, 180848, 280652, 231592, 230648, 194530, 131496, 196669, 153746, 121813, 163192, 199230, 162465, 124441, 155518, 205355, 251637, 260711, 251983, 289051, 330360, 354944, 232407, 158242, 33359, 55757, 185727, 174542, 173290, 265757, 255435, 150818, 142990, 93383, 89898, -30104, -18625, 87497, 116910, 208111, 289401, 152765, 107248, 4355, 70778, 153062, 131984, 122647, 127051, 85033, 4243, -16842, 21103, 61903, 68973, 107726, 29234, -125384, -169700, -22141, 119095, 204085, 177923, 22038, 168386, 68032, 136876, 129475, 60636, 112021, 48241, -9520, 33411, 66559, -12113, -59017, -63630, 12911, -90228, -113695]
8240a13695J79784j0618q6409M579J96550J09541j13454p8015j08127J9214J03724
8229A03074M0327O2418N1664J01680J1993N2848j62563k5811j45658o5982J15408
8218A39398O7906J2054j6070J9844o4409P133N9976m7939o8872M6425N3653J46132
8206C55231j01802P9979k2481J58331p3390O0783n0738J62578o6721j412j05427
8195C94931J26734k0881M85102J38128j087304O2313M0444k3349K7406P8806r4839
8184A27491P7105k7995O5886J3347O5565j34107j3300K41578J585q2971k6973
8173C07211p401J33365O3339l2032l7475p5687J63497P2878j05629N6447O3888
8162F02401R5907L1369j17893L7196N3114K70372J11875P5797O0962J14473L04069
$$ y = [-113695, 66089, 55471, -30938, -26359, 170191, 279732, 166278, 88263, -19864, -650, 103074, 143401, 205819, 257483, 359163, 371156, 424004, 261441, 235630, 89972, 23990, 139398, 207304, 219358, 203288, 223132, 158723, 165856, 225832, 177893, 109021, 155446, 209099, 355231, 253429, 333408, 310927, 469258, 395868, 456651, 405913, 568491, 501770, 500358, 394931, 521665, 500784, 985886, 1124014, 36710, 99023, 139467, 116118, 143524, 222330, 127491, 204596, 176601, 242487, 255834, 321399, 187292, 173992, 415570, 417155, 334184, 307211, 299810, 433175, 496514, 464482, 427007, 351320, 514817, 587695, 482066, 538513, 602401, 698308, 729677, 611784, 648980, 702094, 972466, 1084341, 1160138, 1221100, 1335573, 1639642]
8151A639642L62991K60217L06008P28410O81707M30293M25015J95364R3521q3739
8141E039429l09562j56239j65682n9394N0102J95286M06094J85033j2285j5844
8131E156938j28362k50149o31179n80250n01311m17837k70051k20263l59808j90552
8121A607176k77268j26061Q5717j42653p1430o4363p3271L9950j40390L6718J17549
8110I91674j82016O0875n1994K7558n4833L0103n1722Q7113k1329j3077j00352
8099G22000P9872J42673q271l8331J63446N8495p5082k5594K5465K7411M2730
8088A114814O8238J22949m428N8300l084J431M0057R7197J75812J05703L0442
8077A807431R8593J85061L04405L78073K78207L68661N59266O25467N41724J88106
$$ y = [1639642, 2002633, 2262850, 2568858, 3297268, 3978975, 4409268, 4834283, 5029647, 5123168, 5039429, 4729867, 4573628, 4407946, 4348552, 4398654, 4593940, 5000034, 5185067, 5172782, 5156938, 5028576, 4778427, 4147248, 3566998, 3065687, 2647850, 2377799, 2157536, 1797728, 1607176, 1329908, 1203847, 1289564, 1146911, 1075481, 1011118, 937847, 977797, 837407, 874125, 991674, 809658, 870533, 818539, 846097, 791264, 821367, 769645, 856758, 835429, 822352, 722000, 801872, 944545, 936274, 897943, 1061389, 1119884, 1044802, 1019208, 1044673, 1072084, 1114814, 1183052, 1306001, 1301573, 1359873, 1356789, 1358220, 1398277, 1495474, 1671286, 1776989, 1807431, 1906024, 2091085, 2395490, 2773563, 3051770, 3420431, 3979697, 4605164, 5146888, 5334994]
8067E334994J37744J89704L3848j01323k41274n5289J92902J41016K42359L37289
8057F211970J90005j8380k55985k59300m68948m87151n25923l64060m03490l00276
8047C318462l66680j61436k63422j91050j11148J39842l2327j34551r5135r7855
8037B004700p1445j06239O5917m648L9157n5330O4265J34834j25616m771J41487
8026B082311l2209P7001J73402k8376J9934p7474p91J5152k7843q4943J49866
8015B266030M9484P5852K52398J02991m9161j9524J17744K3688J27493J12002
8005C058997N9478K8273R8746M6327N1313J08518P6625l223K89685L29814J22686
7994D267239K02441J77399K18736K66634J98064J59832L22108K89317N29779L84303
$$ y = [5334994, 5472738, 5662442, 5696290, 5594967, 5353693, 5298404, 5491306, 5632322, 5874681, 6211970, 6401975, 6383595, 6127610, 5868310, 5399362, 4912211, 4386288, 4022228, 3618738, 3318462, 2951782, 2790346, 2526924, 2335874, 2224726, 2364568, 2332241, 2197690, 2102555, 2004700, 1933255, 1827016, 1892933, 1888285, 1927442, 1872112, 1936377, 2071211, 1945595, 1940824, 2082311, 2050102, 2127103, 2300505, 2272129, 2292063, 2214589, 2213798, 2228950, 2201107, 2116164, 2266030, 2315514, 2391366, 2643764, 2746755, 2697594, 2678070, 2795814, 2819502, 2946995, 3058997, 3118475, 3146748, 3245494, 3291821, 3343134, 3451652, 3528277, 3525054, 3814739, 4144553, 4267239, 4469680, 4647079, 4865815, 5132449, 5330513, 5490345, 5812453, 6101770, 6631549, 7015852]
7984G015852M43099M27964N79406R31783R10876R38061J029521J380554J675802
7975A5332918J868439K238154K964579L695504M068462M453072M744309N000955
7967D4366392N456063O248523P142755P300045O047850M111100K793660K171964
7959H5638352J562200J253678L68696j416050l227447m507066n228607o054277
7951F8389479o336170o190609n993914n863999n384464m954519m489871l856416
7943B5319517l370258k754091k387486j975870j543219j264709j107627r66382
7935I949875o56349o90971m48578o91249n99154m06923k57254l40697k55236k94064
7925E309400l10760k61949k01631k76649k23981J6600j53948j79692m7154j32717
$$ y = [7015852, 7458951, 7886915, 8466321, 9398104, 10308980, 11247041, 12276562, 13657116, 15332918, 17201357, 19439511, 22404090, 26099594, 30168056, 34621128, 39365437, 44366392, 49822455, 56070978, 63213733, 70513778, 76561628, 80672728, 83466388, 85638352, 87200552, 88454230, 88822926, 87406876, 84179429, 79672363, 74443756, 68389479, 62053309, 55862700, 49868786, 44004787, 38620323, 33665804, 29175933, 25319517, 21949259, 19195168, 16807682, 14831812, 13288593, 12023884, 10916257, 9949875, 9293526, 8602555, 8153977, 7462728, 6863574, 6456651, 6199397, 5858700, 5603464, 5309400, 4998640, 4736691, 4535060, 4258411, 4034430, 4051030, 3897082, 3717390, 3670236, 3537519]
7915C537519j32695m8245Q244j60885n654p5021o7878j03902L1332j75352j66742
7904B640721M7586k06280j8363l4204j28122L3747j5091j42096j30081j48464
7894A899353Q262o1295O8187M3041j24711m4645q0731J20911o0999l7945k5021
7883A704407j67505j1503j228N8258P3793j36302n3553m0581q9356k0123J5756
7872A332063j26310M1084R6048j03711k4975r8746m0352L1854n3924Q1754J81482
7861A316267n2886o3948k1632N3749j36491J16271K2252J0663n5868M923J21025
7850A314325j1688j3965J84288K8733R0824J83343P5038J46255K35031J15626
7840B347810K13034L55536K62356R9662L74299M20748M54115M40148J13923Q8530
$$ y = [3537519, 3404824, 3356579, 3364823, 3203938, 3198284, 3123263, 3055385, 2951483, 2982815, 2807463, 2640721, 2688307, 2482027, 2463664, 2429460, 2301338, 2335085, 2319994, 2177898, 2047817, 1899353, 1907615, 1846320, 1914507, 1957548, 1832837, 1788192, 1707461, 1828372, 1767373, 1729428, 1704407, 1536902, 1525399, 1524171, 1582429, 1656222, 1519920, 1466367, 1425786, 1336430, 1316307, 1332063, 1205753, 1246837, 1342885, 1239174, 1214199, 1115453, 1075101, 1106955, 1053031, 1134785, 1316267, 1263381, 1199433, 1177801, 1231550, 1095059, 1211330, 1233582, 1244245, 1188377, 1193300, 1314325, 1302637, 1288672, 1472960, 1501693, 1592517, 1775860, 1850898, 1997153, 2232184, 2347810, 2560844, 2916380, 3178736, 3278398, 3652697, 4073445, 4527560, 4967708, 5081631, 5170161]
7830E170161R2008J11036Q8017K0235j66103k44645k58269j56588l19837l80010
7820C956005k02789k51778k49609l77049l18771j36955j22759j98763j11679k32583
7810A753270j69143N1766n04200L70117N04206j82088J16826L8500K90551R0562
7800B360367N9910J45006L69452K45054L00643K90189L97955K86063K49134L59459
7790E063232N72815L14016K00857L57080J94059J42329n8935L395j60565j42152
7780F486131j37982l08573m26203l46888l34838l85267l89798k58442m27140l29177
7770C141823k35562l30670k64532k70991k88221j02554q8888M8882j25012J9543
7760A503818j09890k46516K0288J02586q0996r522j3163o6955m7248j313J14272
$$ y = [5170161, 5262169, 5373205, 5461222, 5481457, 5315354, 5070709, 4812440, 4655852, 4336015, 3956005, 3753216, 3501438, 3251829, 2874780, 2556009, 2419054, 2296295, 2097532, 1985853, 1753270, 1584127, 1635893, 1131693, 1501810, 2006016, 1823928, 1940754, 1979254, 2269805, 2360367, 2420277, 2565283, 2934735, 3179789, 3480432, 3770621, 4168576, 4454639, 4703773, 5063232, 5636047, 5950063, 6150920, 6508000, 6702059, 6844388, 6785453, 6788848, 6628283, 6486131, 6348149, 6039576, 5613373, 5266485, 4931647, 4546380, 4156582, 3898140, 3471000, 3141823, 2906261, 2575591, 2311059, 2040068, 1751847, 1649293, 1560405, 1609287, 1484275, 1503818, 1393928, 1147412, 1167700, 1270286, 1189290, 1179768, 1166605, 1099650, 1052402, 1051089, 1165361]
7749A165361J64024L0789R8903N4277M798K67367K08294j31793k52979m8840j78522
7738A381679l9358n5711k08689j41937l9424o3374q381N6209k0116m6567j5804
7727G98527Q094l3106k5936l9325N5880O3611P5811J41757n9784Q7019J63601
7716A236149J17114J6602J18918m572M3395N5518k21709J4986j06399j45560j59535
7705I64907L5721q1064r6337n9369K3478j47632k8147J32827N439q4230l3526
7694F32067K10232o9538j2876L0849J25983J47943r2330P8993N6234j8116J25834
7683A215275m3478j7652R1165p77J1488J6150K4857j12270K88678P872N7559m5037
7671A493830J65167R4332P8908L56088L18770L20031P4562K86768M38264K65425
$$ y = [1165361, 1329385, 1360174, 1459077, 1513354, 1518152, 1785519, 1993813, 1862020, 1609041, 1560201, 1381679, 1342321, 1286610, 1077921, 935984, 896560, 833186, 824805, 881014, 860898, 814331, 798527, 806621, 773515, 747579, 708254, 764134, 827745, 903556, 1045313, 985529, 1072548, 1236149, 1353263, 1369865, 1488783, 1484211, 1527606, 1583124, 1361415, 1376401, 1270002, 1124442, 964907, 1000628, 919564, 823227, 763858, 787336, 639704, 611557, 744384, 749823, 665593, 632067, 842299, 772761, 759885, 790734, 916717, 1064660, 972330, 1051323, 1107557, 1089441, 1215275, 1171797, 1154145, 1245310, 1244533, 1256021, 1272171, 1297028, 1184758, 1473436, 1481308, 1538867, 1493830, 1658997, 1753329, 1832237, 2188325, 2507095, 2827126, 2901688, 3188456, 3626720, 3892145]
7661C892145L43036N13161M53873L58176K83308K38118j9358l2496k1475J65137
7651F173625L7386J0819j06543m0760k06759j67574l09899m15197m28146l49517
7641D197435j82753k63454l00260k19857l11378k79420l82754j99114r3312j43022
7631A822111k27969r8764j40793k8810M147K6031K1189q3401K9965o0731j30455
7620A132520j7221M1883j9171o7162m413K2413P490l671j18766j03066K1179m3117
7608H48898J09908K4692j89899l4607n3263j46694m721J60010m3027N7530M3417
7597G72244o0092P7208q9356o9236O2997n2547R0373r0936K10407J154r2676J26786
7585H86326J37484n1764J49581J82860J85534K38776J98257J76314K53396J61721
$$ y = [3892145, 4235181, 4748342, 5202215, 5560391, 5843699, 6081817, 6062459, 6029963, 6008488, 6173625, 6211011, 6221830, 6115287, 6074527, 5867768, 5700194, 5390295, 4975098, 4546952, 4197435, 4014682, 3751228, 3450968, 3231111, 2919733, 2640313, 2257559, 2058445, 1965133, 1822111, 1594142, 1495378, 1354585, 1325775, 1329922, 1355953, 1377142, 1293741, 1323706, 1262975, 1132520, 1115299, 1157182, 1138011, 1070849, 1066436, 1088849, 1096339, 1092668, 973902, 870836, 892015, 848898, 958806, 983498, 793599, 758992, 705729, 559035, 554314, 714324, 671297, 728827, 772244, 712152, 789360, 700004, 630768, 693765, 641218, 731591, 640655, 851062, 852216, 759540, 886326, 1023810, 972046, 1121627, 1304487, 1490021, 1728797, 1927054, 2103368, 2356764, 2518485]
7575B518485R412P8810Q871J55342R5365O8280j4391j50513j58512q1307j68244
7564B361598j78463k95613j14225j96547J4482r9528j01291m6430j24223j06184
7554A113576K1627o9015J03794n9655j10960j48782k0735J43384K7678O4113j12128
7543I52897r7011L6027P5640l1494n6529q2653K02622q3760l255L1168j11700
7532H31952n3760J31599p2566j21789n3583J48395M7228o1128j8297l4967l9530
7521G03554K3135O0235r4986l3796R7240l7833j18616n8703J02268j07583m5774
7510D89141L1447J8419O3713j2908J82982r9695j14504J34288M8378p9128q9988
7499E72145R1645L1773l0939l6472R9122O1689r8284k5659N774l6386Q9085K9382
$$ y = [2518485, 2527897, 2606707, 2615578, 2770920, 2866285, 2934565, 2920174, 2769661, 2611149, 2529842, 2361598, 2183135, 1887522, 1773297, 1576750, 1591232, 1491704, 1390413, 1343983, 1219760, 1113576, 1135203, 1066188, 1169982, 1110327, 999367, 850585, 829850, 973234, 1000912, 1065025, 952897, 855886, 891913, 967553, 936059, 879530, 796877, 999499, 915739, 912484, 943652, 831952, 778192, 909791, 837225, 715436, 661853, 810248, 857476, 796348, 778051, 743084, 703554, 726689, 786924, 691938, 658142, 755382, 717549, 598933, 540230, 642498, 534915, 489141, 520588, 539007, 602720, 589812, 772794, 673099, 558595, 692883, 741261, 662133, 572145, 663790, 695563, 664624, 628152, 727274, 788963, 690679, 665020, 670794, 634408, 723493, 752875]
7487G52875j28570Q0289j2635K5907J39529J44022J275M0689J72101Q4964J95351
7476A495797J18940J56466K60425M10684L45182J97266K05P6019O2359j21490
7466C001853j6754j49586q6243r7850j07975k20087o4862j27398k85264j18434
7456A727400j62257k65405j15129l4309n814j9692j67324J8139L325L3253j28165
7445H84022J95245J96770J5943L7827n9457N8028O2997J07212p3035J66395M8379
7434A640326K7621k7872p8198j11181L4697L7590M1370k0918j32406p8449o8121
7423A264459J64392J23352o543M2880L6702P578l842J914P7068O7510M0771R646
7411A825887M5423J41501m7120J03455L278q0156K11147R1783p8796n8843L2814
$$ y = [752875, 624305, 704594, 691959, 717866, 857395, 1001417, 1002692, 1043381, 1215482, 1300446, 1495797, 1614737, 1771203, 2031628, 2442312, 2787494, 2984760, 2984965, 3060984, 3123343, 3001853, 2985099, 2835513, 2749270, 2651420, 2543445, 2323358, 2258496, 2131098, 1845834, 1727400, 1565143, 1299738, 1184609, 1150300, 1144486, 1124794, 957470, 975609, 978934, 1012187, 884022, 1079267, 1276037, 1291980, 1329807, 1270350, 1328378, 1391375, 1498587, 1425552, 1591947, 1640326, 1667947, 1640075, 1561877, 1450696, 1485393, 1522983, 1564353, 1543435, 1411029, 1332580, 1264459, 1428851, 1552203, 1545660, 1588540, 1625242, 1632820, 1628978, 1630892, 1707960, 1775470, 1816241, 1825887, 1871310, 2012811, 1965691, 2069146, 2072424, 1992268, 2203415, 2295198, 2216402, 2157559, 2190373]
7400B190373p9966J61134K35594n229J22165J95555K31694J8361P2819J18537
7390C261037O2365K82646K76867L11903L83922L06474M37528N48509M64671N97628
7380F933550N16771M97406M49032M49881M25914L48679J84077K57218J40554k7964
7370A0175118P2706J39846j07169o4178j4777p2669j02395k44132q3511k92399
7360I406440l51580k53713k28303j16047j66413m24516l38314m43858l13268l80774
7350F389654m48783l31776k60494m00882n41796k55413l28468k37511j45517k26113
7340C212901j07886j02735j94618j09170K7109r1656j05744m8947Q7729n9066
7330B507917O2492P5199m1807j4547J6140K24937J72043n7682k6825N2946q0793
$$ y = [2190373, 2110407, 2271541, 2507135, 2501906, 2624071, 2819626, 3051320, 3069681, 3142500, 3261037, 3323402, 3606048, 3882915, 4194818, 4578740, 4885214, 5322742, 5871251, 6335922, 6933550, 7450321, 7947727, 8396759, 8846640, 9272554, 9621233, 9805310, 10062528, 10203082, 10175118, 10247824, 10387670, 10280501, 10216323, 10201546, 10128877, 10026482, 9782350, 9698839, 9406440, 9054860, 8801147, 8572844, 8456797, 8290384, 7865868, 7527554, 7083696, 6770428, 6389654, 5940871, 5609095, 5348601, 4947719, 4405923, 4150510, 3822042, 3584531, 3439014, 3212901, 3105015, 3002280, 2807662, 2698492, 2725601, 2633945, 2528201, 2479254, 2566983, 2507917, 2570409, 2645608, 2603801, 2589254, 2605394, 2830331, 3002374, 2944692, 2917867, 2970813, 2890020]
7319B890020J60392N3276J66205J55665J22949J08236J66720K51447J40325J87481
7309D402716j1820K01399K74497M6362L56052L66506O24817O91957Q16673Q47102
7299H616261Q12310P43787O26525P45765O71214O69637R95148J426154K174204
7290A7481005K931317L890157N171436N929872N988190M701068K421599M13559
7282D8928203j646560l498351m766816n217756m823079m227096l433893k707809
7274A8606843j849614j000345m27130k01969p7396J43529K16958M79968O89068
7265A6579912O20279L95046J43324l01353l73395n31415j176365j271765j253454
7256A2830814j216943j424909j215037r29236r31856o79515m60702m28001n16418
$$ y = [2890020, 3050412, 3103688, 3269893, 3425558, 3548507, 3656743, 3823463, 4074910, 4215235, 4402716, 4390896, 4592295, 4866792, 4913154, 5269206, 5635712, 6260529, 6952486, 7769159, 8616261, 9428571, 10172358, 10798883, 11544648, 12215862, 12885499, 13880647, 15306801, 17481005, 20412322, 24302479, 29473915, 35403787, 41391977, 46093045, 48514644, 48928203, 47281643, 43783292, 39016476, 33798720, 28975641, 24748545, 21314652, 18606843, 16757229, 15756884, 15329754, 15127785, 15050389, 15193918, 15410876, 15890844, 16579912, 17200191, 17595237, 17738561, 17437208, 17063813, 16532398, 15356033, 14084268, 12830814, 11613871, 10188962, 8973925, 8044689, 7112833, 6433318, 5972616, 5544615, 5028197]
7247E028197l63506l26065j63981j11770m5242o1727j61168j60461m2348J479
7237C593408j01353Q0296M3219J30101L1289k0305q8031N4517J85394K44556L70096
7226D523187M03388K88442L74764M83299L64159L14438Q4262k75124j84878l33853
7216F042084j17100o2762J57770K47445L10397K69316m6196k04668l39339k97844
7206E959103k94662m94980m41807l96928k43549o7985q4676j10944q7719k3554
7196C712299K5418J03689L8473R0776N5603K57950j992J35940J44780J69546J64226
7185D896708L04165L19323L67002M25236O86370O69664Q15411J045028J244437
7176A0773344J573420K015496K545486K869735L336038L522484L348269K892372
$$ y = [5028197, 4664691, 4338626, 4174645, 4062875, 4017633, 3955906, 3794738, 3634277, 3591929, 3593408, 3492055, 3572351, 3615570, 3745671, 3776960, 3756655, 3668624, 3723141, 3908535, 4153091, 4523187, 4926575, 5215017, 5589781, 6073080, 6437239, 6751677, 6835939, 6560815, 6375937, 6042084, 5924984, 5862222, 6019992, 6267437, 6577834, 6847150, 6800954, 6596286, 6256947, 5959103, 5664441, 5169461, 4727654, 4330726, 4087177, 4019192, 3934516, 3823572, 3735853, 3712299, 3737717, 3841406, 3879879, 3970655, 4026258, 4284208, 4282216, 4418156, 4562936, 4732482, 4896708, 5200873, 5520196, 5887198, 6312434, 6998804, 7668468, 8483879, 9528907, 10773344, 12346764, 14362260, 16907746, 19777481, 23113519, 26636003, 29984272, 32876644]
7168C2876644K330002J774897J084115K67338n36393j498869k126880l065809
7160C1105045l372146l462429l347180k964244k679605k184766k030869j489466
7152I574340j117333q36523o02007o60723m73612k97247k75611k79855l30348
7143D701081k75056K147k81420m04323j72203j49366p3179j60003j83597o1964
7133B942117M2984l5372j8460j9374n7040J7697j52584K1234m0652J38789q2158
7122B757181j01197J99968J23157R7118P9614J62615K56176K88832K56004N23932
7112D643400K65235K82675K98202M16758N22973M49698L65933N98508P61656N56303
7102I161341L34343M9027n8438k69634n43149n95759n27753p99418p07368n17648
$$ y = [32876644, 35206646, 36981543, 38065658, 38332996, 37796603, 36297734, 34170854, 31105045, 27732899, 24270470, 20923290, 17959046, 15279441, 13094675, 11063806, 9574340, 8457007, 7620484, 7018477, 6357754, 5884142, 5586895, 5311284, 5031429, 4701081, 4426025, 4428172, 4146752, 3742429, 3570226, 3420860, 3347681, 3187678, 3004081, 2942117, 2985101, 2949729, 2931269, 2911895, 2854855, 2872552, 2719968, 2741202, 2700550, 2839339, 2757181, 2655984, 2855952, 2979109, 3076227, 3155841, 3318456, 3574632, 3863464, 4119468, 4643400, 4908635, 5191310, 5489512, 5906270, 6429243, 6878941, 7244874, 7843382, 8605038, 9161341, 9495684, 9544711, 9486273, 9216639, 8673490, 8077731, 7549978, 6750560, 6043192, 5525544]
7092E525544m89258l16540k76971n7160n905J00364J71484O9421q7471J41516
7082D775024K23326m4198M681o6623j30167k93734m31604l97074k77293k97753
7072C064585l11783k41924n1886J7207k36575j48220J17957J21235n1804q3153
7062B195639N2988J07880K19675K36497K71697J90434M52038L85215L24983K22675
7052D659721p3581r5510k56015m34898m54813l95980k48961k80117l07096o0181
7042B052569j1392j19030q7129j5435j07235Q6533r1118p84j5915j08005R1960
7031A675019J24022p3175P389J55492K8000l502J9114J0030O7215r1459k01870
7020A716275m4030Q5037k9555l1778J11657J33694J6915K4898J61002N8214J56673
$$ y = [5525544, 5036286, 4719746, 4442775, 4385615, 4379710, 4480074, 4651558, 4720979, 4633508, 4775024, 4998350, 4954152, 4958833, 4892210, 4762043, 4468309, 4036705, 3639631, 3362338, 3064585, 2752802, 2510878, 2458992, 2476199, 2239624, 2091404, 2209361, 2330596, 2278792, 2195639, 2248627, 2356507, 2576182, 2812679, 3084376, 3274810, 3726848, 4112063, 4437046, 4659721, 4586140, 4490630, 4234615, 3799717, 3344904, 2948924, 2699963, 2419846, 2112750, 2052569, 2041177, 1922147, 1835018, 1819583, 1712348, 1798881, 1707763, 1706979, 1691064, 1583059, 1675019, 1799041, 1725866, 1733255, 1888747, 1916747, 1913245, 1932359, 1942389, 2009604, 1918145, 1716275, 1672245, 1757282, 1727727, 1695949, 1807606, 1941300, 1958215, 1983113, 2144115, 2202329, 2359002]
7009B359002M8703j70330j8097R2965p107J22540q9149j3971L02283Q0786Q4971
6998B792596L3950R8437J68614K48915L75151L14954L08440J65464K83669M14209
6988E204399L58620J24391J4309O186J05506O6239J93022M09945O74922P07193
6978G864732R58075J291250J593812J851344J662967J904764K022858J959579
6970B1109381K009762J648354R45087q7791r89668j702700k107148k627205k618360
6961A5579712k178376j962604j648691j336089q42755n23108m98866k21281J10921
6952F478863N3987N8848o3480o7512n6481N403J01003K55930K42723M08438M75635
6941G893357L52182L51898J3148k83546l68860m66116p58297o22281p09354o44179
$$ y = [2359002, 2407705, 2237375, 2219278, 2312243, 2305136, 2427676, 2338527, 2324556, 2626839, 2707625, 2792596, 2826546, 2924983, 3093597, 3342512, 3717663, 4032617, 4341057, 4506521, 4790190, 5204399, 5563019, 5687410, 5701719, 5707905, 5813411, 5879650, 6072672, 6482617, 7157539, 7864732, 8822807, 10114057, 11707869, 13559213, 15222180, 17126944, 19149802, 21109381, 23119143, 24767497, 25712584, 25624793, 24635125, 22932425, 20825277, 18198072, 15579712, 13401336, 11438732, 9790041, 8453952, 7611197, 7088089, 6589223, 6367942, 6478863, 6532850, 6591698, 6528218, 6460706, 6404225, 6409628, 6510631, 6766561, 7009284, 7417722, 7893357, 8245539, 8597437, 8610585, 8327039, 7958179, 7492063, 6733766, 6111485, 5402131, 4757952]
6931D757952m98248m54743k96867l29368j19215l47532r0862j16861j01178l3669
6921B369409j73583j71574p9941K9391j31855j57919j41699M1124J9817j27225
6911A475945r4765n2896r5866p3631K1262p9357k9238o7426j35277j172r109L8773
6899H97243P4334R2428n9274r4418j6430q3125J080Q5544K6804r7680J9700j29808
6887G16398K4717O9071o7572r646o6625j23565j9607O0044o6881l4082O6862J39779
6875F88893k8199j13977L6696J09815M1198j24177r6282P1580r8288K9894Q0866
6864E98019l2640r637M4687J37202k5841j20596P5286k9633q9067k1543K0132
6853E46369k7214m38L493p3439J02604J50924j40793j49006j12602N9257L1827
$$ y = [4757952, 4259704, 3804961, 3508094, 3178726, 3059511, 2711979, 2621117, 2504256, 2403078, 2369409, 2195826, 2024252, 1944311, 1973702, 1841847, 1683928, 1542229, 1583353, 1603170, 1475945, 1381180, 1328284, 1232418, 1158787, 1180049, 1100692, 1071454, 1004028, 868751, 867579, 858470, 897243, 971577, 1064005, 1004731, 910313, 893883, 810758, 811838, 897382, 924186, 826506, 846206, 716398, 741115, 810186, 742614, 732968, 666343, 542778, 523171, 583215, 516334, 482252, 549114, 688893, 660694, 546717, 583413, 693228, 734426, 610249, 513967, 585547, 487259, 517153, 598019, 565379, 555742, 600429, 737631, 711790, 591194, 666480, 636847, 547780, 526237, 546369, 519155, 518717, 522210, 448771, 551375, 702299, 561506, 412500, 299898, 359155, 390982]
6842C90982Q4357N4383p6792K5909O9241K3350m674l8271j72860J49295J3627
6831E18547p4876k9674L652J8678K600K3109J0907p2833j22603m1523k5529Q1764
6819B92219O0330L9892j22772K6501J19013k8743R9132o470J21192o9471l8034
6808D92789J02106j20699o5920L6441k4074Q301J53386K5748N3763L3670j76273
6797E19238q4397m2618j15351O6099m0964K0182J56729N6189j18033P0578K19352
6786G07004R806j62201m278J03369q0956J4759P6452K1737n8011m1399m1737j1867
6774E32678q4783j9939Q479J01816L9819k5747l3341P8305P2749o2820J30647
6763G37863J09633O1994m6510Q9448J52472N1837o7755j7640M3519R4548N8881
$$ y = [390982, 475339, 529722, 452930, 478839, 548080, 571430, 566756, 528485, 355625, 504920, 518547, 443671, 413997, 417649, 436327, 438927, 462036, 472943, 400110, 277507, 235984, 210455, 292219, 352549, 392441, 269669, 296170, 415183, 386440, 485572, 479102, 600294, 530823, 492789, 594895, 474196, 408276, 444717, 420643, 428944, 582330, 608078, 661841, 695511, 519238, 434841, 392223, 276872, 342971, 302007, 322189, 478918, 535107, 417074, 487652, 707004, 716810, 554609, 550331, 653700, 572744, 587503, 663955, 685692, 627681, 586282, 544545, 532678, 447895, 427956, 436435, 538251, 578070, 552323, 518982, 597287, 670036, 607216, 737863, 847496, 909490, 862980, 952428, 1104900, 1156737, 1088982, 1071342, 1114861, 1209409, 1268290]
6752A268290r6676p2803k1104j36175j75858k4789J71193j97266o6113N6010L8832
6741G43541R127J4305m9523k7722O9543P6602P1364p9127J08489J64362J43727
6730A244688m5957R6439M1911N8670j27966L6080j2713k03359j29640k6071O2088
6719I94170J8426j8851r2599j36652j51111k315M6868Q6919J9347j5940j39858
6708F08404J5415J17691K6109P2165Q1276q2035j9725j11361p2124L831K127Q6355
6696G28128j1446r5499j5779R4093J39J51732k0858M3505j7081o5976j6744J2043
6684G86257P852P0938J89580O9745K141j9101n4010k7491m9451K8478J11969O4643
6672A181550Q3532J63755r3514M8370j03680j66985r1082k1230M2323L3565N0829
$$ y = [1268290, 1171614, 1098811, 1077707, 941532, 765674, 740885, 912078, 714812, 648699, 704709, 743541, 752668, 766973, 717450, 689728, 759271, 835873, 907237, 828110, 936599, 1100961, 1244688, 1198731, 1295170, 1337081, 1395751, 1267785, 1303865, 1291152, 1087793, 958153, 932082, 994170, 1012596, 993745, 901146, 764494, 613383, 611068, 657936, 744855, 764202, 748262, 608404, 623819, 741510, 767619, 839784, 921060, 839025, 819300, 707939, 635815, 639646, 641773, 728128, 716682, 621183, 605404, 699497, 699636, 851368, 830510, 874015, 856934, 790958, 774214, 786257, 794109, 865047, 1054627, 1124372, 1126513, 1107412, 1053402, 1025911, 976460, 1004938, 1116907, 1181550, 1265082, 1428837, 1335323, 1383693, 1280013, 1113028, 1021946, 1000716, 1043039, 1076604, 1127433]
6661A127433O116K3598k3505o5707j47253K0324j80810q5592l0533l6493q8523
6650E19055J21055m636r0212k2642K6966m3101j13722J27743J42214j28423M3323
6639E77620j15716p519P0333j9514l4588O2849n9464o6938O8148q98L738o1959
6627D16092N1789M9761R1002m0086l3719L9924j7177j06251j06114M8286L6357
6616D29864j08367P3743P5870m3161M2273N0874j02038k7895q879k6923L8892
6605C94253O4989M0420k9999P883K1484p8717j33497Q1800Q1721O4093j07564
6594D06866j27171N1715J5772R1897q8545j73968o4591J34502m211M0767m2080
6583B40953P2333K26594j16732j92948R5374N7698J6136j04467L419k5236K7066
$$ y = [1127433, 1133549, 1157147, 1133642, 1067935, 920682, 941006, 760196, 674604, 644071, 607578, 519055, 640110, 635474, 545262, 522620, 549586, 506485, 392763, 520506, 662720, 534297, 577620, 461904, 454385, 524718, 505204, 470616, 533465, 474001, 407063, 475211, 474313, 478051, 416092, 467881, 517642, 608644, 568558, 534839, 574763, 557586, 451335, 345221, 393507, 429864, 321497, 395240, 471110, 427949, 470222, 521096, 419058, 391163, 382284, 355361, 394253, 459242, 499662, 469663, 477546, 499030, 420313, 286816, 368616, 450337, 514430, 406866, 279695, 331410, 347182, 439079, 350534, 176566, 111975, 246477, 242266, 283033, 240953, 313286, 539880, 423148, 230200, 325574, 383272, 399408, 294941, 298360, 273124, 300190]
6572C00190K7481J13611o9883M4817J16727o3040j63888j00584J85904L9158J75218
6561F05711L1412j6801k6447o6100j3525M1531j07724K0717k3010j37320J06863
6550D15307J48667O985k50269l2354J42149j07739l1445J22099M3339K3147N9202
6539E39088Q6398j8224n1289n1577j41284J05304o768j14198m7293J76935m8170
6528D28922M1454k0573m3697M2561j44009R4465N4595l2273J4850K4171J590k17375
6516B44681R4748J69420j3868J2200J14322o1816j99988p582p9768J1931q141
6505B76139J20863m1044j03990Q439r3278N9932l1545J1793J707L1273q0735M1432
6493B00986K40911j1520r6257q8341j73906J08809O5465j08408O3694K9661L5107
$$ y = [300190, 327671, 441282, 371399, 416216, 532943, 469903, 306015, 205431, 391335, 430493, 605711, 637123, 620322, 593875, 527775, 514250, 555781, 448057, 468774, 445764, 308444, 415307, 563974, 570959, 320690, 288336, 430485, 322746, 291301, 413400, 456739, 479886, 539088, 625486, 607262, 555973, 504396, 363112, 468416, 461648, 347450, 300157, 477092, 428922, 470376, 449803, 406106, 448667, 304658, 399123, 453718, 421445, 436295, 460466, 462056, 244681, 339429, 508849, 494981, 507181, 621503, 559687, 359699, 352117, 272349, 284280, 276139, 397002, 355958, 251968, 260407, 167129, 227061, 195516, 207309, 209016, 240289, 159554, 200986, 441897, 430377, 334120, 245779, 71873, 180682, 246147, 137739, 201433, 231094, 266201]
6482B66201r919K3734Q2985j16285j87561r808p2670J36157J8405P462J08057
6471B46758M8136o3866j40425L7144N751P2889o6130j1046n0403J5797J02115
6460A96720j1026N9902Q2305o4534M742N2615l5560P4404p0794j3315J18264Q3536
6448D77259j81736m1023k3906J30928J97066r808p5852L8197m0874N0959p4218
6437D46992k2399j80509J3433J63881p4321O552M4106m668o1753J8629J47573
6426D97516K6593j29127j91629P7619J77753j48513M9100n8400j01655J55249
6416C54506j1454r6427O464J32761k7446j3880R0666r2992O9314o3144o8875N1270
6404C30763L9817j0978J2856l393j2589N4614K9717j5386m1375N1628J2936k7575
$$ y = [266201, 256282, 280016, 363001, 246716, 59155, 49347, -23323, 112834, 131239, 138701, 246758, 294894, 231028, 90603, 127747, 133498, 206387, 140257, 129211, 78808, 94605, 196720, 185694, 245596, 327901, 263367, 268109, 320724, 285164, 359568, 288774, 275459, 393723, 477259, 295523, 254500, 230594, 361522, 558588, 548780, 472928, 511125, 470251, 521210, 446992, 424593, 244084, 257517, 421398, 347077, 353629, 397735, 393067, 331314, 349943, 497516, 524109, 394982, 203353, 280972, 458725, 310212, 359312, 300912, 199257, 354506, 343052, 246625, 253089, 385850, 358404, 344524, 435190, 342198, 411512, 348368, 279493, 330763, 370580, 359602, 372458, 369065, 356476, 411090, 440807, 425421, 384046, 435674, 448610, 421035]
6392D21035k1135q1202Q5697J14257M2056J08595L3156j66928M8993p3818L2481
6381E43187R8726j1557J25483M9013k09139K7120l2980o2706m6837J29381J41593
6370G51284j74805n5592j3975l5480R1976m9441p5143K28199J50707n8066o6371
6359F93293J08587j00471l8306J27115j6576o8507l5847Q5928J0382j11711R1968
6348G45855L3665j05885j05063Q1653j01788Q8555K6175o8612l5326N4942L5336
6337F49507j3018j4838l6781J42880m3544K4317P3927M9396P7443L5511r737J28889
6325A063952J50993R5449p4376O7911O227M8951K2013j07411j22176L4091K0498
6314A206122q2212j65731P3893J56711o1925q1352O5503j60001M6397p4487P0089
$$ y = [421035, 399900, 318698, 404395, 518652, 560708, 669303, 702459, 535531, 584524, 510706, 543187, 641913, 630356, 755839, 804852, 595713, 622833, 589853, 527147, 480310, 609691, 751284, 576479, 520887, 506912, 471432, 563408, 513967, 438824, 667023, 817730, 759664, 693293, 801880, 701409, 663103, 790218, 773642, 705135, 669288, 755216, 765598, 653887, 745855, 779520, 673635, 568572, 650225, 548437, 636992, 663167, 594555, 559229, 614171, 649507, 636489, 621651, 584870, 727750, 684206, 708523, 782450, 831846, 909289, 944800, 935063, 1063952, 1214945, 1310394, 1236018, 1303929, 1310156, 1359107, 1381120, 1273709, 1151533, 1185624, 1206122, 1123910, 958179, 1032072, 1188783, 1126858, 1045506, 1111009, 951008, 997405, 922918, 993007]
6303I93007J11387k5027J4110r4743J16181j61401M1990M7982o2199Q0249K8067
6292A089603n3873J3124r9963j13383q1864n276J01202J70284R9342k6943j5021
6281A077232P3309K9014L0064M2080q0476k0711L0090J01972J16767j10966n8101
6270A230274q4193L074r843J43303J36243K09891L8525j02047o0300j19787q4668
6259A300472J36176L2122K3908q1849l3667k3556j6334J29372J18427J51206J31034
6248A867311M4997O0423J03101J22540J25565k00119O1069J38864j5914q2845
6238B224992K6523r341j06701O9097J09505l7347n3099n4261N3149o6039o9086
6227B087392O2134m2890j6604j51366Q62k6070Q2712M7156K17567L1139j12632
$$ y = [993007, 1104394, 1079367, 1093477, 998734, 1114915, 953514, 995504, 1043486, 981287, 1061536, 1089603, 1035730, 1048854, 948891, 835508, 753644, 748368, 849570, 1019854, 1119196, 1092253, 1077232, 1150541, 1179555, 1209619, 1251699, 1171223, 1150512, 1180602, 1282574, 1399341, 1288375, 1230274, 1146081, 1149155, 1139312, 1282615, 1418858, 1628749, 1667274, 1565227, 1504927, 1385140, 1300472, 1436648, 1468770, 1492678, 1410829, 1377162, 1353606, 1337272, 1466644, 1585071, 1736277, 1867311, 1912308, 1972731, 2075832, 2198372, 2323937, 2123818, 2184887, 2323751, 2307837, 2224992, 2251515, 2242174, 2135473, 2204570, 2314075, 2276728, 2223629, 2169368, 2222517, 2156478, 2087392, 2149526, 2106636, 2090032, 1938666, 1939528, 1913458, 1996170, 2043326, 2260893, 2292032, 2179400]
6216B179400L8084P9919O0570q6890J21837K5468j92167k95299n5086J4342K8122
6205A918300K7127L1032k3146o3662P739j94120m8824J44306q4196o1048J16265
6194A769773j2393M3188p600J32360K34750R6467N7349K36389K89767m9124K22437
6183C013363J33917K21158m3580p6038j06756p4418k4405j35331j09385Q4334
6173B882859L7985j3254o7245r2607k02138j53360m8406p0831q3554j8517O2943
6162B233875P2910P1269O7276M4379L1053J33232K8917J47977J19557J83575J14873
6151C248893J04306J53811K8491j11737j32603N6544J19659Q9176j22708Q27J72318
6140C606977q0241P1668j81114j70808o3713j19342j16831j69662J3376j34403
$$ y = [2179400, 2217484, 2297403, 2357973, 2271083, 2392920, 2418388, 2226221, 1930922, 1875836, 1890178, 1918300, 1945427, 1976459, 1953313, 1889651, 1897390, 1703270, 1654446, 1798752, 1714556, 1653508, 1769773, 1757380, 1800568, 1792968, 1925328, 2160078, 2256545, 2313894, 2550283, 2840050, 2790926, 3013363, 3147280, 3368438, 3324858, 3248820, 3142064, 3067646, 3043241, 2907910, 2798525, 2882859, 2920844, 2907590, 2840345, 2747738, 2545600, 2392240, 2343834, 2273003, 2189449, 2170932, 2233875, 2306785, 2378054, 2445330, 2489709, 2520762, 2653994, 2682911, 2830888, 2950445, 3134020, 3248893, 3353199, 3507010, 3535501, 3423764, 3291161, 3347705, 3467364, 3556540, 3433832, 3434659, 3606977, 3526736, 3598404, 3417290, 3246482, 3182769, 3063427, 2946596, 2776934, 2790310, 2655907]
6130B655907j42576N6241J14004l4059J7654O7727J38364o3759l4898M1221J12985
6119B928811R4188J30190J35925N3477K53952K55483L69833K00884K42710M9989
6109D715442J2755J94897j3394j11844j43995k26203k42675j46555q6603p5635
6099C876190j37621j21283N7804l9634o6480q5547J34772j0099N8400J01572P7653
6088C845727P270O7124p2130Q2419J38122J55021O8871J53635J64784R3225J45111
6077D849179J78490K52412P4111N4930j1292n0980o8642k99993k50386j05557
6067D622272j48432k5707k8433J62930m4036n0112M2661o9423n9088Q5147M7166
6056D534945K50439L2364p9169J59388P2032M790j6488O9546J60308P9995k6793
$$ y = [2655907, 2513331, 2569572, 2683576, 2649517, 2667171, 2734898, 2873262, 2809503, 2774605, 2815826, 2928811, 3022999, 3153189, 3289114, 3342591, 3596543, 3852026, 4221859, 4422743, 4665453, 4715442, 4728197, 4923094, 4909700, 4797856, 4653861, 4427658, 4184983, 4038428, 3951825, 3876190, 3738569, 3617286, 3675090, 3635456, 3568976, 3483429, 3618201, 3608102, 3666502, 3768074, 3845727, 3852997, 3920121, 3847991, 3930410, 4068532, 4223553, 4292424, 4446059, 4610843, 4704068, 4849179, 5027669, 5280081, 5354192, 5409122, 5397830, 5346850, 5278208, 4978215, 4727829, 4622272, 4473840, 4448133, 4419700, 4582630, 4538594, 4488482, 4531143, 4461720, 4402632, 4487779, 4534945, 4785384, 4817748, 4738579, 4897967, 4969999, 4974789, 4958301, 5027847, 5188155, 5268150, 5241357]
6045E241357M2018K17727L0736L453J47139J77418L9589J91034J47966L34670
6035F573107L25337L79202M45963N87508O54729N61484O05143M23416M31577K98723
6025A1286189L50118L65076L89829N19927L31635K71351K84417L6420m8752n7137
6015A3729073K5877j30231l59767m03864j97100k88296l33513k76043j54561q5227
6005A1526348l6595m7351J26913K26457L74366K76852K79746L72402N16780O08844
5995A4224762L70682N67458N31318M90879L90446M05829L92753L45989O2292o046
5985A7776362o3654L7996j6220j8177L7915J9896O6514P5137K18503L57395L73235
5974A8864902O28446P75647Q69559R96712J242128J413200J583195K042017K325576
$$ y = [5241357, 5283375, 5501102, 5531838, 5535291, 5682430, 5859848, 5899437, 6090471, 6238437, 6573107, 6898444, 7277646, 7723609, 8311117, 8965846, 9527330, 10132473, 10555889, 10987466, 11286189, 11636307, 12001383, 12391212, 12911139, 13242774, 13514125, 13798542, 13834962, 13786210, 13729073, 13754950, 13624719, 13264952, 12861088, 12663988, 12375692, 12042179, 11766136, 11611575, 11526348, 11489753, 11442402, 11569315, 11795772, 12170138, 12446990, 12726736, 13099138, 13615918, 14224762, 14595444, 15162902, 15694220, 16185099, 16575545, 16981374, 17374127, 17720116, 17782408, 17776362, 17712708, 17750704, 17734484, 17716307, 17754222, 17774118, 17840632, 17915769, 18134272, 18491667, 18864902, 19493348, 20268995, 21138554, 22135266, 23377394, 24790594, 26373789, 28415806, 30741382]
5965C0741382L077261L877670M505514N302543N237829M518329L023024J745372
5957F2028924P62078m28811q26739o54140K22069J238236K288683K836561K785691
5948G0252552J834004N88360k85066j244801k153998k272084j985015j155923
5940F3578029r4956R42774K162207L457118N007973O323665O933253O938079O253380
5931A01501522N454071N179445N217016O156301Q131895J0992895J4632425J7589439
5923A74855009J8997041J7860210J3640963P893549K042845l106183o700496p829581
5915B17653357o243623l238315L53168K849697L571593K044760j509307n623158
5907B09858172r603224j2946166j5042868j5663382j5216036j4049503j2573282
$$ y = [30741382, 33818643, 37696313, 42201827, 47504370, 52742199, 57260528, 60283552, 62028924, 62791002, 62362191, 61535452, 60881312, 61103381, 62341617, 64630300, 67466861, 70252552, 72086556, 72674916, 72389850, 71145049, 68991051, 66718967, 64733952, 63578029, 63483073, 64425847, 66588054, 70045172, 75053145, 81376810, 88310063, 95248142, 101501522, 106955593, 112135038, 117352054, 123508355, 131640250, 142633145, 157265570, 174855009, 193852050, 211712260, 225353223, 233246772, 235289617, 232183434, 225482938, 217653357, 211409734, 208171419, 208524587, 211374284, 214945877, 216990637, 215481330, 209858172, 200254948, 187308782, 172265914, 156602532, 141386496, 127336993, 114763711]
5900A14763711j0897171q987531p323121o068293n145673m289589l671242l307623
5892F5073468k901683k781669k479992k408764k365155k160329k200683j994469
5884D5780724j957176j615403j399776j159030r70374r97604r16015r75031r46755
5875C4843560j036630j232112j207427j292481j372296j356246j202036j108443
5867B5035889q31089o63266q25916o42165n37751l19605k85874k71366k72288
5858B0386569k04217j32597p7274j28463k82662k44696j42688j45553q7104p4130
5848A8867185J2367M3147M0670K34212K02283L47758N99790O39155N68526N71640
5838B2126733O78923N27164O70899P89583P99403P06871M67481M595p4415k62813
$$ y = [114763711, 103866540, 94879009, 87555888, 81487595, 76341922, 72052333, 68381091, 65073468, 62171785, 59390116, 56910124, 54501360, 52136205, 49975876, 47775193, 45780724, 43823548, 42208145, 40808369, 39649339, 38678965, 37681361, 36765346, 35790315, 34843560, 33806930, 32574818, 31367391, 30074910, 28702614, 27346368, 26144332, 25035889, 24204800, 23541534, 22715618, 22073453, 21535702, 21216097, 20930223, 20658857, 20386569, 20182352, 20049755, 19972481, 19844018, 19561356, 19316660, 19173972, 19028419, 18941315, 18867185, 18879552, 18922699, 18963369, 19197581, 19399864, 19747622, 20347412, 20986567, 21555093, 22126733, 22805656, 23332820, 24003719, 24793302, 25592705, 26299576, 26767057, 26771652, 26697237, 26434424]
5828B6434424m46137o55796l83488k95605j51149q3830M964L7565L00384O17021
5818B5378353M48001O83052R20364J082602J304252J532415J657435J856790K125024
5809C6988288K543937K821936K821704K871143K085351J013623O82508m1274p04370
5800E1082846p09446l20837q61O60358J535085K296658L076495L894532N007135
5791F6521965O137812P228891Q789213J0572500J3113492J6765353K2428660K8811136
5783A80369022L4718249L7271809L2958436K4010928J9229948J6180933Q711607
5776C53450932n63844j1907338k0144328k4982711l0655605l3439856l1840038
5769A99917212k8057955k3873353j9810612j5638675j1748616q243795n415792
$$ y = [26434424, 25988287, 25332491, 24949003, 24653398, 24502249, 24418419, 24423383, 24460948, 24761332, 25378353, 25826354, 26509406, 27429770, 28512372, 29816624, 31349039, 33006474, 34863264, 36988288, 39532225, 42354161, 45175865, 48047008, 50132359, 51145982, 51828490, 51787216, 51082846, 50373400, 50052563, 50051702, 50712060, 52247145, 54543803, 57620298, 61514830, 66521965, 72659777, 79888668, 88677881, 99250381, 112363873, 129129226, 151557886, 180369022, 215087271, 252359080, 285317516, 309328444, 328558392, 344739325, 353450932, 352887088, 340979750, 320835422, 295852711, 265197106, 231757250, 199917212, 171859257, 147985904, 128175292, 112536617, 100788001, 92544206, 87128414]
5762H7128414l040404j390026m43212J118230K469657L415532M972441O739220
5754A00969852R137859J2509601J6550351K1376753K6021493K9621121L3160909
5747B49347939L1753336K0677736N355456m464780j2945455k2645246k7484602
5740B39594384k8199056k6806280k4605340k2082783j8954427j5742125j2456877
5733I0747496r567131p456496n824316m384828l126501k289209j712481j627440
5725E4759094j241625r41128m54991j30310R4096O95820J538247K458477M069878
5716F0847558N356915O383882O101794M818201L796992L347233K947073L174452
5708I6774100M715176P241314J1348699J7206178K4220147L0833938L3666383
$$ y = [87128414, 84088010, 82697984, 82254772, 83373002, 85842659, 89258191, 94230632, 100969852, 110107711, 122617312, 139167663, 160544416, 186565909, 216187030, 249347939, 281101275, 301779011, 307134467, 302669687, 289724232, 267078986, 239594384, 211395328, 184589048, 159983708, 137900925, 118946498, 103204373, 90747496, 81180365, 73723869, 67899553, 63514725, 60388224, 58099015, 56386534, 54759094, 53517469, 52576341, 52121350, 51991040, 52085136, 52780956, 54319203, 56777680, 60847558, 66204473, 72588355, 78690149, 83508350, 87305342, 90652575, 93599648, 96774100, 101489276, 108730590, 120079289, 137285467, 161505614, 192339552, 226005935]
5701B26005935K8129801J3213878K52739q822003k0037169k7537636k9093328
5694A82112217k6631597k3363814k0254559j5900530j2391187r294891o836049
5687F7439590n292135m185061l400195k916618k643083k563691k874611k930525
5679D0633671k873071k717711k476363k413092k102557j788382j667446j385490
5671B3209559j249149j052607j034076q41141p69177o87010o87427m67890m31694
5662A5989388n64340n15985k21493l32288l98840l40420m20189j76087q3710k31215
5652A2704821j65570R130m839j53641j50584j60273M9633J7754O8688J26721K87421
5641A2629261M13188M87548P23940R73293J084998J314843J671405K050408K375166
$$ y = [226005935, 254135736, 267349614, 267602353, 258780350, 238743181, 211205545, 182112217, 155480620, 132116806, 111862247, 95961717, 83570530, 74275639, 67439590, 62147455, 57962394, 54562199, 51645581, 49002498, 46438807, 43564196, 40633671, 37760600, 35042889, 32566526, 30153434, 28050877, 26262495, 24595049, 23209559, 21960410, 20907803, 19873727, 19032586, 18263409, 17576399, 16888972, 16421082, 15989388, 15425048, 14909063, 14687570, 14355282, 13956442, 13616022, 13195833, 13019746, 12936036, 12704821, 12539251, 12548381, 12543542, 12389901, 12239317, 12079044, 12128677, 12146431, 12215119, 12341840, 12629261, 13042449, 13529997, 14253937, 15227230, 16312228, 17627071, 19298476, 21348884, 23724050]
5632B3724050K168320J948298J547815R05862O10109K58015l17762p56606j353794
5623B8734307j855996k035944k292808k400200k186768j941746j687275j358267
5615A2975303j109050r93083q29249l56220m16622m71527m71410k33080j81431
5606G913631k82095k27964k14325l50827k08195j58087k2773L0662n6625l2617
5596F390785j71233j73592l4065p2113N4024j02671j39962J1234k6218p3201L4952
5585E697940K69836J46627J34290J78950L77883L88856M31305L65555L59674K97054
5575H647970J74330J76413j16004l33697l34485l68958l57010o35719m69862l12836
5565F070142l46711k86494l04565l09112k20861k46583o3704M8958M3710k5962
$$ y = [23724050, 25892370, 27840668, 29388483, 30294345, 30904454, 31162469, 30844707, 30088101, 28734307, 26878311, 24842367, 22549559, 20149359, 17962591, 16020845, 14333570, 12975303, 11866253, 10873170, 10043921, 9687701, 9271079, 8799552, 8328142, 8095062, 7913631, 7631536, 7403572, 7189247, 6838420, 6630225, 6472138, 6449365, 6480027, 6423402, 6390785, 6219552, 6045960, 6011895, 5939782, 5993806, 5891135, 5751173, 5762407, 5736189, 5662988, 5697940, 5967776, 6114403, 6248693, 6427643, 6805526, 7194382, 7625687, 7991242, 8350916, 8647970, 8822300, 8998713, 8882709, 8549012, 8214527, 7845569, 7488559, 6852840, 6382978, 6070142, 5723431, 5436937, 5132372, 4823260, 4602399, 4355816, 4292112, 4341070, 4384780, 4358818]
5555D358818j34299k79413p7214O5026j05421j84793j94893r2260j32791j11607
5545C111153p777j89651n5626r7973J9583j56122j35734M3021r4195m5758P9290
5534B470211q7871p6011K5630K3585j28262J6462J2350K6197M837P313m1462n4052
5522B198927Q9637j6225m2539l1671r1401q0207k361o2097r176j28602K2523l2247
5510A814561q0473o5414j21964J22524k4275j1551l636J3293Q3675m4805R0910
5499A772845J62815K1398j26207O340O0669J69244R1632q0034J3094j7106O8584
5488B143274J53618r6044K3782j3022P317J10916J3962p4938p1146J0504j52817
5477B055406k3810j07073j89349R1906P087j37009L1948R5677J414q9976p7436
$$ y = [4358818, 4224519, 3945106, 3867892, 3932918, 3827497, 3642704, 3447811, 3355551, 3222760, 3111153, 3103376, 2913725, 2858099, 2760126, 2779709, 2623587, 2487853, 2530874, 2436679, 2390921, 2470211, 2382340, 2306329, 2331959, 2355544, 2227282, 2243744, 2256094, 2282291, 2287128, 2294441, 2252979, 2198927, 2288564, 2272339, 2229800, 2198129, 2106728, 2026521, 2024160, 1962063, 1952887, 1824285, 1846808, 1814561, 1734088, 1668674, 1546710, 1669234, 1644959, 1633408, 1629772, 1643065, 1726740, 1681935, 1772845, 1935660, 1957058, 1830851, 1837191, 1897860, 2067104, 2158736, 2078702, 2091796, 2074690, 2143274, 2296892, 2200848, 2224630, 2211608, 2218925, 2329841, 2343803, 2268865, 2197719, 2208223, 2055406, 2031596, 1924523, 1735174, 1827080, 1834167, 1697158, 1729106, 1824783, 1826197, 1736221, 1658785]
5466A658785O9444l0435r3836R2116J11936J01872O3464M5226j7310J10748k8014
5455B083996O3591J13940J20879K85856k44J13931J37183J58432K13823K30433
5445C521820M2852J15513m1842J61981Q8022J12918M4052j57097j38560L2547
5435C782206p4442j54391p6369r1924J03318m6307R617Q3125L7308J96344K12437
5424C980922K64878J55097L13115M84153O50352O16170O99007O66695O91702J091824
5414I613915J062685J386266J826637K203648K774950L116246L432323L142500
5406B8559170K427487J612233K13332j048008j999076k796694l183264l192146
5398B0593034l023225k567847k113291j879531j532184j022322q54036n32521
$$ y = [1658785, 1728229, 1697794, 1603958, 1696074, 1808010, 1909882, 1973346, 2018572, 2001262, 2112010, 2083996, 2147587, 2261527, 2382406, 2668262, 2668018, 2781949, 2919132, 3077564, 3291387, 3521820, 3564672, 3680185, 3638343, 3800324, 3888346, 4001264, 4045316, 3888219, 3749659, 3782206, 3707764, 3553373, 3477004, 3385080, 3488398, 3442091, 3451708, 3534833, 3572141, 3768485, 3980922, 4245800, 4400897, 4714012, 5198165, 5848517, 6464687, 7163694, 7830389, 8522091, 9613915, 10676600, 12062866, 13889503, 16093151, 18868101, 21984347, 25416670, 28559170, 30986657, 32598890, 32812222, 31764214, 29765138, 26968444, 23785180, 20593034, 17569809, 15001962, 12888671, 11009140, 9476956, 8454634, 7600598, 7068077]
5390G068077m08648m41179m72977k85491k50818j76174k03260j97892j46835k21189
5380D263614r8961J3204K1362K2063J8644k05458l7044J28681k7057O6318L53043
5369D518409J48925O4728J04976K08939L01078Q2579j3584J11821J33754K26605
5359E888230K90543L54424M12833N22562P18621Q80141J035399J602731K115241
5350A3820725K198106K188429J936559J441984O24018j88968j168556j709779
5342A9142518j920729k053693k075684j629605j604213j245888r20325q93015
5334F799366o75459n15678l46498j92141l08975l26562k18563k41856k09799k13707
5324C550128j62560k01983j74781j7723p8123M1861j7312k51204m4605p1698j26338
$$ y = [7068077, 6659429, 6218250, 5745273, 5459782, 5208964, 5032790, 4829530, 4631638, 4484803, 4263614, 4164653, 4177857, 4199219, 4221282, 4239926, 4034468, 3997424, 4126105, 4099048, 4165366, 4518409, 4667334, 4732062, 4837038, 5045977, 5347055, 5429634, 5416050, 5527871, 5661625, 5888230, 6178773, 6533197, 6946030, 7468592, 8187213, 9067354, 10102753, 11705484, 13820725, 16018831, 18207260, 20143819, 21585803, 22209821, 22020853, 20852297, 19142518, 17221789, 15168096, 13092412, 11462807, 9858594, 8612706, 7692381, 6799366, 6123907, 5608229, 5261731, 5069590, 4760615, 4434053, 4215490, 3973634, 3763835, 3550128, 3387568, 3185585, 3010804, 2993081, 2914958, 2956819, 2939507, 2688303, 2643698, 2572000, 2445662]
5313B445662k8214m5866N696r8551J42556q9941J5534J15075K36812J26177O3427
5302B888367K73319K8111J4977q6814k0419R5902o6554k31940o7113J6821L6584
5291B881241o7306O617K9088r7075n6786m779J15607j54419j33171L9943P4094
5280B633054J78220J13612N2079m5360J09858j6764j12404M3989J1119q4196O658
5269B889865Q0944n5450n4308K04454O1851K2789k62J33743m6658J04546m5980
5258C295534p5819p4956o7889K4218j58564j10709l8442o6653l9630J15391k517
5247B799964K3771j37524J17353k9076M5741o4701L8968j7504j52603L009j53205
5236B474193j47121Q9088J32899q7034j9288J0360n484j35543J22712j00598K0427
$$ y = [2445662, 2417448, 2371582, 2377278, 2278727, 2421283, 2331342, 2346876, 2461951, 2698763, 2824940, 2888367, 3161686, 3189797, 3204774, 3117960, 3097541, 3193443, 3126889, 2894949, 2827836, 2844657, 2881241, 2813935, 2820552, 2849640, 2752565, 2695779, 2691000, 2806607, 2652188, 2519017, 2558960, 2633054, 2811274, 2924886, 2976965, 2931605, 3041463, 3024699, 2912295, 2956284, 2967403, 2883207, 2889865, 2970809, 2915359, 2861051, 3065505, 3127356, 3150145, 3149883, 3283626, 3236968, 3341514, 3295534, 3219715, 3144759, 3076870, 3101088, 2942524, 2831815, 2793373, 2726720, 2687090, 2802481, 2799964, 2823735, 2686211, 2803564, 2774488, 2820229, 2755528, 2794496, 2776992, 2624389, 2627398, 2474193, 2327072, 2416160, 2549059, 2462025, 2442737, 2453097, 2447613, 2312070, 2434782, 2334184, 2354611]
5225B354611J1023k5852q4267j67423n6179J16684r3431L4582k7641p1002J46165
5214B137270R6856O3815j23232o2938j58573K296J27812o5808o6256J9451M7296
5203B017989n9089q2280M2201L1461Q7642R2713j60424n6081o8170m0190P8328
5192A884100J51485P6667j6290n8220q4969j25738J36661P3843l0127L7027Q0527
5181B124966j50980q7638K2312j40085n7673l8956J26056J8442O1387n1777Q2114
5170A908168k3868k9016p120J44153J1265J8198k3936P0645p267J7281J20980
5159B199483P9015L3418p3766n0208m6021M9034J253P760K3587J15443J95039
5148B534037K0514L0285R1516o2208r3708l738O0197R212q141R9409L126J06587
$$ y = [2354611, 2365634, 2339782, 2255515, 2088092, 2031913, 2148597, 2055166, 2089748, 2062107, 1991105, 2137270, 2234126, 2297941, 2174709, 2111771, 1953198, 1955494, 2083306, 2017498, 1951242, 1970693, 2017989, 1958900, 1876620, 1918821, 1950282, 2037924, 2130637, 1970213, 1914132, 1845962, 1805772, 1884100, 2035585, 2112252, 2095962, 2037742, 1952773, 1827035, 1963696, 2037539, 2007412, 2044439, 2124966, 1973986, 1886348, 1908660, 1768575, 1710902, 1671946, 1798002, 1816444, 1877831, 1826054, 1908168, 1884300, 1855284, 1848164, 1992317, 2003582, 2021780, 1997844, 2068489, 2061222, 2078503, 2199483, 2278498, 2311916, 2238150, 2187942, 2141921, 2190955, 2192208, 2199968, 2223555, 2338998, 2534037, 2554551, 2584836, 2676352, 2614144, 2520436, 2516698, 2576895, 2586107, 2577966, 2677375, 2680501, 2787088]
5136B787088J89189Q8637J16442R0950J7448N6620Q296j4211M4405L7237k2947
5125C399154m896J4559K1648M5566L7597n2207o5348N2427j01809O4622j4400
5114C396913j4538J38997l2463o1293N1714J79346N5245k3528Q8470M9708J15783
5103C944354O027J0659K3755J97673K81772K8436L5840q69k244J21256K08216
5092D854875J25173J84243J31234R5622K33560J79080J87941J29717K74286L55364
5082F751095M41612M15676J33342L76055L62912N64564P63995P98662J098215
5073A1706128J237497J071499J023644N89530L76728J91823j31424j53672p6642
5064A5835111K54998M93472N38598P32997R49442P90608M39898J58608Q1278l65540
$$ y = [2787088, 2976277, 3064914, 3181356, 3272306, 3289754, 3346374, 3354670, 3340459, 3384864, 3422101, 3399154, 3394258, 3408817, 3430465, 3476031, 3513628, 3461421, 3396073, 3448500, 3346691, 3411313, 3396913, 3382375, 3521372, 3488909, 3427616, 3479330, 3658676, 3713921, 3690393, 3778863, 3828571, 3944354, 3950381, 3961040, 3984795, 4182468, 4464240, 4492676, 4528516, 4527647, 4525403, 4646659, 4854875, 4980048, 5164291, 5295525, 5391147, 5624707, 5803787, 5991728, 6121445, 6395731, 6751095, 7192707, 7608383, 7741725, 8117780, 8480692, 9045256, 9809251, 10607913, 11706128, 12943625, 14015124, 15038768, 15628298, 16005026, 16196849, 16065425, 15911753, 15835111, 16090109, 16583581, 17122179, 17855176, 18804618, 19595226, 20035124, 20193732, 20275010, 19909470]
5054A9909470m64836l87287k39882p1106R5729J07913L27791N60066P34457R60112
5044B1532427J014410R53276R34231R41147R69924Q17883P78410L95425K31383
5035B8568516J32896l46152o65951q46934r08464j175702j158428j302759j282076
5026B1014946j072488j137185j092454p79506p58135o82388o83593o31529n71050
5017A3606618k83178l08879n18324j61864k73595l63013j07087O6119J38629J91565
5007A1986991J17379K03327L84952K97856L41985M87957O40912P51522R15972
4998A6128853J216747J718618K051408J767460J772943J083794M99727J69085
4990B6408635l69994n92247p53618n21180j22164K53048O85580R11106N74878
$$ y = [19909470, 19444634, 19057347, 18817465, 18746359, 18842088, 18950001, 19277792, 19837858, 20572315, 21532427, 22546837, 23500113, 24434344, 25375491, 26345415, 27163298, 27941708, 28337133, 28568516, 28701412, 28355260, 27689309, 26842375, 25933911, 24758209, 23599781, 22297022, 21014946, 19942458, 18805273, 17712819, 16933313, 16175178, 15492790, 14809197, 14177668, 13606618, 13323440, 13014561, 12496237, 12334373, 12060778, 11697765, 11590678, 11656797, 11795426, 11986991, 12104370, 12307697, 12692649, 12990505, 13332490, 13820447, 14461359, 15212881, 16128853, 17345600, 19064218, 21115626, 22883086, 24656029, 25739823, 26239550, 26408635, 26038641, 25446394, 24692776, 24171596, 24049432, 24302480, 24988060, 25899166, 26474044]
4981B6474044J31669m62568j027650j270524j570535j759612j673617j465853
4973A7375354j304596q81833p73806n68738j81683l05237k83811o6823n066k74786
4963A2728975k29262O6449M8336r5187m819j66136j90233m7300j38770j05970
4953A1866083r497l04215j39936p881R0818k1755R667J18827p6604q0440J65910
4942A1610977R3717o3833M01310K86322l9845K78909J70801K55310J74499K93142
4932A3461309K89801N0427K26997K11039R8249m2932l8581q140K1248m2266J45794
4921A4372945L013P7756P2703R0052L41286J68672K0364L01745K96656M8605J43390
4910A5937187K00417J83683L47232K2056J7343O3802m2523j67562L5414j17022
$$ y = [26474044, 26605713, 26143145, 25115495, 23844971, 22274436, 20514824, 18841207, 17375354, 16070758, 15188925, 14415119, 13846381, 13664698, 13359461, 13075650, 13008827, 13003761, 12728975, 12499713, 12566162, 12614498, 12519311, 12514492, 12348356, 12158123, 12110823, 11972053, 11866083, 11856586, 11552371, 11412435, 11404554, 11495372, 11473617, 11483284, 11602111, 11525507, 11445067, 11610977, 11704694, 11640861, 12042171, 12328493, 12288648, 12567557, 12738358, 12993668, 13168167, 13461309, 13751110, 13801537, 14028534, 14239573, 14337822, 14294890, 14256309, 14248169, 14269417, 14227151, 14372945, 14375958, 14453714, 14526417, 14616469, 14957755, 15126427, 15146791, 15448536, 15745192, 15793797, 15937187, 16137604, 16321287, 16668519, 16690575, 16707918, 16771720, 16729197, 16561635, 16597049, 16480027]
4900A6480027j63517j72224k10091l5339q7841k49276k36557k04976j77761M4332
4890A4986777j4626k07512r3335O3187K8046M09122K65484P4986L31329J4380
4880A5857838L6713L1810J40032J40117J57052L0774L66336K84137K34558K47460
4870A7526827Q7829K04549K2143N0260p2716o9024j9016J25311J70578K54619
4860A8281360L42750K83265L51189K71567J3074J31434Q0055Q0240J03554K50298
4850B0188786K67473M46900N32995P32667Q13969J041875J204545J644245K200044
4841B9073499K313678K338821J719799J162551Q45756K16712l0219k04103K20987
4832C7657481N97152J125877J846959K687457L082497L477036L794357L747498
$$ y = [16480027, 16316510, 16144286, 15934195, 15898856, 15811015, 15561739, 15325182, 15120206, 14942445, 14986777, 14972151, 14764639, 14671304, 14734491, 14762537, 15171659, 15437143, 15512129, 15843458, 15857838, 15894551, 15926361, 16066393, 16206510, 16363562, 16394336, 16760672, 17044809, 17279367, 17526827, 17614656, 17819205, 17841348, 17891608, 17818892, 17749868, 17730852, 17856163, 18026741, 18281360, 18624110, 18907375, 19258564, 19530131, 19543205, 19674639, 19754694, 19834934, 19938488, 20188786, 20456259, 20903159, 21436154, 22168821, 22982790, 24024665, 25229210, 26873455, 29073499, 31387177, 33725998, 35445797, 36608348, 37454104, 37670816, 37640597, 37436494, 37657481, 38254633, 39380510, 41227469, 43914926, 46997423, 50474459, 54268816, 58016314]
4824E8016314L036179P04189j266359j586094k687310l626380l399781k817976
4816D6372782k357791j893162j365371p18470j21789K16893M21260P04106P49995
4807D2008453R09989J134688J135077J406765J377137J291964J283532J418687
4799E1966292J554882J721152J658255J814844J914168J986861K179867K393292
4791F7189613K452639K717401L124592L658728M581300N568840O479744P349220
4783A03122077P682331P166706O341630N796775N129846M505075M634835N536215
4775A49915490P227302R483134J1243258J1741223R676508N891584K808156P5070
4767B08061725k650624m110370m299456l256503k060055j106836o30866o57502
$$ y = [58016314, 61052493, 61756682, 60490323, 58904229, 56216919, 52590539, 49190758, 46372782, 44014991, 42121829, 40756458, 40037988, 39916199, 40133092, 40554352, 41258458, 42008453, 42918442, 44053130, 45188207, 46594972, 47972109, 49264073, 50547605, 51966292, 53521174, 55242326, 56900581, 58715425, 60629593, 62616454, 64796321, 67189613, 69642252, 72359653, 75484245, 79142973, 83724273, 89293113, 95772857, 103122077, 110804408, 117971114, 124312744, 130109519, 135239365, 139744440, 144379275, 149915490, 157142792, 166625926, 177869184, 189610407, 199286915, 205178499, 207986655, 208061725, 205411101, 201300731, 197001275, 193744772, 191684717, 190577881, 189947015, 189289513]
4759A89289513j268900k179378l043404l876339m155868l905700l442507k619116
4751A64798301k003811j529736j337794j011116m01065p1412L40396P86644J509466
4742A61079873K099598K682792L375967M280006N145224N769246O678309O941831
4734A98052846O611711N627274M759216L976556K873212K229127K214415K638143
4726B28982500L387997M182626M771191L654274Q53164j054089k184456l696622
4718B38896585m397696m079867k975778j824748n35274O98152J213274Q65058
4710B27859706L68328j37369p02565r61681j192659j074808r77389r86489o33447
4701B21561627k41119J24103Q26741K041300L923480O389231R234455J1521466
$$ y = [189289513, 188020613, 185841235, 182797831, 178921492, 174765624, 170859924, 167417417, 164798301, 162794490, 161264754, 159926960, 158915844, 158514779, 158443367, 158783763, 159570407, 161079873, 163179471, 165862263, 169238230, 173518236, 178663460, 184432706, 191111015, 198052846, 204664557, 210291831, 215051047, 219027603, 221900815, 224129942, 226344357, 228982500, 232370497, 236553123, 241324314, 244978588, 245831752, 244777663, 242593207, 238896585, 234498889, 230419022, 227443244, 225618496, 225083222, 225781374, 226994648, 227859706, 228228034, 228090665, 227388100, 226426419, 225233760, 224158952, 223181563, 222195074, 221561627, 221320508, 221444611, 222271352, 224312652, 228236132, 234625363, 243859818, 255381284]
4693B55381284J2163930R750948M613636N1591l616563o987845q750928p780905
4685B54825148m886442j362319K555168O021697O864106M550130J7883n594585
4677B62990786j0537359j4522959j6949621j7847656j7248527j5570405j3497186
4670A56817073j1597507r415359p773672o610049n464604m636296l832043l275656
4662A04211887k781809j992904j707607j111010m03457r8372J27653K16221k07232
4653I6253370p64196r88032r95017r07407k86689L28430J202133K148536L077778
4644I9068906L191043K465082J178444K62838o48469j704344k077312k118079
4636I9618109j733959r57645m36568L6307O18423Q47562Q31029O91514Q52197
$$ y = [255381284, 267545214, 277296162, 281909798, 281961389, 278344826, 271356981, 262606053, 254825148, 249938706, 248576387, 251131555, 257153252, 264017358, 268567488, 268585371, 262990786, 252453427, 237930468, 220980847, 203133191, 185884664, 170314259, 156817073, 145219566, 135804207, 128030535, 121420486, 115955882, 111319586, 107487543, 104211887, 101430078, 99437174, 97729567, 96618557, 96215100, 96116728, 96244381, 96460602, 96253370, 95489174, 94501142, 93506125, 92598718, 92312029, 92640459, 93842592, 95991128, 99068906, 102259949, 104725031, 105903475, 106166313, 105517844, 103813500, 101736188, 99618109, 97884150, 96926505, 96489937, 96526244, 97144667, 97992229, 98823258, 99514772, 100366969]
4627A00366969O13037P62035O47156L64101L09756L79802L45965L57912M19120
4618A04565853K04783J8406j53132l28302n94132p72271o22425p81434q58251
4609A00679095p88414q87565r90768j032264j005062j239982r92640p63713n47829
4600I2430858m10820j03272r2427M8246K33568L90239N97133P05908N95318L65206
4590I4759957Q0142l06035k87464l13432Q1740R92316K066545L102897M150824
4581A04327490M730257M060496K123030J87137r92737k003150k856864k470223
4573A07105436j053001P88805L432159N877352P225269N940209K634596p4279
4565A31876546k423992m840451o028951o039126n070340l665683j738582L93138
$$ y = [100366969, 100980006, 101742041, 102389197, 102753298, 103063054, 103442856, 103788821, 104146733, 104565853, 104770636, 104789042, 104635910, 104307608, 103713476, 102941205, 102318780, 101537346, 100679095, 99890681, 99003116, 98012348, 96980084, 95975022, 94735040, 93742400, 92978687, 92430858, 92020038, 91916766, 91824339, 91872585, 92106153, 92496392, 93093525, 93799433, 94394751, 94759957, 94840099, 94534064, 94246600, 93933168, 94014908, 95007224, 97073769, 100176666, 104327490, 109057747, 113118243, 115241273, 115428410, 114435673, 112432523, 109575659, 107105436, 106052435, 106841240, 110273399, 116150751, 123376020, 129316229, 131950825, 131876546, 129452554, 124612103, 118583152, 112544026, 107473686, 103808003, 102069421, 102462559]
4557A02462559J856439K747004K632930K519311K189135R40720j08427j053512
4549A14186159k489740l999531n363366n518491n528502n488044n219219m727561
4541G5851705m161945l451379l016979k515328k071322j740631j650894j454608
4533E5788619j364237j218472j254899j317529j357406j316546j149160j264359
4525D5546011j150431j133275j202007p86530q61560r48491j016946j020891j061438
4516C6364442q83113q62295q42123r86126j103231q74894j013294q63324r63591
4507B7972451p82134p23037q31654p88760n72706o19756n06122m08052k06368
4498B2533862j47445j76973j13245k41135p9058o7910p59K57619O2714R3076L38444
$$ y = [102462559, 104318998, 107066002, 109698932, 112218243, 114407378, 115348098, 115239671, 114186159, 111696419, 107696888, 102333522, 96815031, 91286529, 85798485, 80579266, 75851705, 71689760, 68238381, 65221402, 62706074, 60634752, 58894121, 57243227, 55788619, 54424382, 53205910, 51951011, 50633482, 49276076, 47959530, 46810370, 45546011, 44395580, 43262305, 42060298, 41273768, 40412208, 39463717, 38446771, 37425880, 36364442, 35481329, 34619034, 33776911, 32790785, 31687554, 30812660, 29799366, 28936042, 27972451, 27190317, 26467280, 25635626, 24846866, 24274160, 23654404, 23148282, 22740230, 22533862, 22386417, 22209444, 22096199, 21855064, 21776006, 21708096, 21707337, 21964956, 22027670, 22120746, 22459190]
4487B2459190Q9751J078Q3802J39491Q7734J7410K32831K79677L3390J28152Q3224
4476B3635730L51126M95163K31418K89537N10827M82008L32524N34146N29428
4467B7391907O31760N87272M30788N44022N24914N21078N61097M90298N10853
4458C2193989M75138O16098N40224N29487M42822M11989L17316K09351O1262J38105
4448C5935781j04805l1746J58768K17822L67468L07997M15195M63514M84600O07110
4438C8821704Q21276N16880P05135Q41974N46210O58041P46598O24438N25532
4429D4807788O03182N14980N31729M41075J90319K23364K12111j1079j72770l09883
4419D7030816m85452m85765n97296n10371n90916n48472n19815n36409m56387
$$ y = [22459190, 22548941, 22550019, 22633821, 22773312, 22861046, 22878456, 23111287, 23390964, 23424354, 23552506, 23635730, 23986856, 24482019, 24713437, 25002974, 25513801, 25995809, 26328333, 26862479, 27391907, 28023667, 28610939, 29041727, 29585749, 30110663, 30631741, 31192838, 31683136, 32193989, 32669127, 33285225, 33825449, 34354936, 34797758, 35209747, 35527063, 35736414, 35797676, 35935781, 35830976, 35799230, 35957998, 36175820, 36543288, 36851285, 37266480, 37729994, 38214594, 38821704, 39642980, 40159860, 40864995, 41706969, 42253179, 42911220, 43657818, 44282256, 44807788, 45410970, 45925950, 46457679, 46898754, 47089073, 47312437, 47524548, 47513469, 47340699, 47030816, 46545364, 46059599, 45462303, 44951932, 44361016, 43812544, 43292729, 42756320, 42299933]
4410D2299933o14029l80573n49294m27569l24658k79720q7821j45454k9862K8227
4400C9489180o2009o8333j32604q9969k40323j12305q3958j50774k55103j37740
4390C8156062R7819j9892p8733n9361j46210p23R1691L26318M31765N44108M52588
4379C9795432N07623P61563N87675L94594L37362J32770J91284K51038J44811
4370D3104152J33200L48205L73048K75092O41875M31209O25154P65350R53817
4361D7651102R66747J468394J603195J799242K177396K091548K036293J722083
4353F1516000J417269J252387J213163N78315N51921N63365J64309J58990L47158
4344F7762877L04735L36423M19696N92813O28655O55375P38894P11888P69603
$$ y = [42299933, 41685904, 41305331, 40756037, 40328468, 40003810, 39724090, 39636269, 39490815, 39460953, 39489180, 39427171, 39358838, 39226234, 39136265, 38895942, 38783637, 38699679, 38548905, 38293802, 38156062, 38253881, 38233989, 38155256, 38095895, 37949685, 37948962, 38040653, 38366971, 38798736, 39342844, 39795432, 40303055, 41064618, 41652293, 42046887, 42384249, 42517019, 42708303, 42959341, 43104152, 43237352, 43585557, 43958605, 44233697, 44875572, 45306781, 45931935, 46697285, 47651102, 48617849, 50086243, 51689438, 53488680, 55666076, 57757624, 59793917, 61516000, 62933269, 64185656, 65398819, 65977134, 66529055, 67092420, 67256729, 67415719, 67762877, 68067612, 68404035, 68823731, 69416544, 70045199, 70700574, 71439468, 72151356, 72920959]
4335G2920959R07333Q32675R66896Q76278Q45646R67982P12066N80545J89336
4326G9799716J01696k75227l54081m42603l40711m96305k73468k76021m14906
4317G7028090l97712m36892q02497q02225r85774j126030j015684r22430q88617
4308F9650229p91191n40042m11400l02628k53738j50101O1164K2349J694O6232
4298F7352568J89869L03523N59373R16544J255658J608354K217736K931410L654832
4289H0989867M674365N886851P397578R288060J1959560J5515554K0379467K6315487
4281A82406789L1046147L2608561K8391251J9874641J4613250J1511229P784015
4274C28235883M609804L33382p906504j6432389k1871978k6613670l0256140l0138114
$$ y = [72920959, 73828292, 74660967, 75627863, 76504141, 77349787, 78317769, 79029835, 79610380, 79799716, 79901412, 79626185, 79272104, 78829501, 78488790, 77992485, 77719017, 77442996, 77028090, 76630378, 76193486, 75390989, 74588764, 73602990, 72476960, 71461276, 70538846, 69650229, 68859038, 68318996, 67907596, 67604968, 67351230, 67201129, 67262293, 67284642, 67286336, 67352568, 67542437, 67845960, 68405333, 69321877, 70577535, 72185889, 74403625, 77335035, 80989867, 85664232, 91551083, 98948661, 108236721, 120196281, 135711835, 156091302, 182406789, 213452936, 246061497, 274452748, 294327389, 308940639, 320451868, 328235883, 332845687, 333179069, 325272565, 308840176, 286968198, 260354528, 230098388, 199960274]
4266A99960274k7206797k3559437k0236031j6643045j2887502r983106p627249
4259H1817107n810313m919791m042948l303951k957330k503471k434959k144435
4251E3699909j904139j549770j480688j397780r07777q27170n88263m98940l53750
4242D4191632k79768j63686j81033R0196J89229J70878L70059P72072P46162O88081
4232D6593822P43585O84597M35652K19350J06927j25508l28472m10336p71025
4223D7148592q22444j002293r83004p25231q09565q71799l68065j68965k02983
4214D1194243M0478J7472K86868M6881n6895k20902l61422l83886o82119n21184
4204C9359534o00932n97892o71598p17046o43203p82032p25030n50304l72215
$$ y = [199960274, 172753477, 149194040, 128958009, 112314964, 99427462, 89444356, 81817107, 76006794, 71087003, 67044055, 63740104, 60782774, 58279303, 55844344, 53699909, 51795770, 50246000, 48765312, 47367532, 46459755, 45632585, 45044322, 44545382, 44191632, 43911864, 43748178, 43567145, 43657341, 43846570, 44017448, 44387507, 45159579, 45905741, 46593822, 47337407, 48022004, 48457656, 48677006, 48783933, 48658425, 48329953, 47919617, 47148592, 46326148, 45323855, 44340851, 43615620, 42806055, 41934256, 41566191, 41397226, 41194243, 41234721, 41252193, 41539061, 41585942, 41529047, 41308145, 40946723, 40562837, 39880718, 39359534, 38758602, 38160710, 37489112, 36772066, 36128863, 35346831, 34621801, 34071497, 33699282]
4195C3699282o73974n73636n30770n70353o12917m38299p01499p25859p14156
4186B8157819q48388p13396n84456q14043q70051o83893q38980r34525q62046
4177B1008041p57753q05869o37548o10326m01160l18570m72385m01926k48229
4168A6354275k58137j95293k69810j22017j54871j5920M0703k7564J47251K46181
4158A5744798L07068J20325J84518K72191M93191O67091O55099Q81367O72142
4149A9997790M24035Q4678j41894k93603l45491l94356k82734k63763n9923J40715
4139A8865454L3721K18477K19378K26872L53609L99111O80225Q78703J271561
4130B3147111J700510J778853J376249J025980Q00035O30359L71459J83668L0393
$$ y = [33699282, 33025308, 32451672, 31920902, 31350549, 30737632, 30299333, 29597834, 28871975, 28157819, 27309431, 26596035, 26011579, 25197536, 24327485, 23643592, 22804612, 21870087, 21008041, 20250288, 19444419, 18806871, 18196545, 17795385, 17476815, 17004430, 16602504, 16354275, 16096138, 15900845, 15631035, 15509018, 15354147, 15338227, 15378930, 15351366, 15498617, 15744798, 16051866, 16172191, 16356709, 16628900, 17122091, 17789182, 18444281, 19325648, 19997790, 20421825, 20506503, 20364609, 20071006, 19725515, 19331159, 19048425, 18784662, 18724739, 18865454, 18899175, 19117652, 19337030, 19563902, 19917511, 20316622, 20996847, 21875550, 23147111, 24847621, 26626474, 28002723, 29028703, 29828738, 30459097, 30830556, 31014224, 31044617]
4121C1044617o03754q37133j194602j462078j707950j497271j187586j026319
4113B1527924q99534m93194k69583K5980J1882K12192J45201M5529K35117L52770
4103B0894284K48005K31363J73608J99659K41379L10357K55479K81450M54390
4094B3289974N19068M43497N50153P02204R03694P31959L37445N88797O57730
4085B8724521N29980M41889N08036O92476M93642M05845O99064N10578M69065
4076C3475096N35054L01436K33481K67949R4624N0986o7962K0649l3080N2559
4066C4930792Q5257K26462L64888N16054Q60487Q55766R02759O00258K08763J19598
4056C9671084O6091n2580l21168m01177l03756k95719l73200n51069m10408k74573
$$ y = [31044617, 30440863, 29603730, 28409128, 26947050, 25239100, 23741829, 22554243, 21527924, 20628390, 20135196, 19865613, 19891593, 19903475, 20115667, 20260868, 20306397, 20541514, 20894284, 21142289, 21373652, 21547260, 21746919, 21988298, 22298655, 22554134, 22835584, 23289974, 23809042, 24252539, 24802692, 25504896, 26408590, 27140549, 27477994, 28066791, 28724521, 29254501, 29696390, 30204426, 30896902, 31390544, 31796389, 32495453, 33006031, 33475096, 34010150, 34311586, 34545067, 34813016, 34907640, 34958626, 34890664, 34911313, 34878233, 34930792, 35016049, 35242511, 35607399, 36123453, 36983940, 37839706, 38742465, 39342723, 39551486, 39671084, 39737175, 39684595, 39363427, 38962250, 38658494, 38362775, 37989575, 37438506, 37028098, 36753525]
4046C6753525l20035k28119n1418K45992K46357L37295N63708O12191O12528N72096
4036C9344120P51279P71568R74785Q38055O90795Q91176Q66253P33755O30067
4027D6491853P85310R11978O67837N23915N39105N82068O37213P44506Q37503
4018E2721288R75253J243963J233364J390034J630173J468046J390793J433580
4010F3486494J195674J136733J170266J038126Q86040R71352J071199J193457
4002G2149341J199020J009823J138415J468524J269507J166451J148623J331780
3994H1881484J426829J719371J679881J797213J672932J781142J748721J577183
3986I5284756J533756J423186J024530J009047R69036P73442J160677J163774
$$ y = [36753525, 36433490, 36205371, 36153953, 36399945, 36646302, 36983597, 37547305, 38159496, 38772024, 39344120, 40095399, 40866967, 41841752, 42679807, 43370602, 44261778, 45128031, 45861786, 46491853, 47277163, 48189141, 48856978, 49380893, 49919998, 50502066, 51139279, 51883785, 52721288, 53696541, 54940504, 56173868, 57563902, 59194075, 60662121, 62052914, 63486494, 64682168, 65818901, 66989167, 68027293, 68913333, 69884685, 70955884, 72149341, 73348361, 74358184, 75496599, 76965123, 78234630, 79401081, 80549704, 81881484, 83308313, 85027684, 86707565, 88504778, 90177710, 91958852, 93707573, 95284756, 96818512, 98241698, 99266228, 100275275, 101244311, 102017753, 103178430, 104342204]
3978A04342204J401267J698399J887151K282909K392278K624874K788049K860754
3970A22277885K968448L193616L320324L568829L662727L739654L896221L787298
3962A50415002L592524L419927L334016L185867L326188L287152L591016L983553
3954A78135245M363730M787872N376142N794694O005555O137234N814809N400447
3946B21815728N303479M876720M698446M327470L863308L323180K546344J829667
3938B52584342J339933J015005Q57898O76696M62090N18363O52061N64795N36040
3929B59207223N58175R59319J052798J140720J500365J806353J858743J963014
3921B70046710J824187J696135J017105p3981j244461k149835k910289m168113
$$ y = [104342204, 105743471, 107441870, 109329021, 111611930, 114004208, 116629082, 119417131, 122277885, 125246333, 128439949, 131760273, 135329102, 138991829, 142731483, 146627704, 150415002, 154007526, 157427453, 160761469, 163947336, 167273524, 170560676, 174151692, 178135245, 182498975, 187286847, 192662989, 198457683, 204463238, 210600472, 216415281, 221815728, 227119207, 231995927, 236694373, 241021843, 244885151, 248208331, 250754675, 252584342, 253924275, 254939280, 255797178, 256473874, 256935964, 257454327, 258106388, 258671183, 259207223, 259765398, 260724717, 261777515, 262918235, 264418600, 266224953, 268083696, 270046710, 271870897, 273567032, 274584137, 274510156, 273265695, 271115860, 268205571, 264037458]
3913B64037458m978839n330286n502623n656939n372453n117519m683772m141584
3905B23253443l535132l047228k621466k238394j976189j675928j475056j346682
3897B05337368j383146j401685j433228j737475k064653k647049l253503l813237
3889A87603392m387129m764596n051900n328680n248513n023062m738442m345322
3881A48715748l841939l793854l545313l106728k798501k459948k428663k185177
3873A24555625k081435k054824k046541j797377j482965j348120j389956j317975
3865A11036432j300948j184360j144968j277565j186269j120072j007595n69767
3857A02244888n72877n61534n07275l29172m87251n80917n05479n74375o35123
$$ y = [264037458, 259058619, 253728333, 248225710, 242568771, 237196318, 232078799, 227395027, 223253443, 219718311, 216671083, 214049617, 211811223, 209835034, 208159106, 206684050, 205337368, 203954222, 202552537, 201119309, 199381834, 197317181, 194670132, 191416629, 187603392, 183216263, 178451667, 173399767, 168071087, 162822574, 157799512, 153061070, 148715748, 144873809, 141079955, 137534642, 134427914, 131629413, 129169465, 126740802, 124555625, 122474190, 120419366, 118372825, 116575448, 115092483, 113744363, 112354407, 111036432, 109735484, 108551124, 107406156, 106128591, 104942322, 103822250, 102814655, 102244888, 101672011, 101110477, 100603202, 100274030, 99786779, 99205862, 98700383, 98126008, 97490885]
3848I7490885o88259q75217r40745r58816r13969j040182r12228q71409r61259
3839H9328801p72349q04797p53599o06517o06035m35906l13420j15822J44268
3830H5064624L13964P11212O70063Q78609R88135Q65517O10631N30759J20080
3821I0753594j43594q64807q72308j045724j194144j215352j125300j308472j124476
3812H1859417r43771q85449q67887q82803o87769m51488k96650O091J61970l4929
3802G6976732M2967j03483n71464n23494o99888r26433r53380r13001p70227p42360
3792G0815969m87468k95358l18256l41023j93478m84068p58811q69635q65271
3783F6202601j096077r15031q64606q97693q37819q05196n90181n24841q91990
$$ y = [97490885, 96802626, 95927409, 94986664, 94027848, 93113879, 92073697, 91161469, 90290060, 89328801, 88556452, 87751655, 86998056, 86391539, 85785504, 85349598, 85036178, 84920356, 85064624, 85378588, 86089800, 86759863, 87638472, 88626607, 89492124, 90102755, 90633514, 90753594, 90610000, 89745193, 88872885, 87827161, 86633017, 85417665, 84292365, 82983893, 81859417, 80915646, 80030197, 79162310, 78279507, 77591738, 77140250, 76843600, 76849691, 77011661, 76976732, 77019699, 76916216, 76344752, 75821258, 75121370, 74194937, 73241557, 72328556, 71558329, 70815969, 70328501, 70033143, 69714887, 69373864, 69180386, 68696318, 67937507, 67067872, 66202601, 65106524, 64191493, 63326887, 62429194, 61591375, 60786179, 60195998, 59671157, 58779167]
3774E8779167p42350q04173r31397j066299q35336j032938r90329j038006r30290
3765E0408049r40181q75995r40080j029769j004939j012823r28932q41638p62820
3756D2070872p02339p25551q76224q44611r75782j046563j034092j108139j213041
3747C3544530j161535j136197j079367j082993j208524q92569q86981o32775n84489
3738B4879100m79113k65348l09996l27383l73648j96000m64337l14996n49996
3729B1598283n01604n60955o97711n96659n76986o61563n70008o68718n62550
3720A6201529o40010m92861n40179n17287l17767n39351k04407l45216k37286
3711A2367165k34601l76218k52189k05085l39330l63402k29402l13212k09465
$$ y = [58779167, 58036817, 57232644, 56301247, 55234948, 54399612, 53366674, 52376345, 51338339, 50408049, 49467868, 48591873, 47651793, 46622024, 45617085, 44604262, 43675330, 42833692, 42070872, 41368533, 40642982, 39766758, 38922147, 37946365, 36899802, 35865710, 34757571, 33544530, 32382995, 31246798, 30167431, 29084438, 27875914, 26983345, 26096364, 25463589, 24879100, 24399987, 24134639, 23824643, 23497260, 23123612, 22927612, 22463275, 22148279, 21598283, 21096679, 20535724, 19838013, 19241354, 18664368, 18002805, 17432797, 16764079, 16201529, 15561519, 15068658, 14528479, 14011192, 13693425, 13154074, 12949667, 12604451, 12367165, 12132564, 11756346, 11504157, 11299072, 10959742, 10596340, 10366938, 10053726, 9844261]
3702I844261j89391k07196l08944j75853j41846j70683k67315k15715j47478j1751
3692H008089o563m0500j11327r8857k13608j41559O1114j5938k75941k27825k29033
3681F708052J334o5687k68268j50813j85904q565r8869j08650j57564k18562l7096
3670E409408o7244l0196L8993m4208j62778j34983j9544j03288n0744K6259r062
3659D852613j66267r3128r100J28835P2274J6378p2820o2306O2120n4328j12922
3648D561349q4440o3179q6358m6238J45089k1320k1902R6341K9150Q432m0131
3637D476793J71693R9525J77440r4311j4149J8530P1981Q6567q0650q656l7246
3626D867517J19910Q3599M8511j58429L2119M7200J2227N630m9591K0841q9463
$$ y = [9844261, 9654870, 9447674, 9138730, 8962877, 8821031, 8650348, 8383033, 8167318, 8019840, 8008089, 8001526, 7961026, 7849699, 7750842, 7537234, 7395675, 7456789, 7440851, 7164910, 6937085, 6708052, 6709386, 6643699, 6375431, 6224618, 6038714, 6030149, 5931280, 5822630, 5665066, 5446504, 5409408, 5342164, 5311968, 5350961, 5306753, 5143975, 5008992, 4989448, 4886160, 4835416, 4861675, 4852613, 4686346, 4593218, 4584118, 4712953, 4785227, 4801605, 4728785, 4666479, 4728599, 4674271, 4561349, 4476909, 4413730, 4327372, 4281134, 4426223, 4404903, 4383001, 4479342, 4508492, 4516924, 4476793, 4648486, 4748011, 4925451, 4831140, 4816991, 4835521, 4907502, 4994069, 4913419, 4904763, 4867517, 4987427, 5071026, 5119537, 4961108, 4993227, 5040427, 5052654, 5058284, 5008693, 5029534, 4940071]
3615D940071M4633R2248K3047J08254j3799j31747J68447N8840o3409J26238J1292
3604E364115J61591J26909J30265k9618J85055q932n8227L3047J85653J25729
3594F215587m5433J36354K19154O8244N0309J94495K74241j9126O8676L44614
3584G507115J12942M0951J92328K51231L43532L42311K38645L02018L18964K47968
3574I898005K06139j7220m4454Q8479J39423R2073M3486J1673K24247K68341K61758
3563A1171950K53879J34023L08010L84898K98368M49141N80387N18078P16829
3554A4815563O62382N91570N99261O81131N40944M74011M13189O43502N71570
3545A9993123M02798N16191K38473L6099L709R3536p274m9952J89890Q9293O7725
$$ y = [4940071, 4984704, 5076952, 5099999, 5208253, 5194454, 5062707, 5231154, 5289994, 5226585, 5352823, 5364115, 5525706, 5652615, 5782880, 5753262, 5938317, 5929385, 5871158, 5904205, 6089858, 6215587, 6170154, 6306508, 6525662, 6593906, 6644215, 6838710, 7112951, 7093825, 7162501, 7507115, 7620057, 7661008, 7853336, 8104567, 8448099, 8790410, 9029055, 9331073, 9650037, 9898005, 10104144, 10086924, 10042470, 10130949, 10270372, 10362445, 10405931, 10417604, 10641851, 10910192, 11171950, 11425829, 11559852, 11867862, 12252760, 12551128, 13000269, 13580656, 14098734, 14815563, 15477945, 16069515, 16668776, 17349907, 17890851, 18364862, 18778051, 19421553, 19993123, 20395921, 20912112, 21150585, 21186684, 21190393, 21283929, 21276655, 21226703, 21416593, 21505886, 21573611]
3534B1573611K97567L36471M19833O79917P37200Q49887Q04648R37719Q55160
3525B7492013J042409J255720J092803J032593R21934R63617J197959J194355
3517C6193403R61325Q22878P73375J018880Q81668O62205P12331N93262M95520
3508D3114847O33719N61912O13338P12046R32344J089905J057318J352327J579019
3499E1646775J859245J899269J927365K000750K030978K002441K061217K119383
3491F7547423K252925K462491K941917L335998L850417M331124N147574N788384
3483I7658253O857782P411965Q014745Q511134Q586682Q548350Q097446O824391
3475A60510748N495163L778216J649665n91567k575375m235530n520370o193136
$$ y = [21573611, 21871178, 22207649, 22627482, 23307399, 24044599, 24894486, 25699134, 26636853, 27492013, 28534422, 29790142, 30882945, 31915538, 32837472, 33801089, 34999048, 36193403, 37154728, 37977606, 38750981, 39769861, 40651529, 41313734, 42026065, 42619327, 43114847, 43748566, 44310478, 44923816, 45635862, 46568206, 47658111, 48715429, 50067756, 51646775, 53506020, 55405289, 57332654, 59333404, 61364382, 63366823, 65428040, 67547423, 69800348, 72262839, 75204756, 78540754, 82391171, 86722295, 91869869, 97658253, 104516035, 111928000, 119942745, 128453879, 137040561, 145588911, 153686357, 160510748, 166005911, 169784127, 171433792, 170842225, 168266850, 164031320, 158510950, 152317814]
3467A52317814o578948o526356o152114n698581n217761m708486m316452m047299
3459A09071817l683688l612336l552764l568666l838852l935232m279061m391890
3451G8209328m733000m768795m737311m594899m286871l741360l573714l315865
3443D4457513k965133k561068k238329k121772j802864j440884j484656j138241
3435B8704566j191116j323242j010645q73857r03497r11403r44942p90310q66288
3426A9889266q66117p61627n51075n89247o41051l93256l71493o33738m67171
3417A4614491m20593m53087l85527k54669m54184k95595l28814m78232m12560
3408A1131230l74987l22124l08153m05087l21403k28908m24121k40866k14417
$$ y = [152317814, 145738866, 139212510, 133060396, 127361815, 122144054, 117435568, 113119116, 109071817, 105388129, 101775793, 98223029, 94654363, 90815511, 86880279, 82601218, 78209328, 73476328, 68707533, 63970222, 59375323, 55088452, 51347092, 47773378, 44457513, 41492380, 38931312, 36692983, 34571211, 32768347, 31327463, 29842807, 28704566, 27513450, 26190208, 25179563, 24305706, 23402209, 22490806, 21545864, 20755554, 19889266, 19023149, 18261522, 17710447, 17121200, 16480149, 16086893, 15715400, 15081662, 14614491, 14193898, 13740811, 13355284, 13100615, 12646431, 12350836, 12022022, 11543790, 11131230, 10756243, 10434119, 10125966, 9720879, 9399476, 9170568, 8746447, 8505581, 8291164]
3399H291164j44746l71658k15353k48657l29618k46883k27817L177j34431j75161
3389F200017k13780j70936J996q1625k14220j64470k06453j11743j75468k61551
3379D601767j80399M6267j32043j46028j10603p8707n6950K9658q1916l7164K1094
3368C874976o331k16643j36709O9034j53020r5168P129j42981j05518o0805r9060
3357B934904l04O3182j4182l8345l4808j03886j10067o2341l7557O1235n0421
3346B607410n7500N0813j34119M1265L5309K0652K3279l3808k37183K3038N1732
3335B390888J94228k0671j47501o6913r1671k10622j30152J02382j6415k06590
3325A796963M9752l0690M2513o5689m4029p1132J22211L6771J6134l7102J1996
$$ y = [8291164, 8146418, 7774760, 7559407, 7310750, 6981132, 6734249, 6506432, 6509609, 6375178, 6200017, 5986237, 5815301, 5817297, 5735672, 5521452, 5356982, 5150529, 5038786, 4863318, 4601767, 4421368, 4467635, 4335592, 4189564, 4078961, 4000254, 3943304, 3972962, 3891046, 3853882, 3874976, 3868645, 3652002, 3515293, 3584327, 3431307, 3336139, 3343268, 3200287, 3094769, 3033964, 2934904, 2934600, 2997782, 2983600, 2945255, 2910447, 2806561, 2696494, 2634153, 2596596, 2657831, 2607410, 2549910, 2600723, 2466604, 2507869, 2543178, 2563830, 2587109, 2553301, 2316118, 2339156, 2390888, 2585116, 2564445, 2416944, 2350031, 2258360, 2047738, 1917586, 2019968, 2003553, 1796963, 1846715, 1816025, 1858538, 1792849, 1748820, 1677688, 1799899, 1836670, 1852804, 1815702, 1827698]
3314A827698j24130P2336j4398K339O1455m3811l9627m3514J8717R9145Q8819
3303A905029r3083l7741Q5762J71176m5775p1694j6943K5646j09190K5465j0977
3292A827675n0035R7998R2685p3624L1410L7881L1360P4380p3738o4119J093M1525
3280A974491m1275p7842J63389J48184n0604l430n8708l9529J1209j26792P5662
3269A974755P2147l7071k4580J08405L3386p3051j7057K06788J73845k3511J1698
3258B405754J04354n2701r277r0700P6608Q3724R8368P7623q0569O9754J41785
3247B824723J14724K9368q3421O79J09562J43047P1107k5066J65344O9474N5407
3236C474948M4767p8281m994J93491N0292o3176J48833R5783N2631K00485K16309
$$ y = [1827698, 1703568, 1775904, 1761506, 1763845, 1825300, 1781489, 1741862, 1698348, 1717065, 1816210, 1905029, 1811946, 1774205, 1859967, 2031143, 1985368, 1913674, 1896731, 1922377, 1813187, 1838652, 1827675, 1777640, 1875638, 1968323, 1894699, 1926109, 1963990, 1995350, 2069730, 1995992, 1931873, 1932966, 1974491, 1933216, 1855374, 2018763, 2166947, 2116343, 2112913, 2054205, 2014676, 2025885, 1899093, 1974755, 2046902, 2009831, 1985251, 2093656, 2127042, 2053991, 2036934, 2243722, 2417567, 2394056, 2405754, 2510108, 2457407, 2448130, 2357430, 2434038, 2517762, 2616130, 2693753, 2613184, 2682938, 2824723, 2939447, 2968815, 2885394, 2886073, 2995635, 3138682, 3209789, 3184723, 3350067, 3419541, 3474948, 3519715, 3441434, 3436440, 3629931, 3680223, 3617047, 3765880, 3861663, 3914294, 4114779, 4331088]
3225D331088J24960R6232J20136J89526K26522J92460J05141K07877J1968J73547
3215E779457L09361J18641R3717K25903J55226O2954K04716J17346R0476K03407
3205G361204K1946M289J14544L18667J9268R1355K32132K36412J75264J12257
3195H687338K66336K37138L90456M21511K85132M18940K59631L80844M95340M01800
3185A2244466N74488K99408N32182P25859P25794P16916P02672P77099Q55445
3176A8154329R58848R80252J155864J387197J454775J470860J502499J967364
3168B9031988K142400K443120K570964K867309L141613L124645L261292L015772
3160E1599103K720931K179194J663062R58431O86986K18894r4998j68807k38856
$$ y = [4331088, 4456048, 4552280, 4672416, 4861942, 5088464, 5280924, 5386065, 5593942, 5605910, 5779457, 6088818, 6207459, 6301176, 6527079, 6682305, 6745259, 6949975, 7067321, 7157797, 7361204, 7383150, 7387439, 7501983, 7820650, 7839918, 7931273, 8163405, 8399817, 8575081, 8687338, 8953674, 9190812, 9581268, 10002779, 10287911, 10706851, 10966482, 11347326, 11842666, 12244466, 12818954, 13118362, 13650544, 14376403, 15102197, 15819113, 16521785, 17298884, 18154329, 19113177, 20093429, 21249293, 22636490, 24091265, 25562125, 27064624, 29031988, 31174388, 33617508, 36188472, 39055781, 42197394, 45322039, 48583331, 51599103, 54320034, 56499228, 58162290, 59120721, 59807707, 60026601, 59931603, 59762796, 59523940]
3151E9523940j62131j66956p1093j15504K18059L66192N16369P16846Q99335R31034
3141F2656091J512381J821276K106958K953500L813119M988331O778942Q703910
3133I5334508J0233374J0290593P598596L315056j79596l625017p236766r262484
3125A06468264r962206r430319q598174p621438o440586n131343m082288l130961
3117E2070949k538599k121919j589374j032211q04135m01371k82526o0841K53498
3108D3493471M86190Q63750J056667J200394J490886J632521J440872J283236
$$ y = [59523940, 59361809, 59194853, 59123760, 59008256, 59226315, 59592507, 60108876, 60825722, 61725057, 62656091, 64168472, 65989748, 68096706, 71050206, 74863325, 79851656, 86630598, 95334508, 105567882, 115858475, 123457071, 126772127, 126592531, 122967514, 115730748, 106468264, 96506058, 87075739, 78477565, 70856127, 64415541, 59284198, 55201910, 52070949, 49532350, 47410431, 45821057, 44788846, 43984711, 43583340, 43300814, 43239973, 43493471, 43979661, 44843411, 45900078, 47100472, 48591358, 50223879, 51664751, 52947987]
$$ [...]
##END NTUPLES=NMR SPECTRUM
##END=
