##TITLE=1H_DE-80H_X3
 200.13MHz, d2o
 8 sc
 
 19ns.26.2.2025
##JCAMPDX= 6.0         $$ Bruker NMR JCAMP-DX V2.0
##DATA TYPE= NMR SPECTRUM
##DATA CLASS= NTUPLES
##ORIGIN= UXNMR, Bruker Analytische Messtechnik GmbH
##OWNER= pz
$$ XWIN-NMR		Version 3.5
$$ Thu Jul  2 10:28:35 2026 Russian Standard Time (UT+4h)  Yarkov@DPX200
##.OBSERVE FREQUENCY= 200.1313
##.OBSERVE NUCLEUS= ^1H
##.ACQUISITION MODE= SIMULTANEOUS
##.ACQUISITION SCHEME= undefined
##.AVERAGES= 8
##.DIGITISER RES= 18
##SPECTROMETER/DATA SYSTEM= spect
##.PULSE SEQUENCE= zg30
##.SOLVENT NAME= CDCl3
##.SHIFT REFERENCE= (INTERNAL, CDCl3, 0, 15.5012)
##AUDIT TRAIL= $$ (NUMBER, WHEN, WHO, WHERE, WHAT)
$$ ##TITLE= Audit trail, XWIN-NMR		Version 3.5
$$ ##JCAMPDX= 5.01
$$ ##ORIGIN= Bruker BioSpin GmbH
$$ ##OWNER= Yarkov
$$ C:/Bruker/XWIN-NMR/data/yarkov2/nmr/H-C/1/pdata/1/auditp.txt
$$ ##AUDIT TRAIL=  $$ (NUMBER, WHEN, WHO, WHERE, WHAT)
(   1,<2026-07-02 10:27:36.51 +0400>,<Yarkov>,<DPX200>,
      <created by zg, POWCHK disabled, PULCHK disabled
       configuration hash MD5:
       00 E9 B6 7A A2 85 ED C7 34 08 36 98 17 FE 4E 26
       data hash MD5: 16K
       19 F6 11 B4 A1 F0 91 D0 C5 7E 68 A9 46 CD 6B CF>)
(   2,<2026-07-02 10:27:43.14 +0400>,<Yarkov>,<DPX200>,
      <Start of raw data processing
       efp BC_mod = 2 LB = 0.25 FT_mod = 6 PKNL = 1 PHC0 = -6894.148 PHC1 = 6.42196 SI = 16K 
       data hash MD5: 16K
       99 81 43 41 C7 4E EE B2 DA C3 1B C8 DD 67 52 E8>)
$$ ##END=
$$ 
$$ hash MD5
$$ 28 04 BC 8C 73 CF ED 4D 1D 68 1B D8 2A 72 02 E1
##$RELAX= 
##$RELAX= 
##$RELAX= 
##$RELAX= 
##$RELAX= 
##$RELAX= 
$$ Bruker specific parameters
$$ --------------------------
##$DU= <C:/Bruker/XWIN-NMR>
##$EXPNO= 1
##$NAME= <H-C>
##$PROCNO= 1
##$TYPE= <nmr>
##$USER= <yarkov2>
##$AMP= (0..31)
100 100 100 100 100 100 100 100 100 100 100 100 100 100 100 100 100 100 
100 100 100 100 100 100 100 100 100 100 100 100 100 100 
##$AQSEQ= 0
##$AQ_mod= 1
##$AUNM= <au_zg>
##$AUTOPOS= <>
##$BF1= 200.13
##$BF2= 200.13
##$BF3= 200.13
##$BF4= 200.13
##$BF5= 200.13
##$BF6= 200.13
##$BF7= 200.13
##$BF8= 200.13
##$BYTORDA= 1
##$CFDGTYP= 0
##$CFRGTYP= 5
##$CHEMSTR= <none>
##$CNST= (0..31)
1 1 145 1 1 1 1 1 1 1 1 1 1 1 1 1 1 1 1 1 1 1 1 1 1 1 1 1 1 1 1 1 
##$CPDPRG= <>
##$CPDPRG1= <>
##$CPDPRG2= <>
##$CPDPRG3= <>
##$CPDPRG4= <mlev>
##$CPDPRG5= <mlev>
##$CPDPRG6= <mlev>
##$CPDPRG7= <mlev>
##$CPDPRG8= <mlev>
##$CPDPRGB= <>
##$CPDPRGT= <>
##$D= (0..31)
0 0.7 0 0 0 0 0 0 0 0 0 0.03 0 0 0 0 0 0 0 0 0 0 0 0 0 0 0 0 0 0 0 0 
##$DATE= 1782973656
##$DBL= (0..7)
120 120 120 120 120 120 120 120 
##$DBP= (0..7)
150 150 150 150 150 150 150 150 
##$DBP07= 0
##$DBPNAM0= <>
##$DBPNAM1= <>
##$DBPNAM2= <>
##$DBPNAM3= <>
##$DBPNAM4= <>
##$DBPNAM5= <>
##$DBPNAM6= <>
##$DBPNAM7= <>
##$DBPOAL= (0..7)
0.5 0.5 0.5 0.5 0.5 0.5 0.5 0.5 
##$DBPOFFS= (0..7)
0 0 0 0 0 0 0 0 
##$DE= 6
##$DECBNUC= <off>
##$DECIM= 32
##$DECNUC= <off>
##$DECSTAT= 4
##$DIGMOD= 1
##$DIGTYP= 9
##$DL= (0..7)
0 120 120 120 120 120 120 120 
##$DP= (0..7)
$$ [...]
##$SUBNAM2= <"">
##$SUBNAM3= <"">
##$SUBNAM4= <"">
##$SUBNAM5= <"">
##$SUBNAM6= <"">
##$SUBNAM7= <"">
##$SUBNAM8= <"">
##$SUBNAM9= <"">
##$SW= 18.0517328524113
##$SWIBOX= (0..15)
0 0 2 0 0 0 0 0 0 0 0 0 0 0 0 0 
##$SW_h= 3612.71676300578
##$TD= 16384
##$TD0= 1
##$TE= 0
##$TE2= 300
##$TE3= 300
##$TEG= 300
##$TL= (0..7)
0 120 120 120 120 120 120 120 
##$TP= (0..7)
150 150 150 150 150 150 150 150 
##$TP07= 0
##$TPNAME0= <>
##$TPNAME1= <>
##$TPNAME2= <>
##$TPNAME3= <>
##$TPNAME4= <>
##$TPNAME5= <>
##$TPNAME6= <>
##$TPNAME7= <>
##$TPOAL= (0..7)
0.5 0.5 0.5 0.5 0.5 0.5 0.5 0.5 
##$TPOFFS= (0..7)
0 0 0 0 0 0 0 0 
##$TUNHIN= 0
##$TUNHOUT= 0
##$TUNXOUT= 0
##$USERA1= <user>
##$USERA2= <user>
##$USERA3= <user>
##$USERA4= <user>
##$USERA5= <user>
##$V9= 5
##$VALIST= <valist>
##$VCLIST= <CCCCCCCCCCCCCCC>
##$VD= 0
##$VDLIST= <DDDDDDDDDDDDDDD>
##$VPLIST= <PPPPPPPPPPPPPPP>
##$VTLIST= <TTTTTTTTTTTTTTT>
##$WBST= 1024
##$WBSW= 4
##$XGAIN= (0..3)
0 0 0 0 
##$XL= 0
##$YL= 0
##$YMAX_a= 140509
##$YMIN_a= -249618
##$ZGOPTNS= <>
##$ZL1= 120
##$ZL2= 120
##$ZL3= 120
##$ZL4= 120
##$ABSF1= 0
##$ABSF2= 0
##$ABSG= 0
##$ABSL= 0
##$ALPHA= 0
##$AQORDER= 0
##$ASSFAC= 0
##$ASSFACI= 0
##$ASSFACX= 0
##$ASSWID= 0
##$AUNMP= <proc_1d>
##$AZFE= 0.1
##$AZFW= 0.1
##$BCFW= 0
##$BC_mod= 2
##$BYTORDP= 0
##$COROFFS= 0
##$CY= -3
##$DATMOD= 1
##$DC= 0
##$DFILT= <>
##$DTYPP= 0
##$F1P= 0
##$F2P= 0
##$FCOR= 1
##$FTSIZE= 16384
##$FT_mod= 6
##$GAMMA= 0
##$GB= 0
##$INTBC= 1
##$INTSCL= 3.241238e-09
##$ISEN= 128
##$LB= 0.25
##$LEV0= 0
##$LPBIN= 0
##$MAXI= 10000
##$MC2= 0
##$MEAN= 0
##$ME_mod= 0
##$MI= 1.114404
##$NCOEF= 0
##$NC_proc= -7
##$NLEV= 6
##$NOISF1= 3.799351
##$NOISF2= 2.8
##$NSP= 0
##$NTH_PI= 0
##$NZP= 0
##$OFFSET= 15.50119
##$PC= 1
##$PHC0= -6894.148
##$PHC1= 6.42196
##$PH_mod= 1
##$PKNL= yes
##$PPARMOD= 0
##$PSCAL= 0
##$PSIGN= 0
##$REVERSE= no
##$SF= 200.130004105175
##$SI= 16384
##$SIGF1= 3
##$SIGF2= 2
##$SINO= 0.751879
##$SIOLD= 32768
##$SREGLST= <19F.Aceton>
##$SSB= 0
##$STSI= 16384
##$STSR= 0
##$SW_p= 3612.71676300578
##$SYMM= 0
##$S_DEV= 0
##$TDeff= 16384
##$TDoff= 0
##$TI= <>
##$TILT= no
##$TM1= 0
##$TM2= 0
##$TOPLEV= 0
##$USERP1= <user>
##$USERP2= <user>
##$USERP3= <user>
##$USERP4= <user>
##$USERP5= <user>
##$WDW= 1
##$XDIM= 16384
##$YMAX_p= 520956948
##$YMIN_p= -770623
$$ End of Bruker specific parameters
$$ ---------------------------------
##NTUPLES= NMR SPECTRUM
##VAR_NAME=  FREQUENCY,     SPECTRUM/REAL,   SPECTRUM/IMAG
##SYMBOL=    X,             R,               I
##VAR_TYPE=  INDEPENDENT,   DEPENDENT,       DEPENDENT
##VAR_FORM=  AFFN,          ASDF,            ASDF
##VAR_DIM=   16384,         16384,           16384
##UNITS=     HZ,            ARBITRARY UNITS, ARBITRARY UNITS
##FACTOR=    0.220516191357247, 1,           1
##FIRST=     3102.25325546859, 0,            0
##LAST=      -510.463507537186, 0,           0
##MIN=       -510.463507537186, -770623,     0
##MAX=       3102.25325546859, 520956948,    0
$$ Real data points
##PAGE= N=1
##DATA TABLE= (X++(R..R)), XYDATA
$$ [...]
$$ plain form
9010 15376 26720 35265 -85386 -75695 -69848 -25640 -27635 -62160 -43970 24330 43436 -1220
8998 -1220 32008 51415 85713 97042 75175 17597 -10061 29061 30120 121272 63602 -18183
8986 -18183 -21718 -1149 -40255 45471 57354 81336 82645 103219 16009 63588 86225 17787
8974 17787 45279 95673 106970 131300 119356 120930 174629 140156 206399 196687 149239 142552
8962 142552 172523 224274 336783 291506 226183 306018 239300 331472 347350 347293 360275 319829
8950 319829 378325 378212 362504 402125 460306 418991 452431 520234 615693 720803 670845 686211
8938 686211 847398 936070 1008700 1177436 1447967 1615886 1896902 2290105 2823600 3652559
8928 3652559 4874670 6442019 8378739 10428567 11394506 11641080 11475101 10124233 8466167
$$ packed form
9010A5376J1344Q545j20651R691N847M4208j995l4525J8190O8300J9106m4656
8998a220L3228J9407L4298J1329k1867n7578k7658L9122J059R1152n7670q1785
8986a8183l535K0569l9106Q5726J1883K3982J309K0574q7210M7579K2637o8438
8974A7787K7492N0394J1297K4330j1944J574N3699l4473O6243r712m7448o687
8962A42552K9971N1751J12509m5277o5323P9835o6718R2172J5878n7J2982m0446
8950C19829N8496j13j5708L9621N8181m1315L3440O7803R5459J05110m9958J5366
8938F86211J61187Q8672P2630J68736K70531J67919K81016L93203N33495Q28959
8928C652559J222111J567349J936720K049828R65939K46574j65979j350868j658066
$$ plain form
8919 8466167 6933684 5572176 4384701 3289369 2454202 2005649 1653163 1405508 1250974
8910 1250974 1048271 879350 781398 723840 770711 724000 655546 589808 568960 630407 594231
8899 594231 504612 473063 480227 471009 417035 424916 447864 369089 320804 340178 272885 286981
8887 286981 286362 253214 264883 339340 267230 195475 222000 212678 250197 199632 188587 173001
8875 173001 171166 217032 158212 28162 100542 116401 102854 28534 38265 49070 103059 166414
8863 166414 108756 86483 33447 89194 84960 -3524 64016 18823 52121 75902 41700 52386
8851 52386 57380 108790 81247 103814 104784 110997 74534 -50945 -32247 -63093 -49100 -13509
8839 -13509 -10634 44403 -4640 56479 40233 -4355 61073 55079 -1659 -4216 -15614 -32020
$$ packed form
8919H466167j532483j361508j187475j095332q35167m48553l52486k47655j54534
8910A250974k02703j68921r7952n7558M6871m6711o8454o5738k0848O1447l6176
8899E94231q9619l1549P164r218n3974P881K2948p8775m8285J9374o7293J4096
8887B86981o19l3148J1669P4457p2110p1755K6525r322L7519n0565j1045j5586
8875A73001j835M5866n8820j30050P2380J5859j3547p4320R731J0805N3989O3355
8863A66414n7658k2273n3036N5747m234q8484O7540m5193L3298K3781l4202J0686
8851E2386M994N1410k7543K2567R70O213l6463j25479J8698l0846J3993L5591
8839a3509K875N5037m9043O1119j6246m4588O5428n994n6738k557j1398j6406
$$ plain form
8827 -32020 24498 10217 42461 -3353 -48968 -77967 -41900 8006 -6726 19926 75272 90072
8815 90072 30340 -31884 77902 6621 -37700 -11610 -46202 -31885 15140 56467 -9558 -43110
8803 -43110 -59581 -41956 -10492 -9191 56302 31427 3457 74249 147751 227885 117731 100582
8791 100582 134801 128016 179523 240962 286072 279579 301413 280056 222892 192725 167458 141958
8779 141958 100823 80469 32491 78454 159597 140135 164261 190901 195358 301449 370144 394352
8767 394352 360942 359191 323584 321769 311307 307975 378075 407057 437972 435835 436917 375478 258052
8754 258052 265450 245355 244696 185186 173445 97010 81794 120620 118831 152986 170272 153548
8742 153548 179387 193022 208025 266399 301001 253886 258072 249127 171596 136980 129594 121445
$$ packed form
8827c2020N6518j4281L2244m5814m5615k8999L6067M9906j4732K6652N5346J4800
8815I0072n9732o2224J09786p1281m4321K6090l4592J4317M7025M1327o6025l3552
8803d3110j6471J7625L1464J301O5493k4875k7970P0792P3502Q0134j10154j7149
8791A00582L4219o785N1507O1439M5110o493K1834k1357n7164l0167k5267k5500
8779A41958m1135k0354m7978M5963Q1143j9462K4126K6640M457J06091O8695K4208
8767C94352l3410j751l5607j815j0462l332P0100K8982L0915k137J082o1439j17426
8754B58052P398k0095o59n9510j1741p6435j5216L8826j789L4155J7286j6724
8742A53548K5839J3635J5003N8374L4602m7115M186q945p7531l4616p386q149
$$ plain form
8730 121445 81568 96683 5119 20574 42575 2605 10483 -9583 45872 35832 27073 21655
8718 21655 14537 66429 95860 120641 109206 159921 288931 268315 230530 293501 298145 194351
8706 194351 120046 55014 29707 43530 -32683 3667 -14460 -30631 -102591 -124004 -61793 -82675
8694 -82675 -127962 -59704 -32076 -2237 -69268 -102850 -40287 -13080 -60449 -45842 -33750 -56295
8682 -56295 -74410 -41042 -96862 -73458 -138358 -145958 -96112 -88286 -48466 -21039 -44594 -29185
8670 -29185 -50884 -87037 -60263 -18509 46154 88418 152275 208637 234399 247349 288086 239055
8658 239055 181571 140033 139800 97474 49001 -38905 -114749 -142650 -145692 -115958 -95708 -87827
8646 -87827 -80393 -122291 -84418 -62290 -69814 -38411 -993 -59993 -67027 -138052 -146246 -193367 -173721
$$ packed form
8730A21445l9877J5115r1564J5455K2001l9970P878k0066N5455j0040q759n418
8718B1655p118N1892K9431K4781j1435N0715J29010k0616l7785O2971M644j03794
8706A94351p4305o5032k5307J3823p6213L6350j8127j6171p1960k1413O2211k0882
8694h2675m5287O8258K7628K9839o7031l3582O2563K7207m7369J4607J2092k2545
8682e6295j8115L3368n5820K3404o4900p600M9846P826L9820K7427k3555J5409
8670b9185k1699l6153K6774M1754O4663M2264O3857N6362K5762J2950M0737m9031
8658B39055n7484m1538k33m2326m8473q7906p5844k7901l042K9734K0250P881
8646h7827P434m1898L7873K2128p524L1403L7418n9000p034p1025q194m7121J9646
$$ plain form
8633 -173721 -130363 -149847 -125210 -103647 -85164 -12132 -6652 -19526 -84049 -92560 -76187 -143094
8621 -143094 -121272 -119115 -90844 -101400 -106851 -142328 -168202 -126271 -160407 -144160 -152939 -124320
8609 -124320 -132683 -110852 -109143 -115962 -104557 -130264 -143486 -105476 -108208 -158991 -125772 -66053
8597 -66053 -137689 -107136 -127997 -104239 -99697 -149324 -162011 -79087 -87718 -143996 -203418 -142063
8585 -142063 -125818 -127961 -158595 -103960 -94417 -103957 -142949 -97850 363176 205509 26508 -87764
8573 -87764 -133724 -169710 -179545 -202407 -166503 -129432 -92122 -145431 -130248 -144662 -151924 -117089
8561 -117089 -139186 -140341 -141474 -167775 -183594 -141271 -151651 -142033 -72872 -137778 -130199 -135615 -119211
8548 -119211 -78085 -61405 -78030 -78278 -116555 -139391 -168129 -163712 -124355 -118925 -82584 -91585 -153641
$$ packed form
8633a73721M3358j9484K4637K1563J8483P3032N480j2874o4523q511J6373o6907
8621a43094K1822K157K8271j0556n451l5477k5874M1931l4136J6247q779K8619
8609a24320q363K1831J709o819J1405k5707j3222L8010k732n0783L3219N9719
8597f6053p1636L0553k0861K3758M542m9627j2687Q2924q631n6278n9422O1355
8585a42063J6245k143l0634N4635R543r540l8992M5099M61026j57667j79001j14272
8573h7764m5960l5986r835k2862L5904L7071L7310n3309J5183j4414p262L4835
8561a17089k2097j155j133k6301j5819M2323j0380R618O9161o4906P579n416J6404
8548a19211M1126J6680j6625k48l8277k2836k8738M417L9357N430L6341r001o2056
$$ plain form
8535 -153641 -168803 -146561 -192719 -180577 -122788 -131180 -187965 -187326 -190984 -208651 -200927 -135749 -117215
8522 -117215 -95013 -61783 -54491 -94972 -129144 -37880 -63326 -89053 -70143 -172587 -183327 -76475
8510 -76475 -78578 -78954 -136558 -142018 -81966 -83490 -50995 -10531 80534 78040 60006 -31928 -11510
8497 -11510 -39446 -55386 -55833 -82509 -20550 9874 -40896 -65065 -90382 -91208 -85842 -120496 -113162
8484 -113162 -84981 -104196 -119724 -122257 -95784 -68481 -79255 -51046 -48792 -137448 -158625 -105590
8472 -105590 -67480 -143404 -125940 -157961 -120241 -45171 -67661 -84154 -138412 -100929 -29497 -125450
8460 -125450 -77459 -43174 -104522 -153697 -113555 -68803 -97725 -95788 -30054 -72951 -101763 -136321
8448 -136321 -102980 -3170 -92805 -77657 -19409 -50961 -59688 -18989 -67852 -24526 -11363 -74219
$$ packed form
8535a53641j5162K2242m6158J2142N7789q392n6785O39l658j7667P724O5178J8534
8522a17215K2202L3230P292m0481l4172R1264k5446k5727J8910j02444j0740J06852
8510g6475k103l76n7604n460O0052j524L2495M0464R1065k494j8034r1934K0418
8497a1510k7936j5940m47k6676O1959L0424n0770k4169k5317q26N366l4654P334
8484a13162K8181j9215j5528k533K6473K7303j0774K8209K254q8656k1177N3035
8472a05590L8110p5924J7464l2021L7720P5070k2490j6493n4258L7483P1432r5953
8460a25450M7991L4285o1348m9175M0142M4752k8922J937O5734m2897k8812l4558
8448a36321L3341R9810q9635J5148N8248l1552q727M0699m8863M3326J3163o2856
$$ plain form
8436 -74219 -128564 -153283 -99094 -81550 -90648 -100512 -29060 -37532 -83954 -103470 -122116 -120697 -72605
8423 -72605 17822 -25957 -36046 -55464 8749 -32137 -80748 -34505 -89246 -55707 -29592 -59920
8411 -59920 -98958 -170397 -154503 -119426 -154665 -160792 -128214 -83235 -62744 -14823 211 -116666
8399 -116666 -94746 -28531 -56523 -32391 -75290 -112394 -66685 -126887 -159192 -111866 -60937 -52119
8387 -52119 -66471 -126441 -146237 -147121 -84304 -136673 -73978 -75254 -89550 -162066 -110688 -11618
8375 -11618 -23561 -55208 -62540 -115609 -128914 -137680 -50764 48119 -17478 -74171 -79179 -58716
8363 -58716 -54449 11912 10462 16348 232 18312 95776 80314 8193 -15257 -30107 51996
8351 51996 44834 24412 31256 31503 7431 80264 77857 46971 34382 115774 168694 191029 234090
$$ packed form
8436g4219n4345k4719N4189J7544r098r864P1452q472m6422j9516j8646J419M8092
8423g2605R0427m3779j0089j9418O4213m0886m8611M6243n4741L3539K6115l0328
8411e9920l9038p1439J5894L5077l5239o127L2578M4979K0491M7921J5034j16877
8399a16666K1920O6215k7992K4132m2899l7104M5709o0202l2305M7326N0929Q818
8387e2119j4352n9970j9796q84O2817n2369O2695j276j4296p2516N1378R9070
8375a1618j1943l1647p332n3069j3305q766Q6916R8883o5597n6693n008K0463
8363e8716M267O6361j450N886j6116J8080P7464j5462p2121k3450j4850Q2103
8351E1996p162k0422O844K47k4072P2833k407l0886j2589Q1392N2920K2335M3061
$$ plain form
8338 234090 239254 258153 230807 219601 302056 262682 244345 231265 279912 358443 285634 258323
8326 258323 220313 167914 114170 78123 69094 30159 26035 13579 -52138 -73557 -39228 -11376
8314 -11376 -57397 -7609 77720 59185 -745 18413 35410 31970 39438 27840 36058 57059
8302 57059 48116 25318 14397 8969 -16608 14351 20269 30306 -15978 1293 46388 -24484
8290 -24484 59394 61518 128417 147374 120595 171818 209832 197924 139326 143557 190568 138152
8278 138152 167207 162279 179077 120345 52631 85130 97253 135151 101845 37329 -18080 50293
8266 50293 53872 92169 30823 37310 65557 -83 -43248 25728 -3031 39908 71818 82401
8254 82401 104708 89634 103130 75153 123369 145038 113728 39426 -19846 -13049 4958 -36009
$$ packed form
8338B34090N164J8899k7346j1206Q2455l9374j8337j3080M8647P8531p2809k7311
8326B58323l8010n2399n3744l6047r029l8935m124j2456o5717k1419L4329K7852
8314a1376m6021M9788Q5329j8535n9930J9158J6997l440P468j1598Q218K1001
8302E7059q943k2798j0921n428k5577L0959N918J0037m6284J7271M5095p0872
8290b4484Q3878K124O6899J8957k6779N1223L8014j1908n8598M231M7011n2416
8278A38152K9055m928J6798n8732o7714L2499J2123L7898l3306o4516n5409O8373
8266E0293L579L8297o1346O487K8247o5640m3165O8976k8759M2939L1910J0583
8254H2401K2307j5074J3496k7977M8216K1669l1310p4302n9272O797J8007m0967
$$ plain form
8242 -36009 51013 1287 -19034 -54885 -96926 -40033 1070 -43487 -60711 19870 39046 -22285
8230 -22285 22604 9378 5012 1959 -52486 -16250 -36714 -67987 11519 26283 2660 -8335
8218 -8335 -92005 -73517 2106 -3838 1702 43839 40368 30239 -35705 -38664 -67174 -66814 -52476
8205 -52476 -10231 21772 -23216 -57110 -47315 -55511 -23393 57245 65447 32128 65886 224545
8193 224545 384356 -97660 -318893 -17055 54845 33836 43668 55642 29614 -29389 14788
8182 14788 18434 -79566 -52945 -12886 13805 82136 57142 -584 43836 138382 183739 233231
8170 233231 317791 258841 365507 417195 468431 496700 439306 453667 465702 403300 376241
8159 376241 425355 407939 432310 458549 447377 432914 356276 384094 390305 324638 253012 231208
$$ packed form
8242c6009Q7022m9726k0321l5851m2041N6893M1103m4557j7224Q0581J9176o1331
8230b2285M4889j3226m366l053n4445L6236k0464l1273P9506J4764k3623j0995
8218h335q3670J8488P5623n944N540M2137l471j0129o5944k959k8510L60J4338
8205e2476M2245L2003m4988l3894R795q196L2118Q0638Q202l3319L3758J58659
8193B24545J59811m82016k21233L01838P1900k1009R832J1974k6028n9003M4177
8182A4788L646r8000K6621M0059K6691O8331k4994n7726M4420R4546M5357M9492
8170B33231Q4560n8950J06666N1688N1236K8269n7394J4361J2035o2402k7059
8159C76241M9114j7416K4371K6239j1172j4463p6638K7818O211o5667p1626k1804
$$ plain form
8147 231208 205463 168495 145172 178117 200681 115762 151784 110043 103204 15276 -4952 27447
8135 27447 12592 78184 189113 159552 86298 84588 56590 105289 64333 10824 52227 83214
8123 83214 113381 117960 135773 172431 80349 152835 161712 106555 50648 -14532 77166 86943
8111 86943 45792 124370 164157 107680 82453 153316 193677 130038 97705 83147 93972 187820
8099 187820 253112 258838 278783 311907 249884 240891 309679 346816 386498 393254 427085 433445
8087 433445 409878 409334 400589 459910 506620 493708 387429 412200 491727 463912 509710 482975
8075 482975 460755 421364 380210 274448 277931 368644 353223 329152 288306 239017 288843 334745
8063 334745 333777 371384 394995 316192 265355 196772 167799 206138 239750 310447 254521 240608
$$ packed form
8147B31208k5745l6968k3323L2945K2564q4919L6022m1741o839q7928k0228L2399
8135B7447j4855O5592J10929k9561p3254j710k7998M8699m0956n3509M1403L0987
8123H3214L0167M579J7813L6658r2082P2486Q877n5157n5907o5180R1698R777
8111H6943m1151P8578L9787n6477k5227P0863M0361o3639l2333j4558J0825R3848
8099A87820O5292N726J9945L3124o2023q993O8788L7137L9682O756L3831O360
8087D33445k3567n44q745N9321M6710j2912j06279K4771P9527k7815M5798k6735
8075D82975k2220l9391m1154j05762L483R0713j5421k4071m0846m9289M9826M5902
8063C34745r68L7607K3611p8803n0837o8583k8973L8339L3612P0697n5926j3913
$$ plain form
8051 240608 143762 116997 229251 293578 277354 267492 256900 215858 189662 129365 184689 210798
8039 210798 226527 153109 212600 198994 146372 186666 219313 290823 281376 285211 269799 264995
8027 264995 219446 206217 156664 224350 232584 238206 241371 189018 175205 210128 241738 214679
8015 214679 300412 344206 316254 275034 329557 405086 307642 269031 258514 243982 332869 323870
8003 323870 325647 387768 399762 376250 426493 456987 416169 396926 386139 314515 331361 415873
7991 415873 466220 440858 456167 518818 506136 520878 559340 561673 572028 530050 543416 578407
7979 578407 587410 508178 514043 547205 536705 574005 456020 453721 480500 481635 508477 548660
7967 548660 611865 594975 512341 591890 625769 621068 690471 680740 712206 797519 851768 905840
$$ packed form
8051B40608r6846k6765J12254O4327j6224r862j0592m1042k6196o0297N5324K6109
8039B10798J5729p3418N9491j3606n2622M0294L2647P1510r447L835j5412m804
8027B64995m5549j3229m9553O7686Q234N622L165n2353j3813L4923L1610k7059
8015B14679Q5733M3794k7952m1220N4523P5529r7444l8611j0517j4532Q8887q999
8003C23870J777O2121J1994k3512N0243L0494m0818j9243j0787p1624J6846Q4512
7991D15873N0347k5362J5309O2651j2682J4742L8462K333J0355m1978J3366L4991
7979E78407R003p9232N865L3162j0500L7300j17985k299K6779J135K6842M0183
7967E48660O3205j6890q2634P9549L3879m701O9403r731L1466Q5313N4249N4072
$$ plain form
7955 905840 899384 987501 1059749 1044830 1018303 1033538 1042911 1004978 944427 900544 910314 959990
7943 959990 893066 847237 861811 861466 839971 791635 760062 864524 917021 881919 867795 940475
7931 940475 873134 745568 845303 847961 844987 871302 924082 885617 916825 979869 962288 935218
7919 935218 953236 1002095 1070727 1028707 954549 1025003 1164443 1195067 1303297 1329604 1310198
7908 1310198 1362473 1349828 1350255 1395430 1366853 1399604 1442578 1394140 1404542 1431459 1488893 1450421
7896 1450421 1483264 1525387 1506849 1508135 1556934 1565911 1603723 1643824 1683854 1681890 1663489 1675857
7884 1675857 1726489 1828939 1831258 1878825 1860876 1864346 1926270 1986360 2038540 2053398 2104468 2092854
7872 2092854 2137218 2225779 2264056 2309766 2389336 2376740 2379031 2467969 2527421 2592935 2631528 2724783
$$ packed form
7955I05840o456Q8117P2248j4919k6527J5235R373l7933o0551m3883R770M9676
7943I59990o6924m5829J4574l45k1495m8336l1573J04462N2497l5102j4124P2680
7931I40475o7341j27566R9735K658k974K6315N2780l8465L1208O3044j7581k7070
7919I35218J8018M8859O8632m2020p4158P0454J39440L0624J08230K6307j9406
7908A310198N2275j2645M27M5175k8577L2751M2974m8438J0402K6917N7434l8472
7896A450421L2843M2123j8538J286M8799Q977L7812M0101M0030j964j8401J2368
7884A675857N0632J02450K319M7567j7949L470O1924O0090N2180J4858N1070j1614
7872B092854M4364Q8561L8277M5710P9570j2596K291Q8938N9452O5514L8593R3255
$$ plain form
7860 2724783 2801275 2851195 2839005 2943606 3062132 3117717 3201088 3276277 3321926 3406412 3453139
7849 3453139 3541966 3601768 3754265 3831278 3936329 4010054 4049380 4182598 4327700 4495324
7839 4495324 4620900 4741358 4793223 4970738 5217667 5344937 5544844 5728867 5807494 6019803
7829 6019803 6191717 6447642 6635317 6850916 7125390 7437438 7780544 8057939 8293326 8623144
7819 8623144 8965542 9284498 9681290 10170428 10589882 11107920 11626928 12075861 12650619 13231359
7809 13231359 13855537 14418950 15011783 15763646 16721267 17651659 18521919 19452652 20456236
7800 20456236 21521820 22588346 23704989 24847667 25981258 27126292 28206751 29228071
7792 29228071 30277448 31165350 32090066 32785377 33376065 33840925 34090724 34092475 33933686 33661176
$$ packed form
7860B724783P6492M9920j2190J04601J18526N5585Q3371P5189M5649Q4486M6727
7849C453139Q8827N9802J52497P7013J05051P3725L9326J33218J45102J67624
7839D495324J25576J20458N1865J77515K46929J27270J99907J84023P8627K12309
7829F019803J71914K55925J87675K15599K74474L12048L43106K77395K35387L29818
7819H623144L42398L18956L96792M89138M19454N18038N19008M48933N74758N80740
7809A3231359O24178N63413N92833P51863R57621R30392Q70260R30733J003584
7800B0456236J065584J066526J116643J142678J133591J145034J080459J021320
7792B9228071J049377Q87902R24716O95311N90688M64860K49799J751j58789k72510
$$ plain form
7782 33661176 33206766 32588621 31810787 31016266 30055657 28996116 27925903 26827813 25726398
7773 25726398 24601764 23531103 22482939 21455729 20471123 19414687 18553180 17768429 16901232
7764 16901232 16101517 15385782 14741317 14095393 13445357 12861009 12340101 11785303 11309430
7755 11309430 10931758 10543755 10156632 9849973 9459500 9106754 8870121 8578070 8276203
7746 8276203 7987654 7769492 7505982 7262956 7001258 6795016 6587992 6337629 6124236 5964801
7736 5964801 5799130 5664609 5513769 5257555 5090188 4973171 4778638 4619736 4484184 4333000
7726 4333000 4231610 4149076 3980708 3891983 3834495 3781298 3671392 3546457 3434210 3357935
7716 3357935 3287640 3235329 3173540 3073036 2959648 2966572 2934266 2812886 2741688 2709702 2615051
$$ packed form
7782C3661176m54410o18145p77834p94521r60609j059541j070213j098090j101415
7773B5726398j124634j070661j048164j027210r84606j056436q61507p84751q67197
7764A6901232p99715p15735o44465o45924o50036n84348n20908n54798m75873
7755A1309430l77672l88003l87123l06659l90473l52746k36633k92051l01867
7746H276203k88549k18162k63510k43026k61698k06242k07024k50363k13393j59435
7736E964801j65671j34521j50840k56214j67367j17017j94533j58902j35552j51184
7726D333000j01390q2534j68368q8725n7488n3197j09906j24935j12247p6275
7716C357935p0295n2311o1789j00504j13388O924l2306j21380p1198l1986r4651
$$ plain form
7705 2615051 2536009 2496837 2447039 2425476 2389016 2365386 2314556 2219972 2154896 2124242 2056501
7694 2056501 1992136 1940019 1900190 1911059 1835607 1793661 1848869 1825945 1708937 1687400 1744725
7683 1744725 1645222 1636658 1615297 1637839 1577460 1571528 1535365 1433638 1384035 1359740 1324091 1287623
7671 1287623 1310599 1342216 1318450 1274739 1312410 1288031 1207369 1164001 1144599 1106832 1083816
7660 1083816 1060557 1003060 1125925 1196034 1178048 1142451 1126113 1048930 951038 936022 887384
7649 887384 955356 946002 867153 931832 958135 933118 869897 819926 828293 841964 870891 797238
7637 797238 737467 728246 681776 641512 613495 636768 647381 635217 693273 790044 702129 645045
7625 645045 710093 677558 657879 610284 679495 721003 719721 616380 545520 518919 624676
$$ packed form
7705B615051p9042l9172m9798k1563l6460k3630n0830r4584o5076l0654o7741
7694B056501o4365n2117l9829J0869p5452m1946N5208k2924j17008k1537N7325
7683A744725r9503q564k1361K2542o0379n932l6163j01727m9603k4295l5649l6468
7671A287623K2976L1617k3766m3711L7671k4379q0662m3368j9402l7767k3016
7660A083816k3259n7497J22865P0109j7986l5597j6338p7183r7892j5016m8638
7649H87384O7972r354p8849O4679K6303k5017o3221m9971Q367J3671K8927p3653
7637G97238n9771r221m6470m0264k8017K3273J0613j2164N8056R6771q7915n7084
7625F45045O5048l2535j9679m7595O9211M1508j282j03341p0860k6601J05757
$$ plain form
7614 624676 547757 533835 525704 520086 558739 548732 576348 579738 518491 510159 511301 496046 580357
7601 580357 577388 510014 532664 506875 488980 542490 563102 558471 537934 557376 590526 541458
7589 541458 592509 668660 642297 640436 622373 573815 518227 502617 479072 463025 416318 452889
7577 452889 415812 348786 382597 365826 350865 368182 272981 262245 286885 321158 317553 308837
7565 308837 202356 213604 189128 228643 271072 252534 304590 269476 248658 287805 254329
7554 254329 256983 220631 235829 208389 266919 288267 256673 214069 227879 285113 332600 257559
7542 257559 238428 287606 253400 169074 171365 237541 232049 286430 325145 293062 269002 274885
7530 274885 361035 358415 303337 341417 362196 476888 582668 635139 570946 517612 553411
$$ packed form
7614F24676p6919j3922q131n618L8653j0007K7616L390o1247q332J142j5255Q4311
7601E80357k969o7374K2650k5789j7895N3510K0612m631k0537J9442L3150m9068
7589E41458N1051P6151k6363j861j8063m8558n5588j5610k3545j6047m6707L6571
7577D52889l7077o7026L3811j6771j4961J7317r5201j0736K4640L4273l605q716
7565C08837j06481J1248k4476L9515M2429j8538N2056l5114k0818L9147l3476
7554B54329K654l6352J5198k7440N8530K1348l1594m2604J3810N7234M7487p5041
7542B57559j9131M9178l4206q4326K291O6176n492N4381L8715l2083k4060N883
7530B74885Q6150k620n5078L8080K0779J14692J05780N2471o4193n3334L5799
$$ plain form
7519 553411 514252 451571 448904 425462 412719 358945 341527 348886 334060 344584 390793 424463
7507 424463 431346 436979 464518 474820 584073 632941 729280 847933 926334 982453 1022349 976246
7495 976246 965037 944993 838477 722648 641652 582569 558290 476534 464734 445240 387137
7484 387137 334750 328364 327583 341289 361156 314321 236493 200791 179130 215247 241484 201771
7472 201771 205768 239209 191447 196377 189739 134322 111606 116606 96579 125484 159990 191578
7460 191578 221077 144616 111231 101927 89809 157242 167622 111766 71042 85720 105274 76209
7448 76209 143515 164680 183260 201725 196282 207858 138622 71385 42442 88770 127501 107006
7436 107006 88990 180397 229607 233593 238743 227570 251815 239368 234522 215000 207473 203960 209164
$$ packed form
7519E53411l9159o2681k667k3442j2743n3774j7418P359j4826J0524M6209L3670
7507D24463O883N633K7539J0302J09253M8868R6339J18653P8401N6119L9896m6103
7495I76246j1209k0044j06516j15829q0996n9083k4279q1756j1800j9494n8103
7484C87137n2387o386p81J3706J9867m6835p7828l5702k1661L6117K6237l9713
7472B01771L997L3441m7762M930o638n5417k2716N000k0027K8905L4506L1588
7460A91578K9499p6461l3385r304j2118O7433J0380n5856m0724J4678J9554k9065
7448G6209O7306K1165J8580J8465n443J1576o9236o7237k8943M6328L8731k0495
7436A07006j8016R1407M9210L986N150j1173K4245j2447m846j9522p527l513N204
$$ plain form
7423 209164 160001 87241 115648 147460 142538 167508 195021 186792 169704 155523 110828 176815
7411 176815 155077 154435 157241 167817 194569 251636 198339 219902 242151 238255 261741 288850
7399 288850 277679 269894 262229 239378 273611 280500 251041 245337 234111 166463 186593 179179 258595
7386 258595 271913 207923 259826 337485 340230 405360 439730 538313 577223 653672 734777 766146
7374 766146 734151 652553 678104 627190 584910 512584 489981 495369 503074 536922 547360 531388
7362 531388 560106 515305 474315 381690 329970 294384 232200 235724 278277 310626 313956 211936
7350 211936 265283 287605 252057 250902 231218 315493 366964 398805 499927 472172 524555 607105
7338 607105 736909 863978 907269 917055 924593 906402 794122 675677 647372 596473 561198
$$ packed form
7423B09164m9163p2760K8407L1812m922K4970K7513q229j7088j4181m4695O5987
7411A76815k1738o42K806J0576K6752N7067n3297K1563K2249l896K3486K7109
7399B88850j1171p785p665k2851L4233O889k9459n704j1226o7648K0130p414P9416
7386B58595J3318o3990N1903P7659K745O5130L4370R8583L8910P6449Q1105L1369
7374G66146l1995q1598K5551n0914m2280p2326k2603N388P705L3848J0438j5972
7362E31388K8718m4801m0990r2625n1720l5586o2184L524M2553L2349L330j02020
7350B11936N3347K2322l5548j155j9684Q4275N1471L1841J01122k7755N2383Q2550
7338F07105J29804J27069M3291R786P538j8191j12280j18445k8305n0899l5275
$$ plain form
7327 561198 542185 525006 561826 630181 655856 634277 614372 612177 589431 590152 570395 588018
7315 588018 653279 644687 674616 658950 744180 860150 872698 847931 871367 769999 689598
7304 689598 561831 525483 474258 413399 402868 354924 279172 336428 297980 277583 249633
7293 249633 324110 308957 258367 288758 326209 296439 275038 296202 253099 273153 306090 280291
7281 280291 290132 364958 398868 457112 482935 482312 514679 490273 527625 530821 536630 524092 449810
7268 449810 479406 476517 494174 515358 541942 631454 609624 530701 507966 491075 389910 337157
7256 337157 338390 327626 254247 345926 343788 320242 314765 375487 393098 347734 356831 321292
7244 321292 361277 307602 297292 300811 327525 349351 369213 349885 317782 390122 387531 395541
$$ packed form
7327E61198j9013j7179L6820O8355K5675k1579j9905k195k2746P21j9757J7623
7315E88018O5261q592K9929j5666Q5230J15970J2548k4767K3436j01368q0401
7304F89598j27767l6348n1225o0859j0531m7944p5752N7256l8448k0397k7950
7293B49633P4477j5153n0590L0391L7451k9770k1401K1164m3103K0054L2937k5799
7281B80291R841P4826L3910N8244K5823o23L2367k4406L7352L196N809j2538p4282
7268D49810K9596k889J7657K1184K6584Q9512k1830p8923k2735j6891j01165n2753
7256C37157J233j0764p3379R1679k138k3546n477O0722J7611m5364R097l5539
7244C21292L9985n3675j0310L519K6714K1826J9862j9328l2103P2340k591Q010
$$ plain form
7232 395541 412355 379768 394027 408950 390549 400569 418346 387548 435495 399097 493655 457572
7220 457572 405165 434493 522304 539654 523585 583909 706784 728339 792685 772688 835595
7209 835595 946228 1052366 1141930 1146393 1140212 1211212 1189204 1058000 1004947 925460 856166
7198 856166 783214 680166 653792 647671 689067 663410 641497 643410 687757 730907 713777 718313
7186 718313 652609 696237 674254 669043 731996 701825 740958 798109 823542 868396 915810 904109
7174 904109 834276 854550 930582 930312 929156 939760 967894 1028315 1062605 1138645 1194619 1302019
7162 1302019 1297657 1378948 1444228 1549049 1682285 1764810 1865733 1887443 1938560 2010203 2120493
7151 2120493 2129982 2146508 2249671 2269416 2277391 2328169 2336782 2372912 2525089 2678961 2857847
$$ packed form
7232C95541J6814l2587J4259J4923j8401J0020J7777l0798M7947l6398R4558l6083
7220D57572n2407K9328Q7811J7350j6069O0324J22875K1555O4346j9997O2907
7209H35595J10633J06138Q9564M463o181P1000k2008j31204n3053p9487o9294
7198H56166p2952j03048k6374o121M1396k5657k1913J913M4347M3150j7130M536
7186G18313o5704M3628k1983n211O2953l0171L9133N7151K5433M4854M7414j1701
7174I04109o9833K0274P6032k70j156J0604K8134O0421L4290P6040N5974J07400
7162A302019m362Q1291O5280J04821J33236Q2525J00923K1710N1117P1643J10290
7151B120493R489J6526J03163J9745P975N0778Q613L6130J52177J53872J78886
$$ plain form
7140 2857847 3109852 3419718 3780773 4233670 4697400 5253691 5942892 6719371 7824099
7131 7824099 9257772 11070240 13680180 17657260 23089432 30066983 38921831 47546420
7123 47546420 51652754 52329184 50913116 44920898 37544208 30796845 25024509 19879907
7115 19879907 14902375 11315367 8960091 7436155 6286954 5525952 4947453 4597496 4247251
7106 4247251 3933763 3643724 3443559 3281686 3152730 3004213 2891037 2746802 2603830 2470868
7096 2470868 2283662 2143746 2040089 1954747 1882190 1824428 1735849 1645673 1605637 1578315 1553472
7085 1553472 1510059 1368650 1400757 1360414 1329393 1279524 1263684 1245125 1253913 1205448 1164280
7074 1164280 1145330 1104807 1121716 1130562 1040116 967677 955677 901037 837854 804171 809195 768358
$$ packed form
7140B857847K52005L09866L61055M52897M63730N56291O89201P76479J104728
7131G824099J433673J812468K609940L977080N432172O977551Q854848Q624589
7123D7546420M106334O76430j416068n992218p376690o747363n772336n144602
7115A9879907m977532l587008k355276j523936j149201p61002n78499l49957l50245
7106D247251l13488k90039k00165j61873j28956j48517j13176j44235j42972j32962
7096B470868j87206j39916j03657q5342p2557n7762q8579r0176m0036k7322k4843
7085A553472m3413j41409L2107m0343l1021m9869j5840j8559Q788m8465m1168
7074A164280j8950m0523J6909Q846r0446p2439j2000n4640o3183l3683N024m0837
$$ plain form
7062 768358 763421 729419 678208 564126 725635 802178 680841 647485 653315 667347 630814
7051 630814 582184 577715 634532 576112 526971 502824 459155 427618 449203 419228 394337 417639
7039 417639 414094 445876 485321 413313 378994 376524 354205 360437 370850 400267 404447 396083 318353
7026 318353 320499 324696 305095 295119 365735 359149 328849 356330 337222 349652 318016 356723
7014 356723 347623 254803 214185 235518 298018 273992 269628 269484 239722 229606 224607 228829 296506
7001 296506 296948 326607 328223 398584 339118 309629 301117 281931 265229 259181 215888 295240 341274
6988 341274 284048 316078 275929 260603 282425 293715 314382 309487 319679 364992 282224 285269
6976 285269 236828 242427 229583 180076 137789 197275 168940 164802 176143 181662 150220 107604
$$ packed form
7062G68358m937l4002n1211j14082J61509P6543j21337l3356N830J4032l6533
7051F30814m8630m469N6817n8420m9141k4147m3669l1537K1585k9975k4891K3302
7039D17639l545L1782L9445p2008l4319k470k2319O232J0413K9417M180q364p7730
7026C18353K146M197j9601r976P0616o586l0300K7481j9108J2430l1636L8707
7014C56723r100r2820m0618K1333O2500k4026m364j44k9762j0116m999M222O7677
7001B96506M42K9659J616P0361n9466k9489q512j9186j6702o048m3293P9352M6034
6988C41274n7226L2030m0149j5326K1822J1290K0667m895J0192M5313q2768L045
6976B85269m8441N599j2844m9507m2287N9486k8335m138J1341N519l1442m2616
$$ plain form
6964 107604 125841 128321 167055 207407 160932 169616 166027 141831 168371 110580 109628 152277 140762
6951 140762 118371 148303 169587 139162 87935 114209 60052 57194 94228 132840 164587 115063
6939 115063 101863 163658 129106 139808 87213 73924 55187 -15349 -29707 28296 88294 73547
6927 73547 70470 124888 142437 100971 133547 91926 97119 43099 3140 31622 52589 85391
6915 85391 118816 129474 65553 91772 91962 38485 73582 80827 80808 127110 92999 46868 83102
6902 83102 8562 2215 53752 104883 145739 141998 173495 162221 104890 90047 71804 73878
6890 73878 85970 61142 47847 51881 79809 140638 87549 102760 112551 95911 21059 72542
6878 72542 62563 56903 101321 145080 115722 102995 96405 108649 123221 102188 94944 94453 76879
$$ packed form
6964A07604J8237K480L8734M0352m6475Q684l589k4196K6540n7791r52M2649j1515
6951A40762k2391K9932K1284l0425n1227K6274n4157k858L7034L8612L1747m9524
6939A15063j3200O1795l4552J0702n2595j3289j8737p0536j4358N8003N9998j4747
6927G3547l077N4418J7549m1466L2576m1621N193n4020l9959K8482K0967L2802
6915H5391L3425J0658o3921K6219J90n3477L5097P245j9M6302l4111m6131L6234
6902H3102p4540o347N1537N1131M0856l741L1497j1274n7331j4843j8243K074
6890G3878J2092k4828j3295M034K7928O0829n3089J5211R791j6640p4852N1483
6878G2542r979n660M4418M3759k9358j2727o590J2244J4572k1033p244m91j7574
$$ plain form
6865 76879 82697 174575 130220 115424 77184 145611 108123 97488 71649 37763 59052 97789
6853 97789 104600 67581 23329 43115 120131 142801 141964 138911 114056 127015 146619 116629 71714
6840 71714 103762 122328 70881 22400 46763 25321 55042 119499 84748 46007 89823 37259
6828 37259 41838 121994 151391 140511 146130 129130 41206 76804 87834 108469 139487 198505
6816 198505 125519 124665 110600 78251 69912 35789 -10897 37811 79662 115277 80414 73996
6804 73996 62926 55865 60944 -47271 5846 24430 34194 22814 32211 17546 63189 65722 -10258
6791 -10258 -6100 44996 58372 65626 4557 5825 28853 48857 93043 110576 50352 60268 68438
6778 68438 48466 30315 34722 54890 153764 98512 89068 96689 54879 114440 111090 91528 52962
$$ packed form
6865G6879N818R1878m4355j4796l8240O8427l7488j0635k5839l3886K1289L8737
6853I7789O811l7019m4252J9786P7016K2670q37l053k4855J2959J9604k9990m4915
6840G1714L2048J8566n1447m8481K4363k1442K9721O4457l4751l8741M3816n2564
6828C7259M579Q0156K9397j0880N619j7000q7924L5598J1030K0635L1018N9018
6816A98505p2986q54j4065l2349q339l4123m6686M8708M1851L5615l4863o418
6804G3996j1070p061N079j08215N3117J8584R764j1380R397j4665M5643K533p5980
6791a0258M158N1096J3376P254o1069J268K3028K0004M4186J7533o0224R916Q170
6778F8438j9972j8151M407K0168R8874n5252r444P621m1810N9561l350j9562l8566
$$ plain form
6765 52962 43981 53565 86655 83834 121746 150362 68810 110239 121557 64100 32039 53437
6753 53437 64581 431 16130 2146 -11160 75439 154561 136901 198526 161595 107229 113220
6741 113220 67545 74658 80930 60663 79028 84911 162168 151293 207425 206337 280871 266699
6729 266699 270182 288578 338224 385320 438050 604354 801990 970336 1107904 1252806 1333665
6718 1333665 1420441 1427583 1348904 1320940 1335533 1362914 1411432 1328032 1250880 1196331 1092005
6707 1092005 998025 873641 773304 736490 699232 606301 545913 576662 601357 634518 649660
6696 649660 721477 861080 1015866 1134179 1215810 1236257 1239796 1241048 1213167 1208976 1284835 1431071
6684 1431071 1371330 1356054 1342216 1226366 1127903 990900 868929 768651 755847 656952 568624
$$ packed form
6765E2962q981R584L3090k821L7912K8616q1552M1429J1318n7457l2061K1398
6753E3437J1144o4150J5699j3984j3306Q6599P9122j7660O1625l6931n4366N991
6741A13220m5675P113O272k0267J8365N883P7257j0875N6132j088P4534j4172
6729B66699L483J8396M9646M7096N2730J66304J97636J68346J37568J44902Q0859
6718A333665Q6776P142p8679k7964J4593K7381M8518q3400p7152n4549j04326
6707A092005r3980j24384j00337l6814l7258r2931o0388L0749K4695L3161J5142
6696F49660P1817J39603J54786J18313Q1631K0447L539J252k7881m191P5859J46236
6684A431071n9741j5276j3838j15850r8463j37003j21971j00278j2804r8895q8328
$$ plain form
6673 568624 442115 450338 422901 379817 355605 374145 342709 334602 314343 267732 338223 264669
6661 264669 187695 190225 232542 279308 301631 307997 273558 279647 263059 208858 200429 150134
6649 150134 130112 157578 174414 173041 143285 121311 114165 145166 170028 129169 128382 85285
6637 85285 117546 103227 135122 158252 167849 129012 131900 118668 99051 136125 162926 164475
6625 164475 181377 137325 96382 100332 53037 19876 28059 19646 -43633 91758 115619 133642
6613 133642 64813 49996 90984 52970 103670 97313 66203 67905 1323 33380 88043 82863
6601 82863 68111 129745 179743 173800 116529 121606 86270 95831 130694 107014 95102 118025
6589 118025 136325 98447 46549 92177 168249 119836 82597 134857 204087 157886 117917 188115
$$ packed form
6673E68624j26509Q223k7437m3084k4212J8540l1436q107k0259m6611P0491p3554
6661B64669p6974K530M2317M6766K2323O366l4439O089j6588n4201q429n0295
6649A50134k0022K7466J6836j373k9756k1974p146L1001K4862m0859p87m3097
6637H5285L2261j4319L1895K3130R597l8837K888j3232j9617L7074K6801J549
6625A64475J6902m4052m0943L950m7295l3161Q183q413o3279J35391K3861J8023
6613A33642o8829j4817M0988l8014N0700o357l1110J702o6582L2057N4663n180
6601H2863j4752O1634M9998n943n7271N077l5336R561L4863k3680j1912K2923
6589A18025J8300l7878n1898M5628P6072m8413l7239N2260O9230m6201l9969P0198
$$ plain form
6577 188115 252425 232448 255680 165373 171241 163385 162653 115771 119010 124995 115590 163538 184747
6564 184747 217159 198116 156446 160395 210715 138124 130350 138417 116239 116982 143907 156229 146670
6551 146670 141983 231539 194928 172047 119264 116349 103355 145350 118255 77421 117047 93260
6539 93260 63733 -11143 46393 96621 124660 80906 102556 66408 78362 101311 90856 118370
6527 118370 187122 166771 186848 104476 55186 92365 113294 119354 116764 130505 81277 96126
6515 96126 105971 54513 89560 144846 83488 21866 67705 144753 104792 105683 46884 4951
6503 4951 23574 73746 138224 170167 133641 62137 65106 133526 120894 60402 26159 46369
6491 46369 129854 90702 101059 173419 209618 82160 74177 87592 128661 148829 65274 35944
$$ packed form
6577A88115O4310j9977K3232r0307N868p856p32m6882L239N985r405M7948K1209
6564A84747L2412j9043m1670L949N0320p2591p774Q067k2178P43K6925J2322r559
6551A46670m687Q9556l6611k2881n2783k915j2994M1995k7095m0834L9626k3787
6539I3260k9527p4876N7536N0228K8039m3754K1650l6148J1954K2949j0455K7514
6527A18370O8752k0351K0077q2372m9290L7179K0929O060k590J3741m9228J4849
6515I6126R845n1458L5047N5286o1358o1622M5839P7048l9961Q91n8799m1933
6503D951J8623N0172O4478L1943l6526p1504K969O8420j2632o0492l4243K0210
6491D6369Q3485l9152J0357P2360L6199j27458p983J3415M1069K0168q3555k9330
$$ plain form
6479 35944 143606 117464 139980 156126 80104 99362 141297 124078 129822 207472 175526 123272
6467 123272 91605 127489 87549 101793 120624 154021 149574 110281 93142 131563 92004 90016
6455 90016 101925 129251 43732 89094 170484 206095 115081 46475 87088 151150 157527 49644
6443 49644 74176 128538 159772 94256 147208 116847 100384 138197 152368 198531 164802 149865
6431 149865 184013 179364 187241 174177 145800 219100 142250 235713 212183 139880 191110 140208
6419 140208 152934 179292 246801 223966 197016 213671 218913 190808 166389 205136 239369 189387
6407 189387 188885 246847 238099 256654 310852 243559 237893 236594 274775 295918 207396 226527 249644
6394 249644 319862 351170 298662 260969 252927 204891 197835 266176 258215 310839 300579 320636
$$ packed form
6479C5944J07662k6142K2516J6146p6022J9258M1935j7219N744P7650l1946n2254
6467A23272l1667L5884l9940J4244J8831L3397m447l9293j7139L8421l9559j988
6455I0016J1909K7326q5519M5362Q1390L5611r1014o8606M0613O4062O377j07883
6443D9644K4532N4362L1234o5516N2952l0361j6463L7813J4171M6163l3729j4937
6431A49865L4148m649P877j3064k8377P3300p6850R3463k3530p2303N1230n0902
6419A40208J2726K6358O7509k2835k6950J6655N242k8105k4419L8747L4233m9982
6407A89387n02N7962q748J8555N4198o7293n666j299L8181K1143q8522J9131K3117
6394B49644P0218L1308n2508l7693q042m8036p056O8341p961N2624j0260K0057
$$ plain form
6382 320636 360349 321092 298159 346923 314720 337980 339903 307898 303702 353651 332098 312480
6370 312480 348398 296528 260141 303357 294166 327867 353852 361895 432447 413120 395484 424989
6358 424989 357746 338702 405979 389395 357247 421329 435593 428235 427575 431427 501379 438691
6346 438691 442498 440864 430449 374877 435407 500714 495988 489262 523159 480716 494578 523393
6334 523393 565122 573776 642676 699028 711592 717426 779056 884398 893363 937195 975222 1100028
6322 1100028 1231141 1313618 1377169 1495590 1494778 1439556 1385839 1290913 1333090 1372086 1358481
6311 1358481 1408370 1545152 1530891 1528258 1492390 1441681 1334453 1224680 1161192 1090909 1008841
6300 1008841 941898 892262 892995 880489 790780 718760 770115 785977 688845 741716 788164 778672
$$ packed form
6382C20636L9713l9257k2933M8764l2203K3260J923l2005m196M9949k1553j9618
6370C12480L5918n1870l6387M3216r191L3701K5985Q043P0552j9327j7636K9505
6358D24989o7243j9044O7277j6584l2148O4082J4264p358o60L852O9952o2688
6346D38691L807j634j0415n5572O0530O5307m726o726L3897m2443J3862K8815
6334E23393M1729Q654O8900N6352J2564N834O1630J05342Q965M3832L8027J24806
6322A100028J31113Q2477O3551J18421q12n5222n3717r4926M2177L8996j3605
6311A358481M9889J36782j4261k633l5868n0709j07228j09773o3488p0283q2068
6300A008841o6943m9636P33j2506q9709p2020N1355J5862r7132N2871M6448r492
$$ plain form
6288 778672 724239 697273 757396 760327 752763 823709 835935 870165 872845 856636 801142 838427
6276 838427 822268 806846 813686 743990 789446 794516 776207 808214 744244 835664 873122 819966
6264 819966 816655 807657 772495 788209 702575 769461 772038 786309 829728 823922 894026 863687
6252 863687 811544 883265 858333 877021 845840 888996 968987 948305 916585 850628 851269 868025
6240 868025 933540 944433 950340 982976 1015352 1052408 1104739 1148470 1153854 1119278 1111869 1106679
6228 1106679 1009696 994840 1135578 1124347 1060219 1040903 1132596 1141314 1121510 1084996 1160361
6217 1160361 1218735 1110311 1072191 1083410 1047292 1019767 1081307 1095649 1096727 1170722 1175412 1238997
6205 1238997 1205252 1264998 1328358 1359565 1420397 1373486 1419402 1450607 1372927 1378191 1385341 1326983
$$ packed form
6288G78672n4433k6966O0123K931p564P0946J2226L4230K680j6209n5494L7285
6276H38427j6159j5422O840o9696M5456N070j8309L2007o3970R1420L7458n3156
6264H19966l311q998l5162J5714q5634O6886K577J4271M3419n806P0104l0339
6252H63687n2143P1721k4932J8688l1181M3156P9991k0682l1720o5957O41J6756
6240H68025O5515J0893N907L2636L2376L7056N2331M3731N384l4576p409n190
6228A106679r6983j4856J40738j1231o4128j9316R1693Q718j9804l6514P5365
6217A160361N8374j08424l8120J1219l6118k7525O1540J4342J078P3995M690O3585
6205A238997l3745N9746O3360L1207O0832m6911M5916L1205p7680N264P150n8358
$$ plain form
6193 1326983 1316561 1337819 1459941 1626354 1743000 1689133 1709450 1764537 1732765 1732516 1690121
6182 1690121 1691649 1614472 1482659 1498860 1488523 1467935 1535795 1567654 1626440 1681573 1704224
6171 1704224 1728408 1688778 1686888 1767418 1798318 1805473 1828002 1926989 1944914 1976079 2073496 2140339
6159 2140339 2201721 2283651 2425518 2477286 2422125 2532798 2574591 2511438 2512291 2480611 2407401
6148 2407401 2414205 2416712 2453327 2441647 2387070 2392955 2474275 2476564 2421964 2420663 2411554 2452704 2518982
6135 2518982 2516180 2576561 2709134 2799047 3027952 3409344 3711136 4048751 4339168 4672262
6125 4672262 5061417 5348351 5532227 5634318 5611778 5448747 5291867 5106671 4796813 4485696
6115 4485696 4204314 3979854 3770800 3666960 3588841 3484478 3351299 3220061 3220042 3191826 3254969
$$ packed form
6193A326983j0422K1258J22122J66413J16646n3867K0317N5087l1772k49m2395
6182A690121J528p7177j31813J6201j0337k0588O7860L1859N8786N5133K2651
6171A704224K4184l9630j890Q0530L0900P155K2529R8987J7925L1165R7417O6843
6159B140339O1382Q1930J41867N1768n5161J10673M1793o3153Q53l1680p3210
6148B407401O804K507L6615j1680n4577N885Q1320K289n4600j301r109M1150O6278
6135B518982k802O0381J32573Q9913K28905L81392L01792L37615K90417L33094
6125D672262L89155K86934J83876J02091k2540j63031j56880j85196l09858l11117
6115D485696k81382k24460k09054j03840p8119j04363j33179j31238j9k8216O3143
$$ plain form
6104 3254969 3295419 3289535 3267451 3257601 3218606 3254995 3299519 3375101 3310507 3371564 3395782 3418309
6092 3418309 3441411 3499239 3590837 3677625 3711949 3745309 3749285 3781346 3893874 4014674 4029604
6081 4029604 4167323 4330999 4412045 4542764 4689358 4855414 5126321 5354203 5551678 5735856
6071 5735856 5819156 5788615 5660074 5539241 5497251 5442862 5422225 5326457 5209314 5184092 5278607
6060 5278607 5411678 5460479 5541449 5691632 5842562 5883982 6001339 6132524 6252843 6427082
6050 6427082 6604468 6725070 6872786 7054363 7239149 7416623 7610180 7803331 7981398 8163563
6040 8163563 8386624 8611774 8886719 9146871 9429685 9630258 9964154 10261391 10603808 10949843
6030 10949843 11268150 11732907 12297636 12805942 13408669 14047658 14626947 15235991 15856223
$$ packed form
6104C254969M0450n884k2084r850l8995L6389M4524P5582o4594O1057K4218K2527
6092C418309K3102N7828R1598Q6788L4324L3360L976L2061J12528J20800J4930
6081D029604J37719J63676Q1046J30719J46594J66056K70907K27882J97475J84178
6071E735856Q3300l0541j28541j20833m1990n4389k0637r5768j17143k5222R4515
6060E278607J33071M8801Q0970J50183J50930M1420J17357J31185J20319J74239
6050F427082J77386J20602J47716J81577J84786J77474J93557J93151J78067J82165
6040H163563K23061K25150K74945K60152K82814K00573L33896K97237L42417L46035
6030A0949843L18307M64757N64729N08306O02727O38989N79289O09044O20232
$$ plain form
6021 15856223 16550413 17480711 18476167 19555420 20771162 22132222 23698757 25478545 27534769
6012 27534769 29946669 32679278 35892394 39726072 44193848 49848796 56921221 65787733
6004 65787733 77444732 92543515 111410258 133400845 156435947 176600172 190063386
5997 190063386 195991669 194700615 187568707 178407904 171001027 167794236 169599808 176270785
5989 176270785 186018954 194813827 198515349 195326410 185052312 168356326 148548557 128299758
5981 128299758 109301447 92250691 77421203 65476128 56439931 49722263 44568950
5974 44568950 40596652 37453982 35049379 33190487 31774813 30860207 30398727 30435689 30779061
5965 30779061 31551546 32351701 32601480 32365229 31614211 30355107 28902099 27587313 26710058
$$ packed form
6021A5856223O94190R30298R95456J079253J215742J361060J566535J779788K056224
6012B7534769K411900K732609L213116L833678M467776N654948P072425Q866512
6004F5787733J1656999J5098783J8866743K1990587K3035102K0164225J3463214
5997A90063386N928283j291054p131908r160803p406877l206791J805572O670977
5989A76270785R748169Q794873L701522l188939j0274098j6695986j9807769k0248799
5981A28299758j8998311j7050756j4829488j1945075r036197o717668n153313
5974D4568950l972298l142670k404603j858892j415674r14606m61480L6962L43372
5965C0779061P72485Q00155K49779k36251p51018j259104j453008j314786q77255
$$ plain form
5956 26710058 26254335 26275564 26769899 27520127 28089931 28051685 27529689 26400286 24864270
5947 24864270 23295449 21894470 20727077 19800964 19109220 18900958 19026371 19566651 20537738
5938 20537738 21890438 23333798 24365279 24765420 24727525 24075002 23060371 22199644 21548138
5929 21548138 21219729 21243536 21697164 22481507 23163891 23382396 23117285 22179941 20708633
5920 20708633 19083189 17627933 16222547 14983875 13876870 12932443 12247648 11750550 11309520
5911 11309520 11043661 10850409 10563164 10290087 10147657 9947963 9774101 9663631 9528756
5902 9528756 9422437 9331067 9339385 9292793 9218794 9198414 9122266 9082408 9199668 9342378 9393651
5891 9393651 9315286 9298598 9345033 9416188 9521905 9657201 9720226 9768101 9909515 9991457 10057942
$$ packed form
5956B6710058m55723K1229M94335P50228N69804l8246n21996j129403j536016
5947B4864270j568821j400979j167393r26113o91744k08262J25413N40280R71087
5938B0537738J352700J443360J031481M00141l7895o52523j014631q60727o51506
5929B1548138l28409K3807M53628P84343O82384K18505k65111r37344j471308
5920B0708633j625444j455256j405386j238672j107005r44427o84795m97098m41030
5911A1309520k65859j93252k87245k73077j42430j99694j73862j10470j34875
5902I528756j06319r1370Q318m6592p3999k0380p6148l9858J17260J42710N1273
5891I393651p8365j6688M6435P1155J05717J35296O3025M7875J41414Q1942O6485
$$ plain form
5880 10057942 10064550 10095333 10132431 10110036 10106239 10127051 10200312 10346027 10398069 10455651 10495518
5869 10495518 10574994 10744524 10849162 10855298 10944290 11076310 11180189 11371181 11589843 11834902
5859 11834902 12022753 12200097 12488042 12814979 13077350 13374026 13656899 13996035 14345577
5850 14345577 14595565 14919596 15343510 15748606 16192865 16774085 17468307 18286311 19146729
5841 19146729 20034081 20868019 21590425 22238152 22739789 23140928 23489544 23864673 24197687
5832 24197687 24660939 25230606 25967548 26813754 27868191 29239560 30937949 33073968 35251165
5823 35251165 37338216 39280068 40748588 41896291 42678843 43159206 43737572 44427497 45367954
5814 45367954 46707722 48634596 51049888 53945927 57326952 61435187 66285411 72273646
$$ packed form
5880A0057942O608L0783L7098k2395l797K0812P3261J45715N2042N7582L9867
5869A0495518P9476J69530J04638O136Q8992J32020J03879J90992K18662K45059
5859A1834902J87851J77344K87945L26937K62371K96676K82873L39136L49542
5850A4345577K49988L24031M23914M05096M44259N81220O94222Q18004Q60418
5841A9146729Q87352Q33938P22406O47727N01637M01139L48616L75129L33014
5832B4197687M63252N69667P36942Q46206J054437J371369J698389K136019K177197
5823C5251165K087051J941852J468520J147703P82552M80363N78366O89925R40457
5814D5367954J339768J926874K415292K896039L381025M108235M850224N988235
$$ plain form
5806 72273646 79517007 88569312 99793127 114026400 132770522 158209011 191298324
5799 191298324 233416570 285944698 344241661 396801092 445158851 490632480 516228549
5792 516228549 520956948 518565759 506843423 481201650 445127733 403928099 361858500
5785 361858500 313858130 264507220 221687728 186627787 157566819 132617565 112538815
5778 112538815 97576434 86668560 78430558 72004481 66856481 62667471 59227609 56253401
5770 56253401 53794268 51560461 49608226 47946809 46574324 45411441 44448321 43700185
5762 43700185 43140322 42933665 42935166 43290595 44093021 45293214 46917793 49085914 51882861
5753 51882861 55401782 60039923 66080738 74084234 85308286 101408853 123220331 151028802
$$ packed form
5806G2273646P243361R052305J1223815J4233273J8744122K5438489L3089313
5799A91298324M2118246N2528128N8296963N2559431M8357759M5473629K5596069
5792E16228549M728399k391189j1722336k5641773l6073917m1199634m2069599
5785C61858500m8000370m9350910m2819492l5059941k9060968k4949254k0078750
5778A12538815j4962381j0907874q238002o426077n148000m189010l439862k974208
5770E6253401k459133k233807j952235j661417j372485j162883r63120p48136
5762D3700185n59863k06657J501L55429Q02426J200193J624579K168121K796947
5753E1882861L518921M638141O040815Q003496J1224052J6100567K1811478K7808471
$$ plain form
5745 151028802 184957163 218360581 239039368 249192010 252446817 242940337 226956525
5738 226956525 206764435 185432046 163034192 136889299 113361979 94854176 80643634
5731 80643634 68850483 58677279 50887856 45186825 40987677 37690570 35030096 32826894
5723 32826894 30982054 29473416 28235538 27126049 26058039 25084109 24165671 23430954 22811485
5714 22811485 22325087 21846531 21305593 20724759 20041757 19225175 18439000 17759987 17176039
5705 17176039 16610147 16149220 15790698 15554446 15437704 15499816 15716641 16126702 16695601 17113197
5695 17113197 17102904 16845436 16299497 15294779 14322440 13416242 12661192 11957233 11268665
5686 11268665 10734975 10298301 9932528 9629045 9415026 9138244 8869033 8652978 8492671
$$ packed form
5745A51028802L3928361L3403418K0678787J0152642L254807r506480j5983812
5738B26956525k0192090k1332389k2397854k6144893k3527320j8507803j4210542
5731H0643634j1793151j0173204p789423n701031m199148l297107k660474k203202
5723C2826894j844840j508638j237878j109489j068010r73930r18438p34717o19469
5714B2811485m86398m78556n40938n80834o83002q16582p86175o79013n83948
5705A7176039n65892m60927l58522k36252j16742O2112K16825M10061N68899M17596
5695A7113197j0293k57468n45939j004718r72339r06198p55050p03959o88568
5686A1268665n33690m36674l65773l03483k14019k76782k69211k16055j60307
$$ plain form
5677 8492671 8271520 8218075 8218547 8173777 8078086 8023396 7995112 7918440 7741570 7634392 7426717
5666 7426717 7269244 7117933 6948630 6827315 6729881 6672437 6646948 6543485 6367811 6222612
5656 6222612 6142446 6009724 5924227 5888864 5827171 5734175 5587033 5449133 5371799 5327270 5210883
5645 5210883 5100972 4960814 4852425 4721933 4526731 4362049 4239929 4202820 4151467 4029666
5635 4029666 3880854 3703846 3625798 3632927 3549891 3386076 3290639 3217044 3175035 3137048 3166494
5624 3166494 3111001 3131004 3184455 3186218 3220018 3197642 3150524 3135207 3092476 3035088 3032210 3000545
5612 3000545 2887685 2923853 2874263 2792722 2711427 2699581 2693866 2681488 2705602 2790940 2845757
5601 2845757 2939964 3069478 3228603 3504891 3715776 3764370 3683116 3519932 3271189 3007055
$$ packed form
5677H492671k21151n3445M72m4770r5691n4690k8284p6672j76870j07178k07675
5666G426717j57473j51311j69303j21315r7434n7444k5489j03463j75674j45199
5656F222612q0166j32722q5497l5363o1693r2996j47142j37900p7334m4529j16387
5645E210883j09911j40158j08389j30492j95202j64682j22120l7109n1353j21801
5635D029666j48812j77008p8048P129q3036j63815r5437p3595m2009l7987K9446
5624C166494n5493K0003N3451J763L3800k2376m7118j5317m2731n7388k878l1665
5612C000545j12860L6168m9590q1541q1295j1846n715j2378K4114Q5338N4817
5601B845757R4207J29514J59125K76288K10885M8594q1254j63184k48743k64134
$$ plain form
5591 3007055 2813202 2623993 2475158 2375955 2241447 2176680 2121961 2103060 2010562 1988034 1957488
5580 1957488 1900619 1827500 1813838 1846738 1829641 1840960 1795186 1753072 1733577 1765087 1732454
5569 1732454 1688272 1665591 1608872 1557388 1470175 1414281 1400749 1406594 1344250 1303949 1374469 1355779
5557 1355779 1294582 1344672 1359359 1350350 1276060 1209745 1176796 1204561 1204973 1153331 1198763 1133817
5545 1133817 1153711 1204480 1148989 1175377 1095903 1092144 1000322 981579 986310 918739 930289 884595
5533 884595 921317 912650 827912 861109 812840 871826 899850 840430 834794 803845 829635 774702
5521 774702 785011 829607 796496 741805 766266 732777 815391 759954 724284 781941 801795 794438
5509 794438 794577 743579 741620 741774 762354 884349 893539 871348 890686 851003 808959 783368 687342
$$ packed form
5591C007055j93853j89209j48835r9203j34508o4767n4719j8901r2498k2528l0546
5580A957488n6869p3119j3662L2900j7097J1319m5774m2114j9495L1510l2633
5569A732454m4182k2681n6719n1484q7213n5894j3532N845o2344m0301P0520j8690
5557A355779o1197N0090J4687r009p4290o6315l2949K7765M12n1642M5432o4946
5545A133817J9894N0769n5491K6388p9474l759r1822j8743M731o7571J1550m5694
5533H84595L6722q667q4738L3197m8269N8986K8024n9420n636l0949K5790n4933
5521G74702J0309M4596l3111n4691K4461l3489Q2614n5437l5670N7657J9854p357
5509G94438J39n0998j959J54K0580J21995R190k2191J9338l9683m2044k5591r6026
$$ plain form
5496 687342 707915 739757 812924 754321 681725 652554 694831 727143 700420 668603 690737 696627
5484 696627 687419 722680 791688 840371 846592 842289 807703 780872 778442 818567 826170 807482 921133
5471 921133 938861 941204 973188 1139632 1166792 1236676 1384903 1555061 1783800 2076743 2400673
5460 2400673 2675540 3011602 3228240 3251894 3153713 3122567 2954547 2847530 2671800 2481057
5450 2481057 2308351 2093321 1885918 1698021 1453349 1282666 1193550 1076306 1016202 978283
5440 978283 844163 843150 766760 719910 743118 748261 703442 702138 702311 656185 647124 686106 690944
5427 690944 705630 740063 736202 760932 738649 789487 730193 704809 809270 857646 890032 953080
5415 953080 982040 1052899 1143566 1276220 1474331 1651894 1847899 1877491 1894359 1872251 1813826
$$ packed form
5496F87342K0573L1842P3167n8603p2596k9171M2277L2312k6723l1817K2134N890
5484F96627r208L5261O9008M8683O221m303l4586k6831k430M0125P603j8688J13651
5471I21133J7728K343L1984J66444K7160O9884J48227J70158K28739K92943L23930
5460B400673K74867L36062K16638K3654r8181l1146j68020j07017j75730j90743
5450B481057j72706k15030k07403j87897k44672j70683q9116j17244o0104l7919
5440I78283j34120j013p6390m6850K3208N143m4819j304J73m6126r061L8982M838
5427F90944J4686L4433l861K4730k2283N0838n9294k5384J04461M8376L2386O3048
5415I53080K8960P0859R0667J32654J98111J77563J96005K9592J6868k2108n8425
$$ plain form
5404 1813826 1716313 1565438 1469901 1327926 1193672 1120488 1079351 1036215 963288 956204 1030973
5393 1030973 1105048 1128472 1218652 1369896 1456383 1424151 1365768 1353648 1348152 1324023 1286465
5382 1286465 1253699 1239546 1278704 1207149 1225669 1289580 1299884 1170775 1136063 1151602 1113432
5371 1113432 1113169 1055101 1047306 1061113 1108049 1104624 1136638 1214488 1270803 1360719 1378175 1491076
5359 1491076 1642308 1691450 1896462 2098589 2216587 2341756 2365885 2365269 2324055 2274578 2221417
5348 2221417 2206568 2238926 2394366 2484639 2581799 2733232 2732063 2725666 2638922 2524330 2416745
5337 2416745 2294871 2175129 2004215 1960021 1834598 1818971 1804630 1740506 1657932 1685384 1714005
5326 1714005 1526515 1440190 1437077 1363003 1268982 1267328 1282509 1229338 1156665 1187149 1187899 1184386
$$ packed form
5404A813826r7513j50875r5537j41975j34254p3184m1137m3136p2927p084P4769
5393A030973P4075K3424R0180J51244Q6487l2232n8383j2120n496k4129l7558
5382A286465l2766j4153L9158p1555J8520O3911J0304j29109l4712J5539l8170
5371A113432k63n8068p795J3807M6936l425L2014P7850N6315Q9916J7456J12901
5359A491076J51232M9142K05012K02127J17998J25169K4129o16m1214m9477n3161
5348B221417j4849L2358J55440R0273R7160J51433j169o397q6744j14592j07585
5337B416745j21874j19742j70914m4194j25423j5627j4341o4124q2574K7452K8621
5326A714005j87490q6325l113p4074r4021j654J5181n3171p2673L0484P50l513
$$ plain form
5314 1184386 1185880 1245474 1272096 1221897 1236341 1278360 1186659 1108246 1112167 991082 982003 985889
5302 985889 1014779 1105251 1086816 1071249 1066420 1004889 1029050 1031905 977346 836915 779089 847932
5290 847932 804707 688610 666387 721144 693247 661398 621712 599084 585462 530790 517269
5279 517269 497101 442562 485578 496253 478171 451444 509963 538527 552163 552635 524266 452929
5267 452929 455882 417191 452165 493299 480531 482721 528120 492867 478175 472793 516213 519015
5255 519015 540608 595940 478754 466794 464177 429925 455061 473715 538984 512021 479406 536327
5243 536327 571856 565684 595151 619222 630350 673516 657148 639358 575463 564836 545816 572691
5231 572691 545854 566102 593546 565685 629392 613418 530256 519285 518242 572204 544668 518433
$$ packed form
5314A184386J494N9594K6622n0199J4444M2019r1701p8413L921j21085r079L886
5302I85889K8890R0472j8435j5567m829o1531K4161K855n4559j40431n7826O8843
5290H47932m3225j16097k2223N4757k7897l1849l9686k2628j3622n4672j3521
5279E17269k0168n4539M3016J0675j8082k6727N8519K8564J3636M72k8369p1337
5267D52929K953l8691L4974M1134j2768K190M5399l5253j4692n382M3420K802
5255E19015K1593N5332j17186j1960k617l4252K5136J8654O5269k6963l2615N6921
5243E36327L5529o172K9467K4071J1128M3166j6368j7790o3895j0627j9020K6875
5231E72691k6837K0248K7444k7861O3707j5974q3162j0971j043N3962k7536k6235
$$ plain form
5219 518433 536689 533518 540094 537124 493787 454993 482010 480835 402453 406134 434219 442783 462116
5206 462116 457686 467529 510418 488044 432236 443788 470029 454610 440817 443746 479096 489688
5194 489688 437247 370327 390499 448276 449642 489550 431348 462636 530394 527345 482844 514823
5182 514823 578974 531560 520862 492627 456632 482163 510207 559418 523137 538299 567270 593936
5170 593936 552254 545894 501382 486101 550377 544729 601482 615027 601371 583846 610084 564975
5158 564975 626894 590317 576593 606527 584640 585291 606146 617837 581025 620804 658973 674689
5146 674689 635935 637944 633312 602433 641460 701881 682515 649427 631044 677756 721336 741626
5134 741626 717989 720751 794060 797727 767100 801617 833332 761879 785102 730931 770990 783929
$$ packed form
5219E18433J8256l171O576k970m3337l8794K7017j175p8382L681K8085Q564J9333
5206D62116m430R843M2889k2374n5808J1552K6241j5419j3793K929L5350J0592
5194D89688n2441o6920K0172N7777J366L9908n8202L1288O7758l049m4501L1979
5182E14823O4151m7414j0698k8235l5995K5531K8044M9211l6281J5162K8971K6666
5170E93936m1682o360m4512j5281O4276n648N6753J3545j3656j7525K6238m5109
5158E64975O1919l6577j3724K9934k1887O51K0855J1691l6812L9779L8169J5716
5146F74689l8754K009m632l0879L9027O0421j9366l3088j8383M6712M3580K0290
5134G41626k3637K762P3309L667l0627L4517L1715p1453K3223n4171M0059J2939
$$ plain form
5122 783929 815621 831976 856974 983660 987042 1018776 953769 1018089 1056716 1092311 1127569 1117656
5110 1117656 1120214 1053695 1128711 1156132 1151818 1089853 1129374 1123796 1152569 1211705 1233275 1220532
5098 1220532 1198442 1237490 1241977 1190763 1140848 1171893 1212920 1178612 1211067 1232987 1244889 1224198
5086 1224198 1305048 1325316 1279913 1296466 1312165 1363799 1352837 1354229 1407104 1455473 1433781 1459703
5074 1459703 1472093 1513418 1520254 1492909 1455665 1488363 1520436 1602214 1612649 1670685 1672437 1696145
5062 1696145 1780549 1804595 1783903 1771081 1734795 1780786 1847594 1879964 1865043 1816972 1825807 1898756
5050 1898756 1923736 1904214 1875322 1891263 1887053 1854169 1920550 1924058 1947065 2013345 2018676 2062374
5038 2062374 2136528 2232240 2226972 2214267 2236690 2323542 2371155 2374547 2355265 2381207 2429462 2444117
$$ packed form
5122G83929L1692J6355K4998J26686L382L1734o5007O4320L8627L5595L5258r913
5110A117656K558o6519P5016K7421m314o1965L9521n578K8773N9136K1570j2743
5098A220532k2090L9048M487n1214m9915L1045M1027l4308L2455K1920J1902k0691
5086A224198Q0850K0268m5403J6553J5699N1634j0962J392N2875M8369k1692K5922
5074A459703J2390M1325O836k7345l7244L2698L2073Q1778J0435N8036J752K3708
5062A696145Q4404K4046k0692j2822l6286M5991O6808L2370j4921m8071Q835P2949
5050A898756K4980j9522k8892J5941m210l2884O6381L508K3007O6280N331M3698
5038B062374P4154R5712n268j2705K2423Q6852M7613L392j9282K5942M8255J4655
$$ plain form
5026 2444117 2500524 2532746 2549097 2639205 2676209 2627320 2566699 2584908 2553254 2427270 2406565
5015 2406565 2433520 2396868 2378492 2443811 2550053 2558387 2552092 2554465 2590416 2716891 2690097 2590881
5003 2590881 2563009 2586348 2584304 2591500 2617715 2655152 2635892 2608351 2572713 2578029 2525042 2564993
4991 2564993 2589959 2616669 2556722 2505951 2486650 2470160 2467579 2482941 2399864 2330441 2388402 2359537
4979 2359537 2382845 2400621 2382012 2427723 2480024 2501613 2441291 2452401 2475019 2520495 2533955
4968 2533955 2450444 2456001 2568331 2569048 2605015 2666698 2637893 2641238 2685806 2715221 2692787 2684282
4956 2684282 2735439 2732342 2729502 2701083 2718073 2844284 2826298 2793994 2850797 2939619 2963136 2900015
4944 2900015 2823403 2849860 2851537 2807049 2903488 2912510 2944296 2949986 2841638 2862376 2963053 3021945
$$ packed form
5026B444117N6407L2222J6351R0108L7004m8889o0621J8209l1654j25984k0705
5015B406565K6955l6652j8376O5319J06242Q334o295K373L5951J26475k6794r9216
5003B590881k7872K3339k044P196K6215L7437j9260k7541l5638N316n2987L9951
4991B564993K4966K6710n9947n0771j9301j6490k581J5362q3077o9423N7961k8865
4979B359537K3308J7776j8609M5711N2301K1589o0322J1110K2618M5476J3460
4968B533955q3511N557J12330P17L5967O1683k8805L345M4568K9415k2434q505
4956B684282N1157l097k840k8419J6990J26211j7986l2304N6803Q8822K3517o3121
4944B900015p6612K6457J677m4488R6439R022L1786N690j08348K0738J00677N8892
$$ plain form
4932 3021945 3073470 3110442 3182675 3263703 3297460 3353815 3402068 3409246 3382888 3433078 3562308
4921 3562308 3577706 3591948 3683269 3745887 3822594 3882370 3932560 3972764 3948513 3982257 4078643
4910 4078643 4152522 4164634 4141179 4199088 4354126 4447281 4495037 4591575 4664559 4711986 4761956
4899 4761956 4825349 4909941 4959209 4985981 5101852 5102780 5137959 5195730 5265613 5357102 5419627 5390829
4887 5390829 5416865 5432908 5429633 5498419 5514682 5580242 5685413 5767969 5820619 5923677 6060908
4876 6060908 6116463 6195061 6237182 6364993 6485622 6585909 6669821 6864602 6923818 6957483 7079382
4865 7079382 7189279 7288752 7436883 7567998 7744729 7887504 7987729 8133824 8295060 8522748
4855 8522748 8602793 8806753 9046299 9238944 9403129 9595274 9818377 10131462 10340657 10586366
$$ packed form
4932C021945N1525L6972P2233Q1028L3757N6355M8253P178k6358N0190J29230
4921C562308J5398J4242R1321O2618P6707N9776N0190M0204k4251L3744R6386
4910D078643P3879J2112k3455N7909J55038R3155M7756R6538P2984M7427M9970
4899D761956O3393Q4592M9268K6772J15871R28L5179N7771O9883R1489O2525k8798
4887E390829K6036J6043l275O8786J6263O5560J05171Q2556N2650J03058J37231
4876F060908N5555P8598M2121J27811J20629J00287Q3912J94781N9216L3665J21899
4865G079382J09897R9473J48131J31115J76731J42775J00225J46095J61236K27688
4855H522748Q0045K03960K39546J92645J64185J92145K23103L13085K09195K45709
$$ plain form
4845 10586366 10826337 11068236 11398294 11621518 11913659 12218985 12568980 12817902 13188710
4836 13188710 13672067 14148160 14683750 15208405 15653620 16160506 16756003 17383147 18078952
4827 18078952 18708084 19464697 20329672 21238273 22266417 23432724 24594522 25736444 26906496
4818 26906496 28010806 29049265 30129458 31154029 32238172 33310520 34393494 35684596
4810 35684596 37002432 38438338 40012360 41605614 43242248 44926815 46652268 48439153
4802 48439153 50267498 52175890 54143705 56251886 58505917 60923167 63546278 66245373
4794 66245373 69053330 71747072 74211669 76360419 78262271 79977564 81373267 82688038
4786 82688038 83927576 85090047 86299991 87413640 88566736 89861565 91461680 93498371
$$ packed form
4845A0586366K39971K41899L30058K23224K92141L05326L49995K48922L70808
4836A3188710M83357M76093N35590N24655M45215N06886N95497O27144O95805
4827A8078952O29132P56613Q64975R08601J028144J166307J161798J141922J170052
4818B6906496J104310J038459J080193J024571J084143J072348J082974J291102
4810C5684596J317836J435906J574022J593254J636634J684567J725453J786885
4802D8439153J828345J908392J967815K108181K254031K417250K623111K699095
4794F6245373K807957K693742K464597K148750J901852J715293J395703J314771
4786H2688038J239538J162471J209944J113649J153096J294829J600115K036691
$$ plain form
4778 93498371 95889511 98556375 101255164 103766355 106027184 107996294 109805458 111541925
4770 111541925 113370567 115224110 117029714 118522778 119593943 120088613 120013005 119477925 118461137
4761 118461137 117089269 115423747 113470065 111533960 109548560 107681022 106012440 104571091
4753 104571091 103543500 103016276 102962823 103329058 103982877 104698133 105436776 105999601 106398254
4744 106398254 106566068 106656783 106482842 105990695 105181146 104023246 102524582 100825665 99248474
4735 99248474 97805476 96650106 95652607 94717922 93957417 93277508 92739445 92327814 92133114
4726 92133114 92319131 92790386 93410505 94045173 94641755 95313064 95854529 96241330 96523385
4717 96523385 96717345 96849898 97003523 97186886 97396613 97823809 98296610 98769087 99116464
$$ packed form
4778I3498371K391140K666864K698789K511191K260829J969110J809164J736467
4770A11541925J828642J853543J805604J493064J071165M94670p5608n35080j016788
4761A18461137j371868j665522j953682j936105j985400j867538j668582j441349
4753A04571091j027591n27224n3453L66235O53819P15256P38643N62825L98653
4744A06398254J67814R0715j73941m92147q09549j157900j498664j698917j577191
4735I9248474j442998j155370r97499r34685p60505o79909n38063m11631j94700
4726I2133114J86017M71255O20119O34668N96582O71309N41465L86801K82055
4717I6523385J93960J32553J53625J83363K09727M27196M72801M72477L47377
$$ plain form
4708 99116464 99298152 99387917 99434995 99546233 99783158 100268903 100842395 101326427 101671787 101822020
4698 101822020 101706334 101302099 100658728 99778314 98741786 97344219 95665016 93870133 91804499
4689 91804499 89568683 87256772 84934424 82738766 80704297 78997865 77647327 76344784
4681 76344784 75155769 73841688 72447583 70916810 69272889 67532520 65755279 63897930
4673 63897930 62154647 60467245 58790387 57296249 55933521 54579551 53217464 51775127
4665 51775127 50311102 48846892 47241672 45634219 44105609 42595948 41240482 40100597
4657 40100597 39100886 38141759 37130687 36183379 35173058 34229764 33275266 32324038 31439805
4648 31439805 30625435 29922948 29153850 28419919 27753508 27210475 26734964 26265430 25946824
$$ packed form
4708I9116464J81688Q9765M7078J11238K36925M85745N73492M84032L45360J50233
4698A01822020j15686m04235o43371q80414j036528j397567j679203j794883k065634
4689I1804499k235816k311911k322348k195658k034469j706432j350538j302543
4681G6344784j189015j314081j394105j530773j643921j740369j777241j857349
4673F3897930j743283j687402j676858j494138j362728j353970j362087j442337
4665E1775127j464025j464210j605220j607453j528610j509661j355466j139885
4657D0100597r99711r59127j011072r47308j010321r43294r54498r51228q84233
4648C1439805q14370p02487p69098p33931o66411n43033m75511m69534l18606
$$ plain form
4639 25946824 25835766 25830152 25888400 26049646 26153865 26211056 26213319 26338683 26441128 26586664
4629 26586664 26763436 27003588 27207517 27280954 27211474 27089691 26978129 26718126 26486138 26190878
4619 26190878 25827255 25405739 24976096 24505122 23975559 23531523 23161465 22915209 22844057 22990314
4609 22990314 23262064 23625352 23997695 24374286 24839294 25355060 26083669 26896478 27708546
4600 27708546 28629977 29565579 30425882 31098721 31737820 32342385 32939127 33530116 34071327
4591 34071327 34519550 34884140 35082815 35087346 34942658 34621089 34385589 34235962 34428565 34981588
4581 34981588 35913504 37065839 38214368 39263998 40112185 40711567 41182147 41542399 42040289
4572 42040289 42693990 43275646 43744525 43995461 43973576 43622014 43169038 42687519 42057131 41340023
$$ packed form
4639B5946824j11058n614N8248J61246J04219N7191K263J25364J02445J45536
4629B6586664J76772K40152K03929P3437o9480j21783j11562k60003k31988k95260
4619B6190878l63623m21516m29643m70974n29563m44036l70058k46256p1152J46257
4609B2990314K71750L63288L72343L76591M65008N15766P28609Q12809Q12068
4600B7708546R21431R35602Q60303O72839O39099O04565N96742N90989N41211
4591C4071327M48223L64590J98675M531j44688l21569k35500j49627J92603N53023
4581C4981588R31916J152335J148529J049630Q48187N99382M70580L60252M97890
4572D2040289O53701N81656M68879K50936k1885l51562m52976m81519o30388p17108
$$ plain form
4562 41340023 40564149 39491550 38201380 36750927 35143146 33388859 31808585 30451358
4554 30451358 29463519 28665953 28021325 27710743 27527049 27444498 27487995 27620815 27731127 27858596
4544 27858596 27985009 28047498 28020993 27810056 27427610 26940029 26281434 25558912 24755762 23781022
4534 23781022 22714460 21405652 20068555 18867639 17680989 16496377 15411034 14562199
4526 14562199 13858738 13153093 12558371 12067577 11594198 11215207 10921344 10658598 10424890
4517 10424890 10221536 10079935 9984055 9810508 9601374 9523858 9414884 9318031 9196270 9144479
4507 9144479 9097574 9012158 9005361 9032313 9112297 9077912 9083924 9095804 9117718 9257748 9322923 9383747
4495 9383747 9470603 9535364 9598729 9707931 9798588 9917563 10056209 10173510 10385365 10704813
$$ packed form
4562D1340023p75874j072599j290170j450453j607781j754287j580274j357227
4554C0451358r87839p97566o44628l10582j83694q2551M3497J32820J10312J27469
4544B7858596J26413O2489k6505k10937l82446m87581o58595p22522q03150r74740
4534B3781022j066562j308808j337097j200916j186650j184612j085343q48835
4526A4562199p03461p05645n94722m90794m73379l78991k93863k62746k33708
4517A0424890k03354j41601r5880j73547k09134p7516j08974r6853j21761n1791
4507I144479m6905q5416o797K6952P9984l4385O012J1880K1914J40030O5175O0824
4495I383747Q6856O4761O3365J09202R0657J18975J38646J17301K11855L19448
$$ plain form
4485 10704813 11045192 11408486 11822746 12240561 12766473 13432774 14216749 15182787 16308356
4476 16308356 17766777 19715960 22202466 25469366 29678723 34807345 40704545 46728445
4468 46728445 52009612 55997002 58278388 59217483 59462781 59859961 61519134 65286333 71278827
4459 71278827 79284260 87790997 94507888 97515189 96979225 92713738 85673642 78064729
4451 78064729 71141558 65816321 62286179 60192547 59152114 58262317 56726235 53979449
4443 53979449 49788431 44801778 39540793 34368058 29687084 25605540 22249024 19562771
4435 19562771 17471053 15991456 14815388 13873384 13075561 12391661 11856343 11418088 11052653
4426 11052653 10709200 10414504 10222655 10067962 9918038 9756760 9584573 9412973 9307248
$$ packed form
4485A0704813L40379L63294M14260M17815N25912O66301P83975R66038J125569
4476A6308356J458421J949183K486506L266900M209357N128622N897200O023900
4468D6728445N281167L987390K281386R39095K45298L97180J659173L767199N992494
4459G1278827Q005433Q506737O716891L007301n35964m265487p040096p608913
4451G8064729o923171n325237l530142k093632j040433q89797j536082k746786
4443E3979449m191018m986653n260985n172735m680974m081544l356516k686253
4435A9562771k091718j479597j176068r42004p97823o83900n35318m38255l65435
4426A1052653l43453k94696j91849j54693j49924j61278j72187j71600j05725
$$ plain form
4417 9307248 9084624 9005175 8962914 8916772 8819824 8857109 8964308 9043495 9263516 9675569 10124196
4406 10124196 10757167 11502560 12343839 13004006 13312483 13429914 13225588 12883877 12611542
4397 12611542 12502426 12863576 13534867 14543098 15966584 17225132 17634583 17589803 17065640
4388 17065640 15762019 14430287 13266426 12485137 11883760 11514630 11472011 11631855 11639778
4379 11639778 11391300 10949801 10228430 9385128 8539410 7859660 7258420 6769875 6421802
4370 6421802 6180941 5977766 5910366 5885612 5901791 6015152 6113581 6172035 6223023 6177898 5976313
4359 5976313 5720677 5489860 5379680 5120224 4999944 4853467 4630951 4533884 4469225 4404419
4349 4404419 4321441 4391302 4385208 4429699 4453478 4402572 4434798 4424862 4281460 4241285 4214852 4165209
$$ packed form
4417I307248k22624p9449m2261m6142r6948L7285J07199P9187K20021M12053M48627
4406A0124196O32971P45393Q41279O60167L08477J17431k04326l41711k72335
4397A2611542j09116L61150O71291J008231J423486J258548M09451m4780n24163
4388A7065640j303621j331732j163861p81289o01377l69130m2619J59844P923
4379A1639778k48478m41499p21371q43302q45718o79750o01240m88545l48073
4370F421802k40861k03175o7400k4754J6179J13361R8429N8454N0988m5125k01585
4359E976313k55636k30817j10180k59456j20280j46477k22516r7067o4659o4806
4349D404419q2978O9861o094M4491K3779n0906L2226r936j43402m0175k6433m9643
$$ plain form
4337 4165209 4044247 4003060 4035317 4068468 4137089 4142207 4199006 4253414 4289892 4291876 4332188 4363097
4325 4363097 4450639 4521457 4557797 4628431 4613621 4675215 4801528 4841392 4838211 4939611 4992616
4314 4992616 4988273 5070656 5095568 5098122 5026727 4911453 4808754 4829771 4786615 4703307 4577150
4303 4577150 4616104 4567422 4468875 4472642 4432112 4386261 4328656 4304169 4233434 4242461 4190287 4114276
4291 4114276 4162540 4154142 4153571 4103780 4064137 4049253 4042854 3965312 3858138 3781781 3695191 3630946
4279 3630946 3572117 3609492 3601693 3519613 3461594 3443817 3437082 3452653 3418418 3422128 3422005 3457477
4267 3457477 3435510 3397871 3388195 3386143 3450782 3541319 3518069 3555574 3651812 3656827 3673449 3685688
4255 3685688 3719055 3746947 3764688 3732196 3759915 3804755 3793281 3845985 3921992 3928633 3834781 3807812
$$ packed form
4337D165209j20962m1187L2257L3151O8621N118N6799N4408L6478J984M0312L0909
4325D363097Q7542P0818L6340P0634j4810O1594J26313L9864l181J01400N3005
4314D992616m343Q2383K4912K554p1395j15274j02699K1017m3156q3308j26157
4303D577150L8954m8682r8547L767m0530m5851n7605k4487p0735R027n2174p6011
4291D114276M8264q398n71m9791l9643j4884o399p7542j07174p6357q6590o4245
4279C630946n8829L7375p799q2080n8019j7777o735J5571l4235L710j23L5472
4267C457477k1967l7639r676k052O4639R0537k3250L7505R6238N015J6622J2239
4255C685688L3367K7892J7741l2492K7719M4840j1474N2704P6007O641r3852k6969
$$ plain form
4243 3807812 3842394 3856692 3867530 3917574 3924918 3849296 3846384 3808772 3848625 3847018 3837831 3810496
4231 3810496 3794821 3819190 3841726 3853336 3830717 3814142 3762529 3729867 3691927 3717506 3715139 3735347
4219 3735347 3713350 3670602 3634408 3612740 3612898 3607247 3582677 3540519 3574986 3678972 3639022 3645691
4207 3645691 3667389 3656171 3657000 3716549 3674800 3732232 3745102 3766342 3755430 3785540 3854077 3940833
4195 3940833 3996304 4007482 4111547 4211933 4334488 4492567 4661043 4806254 4945151 4982456
4185 4982456 5041272 5117109 5248856 5245667 5283890 5368860 5416967 5263991 5056573 4915390 4804417
4174 4804417 4668927 4547658 4492182 4606264 4627157 4726311 4809283 4914913 4966389 5053240 5179543
4163 5179543 5180125 5056879 4918630 4721054 4569886 4429229 4307207 4219564 4069285 3969676
$$ packed form
4243C807812L4582J4298J0838N0044P344p5622k912l7612L9853j607r187k7335
4231C810496j5675K4369K2536J1610k2619j6575n1613l2662l7940K5579k367K0208
4219C735347k1997m2748l6194k1668J58n651k4570m2158L4467J03986l9950O669
4207C645691K1698j1218Q29N9549m1749N7432J2870K1240j0912L0110O8537Q6756
4195C940833N5471J1178J04065J00386J22555J58079J68476J45211J38897L7305
4185D982456N8816P5837J31747l189L8223Q4970M8107j52976k07418j41183j10973
4174D804417j35490j21269n5476J14082K0893R9154Q2972J05630N1476Q6851J26303
4163E179543N82j23246j38249j97576j51168j40657j22022q7643j50279r9609
$$ plain form
4153 3969676 3907363 3871648 3921896 3854847 3818730 3841682 3839699 3849989 3832153 3762909 3725102 3811696
4141 3811696 3811160 3810569 3781475 3740010 3784933 3798857 3753260 3835677 3836705 3732930 3726328 3814605
4129 3814605 3827249 3924349 3988622 4048895 4089891 4109068 4183569 4272063 4302023 4418585 4484637
4118 4484637 4568147 4666472 4663315 4728373 4790566 4774626 4760388 4736078 4765944 4778012 4768415 4745956
4106 4745956 4776297 4781443 4810829 4823253 4822717 4810916 4830114 4847501 4873171 4918219 4925247 4927335
4094 4927335 5068411 5207155 5257793 5314983 5411664 5464163 5519139 5579876 5718229 5883144 5998371
4083 5998371 6102939 6250497 6398203 6487208 6491079 6549069 6644002 6714550 6839277 6968381 7029838
4072 7029838 7110076 7247894 7331858 7511643 7683829 7814118 7940150 8138362 8335171 8467949
$$ packed form
4153C969676o2313l5715N0248o7049l6117K2952j983J0290j7836o9244l7807Q6594
4141C811696n36n91k9094m1465M4923J3924m5597Q2417J028j03775o602Q8277
4129C814605J2644R7100O4273O0273M0996J9177P4501Q8494K9960J16562O6052
4118D484637Q3510R8325l157O5058O2193j5940j4238k4310K9866J2068r597k2459
4106D745956L0341N146K9386J2424n36j1801J9198J7387K5670M5048P028K088
4094D927335J41076J38744N0638N7190R6681N2499N4976O0737J38353J64915J15227
4083E998371J04568J47558J47706Q9005L871N7990R4933P0548J24727J29104O1457
4072G029838Q0238J37818Q3964J79785J72186J30289J26032J98212J96809J32778
$$ plain form
4062 8467949 8595353 8789932 8947427 9144032 9321209 9555744 9851313 10059021 10337911 10601348
4052 10601348 10820211 11083160 11388605 11704300 11982118 12305019 12594720 12993817 13414920
4043 13414920 13966318 14620418 15345768 16141316 17141611 18294403 19586158 21091248 22757766
4034 22757766 24582759 26597661 28479495 30027275 31174936 31733125 31679040 30909206 29662474
4025 29662474 28154231 26569808 24976616 23479021 22175124 21110919 20238947 19531903
4017 19531903 18976628 18612194 18335661 18201489 18182669 18284085 18429691 18667695 18989535 19325404
4007 19325404 19715113 20092633 20594225 21014945 21514865 22044848 22646148 23303391 23901979
3998 23901979 24492263 25115506 25626367 26224998 26856307 27502504 28204265 29097929 30063478
$$ packed form
4062H467949J27404J94579J57495J96605J77177K34535K95569K07708K78890K63437
4052A0601348K18863K62949L05445L15695K77818L22901K89701L99097M21103
4043A3414920N51398O54100P25350P95548J000295J152792J291755J505090J666518
4034B2757766J824993K014902J881834J547780J147661N58189n4085p69834j246732
4025B9662474j508243j584423j593192j497595j303897j064205q71972p07044
4017A9531903n55275l64434k76533j34172j8820J01416J45606K38004L21840L35869
4007A9325404L89709L77520N01592M20720M99920N29983O01300O57243N98588
3998B3901979N90284O23243N10861N98631O31309O46197P01761Q93664R65549
$$ plain form
3989 30063478 30950533 31881700 32716831 33450968 34123212 34904637 35742202 36581340 37502542
3980 37502542 38380354 39264368 40116051 41043651 42085962 43182029 44441737 45763194 47169624
3971 47169624 48628058 50070352 51588956 53153400 54944760 57025510 59342105 62065283
3963 62065283 64891458 67786628 70696700 73454509 76060356 78582909 81160382 83726890
3955 83726890 86419796 89274713 92080616 94905409 97831975 100788667 103818973 106994481
3947 106994481 110352687 114081273 118110310 122668060 127862455 133645093 140015876 146889915
3939 146889915 153914121 160809215 167321172 172976647 177476161 180909276 183266144 184913116
3931 184913116 186140434 187463131 189317297 191841849 194907589 198376457 202059952 205828988
$$ packed form
3989C0063478Q87055R31167Q35131P34137O72244P81425Q37565Q39138R21202
3980C7502542Q77812Q84014Q51683R27600J042311J096067J259708J321457J406430
3971D7169624J458434J442294J518604J564444J791360K080750K316595K723178
3963F2065283K826175K895170K910072K757809K605847K522553K577473K566508
3955H3726890K692906K854917K805903K824793K926566K956692L030306L175508
3947A06994481L358206L728586M029037M557750N194395N782638O370783O874039
3939A46889915P024206O895094O511957N655475M499514L433115K356868J646972
3931A84913116J227318J322697J854166K524552L065740L468868L683495L769036
$$ plain form
3923 205828988 209410575 212617363 215350163 217455308 218972209 219894480 220352004 220662261
3915 220662261 220974081 221363121 221570456 221584069 221314228 220432779 218968738 216887477 214092937
3906 214092937 210443753 206238542 201713893 197155472 192550019 187948054 183704724 179691575
3898 179691575 175735543 172093423 168812730 165609265 162441511 159200303 155969375 152785090
3890 152785090 149537526 146339370 143101435 139896905 136701936 133264505 129321405 124793466
3882 124793466 119569197 113944555 108150758 102489287 97141161 92199489 87730318 83808246
3874 83808246 80361240 77329341 74629538 72223970 70017019 68027366 66339150 64747862
3866 64747862 63237053 61864783 60425710 59033883 57613602 56157019 54604933 52843664
$$ packed form
3923B05828988L581587L206788K732800K105145J516901R22271M57524L10257
3915B20662261L11820L89040K07335J3613k69841q81449j464041k081261k794540
3906B14092937l649184m205211m524649m558421m605453m601965m243330m013149
3898A79691575l956032l642120l280693l203465l167754l241208l230928l184285
3890A52785090l247564l198156l237935l204530l194969l437431l943100m527939
3882A24793466n224269n624642n793797n661471n348126m941672m469171l922072
3874H3808246l447006l031899k699803k405568k206951j989653j688216j591288
3866F4747862j510809j372270j439073j391827j420281j456583j552086j761269
$$ plain form
3858 52843664 51067837 49153802 47290248 45602009 44061194 42532386 41195802 39811339
3850 39811339 38290930 36754465 35337896 33852908 32504511 31333667 30241497 29378639
3842 29378639 28572175 27890925 27165133 26439988 25820324 25245812 24529800 23951674 23347578
3833 23347578 22718043 22002184 21305795 20631997 19922379 19311233 18681433 18076637 17575809
3824 17575809 17066104 16498849 16029681 15568840 15126798 14715200 14382787 13970944 13512300
3815 13512300 13094608 12709847 12279350 11883401 11565786 11236525 10873867 10511712 10229602
3806 10229602 10018577 9757226 9538267 9248602 9003472 8748216 8530172 8376206 8199409
3797 8199409 8053861 7870346 7770649 7676538 7571056 7425236 7285497 7134711 7004867 6827913
$$ packed form
3858E2843664j775827j914035j863554j688239j540815j528808j336584j384463
3850C9811339j520409j536465j416569j484988j348397j170844j092170q62858
3842B9378639q06464o81250p25792p25145o19664n74512p16012n78126o04096
3833B3347578o29535p15859o96389o73798p09618o11146o29800o04796n00828
3824A7575809n09705n67255m69168m60841m42042m11598l32413m11843m58644
3815A3512300m17692l84761m30497l95949l17615l29261l62658l62155k82110
3806A0229602k11025k61351k18959k89665k45130k55256k18044j53966j76797
3797H199409j45548j83515r9697r4111j05482j45820j39739j50786j29844j76954
$$ plain form
3787 6827913 6680574 6563665 6478602 6387000 6331103 6209100 6057874 5954976 5856346 5749968
3777 5749968 5647879 5611341 5536177 5442572 5350466 5226914 5137107 5040444 4949221 4910151 4895076
3766 4895076 4799833 4658168 4610903 4532311 4495774 4377186 4364401 4271597 4166703 4077182 4018150
3755 4018150 4047360 3957790 3856846 3779414 3731940 3725759 3623352 3576233 3501579 3421237 3347512
3744 3347512 3339559 3329154 3245594 3178263 3047774 3003828 3030676 3055101 2953347 2846695 2796198
3733 2796198 2759837 2705446 2695414 2737627 2691903 2591383 2528545 2473794 2451740 2348890 2362824
3722 2362824 2324095 2351871 2330046 2314726 2280286 2218187 2245608 2256477 2107094 2083764 2091186
3711 2091186 1995351 1966626 1971664 1954330 1885705 1893113 1937990 1857924 1841921 1838918 1822651 1820655
$$ packed form
3787F827913j47339j16909q5063r1602n5897j22003j51226j02898r8630j06378
3777E749968j02089l6538p5164r3605r2106j23552q9807r6663r1223l9070j5075
3766D895076r5243j41665m7265p8592l6537j18588j2785r2804j04894q9521n9032
3755D018150K9210q9570j00944p7432m7474o181j02407m7119p4654q0342p3725
3744C347512p953j0405q3560o7331j30489m3946K6848K4425j01754j06652n0497
3733B796198l6361n4391j0032M2213m5724j00520o2838n4751k2054j02850J3934
3722B362824l8729K7776k1825j5320l4440o2099K7421J0869j49383k3330P422
3711B091186r5835k8725N038j7334o8625P408M4877q0066j6003l003j6267j996
$$ plain form
3699 1820655 1801198 1727681 1721365 1774917 1698431 1664378 1651648 1715469 1729418 1650548 1532458
3688 1532458 1514179 1470118 1545205 1467260 1446818 1481776 1454730 1446754 1514371 1488590 1431338 1504207
3676 1504207 1587449 1576794 1566629 1579645 1553132 1562896 1540831 1539466 1502333 1488354 1450660 1442434
3664 1442434 1421884 1431307 1518613 1431094 1405503 1428135 1466914 1477512 1407009 1415736 1449771 1461086
3652 1461086 1464801 1556538 1517997 1563498 1610875 1584547 1628395 1670206 1749394 1661277 1552709
3641 1552709 1606022 1601861 1620150 1667500 1638772 1598849 1596580 1664819 1586450 1500114 1468366 1494790
3629 1494790 1496488 1478539 1492505 1519774 1541701 1533061 1438671 1476567 1486668 1480180 1505906 1516186
3617 1516186 1562150 1504024 1511715 1592463 1564907 1518811 1490396 1494952 1504682 1439905 1406952 1426544
$$ packed form
3699A820655j9457p3517o316N3552p6486l4053j2730O3821J3949p8870j18090
3688A532458j8279m4061P5087p7945k0442L4958k7046p976O7617k5781n7252P2869
3676A504207Q3242j0655j0165J3016k6513R764k2065j365l7133j3979l7694q226
3664A442434k0550R423Q7306q7519k5591K2632L8779J0598p0503Q727L4035J1315
3652A461086L715R1737l8541M5501M7377k6328M3848M1811P9188q8117j08568
3641A552709N3313m161J8289M7350k8728l9923k269O8239p8369q6336l1748K6424
3629A494790J698j7949J3966K7269K1927q640r4390L7896J0101o488K5726J0280
3617A516186M5964n8126P691Q0748k7556m6096k8415M556R730o4777l2953J9592
$$ plain form
3605 1426544 1453001 1475588 1429051 1378999 1424275 1419427 1443679 1363696 1356315 1373708 1389178 1356878
3593 1356878 1371132 1418317 1389235 1385291 1407746 1467940 1500245 1491649 1497551 1463940 1427810 1417509
3581 1417509 1383799 1432396 1405914 1391591 1450319 1388247 1365694 1406452 1390601 1369575 1401710
3570 1401710 1368554 1327180 1343565 1383430 1434943 1502707 1444030 1438398 1485342 1489716 1524303 1653395
3558 1653395 1694746 1760837 1846538 1868326 1999734 2070266 2109886 2125826 2111682 2079924 2076100
3547 2076100 2042350 2005079 2080335 2084393 2098444 2135844 2134946 2163494 2072655 2102972 2153629 2112234
3535 2112234 2065140 2113625 2276796 2332063 2412752 2434826 2487441 2623335 2710857 2755118 2856125
3524 2856125 3026112 3177396 3285480 3352569 3474608 3504854 3428164 3443778 3383993 3347613 3364888
$$ packed form
3605A426544K6457K2587m6537n0052M5276m848K4252p9983p381J7393J5470l2300
3593A356878J4254M7185k9082l944K2455O0194L2305q596N902l3611l6130j0301
3581A417509l3710M8597k6482j4323N8728o2072k2553M0758j5851k1026L2135
3570A401710l3156m1374J6385L9865N1513O7764n8677n632M6944M374L4587J29092
3558A653395M1351O6091Q5701K1788J31408P0532L9620J5940j4144l1758l824
3547B076100l3750l7271P5256M058J4051L7400q98K8548r0839L0317N0657m1395
3535B112234m7094M8485J63171N5267Q0689K2074N2615J35894Q7522M4261J01007
3524B856125J69987J51284J08084O7089J22039L0246p6690J5614n9785l6380J7275
$$ plain form
3513 3364888 3416651 3435150 3434700 3440159 3469879 3490569 3576817 3658607 3662355 3727766 3825215 3932746
3501 3932746 3974277 4115431 4190767 4244757 4368466 4493928 4592809 4651762 4687165 4851519 5087521
3490 5087521 5319192 5510303 5648565 5797566 5976629 6175821 6334388 6517976 6684828 6868626
3480 6868626 6930328 7068433 7301375 7407207 7607013 7877831 8214530 8633639 9191852 9742168
3470 9742168 10460749 11270551 12124863 13022042 13917754 14808145 15657343 16334772 16953523 17390254
3460 17390254 17610812 17636442 17496003 17178804 16775261 16337905 15812853 15238078 14684092 14019101
3450 14019101 13345310 12566397 11729639 10970004 10201121 9550526 8843767 8223617 7753859
3441 7753859 7245142 6677856 6308551 5892506 5503116 5184169 4785916 4430822 4193654 4006967
$$ packed form
3513C364888N1763J8499m50N459K9720K0690Q6248Q1790L748O5411R7449J07531
3501C932746M1531J41154P5336N3990J23709J25462R8881N8953L5403J64354K36002
3490E087521K31671J91111J38262J49001J79063J99192J58567J83588J66852J83798
3480F868626O1702J38105K32942J05832J99806K70818L36699M19109N58213N50316
3470I742168P18581Q09802Q54312Q97179Q95712Q90391Q49198O77429O18751M36731
3460A7390254K20558K5630j40439l17199m03543m37356n25052n74775n53986o64991
3450A4019101o73791p78913q36758p59635p68883o50595p06759o20150m69758
3441G753859n08717n67286l69305m16045l89390l18947l98253l55094k37168j86687
$$ plain form
3431 4006967 3844742 3626444 3380471 3185151 2987924 2875401 2760426 2737000 2670069 2501275
3421 2501275 2374095 2288285 2245873 2104101 2024460 1970324 1965528 1855032 1746722 1692919 1617340
3410 1617340 1560154 1523396 1460677 1446592 1385685 1325716 1237128 1151636 1182874 1149060 1211116
3399 1211116 1111057 1031485 988906 975346 956252 864350 863951 818138 847888 828624 808495 694350
3387 694350 618640 685374 640059 674653 646611 646115 594415 519829 493425 412655 457171 489640
3375 489640 463575 518304 498255 483378 444140 452550 468879 457854 429958 420239 398026 329995
3363 329995 312865 216114 326216 327518 318401 291992 257389 273899 306409 304357 279528 262629
3351 262629 279583 234534 291258 276881 221280 190093 193555 215190 141721 211321 239431 205400
$$ packed form
3431D006967j62225k18298k45973j95320j97227j12523j14975k3426o6931j68794
3421B501275j27180q5810m2412j41772p9641n4136m796j10496j08310n3803p5579
3410A617340n7186l6758o2719j4085o0907n9969q8588q5492L1238l3814O2056
3399A211116j00059p9572m2579j3560j9094r1902l99m5813K9750j9264k0129j14145
3387F94350p5710O6734m5315L4594k8042m96n1700p4586k6404q0770M4516L2469
3375D89640k6065N4729k0049j4877l9238Q410J6329j1025k7896r719k2213o8031
3363C29995j7130r6751J10102J302r117k6409l4603J6510L2510k052k4829j6899
3351B62629J6954m5049N6724j4377n5601l1187L462K1635p3469O9600K8110l4031
$$ plain form
3339 205400 233732 281585 265842 233885 167250 135947 159330 134722 163950 171765 152221 136541
3327 136541 114930 51341 31275 94475 165125 162567 145235 128600 97845 135054 98046 40478
3315 40478 72428 181208 126922 96273 107925 92008 110723 163419 136086 103276 69533 114834
3303 114834 116526 98332 105141 121230 88350 74427 81239 6744 1777 22275 110995 97092
3291 97092 59336 102887 123683 161383 75900 85124 113625 152636 102851 -8622 39763 35937
3279 35937 73471 70913 39672 67983 92123 105565 90994 84988 96898 46600 97482 79830
3267 79830 118664 138013 136607 169927 133580 158922 164818 60458 60931 69358 69783 14582 16335
3254 16335 117732 67995 36466 28470 92811 44123 60549 94318 108587 63429 128886 48925
$$ packed form
3339B05400K8332M7853j5743l1957o6635l1303K3383k4608K9228P815j9544j5680
3327A36541k1611o3589k0066O3200P0650k558j7332j6635l0755L7209l7008n7568
3315D0478L1950J08780n4286l0649J1652j5917J8715N2696k7333l2810l3743M5301
3303A14834J692j8194O809J6089l2880j3923O812p4495m967K0498Q8720j3903
3291I7092l7756M3551K0796L7700q5483R224K8501L9011m9785j11473M8385l826
3279C5937L7534k558l1241K8311K4140J3442j4571o006J1910n0298N0882j7652
3267G9830L8834J9349j406L3320l6347K5342N896j04360M73Q427M25n5201J753
3254A6335J01397m9737l1529p996O4341m8688J6426L3769J4269m5158O5457p9961
$$ plain form
3242 48925 59446 61588 62623 116432 77320 96239 139234 162005 149447 111721 135208 127110
3230 127110 90452 217160 160826 130164 187654 194563 251996 280005 256804 274511 380112
3219 380112 389835 313613 230698 219666 277197 246598 223003 234021 282268 307474 270287 296170
3207 296170 316767 296873 323974 362832 323493 376428 426685 374750 433657 441754 456721 470716
3195 470716 511420 498591 533959 589742 603506 668969 694754 662569 678676 680075 748904 739819
3183 739819 765010 726958 718642 746061 677493 704493 795860 847445 810326 822756 876452 887146
3171 887146 895398 910531 1003272 992509 1058677 1177145 1199546 1187766 1232900 1377577 1523576
3160 1523576 1666022 1726240 1899842 2002823 2104314 2332668 2457402 2596080 2825880 3001459
$$ packed form
3242D8925J0521K142J035N3809l9112J8919M2995K2771j2558l7726K3487q098
3230A27110l6658J26708n6334l0662N7490O909N7433K8009k3201J7707J05601
3219C80112R723p6222q2915j1032N7531l0599k3595J1018M8247K5206l7187K5883
3207B96170K0597j9894K7101L8858l9339N2935N0257n1935N8907Q097J4967J3995
3195D70716M0704j2829L5368N5783J3764O5463K5785l2185J6107J399O8829r085
3183G39819K5191l8052q316K7419o8568K7000R1367N1585l7119J2430N3696J0694
3171H87146Q252J5133R2741j0763O6168J18468K2401j1780M5134J44677J45999
3160A523576J42446O0218J73602J02981J01491K28354J24734J38678K29800J75579
$$ plain form
3150 3001459 3216632 3514548 3777889 4045717 4338009 4620913 4954113 5169932 5285348 5367416
3140 5367416 5389835 5447156 5339632 5243508 5315235 5342625 5384222 5321542 5251128 5305602 5432122
3129 5432122 5484316 5517400 5621138 5641893 5760159 5873993 6029820 6300290 6706173 7150940
3119 7150940 7767243 8544775 9540497 10578361 11452978 11863337 11905176 11627790 10926207 10030609
3109 10030609 9013459 8099791 7152545 6389219 5728612 5256306 4935629 4596259 4376032
3100 4376032 4242784 4088286 3977384 3905534 3884064 3892986 3856295 3883999 3922565 3926038 4074086
3089 4074086 4243748 4408514 4563389 4693938 4862945 4916773 4919072 4851896 4604273 4348706
3079 4348706 4032466 3666249 3346216 3130398 2836371 2589599 2386529 2143060 1932885 1788449
$$ packed form
3150C001459K15173K97916K63341K67828K92292K82904L33200K15819J15416Q2068
3140E367416K2419N7321j07524r6124P1727K7390M1597o2680p0414N4474J26520
3129E432122N2194L3084J03738K0755J18266J13834J55827K70470M05883M44767
3119G150940O16303P77532R95722J037864Q74617M10359M1839k77386p01583q95598
3109A0030609j017150r13668r47246p63326o60607m72306l20677l39370k20227
3100D376032j33248j54498j10902p1850k1470Q922l6691K7704L8566L473J48048
3089D074086J69662J64766J54875J30549J69007N3828K299o7176k47623k55567
3079D348706l16240l66217l20033k15818k94027k46772k03070k43469k10175j44436
$$ plain form
3069 1788449 1803008 1678547 1535607 1548107 1478265 1385864 1265108 1099615 1032658 1015044 983176
3058 983176 925798 820783 813502 800023 703941 671624 636776 594908 575934 579766 595950 533825
3046 533825 522175 443583 446187 463754 377089 344569 331123 248248 270971 315559 300521 294977
3034 294977 253979 205818 227811 214718 202951 174865 127946 149915 150553 113122 158264 159670
3022 159670 129998 109504 96258 63892 3323 79197 85076 110400 100378 49919 16332 -63783
3010 -63783 -71139 -15811 29236 -41880 21881 64437 53042 25847 21502 -17103 -41310 60601
2998 60601 -1805 -28118 857 1901 -18410 10460 -60261 -58691 -79447 -79833 -27687 -69636 -84766
2985 -84766 -83158 -104733 -139252 -229521 -185032 -67304 -24810 -32151 -49727 -89719 -97709 -74063
$$ packed form
3069A788449J4559j24461j42940J2500o9842r2401j20756j65493o6957j7614l1868
3058I83176n7378j05015p281j3479r6082l2317l4848m1868j8974L832J6184o2125
3046E33825j1650p8592K604J7567q6665l2520j3446q2875K2723M4588j5038n544
3034B94977m0998m8161K1993j3093j1767k8086m6919K1969O38l7431M5142J406
3022A59670k9672k0494j3246l2366o0569P5874N879K5324j0022n0459l3587q0115
3010f3783p356N5328M5047p1116O3761M2556j1395k7195m345l8605k4207J01911
2998F0601o2406k6313K8975J044k0311K8870p0721J570k0756l86N2146m1949j5130
2985h4766J608k1575l4519r0269M4489J17728M2494p341j7576l9992p990K3646
$$ plain form
2973 -74063 -99035 -178322 -120447 -93537 -65043 -68698 -60600 -95094 -6501 -9290 -64232 -45835
2961 -45835 -30671 -117728 -141577 -126822 -141429 -183144 -216329 -125250 -147872 -179638 -190283 -198602
2949 -198602 -229783 -273571 -180412 -174721 -78646 -85207 -150420 -146141 -107542 -75881 -101738 -120246
2937 -120246 -126072 -127751 -102213 -121227 -119186 -113137 -134315 -151398 -154565 -111902 -137716 -136253 -211501
2924 -211501 -209675 -213436 -150821 -117602 -106272 -103594 -129045 -179005 -186754 -180265 -89132 -123067 -140941
2911 -140941 -168075 -106405 -61222 -95133 -127206 -136898 -241278 -281534 -241713 -176664 -154648 -154558
2899 -154558 -178855 -210541 -198231 -198622 -241164 -226013 -129909 -152470 -57898 -102288 -184371 -151609
2887 -151609 -187257 -157365 -227274 -144777 -124206 -160772 -245206 -252755 -225711 -167225 -178395 -216092
$$ packed form
2973g4063k4972p9287N7875K6910K8494l655Q098l4494Q8593k789n4942J8397
2961d5835J5164q7057k3849J4755j4607m1715l3185R1079k2622l1766j0645q319
2949a98602l1181m3788R3159N691R6075o561o5213M279L8599L1661k5857j8508
2937a20246n826j679K5538j9014K041O049k1178j7083l167M2663k5814J463p5248
2924b11501J826l761O2615L3219J1330K678k5451m9960p749O489R1133l3935j7874
2911a40941k7134O1670M5183l3911l2073r692j04380m0256L9821O5049K2016R0
2899a54558k4297l1686J2310l91m2542J5151R6104k2561R4572m4390q2083L2762
2887a51609l5648K9892o9909Q2497K0571l6566q4434p549K7044N8486j1170l7697
$$ plain form
2875 -216092 -171016 -164528 -174571 -215081 -198557 -195264 -221580 -213871 -266226 -189670 -156262 -156095 -91133
2862 -91133 -127583 -201732 -176969 -133403 -57871 -75844 -113901 -153995 -227197 -220902 -124166 -101042
2850 -101042 -132006 -159362 -157250 -161192 -195431 -155994 -209015 -130173 -159450 -151624 -184334 -207102
2838 -207102 -141412 -88319 -253779 -197654 -144788 -116944 -109357 -79391 -111377 -129408 -128164 -123087
2826 -123087 -97921 -154552 -157199 -96293 -118068 -148523 -171319 -209796 -224607 -159022 -149796 -186775
2814 -186775 -127911 -152815 -161305 -180048 -193902 -223244 -202599 -150898 -128014 -106428 -164504 -148113
$$ packed form
2875b16092M5076O488j0043m0510J6524L293k6316P709n2355P6556L3408J67O4962
2862i1133l6450p4149K4763M3566P5532j7973l8057m0094p3202O295R6736K3124
2850a01042l0964k7356K112l942l4239L9437n3021P8842k9277P826l2710k2768
2838b07102O5690N3093j65460N6125N2866K7844P587K9966l1986j8031J244N077
2826a23087K5166n6631k647O0906k1775l0455k2796l8477j4811O5585R226l6979
2814a86775N8864k4904q490j8743j3854k9342K0645N1701K2884K1586n8076J6391
$$ [...]
##END NTUPLES=NMR SPECTRUM
##END=
