##TITLE=1H_DE-80H_X3
 200.13MHz, d2o
 8 sc
 
 19ns.26.2.2025
##JCAMPDX= 6.0         $$ Bruker NMR JCAMP-DX V2.0
##DATA TYPE= NMR SPECTRUM
##DATA CLASS= NTUPLES
##ORIGIN= UXNMR, Bruker Analytische Messtechnik GmbH
##OWNER= pz
$$ XWIN-NMR		Version 3.5
$$ Thu Jul  2 10:22:50 2026 Russian Standard Time (UT+4h)  Yarkov@DPX200
##.OBSERVE FREQUENCY= 200.1313
##.OBSERVE NUCLEUS= ^1H
##.ACQUISITION MODE= SIMULTANEOUS
##.ACQUISITION SCHEME= undefined
##.AVERAGES= 8
##.DIGITISER RES= 18
##SPECTROMETER/DATA SYSTEM= spect
##.PULSE SEQUENCE= zg30
##.SOLVENT NAME= CDCl3
##.SHIFT REFERENCE= (INTERNAL, CDCl3, 0, 15.5155)
##AUDIT TRAIL= $$ (NUMBER, WHEN, WHO, WHERE, WHAT)
$$ ##TITLE= Audit trail, XWIN-NMR		Version 3.5
$$ ##JCAMPDX= 5.01
$$ ##ORIGIN= Bruker BioSpin GmbH
$$ ##OWNER= Yarkov
$$ C:/Bruker/XWIN-NMR/data/yarkov2/nmr/H-C/1/pdata/1/auditp.txt
$$ ##AUDIT TRAIL=  $$ (NUMBER, WHEN, WHO, WHERE, WHAT)
(   1,<2026-07-02 10:21:21.23 +0400>,<Yarkov>,<DPX200>,
      <created by zg, POWCHK disabled, PULCHK disabled
       configuration hash MD5:
       00 E9 B6 7A A2 85 ED C7 34 08 36 98 17 FE 4E 26
       data hash MD5: 16K
       58 DC EF 43 5F E5 1C C3 8E 03 DD 6B C5 AA BA 9D>)
(   2,<2026-07-02 10:21:33.46 +0400>,<Yarkov>,<DPX200>,
      <Start of raw data processing
       efp BC_mod = 2 LB = 0.25 FT_mod = 6 PKNL = 1 PHC0 = -6895.348 PHC1 = 6.42196 SI = 16K 
       data hash MD5: 16K
       CC 6E 4D C6 82 10 9D 7B 84 36 E5 B8 EF 92 8E 82>)
(   3,<2026-07-02 10:21:37.92 +0400>,<Yarkov>,<DPX200>,
      <abs ABSG = 5 
       data hash MD5: 16K
       0B DA E9 3D A5 ED D2 EE 9E FE 87 0A 7F CA 4C 2E>)
(   4,<2026-07-02 10:21:50.85 +0400>,<Yarkov>,<DPX200>,
      <pk PHC0 = 1.2 PHC1 = 0 
       data hash MD5: 16K
       72 78 7A D0 CE 54 38 FA 14 89 AB 5F 78 60 3F 80>)
$$ ##END=
$$ 
$$ hash MD5
$$ 3B 9D B4 39 71 54 F2 A5 AC CD 75 CD F4 68 E9 F9
##$RELAX= 
##$RELAX= 
##$RELAX= 
##$RELAX= 
##$RELAX= 
##$RELAX= 
$$ Bruker specific parameters
$$ --------------------------
##$DU= <C:/Bruker/XWIN-NMR>
##$EXPNO= 1
##$NAME= <H-C>
##$PROCNO= 1
##$TYPE= <nmr>
##$USER= <yarkov2>
##$AMP= (0..31)
100 100 100 100 100 100 100 100 100 100 100 100 100 100 100 100 100 100 
100 100 100 100 100 100 100 100 100 100 100 100 100 100 
##$AQSEQ= 0
##$AQ_mod= 1
##$AUNM= <au_zg>
##$AUTOPOS= <>
##$BF1= 200.13
##$BF2= 200.13
##$BF3= 200.13
##$BF4= 200.13
##$BF5= 200.13
##$BF6= 200.13
##$BF7= 200.13
##$BF8= 200.13
##$BYTORDA= 1
##$CFDGTYP= 0
##$CFRGTYP= 5
##$CHEMSTR= <none>
##$CNST= (0..31)
1 1 145 1 1 1 1 1 1 1 1 1 1 1 1 1 1 1 1 1 1 1 1 1 1 1 1 1 1 1 1 1 
##$CPDPRG= <>
##$CPDPRG1= <>
##$CPDPRG2= <>
##$CPDPRG3= <>
##$CPDPRG4= <mlev>
##$CPDPRG5= <mlev>
##$CPDPRG6= <mlev>
##$CPDPRG7= <mlev>
##$CPDPRG8= <mlev>
##$CPDPRGB= <>
##$CPDPRGT= <>
##$D= (0..31)
0 0.7 0 0 0 0 0 0 0 0 0 0.03 0 0 0 0 0 0 0 0 0 0 0 0 0 0 0 0 0 0 0 0 
##$DATE= 1782973280
##$DBL= (0..7)
120 120 120 120 120 120 120 120 
##$DBP= (0..7)
150 150 150 150 150 150 150 150 
##$DBP07= 0
##$DBPNAM0= <>
##$DBPNAM1= <>
##$DBPNAM2= <>
$$ [...]
##$SUBNAM3= <"">
##$SUBNAM4= <"">
##$SUBNAM5= <"">
##$SUBNAM6= <"">
##$SUBNAM7= <"">
##$SUBNAM8= <"">
##$SUBNAM9= <"">
##$SW= 18.0517328524113
##$SWIBOX= (0..15)
0 0 2 0 0 0 0 0 0 0 0 0 0 0 0 0 
##$SW_h= 3612.71676300578
##$TD= 16384
##$TD0= 1
##$TE= 0
##$TE2= 300
##$TE3= 300
##$TEG= 300
##$TL= (0..7)
0 120 120 120 120 120 120 120 
##$TP= (0..7)
150 150 150 150 150 150 150 150 
##$TP07= 0
##$TPNAME0= <>
##$TPNAME1= <>
##$TPNAME2= <>
##$TPNAME3= <>
##$TPNAME4= <>
##$TPNAME5= <>
##$TPNAME6= <>
##$TPNAME7= <>
##$TPOAL= (0..7)
0.5 0.5 0.5 0.5 0.5 0.5 0.5 0.5 
##$TPOFFS= (0..7)
0 0 0 0 0 0 0 0 
##$TUNHIN= 0
##$TUNHOUT= 0
##$TUNXOUT= 0
##$USERA1= <user>
##$USERA2= <user>
##$USERA3= <user>
##$USERA4= <user>
##$USERA5= <user>
##$V9= 5
##$VALIST= <valist>
##$VCLIST= <CCCCCCCCCCCCCCC>
##$VD= 0
##$VDLIST= <DDDDDDDDDDDDDDD>
##$VPLIST= <PPPPPPPPPPPPPPP>
##$VTLIST= <TTTTTTTTTTTTTTT>
##$WBST= 1024
##$WBSW= 4
##$XGAIN= (0..3)
0 0 0 0 
##$XL= 0
##$YL= 0
##$YMAX_a= 283729
##$YMIN_a= -479665
##$ZGOPTNS= <>
##$ZL1= 120
##$ZL2= 120
##$ZL3= 120
##$ZL4= 120
##$ABSF1= 15.48797
##$ABSF2= -2.563879
##$ABSG= 5
##$ABSL= 3
##$ALPHA= 0
##$AQORDER= 0
##$ASSFAC= 0
##$ASSFACI= 0
##$ASSFACX= 0
##$ASSWID= 0
##$AUNMP= <proc_1d>
##$AZFE= 0.1
##$AZFW= 0.1
##$BCFW= 0
##$BC_mod= 2
##$BYTORDP= 0
##$COROFFS= 0
##$CY= -3
##$DATMOD= 1
##$DC= 0
##$DFILT= <>
##$DTYPP= 0
##$F1P= 0
##$F2P= 0
##$FCOR= 1
##$FTSIZE= 16384
##$FT_mod= 6
##$GAMMA= 0
##$GB= 0
##$INTBC= 1
##$INTSCL= 3.241238e-09
##$ISEN= 128
##$LB= 0.25
##$LEV0= 0
##$LPBIN= 0
##$MAXI= 10000
##$MC2= 0
##$MEAN= 0
##$ME_mod= 0
##$MI= 1.114404
##$NCOEF= 0
##$NC_proc= -6
##$NLEV= 6
##$NOISF1= 3.799351
##$NOISF2= 2.8
##$NSP= 0
##$NTH_PI= 0
##$NZP= 0
##$OFFSET= 15.51551
##$PC= 1
##$PHC0= -6894.148
##$PHC1= 6.42196
##$PH_mod= 1
##$PKNL= yes
##$PPARMOD= 0
##$PSCAL= 0
##$PSIGN= 0
##$REVERSE= no
##$SF= 200.130001239157
##$SI= 16384
##$SIGF1= 3
##$SIGF2= 2
##$SINO= 0.751879
##$SIOLD= 32768
##$SREGLST= <19F.Aceton>
##$SSB= 0
##$STSI= 16384
##$STSR= 0
##$SW_p= 3612.71676300578
##$SYMM= 0
##$S_DEV= 0
##$TDeff= 16384
##$TDoff= 0
##$TI= <>
##$TILT= no
##$TM1= 0
##$TM2= 0
##$TOPLEV= 0
##$USERP1= <user>
##$USERP2= <user>
##$USERP3= <user>
##$USERP4= <user>
##$USERP5= <user>
##$WDW= 1
##$XDIM= 16384
##$YMAX_p= 340227488
##$YMIN_p= -460361
$$ End of Bruker specific parameters
$$ ---------------------------------
##NTUPLES= NMR SPECTRUM
##VAR_NAME=  FREQUENCY,     SPECTRUM/REAL,   SPECTRUM/IMAG
##SYMBOL=    X,             R,               I
##VAR_TYPE=  INDEPENDENT,   DEPENDENT,       DEPENDENT
##VAR_FORM=  AFFN,          ASDF,            ASDF
##VAR_DIM=   16384,         16384,           16384
##UNITS=     HZ,            ARBITRARY UNITS, ARBITRARY UNITS
##FACTOR=    0.220516191357247, 1,           1
##FIRST=     3105.1189565564, 0,             0
##LAST=      -507.597806449382, 0,           0
##MIN=       -507.597806449382, -460361,     0
##MAX=       3105.1189565564, 340227488,     0
$$ Real data points
##PAGE= N=1
##DATA TABLE= (X++(R..R)), XYDATA
$$ [...]
$$ plain form
8986 -38951 -58026 -49750 -37648 -36883 -42149 -30441 -32617 -25375 -47916 -58866 -30701 -39511 -47454
8973 -47454 -52420 -80316 -79689 -44058 -33167 -17539 -44022 -3334 33881 48536 19118 -13224
8961 -13224 -1623 35208 38131 48598 102523 87268 57922 41878 65468 33417 12994 46436
8949 46436 77821 64226 114068 122085 112623 140961 193395 225182 240706 240251 278028 297533 320462
8936 320462 368492 431133 452916 519315 644934 804660 1050708 1426591 1952298 2650402
8926 2650402 3685286 4843512 5564170 5393013 4973544 4509396 3813132 3056246 2385307
8917 2385307 1871944 1441746 1113765 856585 666727 532017 491017 438574 378913 350032
8907 350032 315855 298999 291660 286650 259580 271732 236412 235734 239844 227457 232503 205886 173146
$$ packed form
8986c8951j9075Q276J2102P65n266J1708k176P242k2541j0950K8165q810p943
8973d7454m966k7896O27L5631J0891J5628k6483M0688L7215J4655k9418l2342
8961a3224J1601L6831K923J0467N3925j5255k9346j6044K3590l2051k0423L3442
8949D6436L1385j3595M9842Q017r462K8338N2434L1787J5524m55L7777J9505K2929
8936C20462M8030O2641K1783O6399J25619J59726K46048L75883N25707O98104
8926B650402J034884J158226P20658j71157m19469m64148o96264p56886o70939
8917B385307n13363m30198l27981k57180j89858j34710m1000n2443n9661k8881
8907C50032l4177j6856p339n010k7070J2152l5320o78M110j2387N046k6617l2740
$$ plain form
8894 173146 147151 109928 105532 95797 95852 68608 25674 36132 67591 72567 74105 43780 38340
8881 38340 53603 29922 12325 5827 -6239 1190 -21977 4641 -2466 -51922 -21192 -24436 -33116
8868 -33116 -22942 -3988 8420 51033 46331 16445 5615 -1284 8487 -26132 -19908 -9159 -22139
8855 -22139 -26995 -56875 -62303 -44915 -29887 -79265 -112658 -98949 -75342 -60706 -42546 -43200 -63053
8842 -63053 -67264 -56126 -57823 -46357 -57872 -85249 -59969 -21091 -35895 -55589 -60016 -61783 -37211
8829 -37211 -81120 -109788 -87912 -95761 -97977 -106527 -96621 -66915 -62110 -123627 -108975 -95490 -107843
8816 -107843 -94804 -103514 -120895 -83979 -56862 -75953 -60761 -81324 -52991 -27764 -3250 -34927
8804 -34927 6267 -2742 -44295 -41530 -51872 -67865 -66609 -40692 -18432 -64202 -96928 -69318
$$ packed form
8894A73146k5995l7223m396r735N5k7244m2934J0458L1459M976J538l0325n440
8881C8340J5263k3681j7597o498j2066P429k3167K6618p107m9456L0730l244q680
8868c3116J0174J8954J2408M2613m702k9886j0830o899R771l4619O224J0749j2980
8855b2139m856k9880n428J7388J5028m9378l3393J3709K3607J4636J8160o54j9853
8842f3053m211J1138j697J1466j1515k7377K5280L8878j4804j9694m427j767K4572
8829c7211m3909k8668K1876p849k216q550R906K9706M805o1517J4652J3485j2353
8816a07843J3039q710j7381L6916K7117j9091J5192k0563K8333K5227K4514l1677
8804c4927M1194r009m1553K765j0342j5993J256K5917K2260m5770l2726K7610
$$ plain form
8792 -69318 -79225 -50083 -31206 -40995 -12190 -10665 1130 28484 13645 -8433 10769 64661
8780 64661 65037 79257 102460 123563 152369 144060 126770 206974 266861 281005 349047 466588
8768 466588 578672 757787 938133 1159899 1456791 1701727 1828583 1853238 1789074 1684570
8758 1684570 1539272 1367842 1181693 994151 814257 663364 566611 501354 445258 489290
8748 489290 508428 508794 546330 582784 631794 696358 753637 826846 916067 974307 1001844 1069348
8736 1069348 1103788 1107976 1124822 1170917 1209666 1178159 1165775 1139243 1124697 1062150 962525 914540
8724 914540 885633 837603 824920 810295 856918 960044 1115128 1343578 1649807 1938694 2185139
8713 2185139 2233481 2131287 1998538 1823738 1640011 1401322 1134703 924720 746657 588548
$$ packed form
8792f9318r907K9142J8877r789K8805J525J1795K7354j4839k2078J9202N3892
8780F4661L76J4220K3203K1103K8806q309j7290Q0204N9887J4144O8042J17541
8768D66588J12084J79115J80346K21766K96892K44936J26856K4655o4164j04504
8758A684570j45298j71430j86149j87542j79894j50893r6753o5257n6096M4032
8748D89290J9138L66L7536L6454M9010O4564N7279P3209Q9221N8240K7537O7504
8736A069348L4440M188J6846M6095L8749l1507j2384k6532j4546o2547r9625m7985
8724I14540k8907m8030j2683j4625M6623J03126J55084K28450L06229K88887K46445
8713B185139M8342j02194j32749j74800j83727k38689k66619k09983j78063j58109
$$ plain form
8703 588548 518345 474866 443547 443440 417090 382306 367521 357444 401171 486427 560712 687712
8691 687712 836565 1045132 1321281 1638794 2017461 2356329 2514448 2476823 2342769 2141451
8681 2141451 1894914 1586258 1268209 975425 763921 607825 492084 376701 310815 254474
8671 254474 215123 182274 163454 133487 75477 44097 66400 64913 78724 58450 19684 52662
8659 52662 83777 92553 89593 91964 79640 79681 65414 71984 95583 127065 130518 189057 236090
8646 236090 306654 389635 497701 634006 828939 1121565 1405918 1760394 2129713 2375478
8636 2375478 2413117 2344768 2204569 2010644 1736702 1405484 1108757 823896 631912 488632
8626 488632 348698 204218 139454 101503 75017 73310 65550 33065 13288 -16807 -14261 -33769
$$ packed form
8703E88548p0203m3479l1319j07k6350l4784j4785j0077M3727Q5256P4285J27000
8691F87712J48853K08567K76149L17513L78667L38868J58119l7625j34054k01318
8681B141451k46537l08656l18049k92784k11504j56096j15741j15383o5886n6341
8671B54474l9351l2849j8820k9967n8010l1380K2303j487J3811k0274l8766L2978
8659E2662L1115Q776k960K371j2324M1j4267O570K3599L1482L453N8539M7033
8646B36090P0564Q2981J08066J36305J94933K92626K84353L54476L69319K45765
8636B375478L7639o8349j40199j93925k73942l31218k96727k84861j91984j43280
8626D88632j39934j44480o4764l7951k6486j707p760l2485j9777l0095K546j9508
$$ plain form
8614 -33769 -63549 -56549 -50450 -69548 -74878 -71758 -96165 -57361 -54557 -78607 -109783 -141348 -139902
8601 -139902 -134488 -139416 -123555 -130871 -121393 -135168 -148238 -157213 -189231 -187730 -173697 -181016 -202866
8588 -202866 -186424 -196560 -163779 -164015 -162744 -171441 -158971 -199655 -240740 -460361 -329836 -87143
8576 -87143 -123142 -105631 -147899 -137944 -135959 -145699 -195763 -166290 -182754 -178439 -169555 -133486 -129419
8563 -129419 -125835 -98049 -94003 -95543 -111995 -123861 -123579 -123452 -125822 -159751 -166820 -171230 -184167 -167634
8549 -167634 -178559 -191769 -154448 -179012 -192649 -150411 -124660 -102277 -122616 -102319 -101030 -139649
8537 -139649 -183180 -168943 -169788 -183276 -157129 -200033 -220542 -185070 -205938 -206318 -210943 -230216 -196047
8524 -196047 -168749 -172024 -218113 -196569 -164401 -171130 -205190 -188091 -203754 -229914 -234826 -243570
$$ packed form
8614c3769k9780P000O099j9098n330L120k4407L8804K804k4050l1176l1565J446
8601a39902N414m928J5861p316R478j3775j3070q975l2018J501J4033p319k1850
8588b02866J6442j0136L2781k36J271q697J2470m0684m1085k19621J30525K42693
8576h7143l5999J7511m2268R955J985r740n0064K9473j6464M315Q884L6069M067
8563a29419L584K7786M046j540j6452j1866K82J27k370l3929p069m410j2937J6533
8549a67634j0925j3210L7321k4564j3637M2238K5751K2383k0339K0297J289l8619
8537a39649m3531J4237q45j3488K6147m2904k0509L5472k0868l80m625j9273L4169
8524a96047K7298l275m6089K1544L2168o729l4060J7099j5663k6160m912q744
$$ plain form
8512 -243570 -208385 -230383 -240879 -204081 -238668 -241373 -236879 -233266 -237470 -250738 -233384 -198963
8500 -198963 -209815 -228156 -215153 -171645 -158925 -188107 -179425 -127948 -167263 -194793 -181822 -181392
8488 -181392 -189823 -168596 -168253 -224649 -207352 -222426 -237466 -201386 -179168 -174003 -144112 -163452
8476 -163452 -195778 -212706 -203837 -207093 -182638 -174513 -191220 -208848 -243659 -237965 -226124 -201930
8464 -201930 -198840 -187354 -166206 -204780 -191603 -196059 -215066 -229727 -258634 -272245 -263528 -263940 -267783
8451 -267783 -243318 -238763 -212878 -180606 -173500 -166149 -170588 -166811 -214336 -196234 -186987 -200166 -211025
8438 -211025 -202581 -214899 -250677 -226776 -215043 -227060 -241039 -227048 -227707 -219503 -215228 -203310 -200761
8425 -200761 -269377 -247625 -235067 -222999 -215750 -209282 -194849 -199730 -208413 -251267 -230228 -202009
$$ packed form
8512b43570L5185k1998j0496L6798l4587k705M494L613m204j3268J7354L4421
8500a98963j0852j8341J3003M3508J2720k9182Q682N1477l9315k7530J2971M30
8488a81392q431K1227L43n6396J7297j5074j5040L6080K2218N165K9891j9340
8476a63452l2326j6928Q869l256K4455Q125j6707j7628l4811N694J1841K4194
8464b01930L090J1486K1148l8574J3177m456j9007j4661k8907j3611Q717m12l843
8451b67783K4465M555K5885L2272P106P351m439L777m7525J8102R247j3179j0859
8438b11025Q444j2318l5778K3901J1733j2017j3979J3991o59Q204M275J1918K549
8425b00761o8616K1752J2558J2068P249O468J4433m881q683m2854K1039K8219
$$ plain form
8413 -202009 -170570 -165046 -197241 -237547 -232629 -220045 -204755 -216867 -205816 -197265 -214223 -247101
8401 -247101 -266418 -277012 -285151 -234369 -198922 -187058 -176103 -167105 -195631 -195623 -212567 -184550 -191014
8388 -191014 -180307 -152402 -147374 -152433 -173291 -204841 -186952 -160875 -117723 -110885 -120549 -130151 -106272
8375 -106272 -99684 -87894 -76554 -95334 -125131 -137925 -155009 -181342 -166415 -197032 -208928 -197476
8363 -197476 -156873 -172454 -180745 -199038 -230788 -160196 -173314 -221555 -200135 -191463 -174772 -212683
8351 -212683 -201057 -223584 -230152 -230190 -235493 -243026 -228916 -238012 -227162 -246044 -222584 -215459 -220613
8338 -220613 -237308 -214310 -193333 -177817 -163368 -159118 -189940 -239915 -230284 -238679 -240598 -207180
8326 -207180 -205767 -197728 -199887 -230889 -205556 -206595 -231865 -217493 -192046 -175335 -193782 -161524
$$ packed form
8413b02009L1439N524l2195m0306M918J2584J5290j2112J1051Q551j6958l2878
8401b47101j9317j0594q139N0782L5447J1864J0955Q998k8526Qj6944K8017o464
8388a91014J0707K7905N028n059k0858l1550J7889K6077M3152O838r664r602K3879
8375a06272O588J1790J1340j8780k9797j2794j7084k6333J4927l0617j1896J1452
8363a97476M0603j5581q291j8293l1750P0592j3118m8241K1420Q672J6691l7911
8351b12683J1626k2527o568l8n303p533J4110r096J0850j8882K3460P125n154
8338b20613j6695K2998K0977J5516J4449M250l0822m9975R631q395j919L3418
8326b07180J413Q039k159l1002K5333j039k5270J4372K5447J6711j8447L2258
$$ plain form
8314 -161524 -161932 -177173 -172800 -204674 -217292 -188181 -150515 -182786 -203085 -235839 -226251 -185422
8302 -185422 -185553 -197528 -196889 -203394 -209651 -179843 -186297 -207637 -176403 -144225 -123199 -115398 -90236
8289 -90236 -74841 -90144 -64157 -51293 -47683 -11095 -13804 -17801 -32389 -6436 20532 28269 -16718
8276 -16718 -76720 -85420 -71424 -76728 -75403 -108492 -118122 -124026 -93624 -85960 -121364 -132999 -160872
8263 -160872 -87566 -65421 -98590 -98200 -144121 -131398 -161126 -139883 -111926 -145422 -161222 -173223
8251 -173223 -202029 -238462 -229227 -205634 -192939 -166418 -175860 -182994 -182293 -167785 -149622 -180384 -178629
8238 -178629 -162787 -203185 -215634 -177821 -158942 -148605 -147066 -133910 -122002 -133482 -147108 -176514
8226 -176514 -219104 -200970 -179313 -175030 -185650 -179395 -189492 -226662 -201124 -203456 -187883 -182847
$$ packed form
8314a61524m08j5241M373l1874j2618K9111L7666l2271k0299l2754R588M0829
8302a85422j31j1975O39o505o257K9808o454k1340L1234L2178K1026P801K5162
8289i0236J5395j5303K5987J2864L610L6588k709l997j4588K5953K6968P737m4987
8276a6718o0002q700J3996n304J325l3089r630n904L0402P664l5404j1635k7873
8263a60872P3306K2145l3169L90m5921J2723k9728K1243K7957l3496j5800j2001
8251a73223k8806l6433R235K3593J2695K6521r442p134P01J4508J8163l0762J755
8238a78629J5842m0398j2449L7813J8879J0337J539J3156J1908j1480j3626k9406
8226a76514m2590J8134K1657M283j0620O255j0097l7170K5538k332J5573N036
$$ plain form
8214 -182847 -175397 -154672 -144605 -169630 -169086 -123714 -115495 -130748 -129977 -49720 -72665 -94426 -99945
8201 -99945 -69024 -91301 -79319 -88997 -117769 -104440 -89203 -61471 -118683 -431249 -362166 -203820
8189 -203820 -255581 -198243 -153189 -112284 -97485 -65175 -115953 -128273 -122471 -40396 -1771 -10798
8177 -10798 13454 56458 90557 43634 24791 15885 7596 28156 -5263 5526 17818 27083
8165 27083 70806 89266 73635 176294 198065 264467 314693 409576 577688 721866 897702
8154 897702 1173765 1525658 1907787 2358862 2714405 2823547 2786099 2757637 2676050 2574810
8144 2574810 2539848 2617781 2757504 2965006 3158917 3102704 2936807 2727180 2452281 2136064
8134 2136064 1761367 1399878 1110730 898373 707340 555595 506482 453824 359302 309151
$$ packed form
8214a82847P450K0725J0067k5025N44M5372Q219j5253P71Q0257k2945k1761n519
8201i9945L0921k2277J1982r678k8772J3329J5237K7732n7212l12566O9083J58346
8189b03820n1761N7338M5054M0905J4799L2310n0778j2320N802Q2075L8625r027
8177a0798K4252M3004L4099m6923j8843q906q289K0560l3419J0789J2292R265
8165B7083M3723J8460j5631J02659K1771O6402N0226R4883J68112J44178J75836
8154H97702K76063L51893L82129M51075L55543J09142l7448k8462q1587j01240
8144B574810l4962P7933J39723K07502J93911n6213j65897k09627k74899l16217
8134B136064l74697l61489k89148k12357j91033j51745m9113n2658r4522n0151
$$ plain form
8124 309151 314254 277798 224616 217749 175741 168056 133110 140101 129298 125517 118273 105653 94665
8111 94665 82779 57362 80904 73765 63624 24374 46800 62325 25904 15448 31497 59462
8099 59462 79804 59675 81925 85871 112584 144058 130460 145702 170722 163934 169041 191842
8087 191842 207681 251077 214956 260524 314900 357216 395912 476092 624472 781694 1008267
8076 1008267 1260568 1564506 1918437 2152502 2245263 2246974 2207251 2120055 2048487 2019526 2056883
8065 2056883 2147397 2322649 2412575 2386241 2264306 2061827 1834206 1586739 1288595 1043095
8055 1043095 833794 670514 524584 446132 398661 336267 284871 242449 213536 202290 219041
8044 219041 191145 194149 188988 178815 174706 191071 149237 127595 138159 140116 100559 74422
$$ packed form
8124C09151N103l6456n3182o867m2008p685l4946O991j0803l781p244j2620j0988
8111I4665j1886k5417K3542p139j0141l9250K2426J5525l6421j0456J6049K7965
8099E9462K0342k0129K2250L946K6713L1474j3598J5242K5020o788N107K2801
8087A91842J5839M3396l6121M5568N4376M2316L8696Q0180J48380J57222K26573
8076A008267K52301L03938L53931K34065R2761J711l9723q7196p1568k8961L7357
8065B056883R0514J75252Q9926k6334j21935k02479k27621k47467k98144k45500
8055A043095k09301j63280j45930p8452m7471o2394n1396m2422k8913j1246J6751
8044B19041k7896L004n161j0173m109J6365m1834k1642J0564J957l9557k6137
$$ plain form
8032 74422 90046 78668 68354 65917 50258 90023 97148 42705 22599 63347 49894 33220
8020 33220 10360 32914 67123 71731 47279 29553 43664 34655 62271 75502 110005 140743
8008 140743 140626 133835 137749 126339 155584 175265 148317 181653 230601 268479 288557 315780
7996 315780 338056 376566 428212 464153 470370 487431 477511 479612 486771 460582 421662 399802
7984 399802 351012 281249 285280 242951 216303 203422 208524 190377 213017 237019 211399 187692
7972 187692 174076 194144 196231 163683 164604 131282 138407 154293 144997 166330 156149 163451 189182
7959 189182 217723 211941 190930 235912 275522 317115 320781 294229 294276 332264 369462 369142 371580
7946 371580 386513 406555 392155 387446 404654 412550 463608 519639 531219 550582 569104 579820
$$ packed form
8032G4422J5624j1378j0314k437j5659L9765P125n4443k0106M0748j3453j6674
8020C3220k2860K2554L4209M608k4452j7726J4111r009K7616J3231L4503L0738
8008A40743j17o791L914j1410K9245J9681k6948L3336M8948L7878K0078K7223
7996C15780K2276L8510N1646L5941O217J7061r920K101P159k6189l8920k1860
7984C99802m8790o9763M031m2329k6648j2881N102j8147K2640K4002k5620k3707
7972A87692j3616K0068K087l2548R21l3322P125J5886r296K1333j0181P302K5731
7959A89182K8541n782k1011M4982L9610M1593L666k6552M7L7988L7198l20K438
7946C71580J4933K0042j4400m709J7208P896N1058N6031J1580J9363J8522J0716
$$ plain form
7934 579820 594359 622882 620172 609512 676423 720085 762206 770138 791444 781443 776150 773883
7922 773883 787543 844292 868783 897962 904917 942994 955177 1021282 1118202 1161286 1244061 1321863
7910 1321863 1408799 1527675 1680556 1828399 1984238 2191086 2411182 2662934 3018987 3474288
7900 3474288 3999098 4653138 5520965 6520236 7740894 9278923 10948597 12635792 14329218
7891 14329218 16247434 18459055 21017470 23631313 25603124 26651963 27236902 27897750
7883 27897750 28650044 29286756 29352243 28453072 26750090 24953449 23266672 21425559 19458200
7874 19458200 17328918 15160641 13112146 11334291 9795579 8438610 7218908 6236169
7866 6236169 5372261 4656516 4120705 3687140 3324742 3050750 2805368 2600440 2412307 2247684
$$ packed form
7934E79820J4539K8523k710j0660O6911M3662M2121P932K1306j0001n293k267
7922G73883J3660N6749K4491K9179O955L8077J2183O6105R6920M3084Q2775P7802
7910A321863Q6936J18876J52881J47843J55839K06848K20096K51752L56053M55301
7900C474288N24810O54040Q67827R99271J220658J538029J669674J687195J693426
7891A4329218J918216K211621K558415K613843J971811J048839N84939O60848
7883B7897750P52294O36712O5487q99171j702982j796641j686777j841113j967359
7874A9458200k129282k168277k048495j777855j538712j356969j219702r82739
7866F236169q63908p15745n35811m33565l62398k73992k45382k04928j88133j64623
$$ plain form
7856 2247684 2094838 1985870 1865443 1768694 1687759 1589110 1540272 1487297 1449057 1446716 1354111
7845 1354111 1306673 1275825 1218118 1187929 1175664 1155409 1149423 1118070 1045637 1022807 976359 938644
7833 938644 897322 894613 863149 826805 809993 831428 796222 780584 791198 794985 758166 744764
7821 744764 758350 733297 716528 728771 703610 707937 691362 638262 598788 593871 594469 549931
7809 549931 517594 563596 574253 543225 406034 338894 371790 361248 363365 370327 353391 343738
7797 343738 347912 339625 353091 304758 287400 280744 296060 339019 326363 308344 291542 296375
7785 296375 296262 300268 297019 308001 291652 246320 239709 268453 285874 304838 296748 283752 287857
7772 287857 311503 293400 284829 324987 343086 388450 461856 521423 583412 677653 774822 907600
$$ packed form
7856B247684j52846j08968j20427r6749q0935r8649m8838n2975l8240k341r2605
7845A354111m7438l0848n7707l0189j2265k0255n986l1353p2433k2830m6448l7715
7833I38644m1322k709l1464l6344j6812K1435l5206j5638J0614L787l6819j3402
7821G44764J3586k5053j6769J2243k5161M327j6575n3100l9474m917N98m4538
7809E49931l2337M6002J0657l1028j37191o7140L2896j0542K117O962j6936r653
7797C43738M174q287J3466m8333j7358o656J5316M2959j2656j8019j6802M833
7785B96375j13M006l249J0982j6349m5332o611K8744J7421J8964q090j2996M105
7772B87857K3646j8103q571M0158J8099M5364P3406N9567O1989R4241R7169J32778
$$ plain form
7760 907600 1053472 1181951 1325490 1504609 1674170 1890454 2078003 2193697 2321996 2475806
7750 2475806 2617997 2755332 2942955 3048611 3098658 3162409 3237597 3279059 3229837 3133141 3071279
7739 3071279 2981809 2881875 2800578 2626902 2422183 2220221 2009117 1821223 1703998 1506695
7729 1506695 1331032 1152940 992664 880568 772213 679066 580042 497021 448871 424562
7719 424562 384607 344999 328391 322391 328963 345469 326635 311418 335699 313936 257890 237410
7707 237410 229954 213125 222415 206848 222450 224269 206514 243385 215236 220400 226743 218921 227124
7694 227124 231036 220936 244175 226530 230596 217564 181676 143446 117232 107996 87751 95612
7682 95612 89690 110712 121812 86339 81143 80785 70742 94176 55571 45970 59139 88433 105109
$$ packed form
7760I07600J45872J28479J43539J79119J69561K16284J87549J15694J28299J53810
7750B475806J42191J37335J87623J05656N0047O3751P5188M1462m9222r6696o1862
7739C071279q9470r9934q1297j73676k04719k01962k11104j87894j17225j97303
7729A506695j75663j78092j60276j12096j08355r3147r9024q3021m8150k4309
7719D24562l9955l9608j6608o000O572J6506j8834j5217K4281k1763n6046k0480
7707B37410p456j6829R290j5567J5602J819j7755L6871k8149N164O343p822Q203
7694B27124L912j0100K3239j7645M066j3032l5888l8230k6214r236k0245P861
7682I5612n922K1022J1100l5473n196l58j0043K3434l8605r601J3169K9294J6676
$$ plain form
7669 105109 102737 77755 67442 80601 59704 51368 56289 68639 73080 69309 63545 61341 108202
7656 108202 121927 146549 158959 150644 168818 175319 220990 299880 359605 436991 504828 604302
7644 604302 730380 854303 941176 997633 1107145 1273383 1438980 1604371 1740954 1825028
7634 1825028 1876498 1885987 1894931 1924174 1959589 1994647 2000858 2035523 2042489 1950916 1795830 1693525
7622 1693525 1610051 1446056 1311566 1183877 1074179 914032 803968 721561 584009 489786
7612 489786 410638 325295 254183 206222 154351 146412 123007 135564 156913 106095 68672 42620
7600 42620 35687 49535 75809 60275 52467 65823 67851 37436 20467 2768 23308 25317 4811
7587 4811 -1931 -14891 -28113 -26704 -34903 -30543 -74847 -37287 -22579 -44240 -33556 -34604 -35200
$$ packed form
7669A05109k372k4982j0313J3159k0897q336M921J2350M441l771n764k204M6861
7656A08202J3725K4622J2410q315J8174O501M5671P8890N9725P7386O7837R9474
7644F04302J26078J23923Q6873N6457J09512J66238J65597J65391J36583Q4074
7634A825028N1470R489Q944K9243L5415L5058O211L4665O966r1573j55086j02305
7622A693525q3474j63995j34490j27689j09698j60147j10064q2407j37552r4223
7612D89786p9148q5343p1112m7961n1871p939k3405J2557K1349n0818l7423k6052
7600D2620o933J3848K6274j5534p808J3356K028l0415j6969j7699K0540K009k0506
7587D811o742j2960j3222J409q199M360m4304L7560J4708k1661J0684j048n96
$$ plain form
7574 -35200 -25506 -5100 -24392 -40045 -65267 -47340 -43612 -38807 -46869 -69530 -59089 -30635 -22556
7561 -22556 -29406 6254 -10030 73 22080 56221 89073 61628 39813 53896 62779 106160
7549 106160 117434 93962 137500 126592 93736 96198 75063 46504 30079 66285 34289 5840
7537 5840 11926 3352 12291 29342 65196 83150 102743 95646 129104 170333 195849 244082 301649
7524 301649 380848 468883 568549 661278 727183 787733 808909 869052 882070 894229 887020 891077
7512 891077 847011 812728 756407 701122 604515 527311 451313 390775 340014 270563 256295 244119
7500 244119 226949 178492 166341 187715 197330 218950 209964 234305 242855 257000 253026 258187 258564
7487 258564 264637 305711 317472 308271 290195 324664 394415 417105 433398 422546 380639 406381
$$ packed form
7574c5200R694K0406j9292j5653k5222J7927L728M805q062k2661J0441K8454Q079
7561b2556o850L5660j6284J0103K2007L4141L2852k7445k1815J4083Q883M3381
7549A06160J1274k3472M3538j0908l2856K462k1135k8559j6425L6206l1996k8449
7537E840O086q574Q939J7051L5854J7954J9593p097L3458M1229K5516M8233N7567
7524C01649P9199Q8035R9666R2729O5905O0550K1176O0143J3018J2159p209M057
7512H91077m4066l4283n6321n5285r6607p7204p5998o0538n0761o9451j4268j2176
7500B44119j7170m8457j2151K1374R615K1620q986K4341Q550J4145l974N161L77
7487B58564O073M1074J1761r201j8076L4469O9751K2690J6293j0852m1907K5742
$$ plain form
7475 406381 393069 388068 348970 324821 303725 272067 239280 235389 235849 249499 281053 322577
7463 322577 370282 420080 515565 581496 653904 776049 888960 996849 1036811 1068946 1061491
7452 1061491 1038357 1060513 1108903 1120614 1085540 1063167 1036534 1007567 944898 861178 807051
7441 807051 730685 688553 618660 594280 569478 539294 545914 549520 535460 490971 496962 483352
7429 483352 428546 452609 413826 395275 420706 395243 382550 366704 381839 397068 387757 409894
7417 409894 420016 431041 433159 440661 452036 422974 410151 423265 435687 448186 477344 463089
7405 463089 472820 459067 447061 466358 463016 487406 518716 559775 581587 602599 595508 637087
7393 637087 721327 785643 839979 923694 1012682 1149942 1283303 1430009 1675056 1897495 2138933
$$ packed form
7475D06381j3312n001l9098k4149k1096l1658l2787l891M60J3650L1554M1524
7463C22577M7705M9798R5485O5931P2408J22145J12911J07889L9962L2135p455
7452A061491k3134K2156M8390J1711l5074k2373k6633k8967o2669q3720n4127
7441H07051p6366m2132o9893k4380k4802l0184O620L606j4060m4489N991j3610
7429D83352n4806K4063l8783j8551K5431k5463j2693j5846J5135J5229r311K2137
7417D09894J0122J1025K118P502J1375k9062j2823J3114J2422J2499K9158j4255
7405D63089R731j3753j2006J9297l342K4390L1310M1059K1812K1012p091M1579
7393F37087Q4240O4316N4336Q3715Q8988J37260J33361J46706K45047K22439K41438
$$ plain form
7382 2138933 2376356 2596499 2777194 2951483 3085330 3197688 3270316 3372902 3433074 3450915
7372 3450915 3426687 3418177 3408395 3440847 3496128 3603189 3777190 3973908 4181935 4477438 4868102
7361 4868102 5298616 5842950 6513047 7516277 8890256 10710915 13002887 15718013 18657031
7352 18657031 21125744 22377448 22305295 21282645 19611834 17502174 15059269 12562645
7344 12562645 10198222 8108377 6514826 5331274 4513471 3916816 3427574 3052179 2744909
7335 2744909 2474335 2257800 2099882 1972596 1890897 1809151 1731251 1670738 1626561 1611250 1584225
7324 1584225 1547351 1578076 1546418 1539179 1523464 1503639 1493942 1467572 1450608 1422387 1461910 1526573
7312 1526573 1600234 1731987 1929593 2213074 2561251 3013870 3616537 4259034 4888705 5242103
$$ packed form
7382B138933K37423K20143J80695J74289J33847J12358P2628J02586O0172J7841
7372C450915k4228q510r782L2452N5281J07061J74001J96718K08027K95503L90664
7361D868102M30514N44334O70097J003230J373979J820659K291972K715126K939018
7352A8657031K468713J251704p2153j022650j670811k109660k442905k496624
7344A2562645k364423k089845j593551j183552q17803n96655m89242l75395l07270
7335B744909k70574k16535j57918j27286q1699q1746p7900o0513m4177j5311k7025
7324A584225l6874L0725l1658p239j5715j9825r697k6370j6964k8221L9523O4663
7312A526573P3661J31753J97606K83481L48177M52619O02667O42497O29671L53398
$$ plain form
7302 5242103 5301186 5349973 5394983 5367673 5268814 5072647 4740970 4412265 4131594 3869060
7292 3869060 3670874 3531238 3504858 3564003 3662121 3680978 3591918 3435273 3225993 2954760
7282 2954760 2672122 2371232 2086934 1804493 1588836 1429483 1310257 1214812 1147167 1075814
7272 1075814 1023097 964866 938173 872805 845503 858253 825446 834178 806798 813306 845133 850208
7260 850208 838500 837834 872317 961128 1060884 1217675 1363541 1597999 1865009 2197397 2555090
7249 2555090 2827541 2958344 2978205 2968169 2894766 2817912 2775588 2735865 2777002 2952149 3037934
7238 3037934 3042720 2916354 2721182 2496621 2218434 1941887 1611740 1324281 1076524 895299
7228 895299 754750 626525 593372 558324 528455 460076 482771 473069 448834 419784 380184
$$ packed form
7302E242103N9083M8787M5010k7310r8859j96167l31677l28705k80671k62534
7292C869060j98186j39636k6380N9145R8118J8857q9060j56645k09280k71233
7282B954760k82638l00890k84298k82441k15657j59353j19226r5445o7645p1353
7272A075814n2717n8231k6693o5368k7302J2750l2807Q732k7380O508L1827N075
7260H50208j1708o66L4483Q8811R9756J56791J45866K34458K67010L32388L57693
7249B555090K72451J30803J9861j0036p3403p6854m2324l9723M1137J75147Q5785
7238C037934M786j26366j95172k24561k78187k76547l30147k87459k47757j81225
7228H95299j40549j28225l3153l5048k9869o8379K2695r702k4235k9050l9600
$$ plain form
7217 380184 358270 347309 383100 363371 328918 324448 320740 334503 378001 368461 373153 388089
7205 388089 376885 336070 357858 386175 394145 403080 426514 467885 427538 440360 468260 443500
7193 443500 441798 461751 462412 464251 473676 466931 469755 484114 505989 462804 448056 421601 429504
7180 429504 436260 458134 482759 484563 479330 493817 518060 523574 528567 544363 589989 617087 593518
7167 593518 630128 643926 620951 632916 646392 671475 649256 653085 671595 711109 736680 781337
7155 781337 818990 866332 911226 966270 1061875 1115612 1196073 1274491 1393727 1541511 1732647
7144 1732647 1919486 2159356 2502279 2992339 3678140 4569048 5726066 7113725 8690551
7135 8690551 10308186 11810074 13076311 14096184 14883700 15466549 15754525 15539638 14895248
$$ packed form
7217C80184k1914j0961L5791j9729l4453m470l708J3763M3498r540M692J4936
7205C88089j1204m0815K1788K8317P970Q935K3434M1371m0347J2822K7900k4760
7193D43500j702J9953O61J839R425o745K824J4359K1875m3185j4748k6455P903
7180D29504O756K1874K4625J804n233J4487K4243N514M993J5796M5626K7098k3569
7167E93518L6610J3798k2975J1965J3476K5083k2219L829J8510L9514K5571M4657
7155G81337L7653M7342M4894N5044R5605N3737Q0461P8418J19236J47784J91136
7144A732647J86839K39870L42923M90060O85801Q90908J157018J387659J576826
7135H690551J617635J501888J266237J019873P87516N82849K87976k14887o44390
$$ plain form
7126 14895248 13928487 12636082 11212321 9705792 8241925 6904292 5666694 4671019
7118 4671019 3899397 3293492 2810063 2468852 2232457 2025638 1869685 1745625 1639276 1548841
7108 1548841 1490842 1424594 1365051 1303266 1248303 1177046 1118518 1051010 975600 917493 903740
7097 903740 831720 793589 767582 746152 744406 723372 699336 706240 671279 634548 649275 651243
7085 651243 620460 545776 543021 537361 506184 545088 523956 493806 527983 520917 523970 508555
7073 508555 510978 492742 501552 500168 533132 535946 536048 528906 567010 597788 640500 706902 796174
7060 796174 920954 1097291 1341648 1622574 1983626 2311539 2589816 2929204 3176688 3312291
7050 3312291 3350249 3260432 3145453 2902496 2582523 2251337 1896829 1615839 1354462 1122052
$$ packed form
7126A4895248r66761j292405j423761j506529j463867j337633j237598r95675
7118D671019p71622o05905m83429l41211k36395k06819j55953j24060j06349r0435
7108A548841n7999o6248n9543o1785n4963p1257n8528o7508p5410n8107j3753
7097I03740p2020l8131k6007k1430j746k1034k4036O904l4961l6731J4727J968
7085F51243l0783p4684k755n660l1177L8904k1132l0150L4177p066L053j5415
7073E08555K423j8236Q810j384L2964K814J02p142L8104L0778M2712O6402Q9272
7060G96174J24780J76337K44357K80926L61052L27913K78277L39388K47484J35603
7050C312291L7958q9817j14979k42957l19973l31186l54508k80990k61377k32410
$$ plain form
7040 1122052 959058 837488 763297 679449 615866 544424 540520 534963 514907 502830 532696
7029 532696 565823 604019 676460 710100 757485 799407 770921 761375 671804 628967 587883 535187
7017 535187 468845 422555 420410 404475 400596 406910 420150 425887 439189 472770 537452 586672
7005 586672 654308 777349 911979 1040469 1136886 1168673 1192527 1164563 1186665 1179229 1147726
6994 1147726 1155476 1223538 1339272 1452318 1456818 1468482 1439804 1407378 1372886 1263911 1201214
6983 1201214 1133621 1078053 1042738 983324 922234 880852 871899 868322 881074 951100 1064262 1218897
6971 1218897 1454978 1757577 2113876 2485373 2776636 2800431 2704758 2623396 2409957 2143925
6961 2143925 1864688 1590764 1375779 1216079 1115789 1059910 1059474 1180475 1304818 1447282
$$ packed form
7040A122052j62994j21570p4191q3848o3583p1442l904n557k0056j2077K9866
7029E32696L3127L8196P2441L3640M7385M1922k8486r546q9571m2837m1084n2696
7017E35187o6342m6290k145j5935l879O314J3240N737J3302L3581O4682M9220
7005E86672O7636J23041J34630J28490R6417L1787K3854k7964K2102p436l1503
6994A147726P750O8062J15734J13046M500J1664k8678l2426l4492j08975o2697
6983A201214o7593n5568l5315n9414o1090m1382q953l577J2752P0026J13162J54635
6971A218897K36081L02599L56299L71497K91263K3795r5673q1362k13439k66032
6961B143925k79237k73924k14985j59700j00290n5879m36J21001J24343J42464
$$ plain form
6951 1447282 1694651 1967865 2257810 2485186 2536784 2520212 2404044 2256246 2094357 1987751
6941 1987751 1873240 1810124 1825862 1851916 1958700 2161646 2431494 2802469 3338686 3974907
6931 3974907 4654104 5226203 5586370 5801574 5808116 5625797 5397541 5177074 5037920 5054737
6921 5054737 5204885 5373204 5384658 5374783 5452142 5437891 5145781 4717104 4332268 3997887
6911 3997887 3644686 3323261 3169638 2928349 2640697 2375407 2140917 1964661 1794601 1640651
6901 1640651 1545643 1500257 1529584 1649883 1783107 1948652 2140556 2367602 2586825 2747233
6891 2747233 2795941 2728426 2661093 2674043 2630046 2489580 2236239 1980862 1757935 1520541
6881 1520541 1284056 1063949 896878 778402 678962 569213 519137 507347 491311 412718
$$ packed form
6951A447282K47369K73214K89945K27376N1598j6572j16168j47798j61889j06606
6941A987751j14511o3116J5738K6054J06784K02946K69848L70975N36217O36221
6931C974907O79197N72099L60167K15204O542j82319k28256k20467j39154J6817
6921E054737J50148J68319J1454r875P7359j4251k92110m28677l84836l34381
6911C997887l53201l21425j53623k41289k87652k65290k34490j76256j70060j53950
6901A640651r5008m5386K9327J20299J33224J65545J91904K27046K19223J60408
6891B747233M8708o7515o7333J2950m3997j40466k53341k55377k22927k37394
6881A520541k36485k20107j67071j18476r9440j09749n0076j1790j6036p8593
$$ plain form
6871 412718 337145 310980 313016 252321 240553 267218 241658 209993 220175 180610 167554 152113
6859 152113 149921 121730 100450 102998 110190 114148 127161 79823 83796 71784 79478 77677 79560
6846 79560 45144 52152 74351 66745 94034 66182 34599 40003 56462 15733 39807 15783
6834 15783 -5436 -28276 -38120 -16194 -14291 -8252 -21079 -14428 -19181 -39864 -52109 -65446 -35306
6821 -35306 -49726 -67390 -61282 -31842 4580 12210 22592 23529 -29398 -27481 -23314 -33173 -14733
6808 -14733 -30921 -55787 -56332 -67657 -80582 -74379 -56027 -74456 -62504 -67662 -71958 -71760 -61692
6795 -61692 -110263 -110549 -113811 -84580 -108016 -114782 -101858 -117343 -125296 -100003 -105280 -124002 -120678
6782 -120678 -128619 -144313 -122710 -117422 -136614 -97412 -80249 -117359 -121624 -120160 -146690 -138352 -119236
$$ packed form
6871D12718p5573k6165K036o0695j1768K6665k5560l1665J0182l9565j3056j5441
6859A52113k192k8191k1280K548P192L958J3013m7338L973j2012P694j801J883
6846G9560l4416P008K2199p606K7289k7852l1583N404J6459m0729K4074k4024
6834A5783k1219k2840r844K1926J903O039j2827O651m753k0683j2245j3337L0140
6821c5306j4420j7664O108K9440L6422P630J0382R37n2927J917M167r859J8440
6808a4733j6188k4866n45j1325j2925O203J8352j8429J1952n158m296J98J0068
6795f1692m8571k86l262K9231k3436o766J2924j5485p953K5293n277j8722L324
6782a20678p941j5694K1603N288j9192L9202J7163l7110m265J464k6530Q338J9116
$$ plain form
6769 -119236 -92052 -96909 -106997 -75918 -50480 -58143 -104977 -147264 -132046 -121904 -97268 -121386
6757 -121386 -117869 -123287 -135599 -136856 -165115 -176870 -187529 -195288 -164915 -168475 -176865 -173527 -138385
6744 -138385 -117393 -138081 -162283 -136956 -133580 -163736 -149737 -145225 -135806 -125011 -124170 -125051 -147513
6731 -147513 -157116 -164261 -174673 -146756 -142797 -138046 -121130 -124759 -117843 -150615 -156045 -148913 -149871 -154546
6717 -154546 -136390 -121165 -122885 -147877 -139695 -118697 -102258 -90029 -82691 -105184 -61448 -50474
6705 -50474 -18379 44181 44598 67668 147949 199917 228604 243266 248524 229221 227926 254747 246105
6692 246105 276656 255620 255215 262756 229412 232695 253933 246983 208757 171156 199582 152196 134391
6679 134391 151977 148429 169342 194478 257282 339363 374082 376781 382884 375692 366489 340555 339864
$$ packed form
6769a19236K7184m857j0088L1079K5438p663m6834m2287J5218J0142K4636k4118
6757a21386L517n418j2312j257k8259j1755j0659p759L0373l560q390L338L5142
6744a38385K0992k0688k4202K5327L376l0156J3999M512R419J0795Q41q81k2462
6731a47513r603p145j0412K7917L959M751J6916l629O916l2772n430P132r58m675
6717a54546J8156J5225j720k4992Q182K0998J6439J2229P338k2493M3736J0974
6705e0474L2095O2560M17K3070Q0281N1968K8687J4662N258j9303j295K6821q642
6692B46105L0551k1036m05P541l3344L283K1238o950l8226l7601K8426m7386j7805
6679A34391J7586l548K0913K5136O2804Q2081L4719K699O103p192r203k5934o91
$$ plain form
6666 339864 354403 370519 401754 396889 379238 373323 313816 284400 243977 179360 121172 67863
6654 67863 38641 32295 2090 7813 9131 38207 4249 5133 22564 30241 8325 -9965 -17207
6641 -17207 10703 52464 25082 26387 5355 -7063 -42013 -25907 -52203 -79110 -129890 -128531
6629 -128531 -129862 -96452 -105008 -124615 -105116 -133277 -155192 -125099 -100015 -101782 -145289 -140849
6617 -140849 -133029 -108229 -92763 -115395 -115975 -108291 -136951 -158691 -139509 -113947 -146284 -171403
6605 -171403 -164521 -154773 -151701 -165799 -193382 -192523 -177357 -187822 -152800 -142066 -169778 -139238 -143152
6592 -143152 -157203 -142833 -140460 -163065 -164193 -141959 -139683 -159218 -172940 -162898 -178436 -177104
6580 -177104 -185341 -187138 -181067 -187019 -206537 -200699 -197971 -207783 -201726 -172259 -193140 -208960 -188435
$$ packed form
6666C39864J4539J6116L1235m865j7651n915n9507k9416m0423o4617n8188n3309
6654F7863k9222o346l0205N723J318K9076l3958Q84J7431P677k1916j8290p242
6641a7207K7910M1761k7382J305k1032j2418l4950J6106k6296k6907n0780J359
6629a28531j331L3410q556j9607J9499k8161k1915L0093K5084j767m3507M440
6617a40849P820K4800J5466k2632n80P684k8660k1740J9182K5562l2337k5119
6605a71403O882R748L072j4098k7583Q59J5166j0465L5022J0734k7712L0540l914
6592a43152j4051J4370K373k2605j128K2234K276j9535j3722J0042j5538J332
6580a77104q237j797O071n952j9518N838K728r812O057K9467k0881j5820K0525
$$ plain form
6567 -188435 -193491 -182747 -178017 -174343 -173569 -168429 -171866 -177081 -192733 -195359 -137758 -164950 -156305 -143541
6553 -143541 -124157 -134633 -138522 -157493 -159651 -121513 -124816 -141217 -160155 -180457 -191628 -206552
6541 -206552 -176536 -163101 -155166 -127095 -153595 -177225 -165993 -179155 -199016 -207755 -181111 -202007
6529 -202007 -207583 -206877 -182277 -172487 -179860 -198593 -186013 -149842 -167021 -176977 -178832 -192089 -203911
6516 -203911 -192156 -199481 -189830 -188238 -191797 -180186 -161175 -148847 -126622 -167453 -174725 -140326 -135203
6503 -135203 -165218 -170434 -150424 -107731 -82270 -110430 -123514 -125970 -114473 -92532 -69607 -89397
6491 -89397 -95478 -94264 -129098 -115568 -116118 -89322 -109439 -82106 -79497 -121797 -90940 -95416 -124907
6478 -124907 -115721 -100225 -124074 -115641 -61172 -87514 -125265 -127544 -112227 -146378 -127543 -82132
$$ packed form
6567a88435n056J0744M730L674P74N140l437n215j5652k626N7601k7192Q645J2764
6553a43541J9384j0476l889j8971k158L8138l303j6401j8938k0302j1171j4924
6541b06552L0016J3435P935K8071k6500k3630J1232j3162j9861q739K6644k0896
6529b02007n576P06K4600R790p373j8733J2580L6171j7179r956j855j3257j1822
6516b03911J1755p325R651J592l559J1611J9011J2328K2225m0831p272L4399N123
6503a35203l0015n216K0010M2693K5461k8160j3084k456J1497K1941K2925j9790
6491h9397o081J214l4834J3530n50K6796k0117K7333K609m2300L0857m476k9491
6478a24907R186J5496k3849Q433N4469k6342l7751k279J5317l4151J8835M5411
$$ plain form
6466 -82132 -63894 -84379 -94355 -86594 -60714 -51635 -48613 -51604 -86314 -109167 -109442 -108247 -100454 -94855
6452 -94855 -95312 -98490 -88613 -106303 -161295 -145288 -149489 -159602 -193879 -182324 -205481 -209513 -155525
6439 -155525 -145048 -179378 -153963 -156417 -178184 -169940 -182350 -145884 -131648 -138253 -153902 -166011
6427 -166011 -154471 -134216 -136819 -129132 -133184 -98957 -84830 -128102 -125443 -138909 -137743 -151271 -121388
6414 -121388 -135788 -126134 -140396 -128506 -114223 -103929 -153075 -145185 -139684 -136576 -135912 -154506 -139415
6401 -139415 -106548 -100125 -99593 -101577 -133890 -139208 -153368 -127128 -135358 -103348 -91592 -101000 -151955
6388 -151955 -173494 -149515 -144673 -134213 -129455 -121200 -92096 -92360 -110015 -94569 -51151 -77881 -70354
6375 -70354 -73041 -62279 -69919 -79918 -96685 -107681 -82132 -106327 -74782 -64080 -70822 -76037 -91764
$$ packed form
6466h2132J8238k0485r976P761K5880R079L022k991l4710k2853k75J195P793N599
6452i4855m57l178R877j7690n4992J6007m201j0113l4277J1555k3157m032N3988
6439a55525J0477l4330K5415k454k1767Q244j2410L6466J4236o605j5649j2109
6427a66011J1540K0255k603P687m052L4227J4127m3272K659j3466J166j3528K9883
6414a21388j4400R654j4262J1890J4283J0294m9146P890N501L108O64j8594J5091
6401a39415L2867O423N32j984l2313n318j4160K6240q230L2010J1756r408n0955
6388a51955k1539K3979M842J0460M758Q255K9104k64j7655J5446M3418k6730P527
6375g0354k687J0762p640r999j6767j0996K5549k4195L1545J0702o742n215j5727
$$ plain form
6362 -91764 -78330 -48720 -42944 -54831 -19928 -34518 -22575 4960 5968 -16286 35958 88868
6350 88868 134322 157031 203199 242723 282212 303208 275007 244267 194195 168722 166119 123916
6338 123916 87552 59235 62414 43200 9653 30758 39930 46450 47118 72841 41903 70376 89405
6325 89405 99846 80827 43886 39079 50177 54784 66048 59852 94421 138379 160529 164012 178690
6312 178690 187810 197703 214028 217458 261620 313500 361916 404212 444067 506516 567421 598056
6300 598056 620032 629158 623888 626274 630928 634969 635911 676365 666338 672102 695192 693674 681972
6287 681972 709509 692271 638772 595782 552973 528917 484090 446037 440613 451019 429074 426659
6275 426659 366914 307213 292617 284892 313605 288937 288059 293866 289239 321019 314810 299358 301809
$$ packed form
6362i1764J3434K9610N776j1887L4903j4590J1943K7535J008k2254N2244N2910
6350H8868M5454K2709M6168L9524L9489K0996k8201l0740n0072k5473k603m2203
6338A23916l6364k8317L179j9214l3547K1105R172O520O68K5723l0938K8473J9029
6325H9405J0441j9019l6941m807J1098M607J1264o196L4569M3958K2150L483J4678
6312A78690R120R893J6325L430M4162N1880M8416M2296L9855O2449O0905L0635
6300E98056K1976R126n270K386M654M041R42M0454j0027N764K3090j518j1702
6287F81972K7537j7238n3499m2990m2809k4056m4827l8053n424J0406k1945k415
6275D26659n9745n9701j4596p725K8713k4668q78N807m627L1780o209j5452K451
$$ plain form
6262 301809 345635 388736 434265 435085 411795 429778 452554 450964 427325 428600 472766 511191
6250 511191 551257 549291 589004 608685 601170 642741 648090 649981 640936 589043 550345 551231 552517
6237 552517 550750 574796 598676 621667 592173 566791 599479 632572 637692 623600 620457 639413
6225 639413 651066 659377 669538 688426 713447 746349 771096 840712 892054 971019 1003633 1060261
6213 1060261 1122348 1163343 1132852 1054250 1028417 956758 900710 873933 806270 751734 707607
6202 707607 661785 644130 617809 626967 591608 576605 599507 611579 634998 671414 673392 688933
6190 688933 701977 713844 755481 803426 896752 964993 1068002 1184382 1252258 1318283 1372632
6179 1372632 1351910 1311107 1250205 1152050 1095339 1015242 955467 897149 847148 852176 845579 823984
$$ packed form
6262C01809M3826M3101M5529Q20k3290J7983K2776j590k3639J275M4166L8425
6250E11191M0066j966L9713J9681p515M1571N349J891r045n1893l8698Q86J286
6237E52517j767K4046K3880K2991k9494k5382L2688L3093N120j4092l143J8956
6225F39413J1653Q311J0161J8888K5021L2902K4747O9616N1342P8965L2614N6628
6213A060261O2087M0995l0491p8602k5833p1659n6048k6777o7663n4536m4127
6202G07607m5822j7655k6321R158l5359j5003K2902J2072K3419L6416J978J5541
6190F88933J3044J1867M1637M7945R3326O8241J03009J16380O7876O6025N4349
6179A372632k0722m0803o0902r8155n6711q0097n9775n8318n0001N028o597k1595
$$ plain form
6167 823984 821806 830176 859012 875517 919961 962075 1033892 1054247 1100682 1108766 1096928 1129462
6155 1129462 1127107 1174007 1241638 1288560 1355055 1362549 1390152 1396164 1382413 1359494 1309172 1248835
6143 1248835 1251122 1216122 1158283 1129782 1108111 1135493 1134835 1143359 1152286 1122236 1147444 1166587
6131 1166587 1196681 1266373 1317869 1393001 1423300 1433286 1454778 1466457 1492222 1525646 1551806 1583226
6119 1583226 1593522 1628444 1674590 1762076 1862488 1938611 2006238 2069428 2179379 2314676 2389567
6108 2389567 2521815 2710805 2923164 3151429 3378659 3589915 3757978 3843875 3889890 3844424
6098 3844424 3724077 3573896 3344727 3128863 2951780 2765006 2590092 2468680 2372595 2307536
6088 2307536 2253273 2161512 2129920 2096718 2047991 2024112 1972203 1953691 1960520 1934386 1929329 1921139
$$ packed form
6167H23984k178Q370K8836J6505M4444M2114P1817K0355M6435Q084j1838L2534
6155A129462k355M6900O7631M6922O6495P494K7603O012j3751k2919n0322o0337
6143A248835K287l5000n7839k8501k1671K7382o58Q524Q927l0050K5208J9143
6131A166587L0094O9692N1496P5132L0299R986K1492J1679K5765L3424K6160L1420
6119A583226J0296L4922M6146Q7486J00412P6123O7627O3190J09951J35297P4891
6108B389567J32248J88990K12359K28265K27230K11256J68063Q5897M6015m5466
6098C844424j20347j50181k29169k15864j77083j86774j74914j21412r6085o5059
6088B307536n4263r1761l1592l3202m8727k3879n1909j8512O829k6134n057q190
$$ plain form
6076 1921139 1948110 1945981 1915248 1916240 1957311 1977953 1955315 1992168 2048091 2085820 2100461 2141451
6064 2141451 2227516 2274824 2294773 2299862 2331444 2412221 2476521 2560063 2630276 2688602 2753796 2827812
6052 2827812 2888317 2938998 3071899 3205542 3368256 3564437 3740838 3865302 3884105 3872320
6042 3872320 3917302 3877913 3832609 3818132 3807769 3816530 3814565 3865381 3933885 4011038 4055515 4115168
6030 4115168 4257641 4333854 4408382 4474520 4556191 4658079 4752077 4857514 4989706 5130843
6020 5130843 5291413 5357274 5434527 5539675 5656861 5824650 5994650 6164765 6334658 6573623
6010 6573623 6770822 6986081 7258416 7531570 7865488 8304678 8702897 9218470 9822619 10456845
6000 10456845 11125718 11871841 12695431 13554441 14502873 15472574 16462885 17538795 18715842
$$ packed form
6076A921139K6971k129l0733R92M1071K0642k2638L6853N5923L7729J4641M0990
6064B141451Q6065M7308J9949N089L1582Q0777O4300Q3542P0213N8326O5194P4016
6052B827812O0505N0681J32901J33643J62714J96181J76401J24464J8803j1785
6042C872320M4982l9389m5304j4477j0363Q761j965N0816O8504P7153M4477N9653
6030D115168J42473P6213P4528O6138Q1671J01888R3998J05437J32192J41137
6020E130843J60570O5861P7253J05148J17186J67789J70000J70115J69893K38965
6010F573623J97199K15259K72335K73154L33918M39190L98219N15573O04149O34226
6000A0456845O68873P46123Q23590Q59010R48432R69701R90311J075910J177047
$$ plain form
5991 18715842 20023826 21589220 23450103 25681336 28441979 31938241 36604306 42775474
5983 42775474 50755252 60662235 72503892 85601859 98347541 107961911 112724849 113548344
5975 113548344 111990186 109131063 105933268 103602208 103352583 105906748 110838259 116575083
5967 116575083 120252246 119674508 115296347 108253541 99055240 88336458 77083282 66284862
5959 66284862 56642724 48488454 42055387 37110869 33361190 30465477 28212718 26525465
5951 26525465 25319463 24483237 24035436 24042847 24580906 25767975 27618288 30162586 33483108
5942 33483108 37381996 41047229 43048191 43144301 42438467 41312037 39808232 38316681 37379670
5933 37379670 37360933 38485761 40756497 43698632 45698697 45810617 44945064 43590674 41572646
$$ packed form
5991A8715842J307984J565394J860883K231233K760643L496262M666065O171168
5983D2775474P979778R906983J1841657J3097967J2745682R614370M762938Q23495
5975A13548344j558158k859123l197795k331060k49625K554165M931511N736824
5967A16575083L677163n77738m378161p042806r198301j0718782j1253176j0798420
5959F6284862r642138q154270o433067m944518l749679k895713k252759j687253
5951B6525465j206002q36226m47801P411N38059J187069J850313K544298L320522
5942C3483108L898888L665233K000962R6110p05834j126430j503805j491551r37011
5933C7379670j8737J124828K270736K942135K000065J11920q65553j354390k018028
$$ plain form
5924 41572646 39028959 36391508 34192793 32669894 32035060 32621287 34402443 37208020
5916 37208020 41017395 45506214 49828606 52384423 52540376 51472882 49841135 47635784
5908 47635784 45272461 43366818 42361887 42456902 43685290 45579757 46693237 45812290 43560805
5899 43560805 40739833 37327531 33352170 29203107 25341393 22038247 19295224 17171047
5891 17171047 15622078 14434115 13408351 12544268 11816655 11182349 10639946 10111368 9744940
5882 9744940 9425211 9119401 8837952 8600678 8372384 8165923 7972442 7755285 7554527 7438042
5872 7438042 7320801 7165174 7038724 6938943 6863881 6767131 6740537 6669456 6628084 6551503 6512840
5861 6512840 6479823 6438705 6388586 6365842 6274668 6253642 6241305 6226177 6178792 6176381 6189678 6178820
$$ packed form
5924D1572646k543687k637451k198715j522899o34834N86227J781156K805577
5916C7208020L809375M488819M322392K555817J55953j067494j631747k205351
5908D7635784k363323j905643j004931R5015J228388J894467J113480q80947k251485
5899D3560805k820972l412302l975361m149063l861714l303146k743023k124177
5891A7171047j548969j187963j025764q64083p27613o34306n42403n28578l66428
5882I744940l19729l05810k81449k37274k28294k06461j93481k17157k00758j16485
5872G438042j17241j55627j26450r9781p5062r6750k6594p1081m1372p6581l8663
5861F512840l3017m1118n0119k2744r1174k1026j2337j5128m7385k411J3297j0858
$$ plain form
5849 6178820 6208577 6237948 6268387 6295870 6371062 6461751 6561199 6659059 6780803 6919544 7034127
5838 7034127 7120512 7193179 7285356 7375948 7519008 7679884 7819783 7962597 8078176 8210995
5828 8210995 8334776 8486635 8660407 8837805 9034632 9235690 9466749 9733084 10000942 10252052
5818 10252052 10388365 10543529 10693415 10797938 10916171 10987874 11113056 11267860 11539102 11866088
5808 11866088 12258829 12754482 13306688 13973927 14685742 15395087 15992771 16499956 16914031
5799 16914031 17325921 17766105 18256131 18826378 19510127 20367060 21383526 22545770 23956823
5790 23956823 25599630 27414030 29518818 32027478 34950607 38426815 42556780 47632480
5782 47632480 54043556 62463705 73837982 89194553 109154974 135141793 168248961
$$ packed form
5849F178820K9757K9371L0439K7483P5192R0689R9448R7860J21744J38741J14583
5838G034127Q6385P2667R2177R0592J43060J60876J39899J42814J15579J32819
5828H210995J23781J51859J73772J77398J96827K01058K31059K66335K67858K51110
5818A0252052J36313J55164J49886J04523J18233P1703J25182J54804K71242L26986
5808A1866088L92741M95653N52206O67239P11815P09345N97684N07185M14075
5799A6914031M11890M40184M90026N70247O83749Q56933J016466J162244J411053
5790B3956823J642807J814400K104788K508660K923129L476208M129965N075700
5782D7632480O411076Q420149J1374277J5356571J9960421K5986819L3107168
$$ plain form
5775 168248961 207206458 247788874 282191290 310601312 333211974 340227488 336520405
5768 336520405 330315449 317588323 293941087 262270215 231115055 202513068 174726277
5761 174726277 149372023 127231418 108096650 91761193 78595960 68332121 60085800
5754 60085800 53386976 47933819 43490878 39968396 37159611 34811928 32878388 31186682
5746 31186682 29788646 28555366 27434414 26449858 25661375 25016302 24576553 24236918 24063655
5737 24063655 24073318 24301359 24716663 25318393 26174044 27389697 29013925 31151096 33830774
5728 33830774 37057142 40544589 43605202 46163622 49352335 53952684 60984103 71367858
5720 71367858 85156156 103305549 126698429 153855874 176707109 182528420 175516243
$$ packed form
5775A68248961L8957497M0582416L4402416K8410022K2610662P015514l707083
5768C36520405o204956j2727126k3647236l1670872l1155160k8601987k7786791
5761A74726277k5354254k2140605j9134768j6335457j3165233j0263839q246321
5754F0085800o698824n453157m442941l522482k808785k347683j933540j691706
5746C1186682j398036j233280j120952r84556p88483o45073m39749l39635j73263
5737B4063655R663K28041M15304O01730Q55651J215653J624228K137171K679678
5728C3830774L226368L487447L060613K558420L188713M600349P031419J0383755
5720G1367858J3788298J8149393K3392880K7157445K2851235N821311p012177
$$ plain form
5713 175516243 166056871 152522427 133855431 112497305 91998221 74488160 59387129
5706 59387129 47942835 40335573 34953501 30767219 27380149 24739302 22672132 21007339
5698 21007339 19580087 18434712 17466644 16655633 15948391 15271881 14629375 14057278 13515578
5689 13515578 12981927 12449813 11954616 11499418 11089731 10713272 10388735 10060517 9818793
5680 9818793 9604518 9412282 9277822 9182486 9068927 8930449 8743171 8574607 8365072 8119303
5670 8119303 7905005 7703265 7577835 7422148 7267975 7215153 7198520 7258918 7410399 7657477
5660 7657477 8030619 8469970 9036377 9604897 10019157 10288188 10482962 10660634 10749947 10682763
5650 10682763 10369407 9835136 9254439 8639297 8018918 7436556 6836704 6308492 5895391
$$ packed form
5713A75516243r459372j3534444j8666996k1358126k0499084j7510061j5101031
5706E9387129j1444294p607262n382072m186282l387070k640847k067170j664793
5698B1007339j427252j145375r68068q11011p07242o76510o42506n72097n41700
5689A3515578n33651n32114m95197m55198m09687l76459l24537l28218k41724
5680I818793k14275j92236j34460r5336j13559j38478j87278j68564k09535k45769
5670H119303k14298k01740j25430j55687j54173n2822j6633O0398J51481K47078
5660G657477L73142M39351N66407N68520M14260K69031J94774J77672Q9313o7184
5650A0682763l13356n34271n80697o15142o20379n82362n99852n28212m13101
$$ plain form
5641 5895391 5547781 5292522 5078715 4915683 4774490 4607087 4474909 4307078 4150714 3993476
5631 3993476 3861353 3749502 3673386 3578250 3499154 3428688 3385710 3374050 3357764 3321913 3315675
5620 3315675 3319859 3351137 3359158 3341107 3322678 3318017 3335902 3319019 3296828 3302965 3328108 3411681
5608 3411681 3525714 3688960 3899758 4195322 4584188 5142383 5878797 6747230 7791431
5599 7791431 8899596 9868003 10621019 11115759 11487498 11752397 11829583 11688905 11201075 10367755
5589 10367755 9415104 8503176 7518128 6581559 5720744 4953322 4340848 3852671 3512652
5580 3512652 3300649 3136543 2996946 2830627 2680352 2565433 2455088 2366542 2303597 2217309
5570 2217309 2117045 2041165 2010528 1942979 1851685 1804256 1743075 1671394 1630342 1606902 1553641
$$ packed form
5641E895391l47610k55259k13807j63032j41193j67403j32178j67831j56364j57238
5631C993476j32123j11851p6116r5136p9096p0466m2978j1660j6286l5851o238
5620C315675M184L1278Q021j8051j8429m661J7885j6883k2191O137K5143Q3573
5608C411681J14033J63246K10798K95564L88866N58195P36414Q68433J044201
5599G791431J108165R68407P53016M94740L71739K64899P7186j40678m87830q33320
5589A0367755r52651r11928r85048r36569q60815p67422o12474m88177l40019
5580C512652k12003j64106j39597j66319j50275j14919j10345q8546o2945q6288
5570B217309j00264p5880l0637o7549r1294m7429o1181p1681m1052k3440n3261
$$ plain form
5559 1553641 1515565 1508841 1491081 1492937 1458237 1392806 1413622 1460514 1450766 1427909 1429257 1459710
5547 1459710 1582200 1716453 1884129 2097490 2311637 2515016 2677043 2760066 2859116 2951444
5537 2951444 2883760 2725170 2556587 2401463 2219553 2054662 1864052 1688110 1559688 1456358
5527 1456358 1388987 1350766 1267225 1195057 1155991 1102641 1011912 947238 955866 914879 858992 839517
5515 839517 833824 793147 790236 795145 785264 773508 699610 645621 642051 616739 611922 628295 601300
5502 601300 590251 544956 577893 586532 533489 450347 457927 487705 472953 462494 432155 431128
5490 431128 419521 401128 385485 386462 381198 366176 374212 362248 317669 318187 346056 338973 337752
5477 337752 324422 336394 360154 362180 371251 403738 425355 407665 406990 370262 357778 339861
$$ packed form
5559A553641l8076o724j7760J856l4700o5431K0816M6892r748k2857J348L0453
5547A459710J22490J34253J67676K13361K14147K03379J62027Q3023R9050R2328
5537B951444o7684j58590j68583j55124j81910j64891j90610j75942j28422j03330
5527A456358o7371l8221q3541p2168l9066n3350r0729o4674Q628m0987n5887j9475
5515H39517n693m0677k911M909r881j1756p3898n3989l570k5312m817J6373k6995
5502F01300j1049m5295L2937Q639n3043q3142P580K9778j4752j0459l0339j027
5490D31128j1607j8393j5643R77n264j5022Q036j1964m4579N18K7869p083j221
5477C37752j3330J1972K3760K026R071L2487K1617j7690o75l6728j2484j7917
$$ plain form
5465 339861 289905 292734 299890 314072 314165 329669 343577 314210 348362 373043 341868 339093 378315
5452 378315 390479 422110 430483 463870 503746 537975 567619 594533 678667 777903 887155 1026893
5440 1026893 1219317 1445938 1702986 1899042 2014871 2050658 1998407 1939542 1872501 1801957
5430 1801957 1705827 1562656 1406925 1241376 1121643 1031809 914688 830475 762246 699458
5420 699458 662635 603507 551470 540004 547497 526500 518624 543201 545732 508645 526807 540810
5408 540810 498086 513192 509135 552145 548004 582244 598799 599539 581887 568325 576789 601747 649614
5395 649614 663316 694628 696926 705016 768471 809370 836440 929114 953937 1014653 1147897 1282573
5383 1282573 1434642 1549889 1651205 1737580 1723193 1709443 1643016 1584071 1556369 1584306 1623642
$$ packed form
5465C39861m9956K829P156J4182R3J5504J3908k9367L4152K4681l1175k775L9222
5452C78315J2164L1631Q373L3387L9876L4229K9644K6914Q4134R9236J09252J39738
5440A026893J92424K26621K57048J96056J15829L5787n2251n8865o7041p0544
5430A801957r6130j43171j55731j65549j19733q9834j17121q4213o8229o2788
5420F99458l6823n9128n2037j1466P493k0997p876K4577K531l7087J8162J4003
5408E40810m2724J5106m057M3010m141L4240J6555P40j7652j3562Q464K4958M7867
5395F49614J3702L1312K298Q090O3455M0899K7070R2674K4823O0716J33244J34676
5383A282573J52069J15247J01316Q6375j4387j3750o6427n8945k7702K7937L9336
$$ plain form
5372 1623642 1706297 1850577 2082859 2366378 2736107 3144487 3591467 4074389 4607268 5172702
5362 5172702 5792993 6551662 7414540 8545201 9804146 11010207 11934393 12441920 12427335
5353 12427335 11927016 10986404 9869715 8657494 7388605 6230644 5211235 4427053 3831442
5344 3831442 3418575 3160980 2904110 2695961 2496851 2361152 2216350 2087043 1988342 1903195
5334 1903195 1814434 1737741 1705209 1687261 1642475 1610204 1601509 1616799 1623391 1610175 1634713 1601304
5322 1601304 1567638 1558697 1544657 1506501 1511861 1527229 1559072 1651169 1734944 1843968 1982688
5311 1982688 2155232 2350089 2555161 2769109 3001468 3254142 3476061 3717771 4001802 4465903
5301 4465903 5084205 5844329 6684862 7461327 8053705 8361058 8264297 7852753 7250584 6468224
$$ packed form
5372A623642Q2655J44280K32282K83519L69729M08380M46980M82922N32879N65434
5362E172702O20291P58669Q62878J130661J258945J206061R24186N07527j4585
5353A2427335n00319r40612j116689j212221j268889j157961j019409p84182n95611
5344C831442m12867k57595k56870k08149j99110j35699j44802j29307r8701q5147
5334A903195q8761p6693l2532j7948m4786l2271q695J5290O592j3216K4538l3409
5322A601304l3666q941j4040l8156N360J5368L1843R2097Q3775J09024J38720
5311A982688J72544J94857K05072K13948K32359K52674K21919K41710K84031M64101
5301D465903O18302P60124Q40533P76465N92378L07353r6761m11544o02169p82360
$$ plain form
5291 6468224 5609588 4780487 4028693 3371673 2841058 2468181 2163844 1939118 1746386 1603044
5281 1603044 1496541 1420102 1302749 1223584 1135540 1063057 1001156 960974 913247 860997 836355
5270 836355 799209 777200 769237 719966 697608 700464 679645 685799 664671 677764 647091 603945
5258 603945 637431 634194 616231 612790 580027 562626 548500 541287 513991 535366 530449 504815
5246 504815 492241 483818 485496 468672 445593 457499 435244 450772 440503 456844 495174 473237
5234 473237 501376 514509 467340 457288 492395 525283 572842 568509 562845 573090 571690 581960
5222 581960 564669 574206 570166 545734 527366 532571 516069 521067 518497 505112 491629 497671 527092
5209 527092 511287 524175 531775 513313 443771 437348 477440 483359 437871 387018 426699 419674
$$ packed form
5291F468224q58636q29101p51794o57020n30615l72877l04337k24726j92732j43342
5281A603044j06503p6439j17353p9165q8044p2483o1901m0182m7727n2250k4642
5270H36355l7146k2009p963m9271k2358K856k0819O154k1128J3093l0673m3146
5258F03945L3486l237j7963l441l2763j7401j4126p213k7296K1375m917k5634
5246E04815j2574q423J678j6824k3079J1906k2255J5528j0269J6341L8330k1937
5234D73237K8139J3133m7169j0052L5107L2888M7559m333n664J0245j400J0270
5222E81960j7291R537m040k4432j8368N205j6502M998k570j3385j3483O042K9421
5209E27092j5805J2888P600j8462o9542o423M0092N919m5488n0853L9681p025
$$ plain form
5197 419674 449080 422211 364890 354029 372841 358229 368766 376203 361511 367464 363444 357706
5185 357706 332412 310847 326912 340206 360660 361083 350427 321435 324656 346191 351575 373586
5173 373586 350451 336154 342443 345060 356483 365881 319450 340540 389770 393823 410493 434735
5161 434735 420163 417678 420802 455266 469952 468630 474699 500711 492511 498092 495449 518724 537920
5148 537920 561847 572638 605294 649077 665759 657279 673100 700953 673503 711396 745361 734858
5136 734858 734165 736067 738191 727502 748331 749404 737566 725707 710343 697536 707061 706716 704261
5123 704261 728155 764254 766213 743697 768600 761168 757569 775236 766488 758321 800604 806784 772025
5110 772025 791138 784819 781389 848183 846111 835875 862355 874672 891003 923008 983842 1035618
$$ packed form
5197D19674K9406k6869n7321j0861J8812j4612J0537P437j4692N953m020n738
5185C57706k5294k1565J6065J3294K0454M23j0656k8992L221K1535N384K2011
5173C73586k3135j4297O289K617J1423R398m6431K1090M9230M053J6670K4242
5161D34735j4572k485L124L4464J4686j322O069K6012q200N581k643K3275J9196
5148E37920K3927J0791L2656M3783J6682q480J5821K7853k7450L7893L3965j0503
5136G34858o93J902K124j0689K0829J073j1838j1859j5364j2807R525l45k455
5123G04261K3894L6099J959k2516K4903p432l599J7667q748q167M2283O180l4759
5110G72025J9113o319l430O6794k072j0236K6480J2317J6331L2005O0834N1776
$$ plain form
5098 1035618 1101564 1181170 1291796 1408662 1516810 1664795 1861271 1988987 2069151 2103451
5088 2103451 2094689 2092391 2053198 2007807 1954460 1932292 1942573 2022903 2133531 2247735 2312492
5077 2312492 2330783 2244091 2137529 2079192 1956237 1808503 1662880 1558305 1500113 1419672
5067 1419672 1393786 1378760 1347262 1354452 1383127 1380903 1380631 1356579 1334704 1367675 1418760 1437157
5055 1437157 1488711 1511043 1555913 1614875 1649589 1648458 1688164 1737571 1766798 1801325 1821257 1881550
5043 1881550 1960798 2003531 2051513 2139176 2176371 2206798 2276180 2285905 2325788 2402662 2403973 2460651
5031 2460651 2484639 2534219 2604020 2635835 2705173 2793656 2885343 3002687 3168913 3441845 3757933
5020 3757933 4082517 4501378 5001717 5505959 5865334 6040373 6084236 6028026 5938834 5798410
$$ packed form
5098A035618O5946P9606J10626J16866J08148J47985J96476J27716Q0164L4300
5088B103451q762k298l9193m5391n3347k2168J0281Q0330J10628J14204O4757
5077B312492J8291q6692j06562n8337j22955j47734j45623j04575n8192q0441
5067A419672k5886j5026l1498P190K8675k224k72k4052k1875L2971N1085J8397
5055A437157N1554K2332M4870N8962L4714j131L9706M9407K9227L4527J9932O0293
5043A881550P9248M2733M7982Q7663L7195L0427O9382R725L9883P6874J311N6678
5031B460651K3988M9580O9801L1815O9338Q8483R1687J17344J66226K72932L16088
5020C757933L24584M18861N00339N04242L59375J75039M3863n6210q9192j40424
$$ plain form
5010 5798410 5675348 5581163 5609396 5745347 6012161 6325625 6502026 6462297 6295072 6050115
5000 6050115 5721490 5311818 4932826 4559458 4237042 3937988 3716752 3645036 3555546 3464926
4990 3464926 3402012 3347894 3302433 3282091 3247799 3201893 3178027 3164396 3112899 3088754 3046663
4979 3046663 3031908 2982350 2960436 2938990 2888880 2837232 2790556 2728668 2699761 2706140 2673890 2694115
4967 2694115 2694773 2703540 2714594 2743957 2759723 2763215 2783139 2813537 2831834 2824307 2856334 2871324
4955 2871324 2950085 3026979 3088531 3167694 3284911 3444200 3593373 3708333 3865571 4128501
4945 4128501 4506660 4997974 5603670 6402824 7363729 8416323 9236153 9621221 9617626 9479880
4935 9479880 9182313 8769243 8401834 8217443 8212988 8467779 9033199 9776495 10314630 10366895
$$ packed form
5010E798410j23062r4185K8233J35951K66814L13464J76401l9729j67225k44957
5000F050115l28625m09672l78992l73368l22416k99054k21236p1716q9490r0620
4990C464926o2914n4118m5461k0342l4292m5906k3866j3631n1497k4145m2091
4979C046663j4755m9558k1914k1446n0110n1648m6676o1888k8907O379l2250K0225
4967B694115O58Q767J1054K9363J5766L492J9924L0398J8297p527L2027J4990
4955B871324P8761P6894O1552P9163J17217J59289J49173J14960J57238K62930
4945D128501L78159M91314O05696P99154R60905J052594Q19830L85068l595j37746
4935I479880k97567m13070l67409j84391m455K54791N65420P43296N38135N2265
$$ plain form
4925 10366895 10115121 9664157 9047124 8323511 7518305 6740556 6098813 5560026 5193573
4916 5193573 4980514 4871806 4797768 4717476 4662686 4664202 4702589 4712047 4741306 4830246 4934505
4905 4934505 5048865 5162506 5312430 5406203 5522706 5672030 5795296 5914494 6050531 6190564
4895 6190564 6330931 6447654 6562114 6632418 6730919 6803070 6870003 6942182 7010341 7107408 7253935
4884 7253935 7387808 7493744 7644097 7807169 7964708 8104406 8292522 8469248 8622880 8723985
4874 8723985 8783318 8834184 8845485 8875341 8852538 8841394 8831642 8769325 8713083 8602816 8466818
4863 8466818 8323204 8151749 7996291 7854151 7793322 7735209 7685517 7700476 7743584 7822327 7958207
4852 7958207 8134500 8290095 8436681 8564312 8686841 8791033 8842550 8813300 8791956 8754059
$$ packed form
4925A0366895k51774m50964o17033p23613q05206p77749o41743n38787l66453
4916E193573k13059j08708p4038q0292n4790J516L8387R458K9259Q8940J04259
4905D934505J14360J13641J49924R3773J16503J49324J23266J19198J36037J40033
4895F190564J40367J16723J14460P0304R8501P2151O6933P2179O8159R7067J46527
4884G253935J33873J05936J50353J63072J57539J39698J88116J76726J53632J01105
4874H723985N9333N0866J1301K9856k2803j1144r752o2317n6242j10267j35998
4863H466818j43614j71455j55458j42140o0829n8113m9692J4959M3108P8743J35880
4852G958207J76293J55595J46586J27631J22529J04192N1517k9250k1344l7897
$$ plain form
4842 8754059 8681668 8628630 8567105 8502975 8429883 8403029 8452603 8506174 8579782 8739585 8959077
4831 8959077 9202689 9509508 9856134 10256133 10734832 11349157 12016631 12756133 13675538 14726401
4821 14726401 15697549 16221966 16345878 16324385 16235266 16068921 15803720 15690764 15787027 16158226
4811 16158226 16840442 17853817 18944795 19725235 20007293 20079467 20087272 19961122 19685376 19422033
4801 19422033 19266441 19229689 19334946 19641868 20141479 20711316 21345845 22029473 22748794 23527920
4791 23527920 24395880 25323498 26334974 27451957 28658610 29967482 31286139 32669632
4783 32669632 34080798 35514789 37013897 38498016 40061848 41623172 43248441 44963297
4775 44963297 46678262 48410483 50198131 52009762 53827535 55570344 57207898 58749839
$$ packed form
4842H754059p2391n3038o1525o4130p3092k6854M9574N3571P3608J59803K19492
4831H959077K43612L06819L46626L99999M78699O14325O67474P39502R19405J050863
4821A4726401R71148N24417J23912k1493q9119j66345k65201j12956R6263L71199
4811A6158226O82216J013375J090978P80440K82058P2174P805j26150k75746k63343
4801A9422033j55592l6752J05257L06922M99611N69837O34529O83628P19321P79126
4791B3527920Q67960R27618J011476J116983J206653J308872J318657J383493
4783C2669632J411166J433991J499108J484119J563832J561324J625269J714856
4775D4963297J714965J732221J787648J811631J817773J742809J637554J541941
$$ plain form
4767 58749839 60193106 61537713 62817548 64080117 65336434 66555396 67793195 69021847
4759 69021847 70296581 71677308 73170091 74755580 76457414 78260919 80125378 82066538
4751 82066538 83920118 85645433 87240809 88592644 89732548 90742198 91762322 92723507
4743 92723507 93273641 93287566 92787612 91865671 90646455 89166809 87631364 86117728 84665092
4734 84665092 83318989 82033080 80851770 79527098 78007439 76506517 75055308 73696873
4726 73696873 72386438 71207503 70152904 69110683 68121165 67207045 66204752 65214610 64180102
4717 64180102 63078062 61978916 60918510 59940567 59026174 58302360 57658541 57086902 56659978
4708 56659978 56340566 56145692 56115269 56306840 56601265 57055470 57640722 58384057 59254400 60382611
$$ packed form
4767E8749839J443267J344607J279835J262569J256317J218962J237799J228652
4759F9021847J274734J380727J492783J585489J701834J803505J864459J941160
4751H2066538J853580J725315J595376J351835J139904J009650J020124R61185
4743I2723507N50134J3925m99954r21941j219216j479646j535445j513636j452636
4734H4665092j346103j285909j181310j324672j519659j500922j451209j358435
4726G3696873j310435j178935j054599j042221r89518r14120j002293r90142j034508
4717F4180102j102040j099146j060406r77943r14393p23814o43819n71639m26924
4708E6659978l19412j94874l0423J91571K94425M54205N85252P43335Q70343J128211
$$ plain form
4698 60382611 61893362 63830574 66365715 69712626 74057380 79528040 86064993 93106077
4690 93106077 99455531 104206314 106978651 107421273 106474295 105044663 103419760 102154800
4682 102154800 101901637 103153709 105876797 109436135 112567690 114468954 114814253 112788549
4674 112788549 108816521 103935087 98305466 92302017 86449852 81198860 76751535 73003873
4666 73003873 69900100 67354125 65154456 63238773 61541577 60014028 58676444 57442405
4658 57442405 56305522 55144405 53968790 52753498 51444477 50111283 48770367 47436435
4650 47436435 46171178 44953039 43901461 42954547 42090829 41318493 40557883 39842947 39217242
4641 39217242 38644056 38177847 37749387 37422394 37202379 37154006 37241382 37383223 37559947 37758104
$$ packed form
4698F0382611J510751J937212K535141L346911M344754N470660O536953P041084
4690I3106077O349454M750783K772337M42622r46978j429632j624903j264960
4682A02154800k53163J252072K723088L559338L131555J901264L45299k025704
4674A12788549l972028m881434n629621o003449n852165n250992m447325l747662
4666G3003873l103773k545975k199669j915683j697196j527549j337584j234039
4658E7442405j136883j161117j175615j215292j309021j333194j340916j333932
4650D7436435j265257j218139j051578r46914q63718p72336p60610p14936o25705
4641C9217242n73186m66209m28460l26993k20015m8373Q7376J41841J76724J98157
$$ plain form
4631 37758104 37951096 38102607 38268153 38406492 38549727 38713516 38816162 38954989 39118230
4622 39118230 39240210 39328900 39355916 39438296 39579172 39897537 40408395 41070202 41840592 42674711
4612 42674711 43448253 44232789 45117335 45997725 46929137 47915569 48913405 49878747 50706441
4603 50706441 51352872 51921088 52305684 52541023 52691448 52722146 52520193 52105217 51479394 50602526
4593 50602526 49622928 48566145 47632003 46834622 46191444 45781163 45597802 45619322 45734488
4584 45734488 45867697 45947726 45997651 46026302 45996336 45917272 45719459 45459403 45131892 44772426
4574 44772426 44400454 43942001 43418155 42767266 42014330 41088881 40048382 38882328 37634382
4565 37634382 36379144 35165320 34056459 33043467 32107765 31297853 30542529 29758575 28961986
$$ packed form
4631C7758104J92992J51511J65546J38339J43235J63789J02646J38827J63241
4622C9118230J21980Q8690K7016Q2380J40876L18365N10858O61807P70390Q34119
4612D2674711P73542P84536Q84546Q80390R31412R86432R97836R65342Q27694
4603E0706441O46431N68216L84596K35339J50425L0698k01953m14976o25823q76868
4593E0602526r79598j056783r34142p97381o43178m10281j83361K1520J15166
4584D5734488J33209Q0029M9925K8651k9966p9064j97813k60056l27511l59466
4574D4772426l71972m58453n23846o50889p52936r25449j040499j166054j247946
4565C7634382j255238j213824j108861j012992r35702q09912p55324p83954p96589
$$ plain form
4556 28961986 28178824 27366250 26570422 25873451 25250867 24695495 24180790 23661829 23129768
4547 23129768 22597169 21971813 21351320 20665960 20006190 19349737 18746036 18164818 17591245
4538 17591245 17023815 16483043 15973650 15467044 15025201 14678174 14380397 14158193 14034643
4529 14034643 13980471 13980493 14134888 14333424 14706485 15274214 16105973 17342323 19045041 21290187
4519 21290187 24124783 27400254 30580296 32949810 34639504 35825509 35865345 34357415
4511 34357415 32008385 29373357 26559277 23731063 21064619 18826820 17023980 15620711
4503 15620711 14588255 13854849 13319069 12916154 12601395 12334077 12096151 11915828 11774099
4494 11774099 11665518 11573673 11513059 11405177 11304221 11181650 11079792 11020167 10949061 10886700
$$ packed form
4556B8961986p83162q12574p95828o96971o22584n55372n14705n18961n32061
4547B3129768n32599o25356o20493o85360o59770o56453o03701n81218n73573
4538A7591245n67430n40772n09393n06606m41843l47027k97777k22204j23550
4529A4034643n4172K2J54395J98536L73061N67729Q31759J236350J702718K245146
4519B1290187K834596L275471L180042K369514J689694J186005L9836j507930
4511C4357415k349030k635028k814080k828214k666444k237799j802840j403269
4503A5620711j032456p33406n35780m02915l14759k67318k37926j80323j41729
4494A1774099j08581r1845o0614j07882j00956j22571j01858n9625p1106o2361
$$ plain form
4484 10886700 10905052 10921244 10978829 11065186 11166551 11228346 11312971 11442081 11599451 11720576
4474 11720576 11879369 12009596 12206033 12459330 12750954 13088053 13458435 13885330 14430686
4465 14430686 15047919 15896693 17030018 18620557 20784923 23608792 27140712 31098121
4457 31098121 35017468 38231438 40315344 41494242 42195549 42828396 43794861 45628803 48759297
4448 48759297 53408372 59256944 65025797 68545063 68733691 66877871 63777657 59735221
4440 59735221 55193633 51092501 48130597 46274346 45331667 44802146 43956109 42404772 40190275
4431 40190275 37533056 34536576 31508660 28687142 26166341 24068208 22389025 21145381
4423 21145381 20208249 19488339 18899305 18475384 18124571 17867047 17703826 17658819 17736391 17929906
$$ packed form
4484A0886700J8352J6192N7585Q6357J01365O1795Q4625J29110J57370J21125
4474A1720576J58793J30227J96437K53297K91624L37099L70382M26895N45356
4465A4430686O17233Q48774J133325J590539K164366K823869L531920L957409
4457C1098121L919347L213970K083906J178898P01307O32847R66465J833942L130494
4448D8759297M649075N848572N768853L519266J88628j855820l100214m042436
4440E9735221m541588m101132k961904j856251r42679n29521q46037j551337k214497
4431D0190275k657219k996480l027916k821518k520801k098133j679183j243644
4423B1145381r37132p19910n89034m23921l50813k57524j63221m5007P7572J93515
$$ plain form
4413 17929906 18203011 18420656 18510676 18426695 18379938 18316297 18219646 18165773 18125561 18190660 18315794
4402 18315794 18543693 18937262 19580612 20539080 21904223 23918195 26459932 29000952 30558934
4393 30558934 30829950 30664680 30324053 29801334 29514020 29993148 31368934 33925679 37919336
4384 37919336 42676671 45801933 45531933 44059638 42264071 39636091 36649797 34124181
4376 34124181 32568802 31763895 31854074 32877968 33848260 33693084 32710090 31645972 30218432
4367 30218432 28523930 26798704 25252866 23874990 22612032 21592092 20786882 20147653
4359 20147653 19615902 19245656 18977584 18776993 18595940 18500977 18413975 18400265 18437639 18525502
4349 18525502 18647308 18827139 19156600 19582726 20135928 20856473 21687212 22654013 23730891
$$ packed form
4413A7929906K73105K17645R0020q3981m6757o3641r6651n3873m0212O5099J25134
4402A8315794K27899L93569O43350R58468J365143K013972K541737K541020J557982
4393C0558934K71016j65270l40627n22719k87314M79128J375786K556745L993657
4384C7919336M757335L125262k70000j472295j795567k627980k986294k525616
4376C4124181j555379q04907R0179J023894R70292j55176r82994j064118j427540
4367C0218432j694502j725226j545838j377876j262958j019940q05210o39229
4359B0147653n31751l70246k68072k00591j81053r4963q7002j3710L7374Q7863
4349A8525502J21806J79831L29461M26126N53202P20545Q30739R66801J076878
$$ plain form
4340 23730891 24656247 25156432 25321406 25372883 25289196 25098449 24838423 24590708 24419969 24310072
4330 24310072 24324240 24350029 24318970 24270433 24187028 24121089 24077678 24113111 24261108 24600571 25219247
4319 25219247 26030285 27052368 28239283 29581400 30961239 32249304 33048612 33283063 33318753
4310 33318753 33256402 33100986 33025725 33185384 33683719 34467082 35653556 37212586 38780199
4301 38780199 39497304 39220007 38726735 38024870 36940258 35716283 34532126 33613090 32863411
4292 32863411 32392243 32350697 32507234 32476557 32189911 31981907 31848585 31755351 31809742 32153491
4282 32153491 32810407 33815374 35273356 37332931 40324349 44617078 50467564 57987174
4274 57987174 67585454 79372631 92346049 102957663 108556720 111868771 115402542 118772078
$$ packed form
4340B3730891R25356N00185J64974N1477q3687j90747k60026k47715j70739j09897
4330B4310072J4168K5789l1059m8537q3405o5939m3411L5433J47997L39463O18676
4319B5219247Q11038J022083J186915J342117J379839J288065P99308K34451L5690
4310C3318753o2351j55416p5261J59659M98335P83363J186474J559030J567613
4301C8780199P17105k77297m93272p01865j084612j223975j184157r19036p49679
4292C2863411m71168m1546J56537l0677k86646k08004j33322r3234N4391L43749
4282C2153491O56916J004967J457982K059575K991418M292729N850486P519610
4274E7987174R598280J1787177J2973418J0611614N599057L312051L533771L369536
$$ plain form
4266 118772078 121647245 122534696 118376694 109887005 100553221 91224878 81290843 71021339
4258 71021339 61325159 53132547 46468260 41579613 38610947 37115246 36812169 37420677
4250 37420677 38369854 38601463 37831031 36761748 35600030 34363050 33281328 32784131 33187864
4241 33187864 34376188 36699621 40300158 44202952 46028115 45266419 43958673 42247306
4233 42247306 39864365 37305327 35170768 33792018 32897417 32799820 33602326 34691936 35043416
4224 35043416 34415561 33504015 32414721 30971489 29307669 27855736 26741022 25827254 25170184
4215 25170184 24628584 24136643 23659087 23211997 22787378 22394450 22008852 21625293 21255970
4206 21255970 20885538 20461177 19945999 19415747 18821488 18183445 17587791 16961212 16374857
$$ packed form
4266A18772078K875167Q87451m158002q489689r333784r328343r934035j0269504
4258G1021339r696180q192612o664287m888647k968666j495701l03077O08508
4250C7420677R49177K31609p70432j069283j161718j236980j081722m97197M03733
4241C3187864J188324K323433L600537L902794J825163p61696j307746j711367
4233D2247306k382941k559038k134559j378750q94601r7597Q02506J089610L51480
4224C5043416o27855r11546j089294j443232j663820j451933j114714r13768o57070
4215B5170184n41600m91941m77556m47090m24619l92928l85598l83559l69323
4206B1255970l70432m24361n15178n30252n94259o38043n95654o26579n86355
$$ plain form
4197 16374857 15853335 15378204 15001536 14717990 14556998 14422546 14316063 14237722 14130699 13961799
4187 13961799 13756157 13522645 13189911 12833621 12435397 12023777 11599695 11140552 10716793
4178 10716793 10302604 9918975 9564246 9241656 8939813 8678369 8436058 8247593 8070104
4169 8070104 7899224 7733648 7590673 7456641 7316388 7178903 7053937 6908122 6784562 6691941
4159 6691941 6580417 6465627 6404339 6362857 6351837 6376889 6379182 6416971 6429970 6500282 6562917
4148 6562917 6606280 6600072 6553615 6460767 6392027 6286320 6209901 6171259 6144499 6120657 6128622 6146488
4136 6146488 6216270 6258053 6273231 6312577 6348203 6388464 6426775 6560252 6690728 6844292 7102525
4125 7102525 7460068 7968363 8550212 9240260 10153225 11127702 11873754 12271685 12578512 12903324
$$ packed form
4197A6374857n21522m75131l76668k83546j60992j34452j06483p8341j07023j68900
4187A3961799k05642k33512l32734l56290l98224m11620m24082m59143m23759
4178A0716793m14189l83629l54729l22590l01843k61444k42311j88465j77489
4169H070104j70880j65576j42975j34032j40253j37485j24966j45815j23560r2621
4159F691941j11524j14790o1288m1482j1020K5052K293L7789J2999P0312O2635
4148F562917M3363o208m6457r2848o8740j05707p6419l8642k6760k3842P965J7866
4136F146488O9782M1783J5178L9346L5626M0261L8311J33477J30476J53564K58233
4125G102525L57543N08295N81849O90048R12965R74477P46052L97931L06827L24812
$$ plain form
4115 12903324 13285434 13649568 13828302 13646991 13317658 12986086 12751148 12701810 12874685 13387595
4105 13387595 14243143 15074914 15890402 16744505 17513483 18109764 18587526 19029574 19200238
4096 19200238 18790877 17754154 16502066 15208351 13876685 12523062 11317020 10324852
4088 10324852 9469357 8784563 8230928 7802948 7521291 7312231 7117057 6973034 6884197 6865647
4078 6865647 6882447 6896953 6932360 6980876 7052701 7149553 7197797 7304289 7365931 7427244 7605124
4067 7605124 7756056 7954014 8178984 8426397 8714484 9002995 9250622 9458200 9640545 9813701
4057 9813701 9949733 10107780 10263332 10366404 10502157 10663910 10858635 11169236 11547036 11997914
4047 11997914 12544593 13149363 13728789 14215233 14569382 14846207 15009834 15111659 15236659
$$ packed form
4115A2903324L82110L64134J78734j81311l29333l31572k34938m9338J72875N12910
4105A3387595Q55548Q31771Q15488Q54103P68978N96281M77762M42048J70664
4096A9200238m09361j036723j252088j293715j331666j353623j206042r92168
4088A0324852q55495o84794n53635m27980k81657k09060j95174j44023q8837j8550
4078F865647J6800J4506L5407M8516P1825R6852M8244J06492O1642O1313J77880
4067G605124J50932J97958K24970K47413K88087K88511K47627K07578J82345J73156
4057I813701J36032J58047J55552J03072J35753J61753J94725L10601L77800M50878
4047A1997914N46679O04770N79426M86444L54149K76825J63627J01825J25000
$$ plain form
4038 15236659 15366715 15531075 15789027 16106106 16437211 16821837 17150375 17441621 17724149
4029 17724149 17909595 18007210 18020940 17950937 17862453 17746637 17673706 17658362 17686803 17824016 18065359
4018 18065359 18337834 18582059 18726849 18736572 18598159 18363912 18097534 17739795 17326509 16948204
4008 16948204 16648896 16373326 16163667 16044382 16029918 16069851 16172300 16322773 16456521 16620179
3998 16620179 16832705 17040220 17246642 17448487 17677850 18014693 18358551 18735358 19174537
3989 19174537 19624870 20045411 20458805 20837648 21281867 21619831 21999945 22443958 22883967
3980 22883967 23418126 23893291 24408805 24935489 25433629 26006047 26577901 27211590 27885116
3971 27885116 28528315 29254073 30005561 30725554 31365771 32036567 32743905 33396894 34053543
$$ packed form
4038A5236659J30056J64360K57952L17079L31105L84626L28538K91246K82528
4029A7724149J85446R7615J3730p0003q8484j15816p2931j5344K8441J37213K41343
4018A8065359K72475K44225J44790R723j38413k34247k66378l57739m13286l78305
4008A6948204k99308k75570k09659j19285j4464L9933J02449J50473J33748J63658
3998A6620179K12526K07515K06422K01845K29363L36843L43858L76807M39179
3989A9174537M50333M20541M13394L78843M44219L37964L80114M44013M40009
3980B2883967N34159M75165N15514N26684M98140N72418N71854O33689O73526
3971B7885116O43199P25758P51488P19993O40217O70796P07338O52989O56649
$$ plain form
3962 34053543 34716591 35395771 36145741 36958012 37832060 38721345 39647290 40611309 41534505
3953 41534505 42421118 43281758 44073419 44854897 45594922 46301904 47019213 47817968 48717786
3944 48717786 49718978 50835935 52061613 53386750 54772952 56202536 57702767 59316514
3936 59316514 61053115 62945766 65073673 67383112 69867794 72447099 75038275 77566271
3928 77566271 80049114 82578447 85143442 87819342 90645925 93698446 97017681 100510060
3920 100510060 104168032 107785271 111265355 114578079 117746838 120780479 123485020 125778508
3912 125778508 127640503 129275687 130842787 132496750 134318882 136363320 138676408 141250717
3904 141250717 144076898 147096060 150172683 153223885 156082983 158512774 160415085 161532171
$$ packed form
3962C4053543O63048O79180P49970Q12271Q74048Q89285R25945R64019R23196
3953D1534505Q86613Q60640P91661P81478P40025P06982P17309P98755Q99818
3944D8717786J001192J116957J225678J325137J386202J429584J500231J613747
3936E9316514J736601J892651K127907K309439K484682K579305K591176K527996
3928G7566271K482843K529333K564995K675900K826583L052521L319235L492379
3920A00510060L657972L617239L480084L312724L168759L033641K704541K293488
3912A25778508J861995J635184J567100J653963J822132K044438K313088K574309
3904A41250717K826181L019162L076623L051202K859098K429791J902311J117086
$$ plain form
3896 161532171 161805547 161350988 160401622 159119925 157674019 156218356 154842818 153561562
3888 153561562 152389988 151310019 150153817 148687041 146686175 144238292 141477500 138472353
3880 138472353 135165080 131592644 128064563 124746820 121669205 118997814 116665210 114748848
3872 114748848 113270554 112063136 111026207 109802547 108107169 105830596 103025540 99800472
3864 99800472 96216716 92462189 88743707 85260779 82099201 79195736 76525990 74131755
3856 74131755 71851014 69684346 67570342 65530432 63615176 61877736 60333012 58997974
3848 58997974 57810773 56767836 55796122 54876937 53943812 52921327 51878194 50860797 49869292
3839 49869292 48965834 48112460 47270332 46476319 45694629 44878985 44024889 43177630 42315177
$$ packed form
3896A61532171K73376m54559r49366j281697j445906j455663j375538j281256
3888A53561562j171574j079969j156202j466776k000866k447883k760792l005147
3880A38472353l307273l572436l528081l317743l077615k671391k332604j916362
3872A14748848j478294j207418j036929j223660j695378k276573k805056l225068
3864I9800472l583756l754527l718482l482928l161578k903465k669746k394235
3856G4131755k280741k166668k114004k039910j915256j737440j544724j335038
3848E8997974j187201j042937r71714r19185r33125j022485j043133j017397r91505
3839D9869292r03458q53374q42128p94013p81690q15644q54096q47259q62453
$$ plain form
3830 42315177 41443165 40592785 39803517 39047274 38352488 37834073 37402009 37059047 36790257
3821 36790257 36590263 36452255 36415645 36394751 36288429 36135116 35940528 35674929 35386322 35106239
3811 35106239 34807229 34482701 34100288 33709917 33305349 32903909 32499746 32206928 31970735
3802 31970735 31824589 31698983 31613461 31584830 31558557 31534024 31464282 31345394 31151570 30916378
3792 30916378 30744413 30582946 30518874 30576869 30758143 31019908 31350438 31776058 32193539 32435195
3782 32435195 32557590 32541415 32360595 32052563 31661602 31190639 30669986 30143464 29662563 29218847
3772 29218847 28788250 28393143 28086386 27835029 27640725 27537108 27447365 27348128 27246390 27051979
3762 27051979 26755722 26378077 25963065 25541302 25133308 24754050 24462526 24303834 24250386 24280100
$$ packed form
3830D2315177q72012q50380p89268p56243o94786n18415m32064l42962k68790
3821C6790257j99994j38008l6610k0894j06322j53313j94588k65599k88607k80083
3811C5106239k99010l24528l82413l90371m04568m01440m04163k92818k36193
3802C1970735j46146j25606q5522k8631k6273k4533o9742j18888j93824k35192
3792C0916378j71965j61467o4072N7995J81274K61765L30530M25620M17481K41656
3782C2435195J22395j6175j80820l08032l90961m70963n20653n26522m80901m43716
3772B9218847m30597l95107l06757k51357j94304j03617q9743r9237j01738j94411
3762B7051979k96257l77645m15012m21763m07994l79258k91524j58692n3448K9714
$$ plain form
3752 24280100 24348888 24435410 24446614 24437559 24411396 24281171 24024016 23666740 23249843 22746016
3742 22746016 22211884 21698884 21176260 20704525 20316170 19964124 19648895 19357082 19128722
3733 19128722 18875192 18661880 18389516 18115309 17802385 17446824 17104916 16788815 16451737
3724 16451737 16064664 15690010 15388896 15088790 14805183 14579922 14288737 14069282 13794012
3715 13794012 13495439 13172257 12868506 12571276 12279952 11944663 11553159 11109590 10658605
3706 10658605 10217035 9801740 9416481 9052749 8725550 8478364 8269357 8177069 8096087 8049996
3696 8049996 7993279 7955414 7926331 7868809 7767990 7656363 7504983 7326164 7121668 6914523
3686 6914523 6726107 6526853 6285360 6093528 5881906 5695145 5511645 5346174 5176467 5024052
$$ packed form
3752B4280100O8788Q6522J1204r055k6163j30225k57155l57276m16897n03827
3742B2746016n34132n13000n22624m71735l88355l52046l15229k91813k28360
3733A9128722k53530k13312k72364k74207l12924l55561l41908l16101l37078
3724A6451737l87073l74654l01114l00106k83607k25261k91185k19455k75270
3715A3794012k98573l23182l03751k97230k91324l35289l91504m43569m50985
3706A0658605m41570m15295l85259l63732l27199k47186k09007r2288q0982m6091
3696H049996n6717l7865k9083n7522j00819j11627j51380j78819k04496k07145
3686F914523j88416j99254k41493j91832k11622j86761j83500j65471j69707j52415
$$ plain form
3676 5024052 4910248 4786614 4677248 4581749 4513851 4441921 4360664 4286389 4244589 4186150 4090555
3665 4090555 3951491 3834632 3714038 3602718 3489855 3400453 3336473 3283561 3232093 3215208
3655 3215208 3189398 3199934 3173128 3187448 3187676 3160505 3144499 3117305 3059376 3018446 2966150 2894899
3643 2894899 2840692 2745884 2679226 2642188 2590349 2567208 2532344 2512400 2484241 2482701 2475745 2451428
3631 2451428 2450799 2427768 2407804 2429168 2385810 2383189 2391832 2409947 2387714 2365624 2394420 2383456
3619 2383456 2360115 2322008 2271257 2274067 2267717 2243207 2246224 2229378 2218601 2203787 2191107 2201623
3607 2201623 2194169 2224233 2235734 2247266 2218424 2231179 2253640 2243155 2236332 2197316 2227266 2246438
3595 2246438 2260052 2282678 2287549 2285881 2318133 2328643 2365778 2407554 2414724 2400762 2383013 2341639
$$ packed form
3676E024052j13804j23634j09366r5499o7898p1930q1257p4275m1800n8439r5595
3665D090555j39064j16859j20594j11320j12863q9402o3980n2912n1468j6885
3655C215208k5810J0536k6806J4320K28k7171j6006k7194n7929m0930n2296p1251
3643B894899n4207r4808o6658l7038n1839k3141l4864j9944k8159j540o956k4317
3631B451428o29k3031j9964K1364m3358k621Q643J8115k2233k2090K8796j0964
3619B383456k3341l8107n0751K810o350k4510L017j6846j0777j4814j2680J0516
3607B201623p454L0064J1501J1532k8842J2755K2461j0485o823l9016K9950J9172
3595B246438J3614K2626M871j668L2252J0510L7135M1776P170j3962j7749m1374
$$ plain form
3583 2341639 2369179 2363703 2343172 2348325 2367130 2355890 2361228 2374432 2372439 2385436 2424870 2470347
3571 2470347 2537258 2553813 2576921 2699509 2760337 2804672 2889513 2970108 3050683 3091106 3114976
3560 3114976 3179230 3187575 3174141 3180188 3180539 3157756 3123394 3115766 3124568 3166805 3193854 3244715 3311002
3547 3311002 3387912 3488091 3561638 3598803 3663845 3748336 3832474 3959636 4108626 4211736 4361459
3536 4361459 4543426 4765710 5067846 5371799 5679151 5900969 6129846 6334926 6508626 6643116
3526 6643116 6756937 6828614 6881587 6989168 7034512 7108350 7216937 7310568 7395870 7487779 7561601
3515 7561601 7587410 7669675 7694728 7777522 7881331 7905872 8031155 8150660 8328932 8566073
3505 8566073 8824460 9202735 9599184 10060883 10605188 11147231 11610292 11982058 12340580 12746021
$$ packed form
3583B341639K7540n476k0531N153J8805j1240N338J3204j993J2997L9434M5477
3571B470347O6911J6555K3108J22588O0828M4335Q4841Q0595Q0575M0423K3870
3560C114976O4254Q345j3434O047L51k2783l4362p628Q802M2237K7049N0861O6287
3547C311002P6910J00179P3547L7165O5042Q4491Q4138J27162J48990J03110J49723
3536D361459J81967K22284L02136L03953L07352K21818K28877K05080J73700J34490
3526F643116J13821P1677N2973J07581M5344P3838J08587R3631Q5302R1909P3822
3515G561601K5809Q2265K5053Q2794J03809K4541J25283J19505J78272K37141
3505H566073K58387L78275L96449M61699N44305N42043M63061L71766L58522M05441
$$ plain form
3495 12746021 13127528 13460119 13737438 13955441 14169548 14416930 14682816 14972382 15287186
3486 15287186 15555540 15833977 16165852 16483775 16761952 17026263 17271056 17519802 17827261
3477 17827261 18140788 18508249 18942097 19480590 20129112 20863578 21674995 22659927 23763690
3468 23763690 24812743 25786130 26736603 27653157 28464297 29265565 30100209 30983698 31974766
3459 31974766 33165319 34586782 36332819 38460524 41048162 44128007 47701361 51767916
3451 51767916 56158642 60804765 65461004 70044242 74366831 78009187 80798103 82519733
3443 82519733 83140996 82734754 81293375 78905210 75835721 72421141 68807776 65211574
3435 65211574 61647764 58218566 55033201 51986135 49174442 46499003 43932466 41472624
$$ packed form
3495A2746021L81507L32591K77319K18003K14107K47382K65886K89566L14804
3486A5287186K68354K78437L31875L17923K78177K64311K44793K48746L07459
3477A7827261L13527L67461M33848N38493O48522P34466Q11417R84932J103763
3468B3763690J049053R73387R50473R16554Q11140Q01268Q34644Q83489R91068
3459C1974766J190553J421463J746037K127705K587638L079845L573354M066555
3451E1767916M390726M646123M656239M583238M322589L642356K788916J721630
3443H2519733O21263m06242j441379k388165l069489l414580l613365l596202
3435F5211574l563810l429198l185365l047066k811693k675439k566537k459842
$$ plain form
3427 41472624 39179023 36903970 34713656 32628196 30691412 28856216 27051808 25355280
3419 25355280 23791958 22302291 20928605 19647025 18438003 17372321 16424947 15566309
3411 15566309 14800407 14130892 13538578 12995870 12530221 12064928 11593311 11167118 10761352
3402 10761352 10362506 9965773 9566887 9201550 8794569 8404382 8081880 7762381 7525205
3393 7525205 7241255 6973147 6754991 6546834 6342789 6138701 5913459 5725127 5529839 5345123
3383 5345123 5206914 5067570 4913463 4805236 4668118 4555058 4422342 4279012 4134090 3975069
3373 3975069 3854828 3763354 3650934 3548367 3410531 3280602 3215145 3113940 3031118 2937237
3363 2937237 2862306 2816469 2750037 2693397 2648833 2594496 2530810 2484735 2430150 2377336 2341199
$$ packed form
3427D1472624k293601k275053k190314k085460j936784j835196j804408j696528
3419B5355280j563322j489667j373686j281580j209022j065682r47374q58638
3411A5566309p65902o69515n92314n42708m65649m65293m71617m26193m05766
3402A0761352l98846l96733l98886l65337m06981l90187l22502l19499k37176
3393G525205k83950k68108k18156k08157k04045k04088k25242j88332j95288j84716
3383E345123j38209j39344j54107j08227j37118j13060j32716j43330j44922j59021
3373C975069j20241r1474j12420j02567j37836j29929o5457j01205q2822r3881
3363B937237p4931m5837o6432n6640m4564n4337o3686m6075n4585n2814l6137
$$ plain form
3352 2341199 2266727 2212685 2167087 2143164 2100254 2047494 2043650 2030722 1983751 1933232 1888457 1848707
3340 1848707 1823360 1791633 1750473 1698183 1668273 1632783 1636922 1587899 1543683 1509216 1496659 1495384
3328 1495384 1433727 1421821 1413395 1353616 1299331 1276863 1258430 1235725 1196413 1219353 1207977 1194194
3316 1194194 1157520 1122028 1136834 1130798 1110435 1094923 1059097 1056199 1072573 1080065 1041792 1014447
3304 1014447 1001199 988740 986876 1001805 1026687 1019247 1012519 1001334 1014718 1004201 987757 958537
3292 958537 941674 969156 975251 959393 954699 941641 920857 907681 948145 955738 966310 956255
3280 956255 953005 938249 912814 911766 920873 900596 877161 892647 920863 912917 913869 949201 952122
3267 952122 938914 915536 924073 944655 947990 948142 981605 968258 991637 994439 990188 983377 974132
$$ packed form
3352B341199p4472n4042m5598k3923m2910n2760l844j2928m6971n0519m4775l9750
3340A848707k5347l1727m1160n2290k9910l5490M139m9023m4216l4467j2557j275
3328A495384o1657j1906q426n9779n4285k2468j8433k2705l9312K2940j1376j3783
3316A194194l6674l5492J4806o036k0363j5512l5826k898J6374P492l8273k7345
3304A014447j3248j2459j864J4929K4882p440o728j1185J3384j0517j6444k9220
3292I58537j6863K7482O095j5858m694j3058k0784j3176M0464P593J0572j0055
3280I56255l250j4756k5435j048R107k0277k3435J5486K8216p946R52L5332K921
3267I52122j3208k3378Q537K0582L335J52L3463j3347K3379K802m251o811r245
$$ plain form
3254 974132 963192 984900 1012262 1006035 1038003 1049173 1049576 1066255 1059264 1061029 1091120 1092959 1071462
3241 1071462 1092151 1133212 1133060 1098019 1075032 1107920 1139381 1134531 1145812 1161502 1165917 1178167
3229 1178167 1149378 1119842 1126681 1190323 1223023 1250280 1256957 1250317 1271425 1294590 1323467 1332952
3217 1332952 1346506 1376240 1415747 1471825 1504577 1521257 1533409 1543385 1582726 1600738 1617881 1599999
3205 1599999 1609663 1660049 1694740 1699706 1713341 1748855 1777520 1819975 1851415 1844480 1845967 1878867
3193 1878867 1939127 1978537 2051074 2129683 2195200 2254238 2344928 2421850 2449087 2540570 2564452
3182 2564452 2658166 2771679 2795686 2877045 2970746 3073891 3184092 3262953 3333549 3386139 3416594
3171 3416594 3479283 3507238 3529827 3534027 3546145 3610322 3679262 3763914 3803007 3867530 3969310
$$ packed form
3254I74132j0940K1708K7362o227L1968J1170M03J6679o991J765L0091J839k1497
3241A071462K0689M1061j52l5041k2987L2888L1461m850J1281J5690M415J2250
3229A178167k8789k9536O839O3642L2700K7257O677o640K1108K3165K8877R485
3217A332952J3554K9734L9507N6078L2752J6680J2152R976L9341J8012J7143j7882
3205A599999R664N0386L4691M966J3635L5514K8665M2455L1440o935J487L2900
3193A878867O0260L9410P2537P8609O5517N9038R0690P6922K7237R1483K3882
3182B564452R3714J13513K4007Q1359R3701J03145J10201P8861P0596N2590L0455
3171C416594O2689K7955K2589M200J2118O4177O8940Q4652L9093O4523J01780
$$ plain form
3160 3969310 4103192 4207740 4311143 4423150 4517746 4620928 4743923 4891027 5076960 5269027
3150 5269027 5452808 5686872 5994102 6292500 6645055 7056085 7458626 7938090 8464469 9075436
3140 9075436 9700676 10381877 11145179 11967471 12942829 14067138 15330152 16737246 18261658
3131 18261658 19869704 21547034 23154586 24605299 25781735 26500018 26904272 27124825 27187680
3122 27187680 27096799 26936304 26778191 26627616 26500839 26423580 26362454 26303046 26302529 26370226 26524473
3111 26524473 26759549 27117914 27598799 28222013 29110316 30420287 32361333 35074542 38598032
3102 38598032 43105709 48631240 54699379 59823716 61933064 61353622 59402463 56155870
3094 56155870 51718574 46616671 41589105 37014676 32984704 29739563 27281568 25395547
$$ packed form
3160C969310J33882J04548J03403J12007R4596J03182J22995J47104J85933J92067
3150E269027J83781K34064L07230K98398L52555M11030M02541M79464N26379O10967
3140I075436O25240O81201P63302Q22292R75358J124309J263014J407094J524412
3131A8261658J608046J677330J607552J450713J176436P18283M04254K20553O2855
3122B7187680r0881j60495j58113j50575j26777p7259o1126n9408n17O7697J54247
3111B6524473K35076L58365M80885O23214Q88303J309971J941046K713209L523490
3102C8598032M507677N525531O068139N124337K109348n79442j951159l246593
3094E6155870m437296n101903n027566m574429m029972l245141k457995j886021
$$ plain form
3086 25395547 23915085 22716995 21725359 20955429 20373929 19895929 19633733 19494090 19470196
3077 19470196 19578502 19822399 20231029 20816676 21576895 22473353 23447740 24409859 25175818
3068 25175818 25567718 25521568 25007733 24043590 22704411 21143478 19528228 17893195 16330790
3059 16330790 14856721 13588123 12474155 11476892 10657669 9925852 9244928 8623449 8092429
3050 8092429 7608544 7166428 6770104 6381183 6029134 5699025 5378619 5090615 4839103 4599193
3040 4599193 4364067 4157195 3980537 3859352 3728904 3558178 3408089 3285711 3188986 3077664
3030 3077664 2976654 2868155 2778581 2739288 2649573 2547898 2450065 2384854 2315336 2271929 2195808
3019 2195808 2120927 2069489 2007272 1945362 1899000 1844576 1760626 1703229 1656272 1638986 1611530
$$ packed form
3086B5395547j480462j198090r91636p69930n81500m78000k62196j39643k3894
3077A9470196J08306K43897M08630N85647P60219Q96458R74387R62119P65959
3068B5175818L91900m6150n13835r64143j339179j560933j615250j635033j562405
3059A6330790j474069j268598j113968r97263q19223p31817o80924o21479n31020
3050H092429m83885m42116l96324l88921l52049l30109l20406k88004k51512k39910
3040D599193k35126k06872j76658j21185j30448j70726j50089j22378r6725j11322
3030C077664j01010j08499q9574l9293q9715j01675r7833o5211o9518m3407p6121
3019B195808p4881n1438o2217o1910m6362n4424q3950n7397m6957j7286k7456
$$ plain form
3008 1611530 1556972 1532060 1504117 1472356 1426283 1376612 1358373 1323323 1252550 1211038 1185732
2997 1185732 1208695 1207291 1147248 1120510 1083395 1091536 1036065 986287 1006174 998400 997458 986903
2985 986903 943311 913530 895633 860850 859164 834104 781552 757009 773227 719287 712927 703406
2973 703406 684963 704443 668046 615360 622035 671172 652270 629170 588250 570853 545749 535036
$$ packed form
3008A611530n4558k4912k7943l1761m6073m9671j8239l5050p0773m1512k5306
2997A185732K2963j404o0043k6738l7115Q141n5471m9778J9887p774r42j0555
2985I86903m3592k9781j7897l4783j686k5060n2552k4543J6218n3940o360r521
2973G03406j8443J9480l6397n2686O675M9137j8902k3100m0920j7397k5104j0713
$$ [...]
##END NTUPLES=NMR SPECTRUM
##END=
