##TITLE=1H_DE-80H_X3
 200.13MHz, d2o
 8 sc
 
 19ns.26.2.2025
##JCAMPDX= 6.0         $$ Bruker NMR JCAMP-DX V2.0
##DATA TYPE= NMR SPECTRUM
##DATA CLASS= NTUPLES
##ORIGIN= UXNMR, Bruker Analytische Messtechnik GmbH
##OWNER= pz
$$ XWIN-NMR		Version 3.5
$$ Wed Jul  1 10:18:08 2026 Russian Standard Time (UT+4h)  Yarkov@DPX200
##.OBSERVE FREQUENCY= 200.1313
##.OBSERVE NUCLEUS= ^1H
##.ACQUISITION MODE= SIMULTANEOUS
##.ACQUISITION SCHEME= undefined
##.AVERAGES= 8
##.DIGITISER RES= 18
##SPECTROMETER/DATA SYSTEM= spect
##.PULSE SEQUENCE= zg30
##.SOLVENT NAME= DMSO
##.SHIFT REFERENCE= (INTERNAL, DMSO, 0, 15.5001)
##AUDIT TRAIL= $$ (NUMBER, WHEN, WHO, WHERE, WHAT)
$$ ##TITLE= Audit trail, XWIN-NMR		Version 3.5
$$ ##JCAMPDX= 5.01
$$ ##ORIGIN= Bruker BioSpin GmbH
$$ ##OWNER= Yarkov
$$ C:/Bruker/XWIN-NMR/data/yarkov2/nmr/H-C/1/pdata/1/auditp.txt
$$ ##AUDIT TRAIL=  $$ (NUMBER, WHEN, WHO, WHERE, WHAT)
(   1,<2026-07-01 10:16:56.18 +0400>,<Yarkov>,<DPX200>,
      <created by zg, POWCHK disabled, PULCHK disabled
       configuration hash MD5:
       00 E9 B6 7A A2 85 ED C7 34 08 36 98 17 FE 4E 26
       data hash MD5: 16K
       79 03 46 A8 9E A1 F8 89 41 7C 30 69 A5 F5 2A B7>)
(   2,<2026-07-01 10:17:03.03 +0400>,<Yarkov>,<DPX200>,
      <Start of raw data processing
       efp BC_mod = 2 LB = 0.25 FT_mod = 6 PKNL = 1 PHC0 = -6898.748 PHC1 = 6.42196 SI = 16K 
       data hash MD5: 16K
       5D D3 96 8E 0C D3 D7 5B 26 4F 8C B0 AB 3B AA 64>)
(   3,<2026-07-01 10:17:08.32 +0400>,<Yarkov>,<DPX200>,
      <abs ABSG = 5 
       data hash MD5: 16K
       CF DB A1 69 1A 69 48 5F D1 60 C0 BC 72 58 CB 75>)
(   4,<2026-07-01 10:17:47.73 +0400>,<Yarkov>,<DPX200>,
      <pk PHC0 = 3.4 PHC1 = 0 
       data hash MD5: 16K
       70 BD 98 DC 87 E7 A0 18 8B D1 8A 55 35 94 BB 88>)
$$ ##END=
$$ 
$$ hash MD5
$$ C4 EA 0C BF 4B 8C A5 D7 D0 6A E7 AC 4D 13 83 66
##$RELAX= 
##$RELAX= 
##$RELAX= 
##$RELAX= 
##$RELAX= 
##$RELAX= 
$$ Bruker specific parameters
$$ --------------------------
##$DU= <C:/Bruker/XWIN-NMR>
##$EXPNO= 1
##$NAME= <H-C>
##$PROCNO= 1
##$TYPE= <nmr>
##$USER= <yarkov2>
##$AMP= (0..31)
100 100 100 100 100 100 100 100 100 100 100 100 100 100 100 100 100 100 
100 100 100 100 100 100 100 100 100 100 100 100 100 100 
##$AQSEQ= 0
##$AQ_mod= 1
##$AUNM= <au_zg>
##$AUTOPOS= <>
##$BF1= 200.13
##$BF2= 200.13
##$BF3= 200.13
##$BF4= 200.13
##$BF5= 200.13
##$BF6= 200.13
##$BF7= 200.13
##$BF8= 200.13
##$BYTORDA= 1
##$CFDGTYP= 0
##$CFRGTYP= 5
##$CHEMSTR= <none>
##$CNST= (0..31)
1 1 145 1 1 1 1 1 1 1 1 1 1 1 1 1 1 1 1 1 1 1 1 1 1 1 1 1 1 1 1 1 
##$CPDPRG= <>
##$CPDPRG1= <>
##$CPDPRG2= <>
##$CPDPRG3= <>
##$CPDPRG4= <mlev>
##$CPDPRG5= <mlev>
##$CPDPRG6= <mlev>
##$CPDPRG7= <mlev>
##$CPDPRG8= <mlev>
##$CPDPRGB= <>
##$CPDPRGT= <>
##$D= (0..31)
0 0.7 0 0 0 0 0 0 0 0 0 0.03 0 0 0 0 0 0 0 0 0 0 0 0 0 0 0 0 0 0 0 0 
##$DATE= 1782886615
##$DBL= (0..7)
120 120 120 120 120 120 120 120 
##$DBP= (0..7)
150 150 150 150 150 150 150 150 
##$DBP07= 0
##$DBPNAM0= <>
##$DBPNAM1= <>
##$DBPNAM2= <>
$$ [...]
##$SUBNAM3= <"">
##$SUBNAM4= <"">
##$SUBNAM5= <"">
##$SUBNAM6= <"">
##$SUBNAM7= <"">
##$SUBNAM8= <"">
##$SUBNAM9= <"">
##$SW= 18.0517328524113
##$SWIBOX= (0..15)
0 0 2 0 0 0 0 0 0 0 0 0 0 0 0 0 
##$SW_h= 3612.71676300578
##$TD= 16384
##$TD0= 1
##$TE= 0
##$TE2= 300
##$TE3= 300
##$TEG= 300
##$TL= (0..7)
0 120 120 120 120 120 120 120 
##$TP= (0..7)
150 150 150 150 150 150 150 150 
##$TP07= 0
##$TPNAME0= <>
##$TPNAME1= <>
##$TPNAME2= <>
##$TPNAME3= <>
##$TPNAME4= <>
##$TPNAME5= <>
##$TPNAME6= <>
##$TPNAME7= <>
##$TPOAL= (0..7)
0.5 0.5 0.5 0.5 0.5 0.5 0.5 0.5 
##$TPOFFS= (0..7)
0 0 0 0 0 0 0 0 
##$TUNHIN= 0
##$TUNHOUT= 0
##$TUNXOUT= 0
##$USERA1= <user>
##$USERA2= <user>
##$USERA3= <user>
##$USERA4= <user>
##$USERA5= <user>
##$V9= 5
##$VALIST= <valist>
##$VCLIST= <CCCCCCCCCCCCCCC>
##$VD= 0
##$VDLIST= <DDDDDDDDDDDDDDD>
##$VPLIST= <PPPPPPPPPPPPPPP>
##$VTLIST= <TTTTTTTTTTTTTTT>
##$WBST= 1024
##$WBSW= 4
##$XGAIN= (0..3)
0 0 0 0 
##$XL= 0
##$YL= 0
##$YMAX_a= 136637
##$YMIN_a= -224066
##$ZGOPTNS= <>
##$ZL1= 120
##$ZL2= 120
##$ZL3= 120
##$ZL4= 120
##$ABSF1= 15.50011
##$ABSF2= -2.55174
##$ABSG= 5
##$ABSL= 3
##$ALPHA= 0
##$AQORDER= 0
##$ASSFAC= 0
##$ASSFACI= 0
##$ASSFACX= 0
##$ASSWID= 0
##$AUNMP= <proc_1d>
##$AZFE= 0.1
##$AZFW= 0.1
##$BCFW= 0
##$BC_mod= 2
##$BYTORDP= 0
##$COROFFS= 0
##$CY= -3
##$DATMOD= 1
##$DC= 0
##$DFILT= <>
##$DTYPP= 0
##$F1P= 0
##$F2P= 0
##$FCOR= 1
##$FTSIZE= 16384
##$FT_mod= 6
##$GAMMA= 0
##$GB= 0
##$INTBC= 1
##$INTSCL= 3.241238e-09
##$ISEN= 128
##$LB= 0.25
##$LEV0= 0
##$LPBIN= 0
##$MAXI= 10000
##$MC2= 0
##$MEAN= 0
##$ME_mod= 0
##$MI= 1.114404
##$NCOEF= 0
##$NC_proc= -7
##$NLEV= 6
##$NOISF1= 3.799351
##$NOISF2= 2.8
##$NSP= 0
##$NTH_PI= 0
##$NZP= 0
##$OFFSET= 15.50011
##$PC= 1
##$PHC0= -6895.348
##$PHC1= 6.42196
##$PH_mod= 1
##$PKNL= yes
##$PPARMOD= 0
##$PSCAL= 0
##$PSIGN= 0
##$REVERSE= no
##$SF= 200.13000432091
##$SI= 16384
##$SIGF1= 3
##$SIGF2= 2
##$SINO= 0.751879
##$SIOLD= 32768
##$SREGLST= <19F.Aceton>
##$SSB= 0
##$STSI= 16384
##$STSR= 0
##$SW_p= 3612.71676300578
##$SYMM= 0
##$S_DEV= 0
##$TDeff= 16384
##$TDoff= 0
##$TI= <>
##$TILT= no
##$TM1= 0
##$TM2= 0
##$TOPLEV= 0
##$USERP1= <user>
##$USERP2= <user>
##$USERP3= <user>
##$USERP4= <user>
##$USERP5= <user>
##$WDW= 1
##$XDIM= 16384
##$YMAX_p= 365775951
##$YMIN_p= -673218
$$ End of Bruker specific parameters
$$ ---------------------------------
##NTUPLES= NMR SPECTRUM
##VAR_NAME=  FREQUENCY,     SPECTRUM/REAL,   SPECTRUM/IMAG
##SYMBOL=    X,             R,               I
##VAR_TYPE=  INDEPENDENT,   DEPENDENT,       DEPENDENT
##VAR_FORM=  AFFN,          ASDF,            ASDF
##VAR_DIM=   16384,         16384,           16384
##UNITS=     HZ,            ARBITRARY UNITS, ARBITRARY UNITS
##FACTOR=    0.220516191357247, 1,           1
##FIRST=     3102.03701574129, 0,            0
##LAST=      -510.679747264493, 0,           0
##MIN=       -510.679747264493, -673218,     0
##MAX=       3102.03701574129, 365775951,    0
$$ Real data points
##PAGE= N=1
##DATA TABLE= (X++(R..R)), XYDATA
$$ [...]
$$ plain form
8779 6602588 6684195 6883416 7081108 7285189 7369108 7601917 7777071 7978071 8160973 8370830
8769 8370830 8609197 8791490 9023335 9279165 9555236 9765410 10072091 10329378 10606337 10931978
8759 10931978 11250044 11510288 11907074 12237752 12562792 12912347 13319255 13742744 14163519
8750 14163519 14581151 15032588 15498527 16038941 16520532 16937714 17432951 18002525 18580554
8741 18580554 19196849 19795746 20409138 21100870 21741928 22368178 23082762 23833611 24647075
8732 24647075 25466001 26300422 27135127 27993872 28874613 29712494 30463158 31193005 31948527
8723 31948527 32634718 33348773 33999763 34701165 35323833 35909671 36451777 36953609 37468181
8714 37468181 37957842 38368630 38757885 38980719 39119970 39181570 39221662 39257641 39110670 39002764
$$ packed form
8779F602588Q1607J99221J97692K04081Q3919K32809J75154K01000J82902K09857
8769H370830K38367J82293K31845K55830K76071K10174L06681K57287K76959L25641
8759A0931978L18066K60244L96786L30678L25040L49555M06908M23489M20775
8750A4163519M17632M51437M65939N40414M81591M17182M95237N69574N78029
8741A8580554O16295N98897O13392O91732O41058O26250P14584P50849Q13464
8732B4647075Q18926Q34421Q34705Q58745Q80741Q37881P50664P29847P55522
8723C1948527O86191P14055O50990P01402O22668N85838N42106N01832N14572
8714C7468181M89661M10788L89255K22834J39251O1600M0092L5979j46971j07906
$$ plain form
8704 39002764 38780601 38413461 37995378 37607927 37150678 36567527 36013216 35455235 34807056
8695 34807056 34112623 33440423 32752338 32075378 31395089 30741114 29961329 29282529 28584241
8686 28584241 27855336 27229390 26569866 25885867 25311078 24802428 24273415 23633280 22992493
8677 22992493 22382429 21763549 21084162 20438181 19794010 19168969 18587106 18037253 17496781
8668 17496781 16944975 16575834 16166172 15694194 15270010 14848024 14501025 14145832 13774290
8659 13774290 13501905 13092761 12843841 12642503 12376236 12216356 12111233 11936484 11763536
8650 11763536 11514871 11209130 10907632 10521218 10224483 9910339 9597408 9283780 8984445
8641 8984445 8769005 8594467 8432992 8173396 8003903 7823803 7661556 7473744 7365814 7237927
$$ packed form
8704C9002764k22163l67140m18083l87451m57249n83151n54311n57981o48179
8695C4807056o94433o72200o88085o76960o80289o53975p79785o78800o98288
8686B8584241p28905o25946o59524o83999n74789n08650n29013o40135o40787
8677B2992493o10064o18880o79387o45981o44171o25041n81863n49853n40472
8668A7496781n51806l69141m09662m71978m24184m21986l46999l55193l71542
8659A3774290k72385m09144k48920k01338k66267j59880j05123j74749j72948
8650A1763536k48665l05741l01498l86414k96735l14144l12931l13628k99335
8641H984445k15440j74538j61475k59596j69493j80100j62247j87812j07930j27887
$$ plain form
8631 7237927 6993174 6854572 6729490 6628611 6513104 6391388 6194517 6075289 5979135 5858405
8621 5858405 5730480 5661055 5634850 5470145 5419300 5386983 5313405 5224575 5080529 4982084 4910894
8610 4910894 4872006 4888941 4867795 4913939 4947774 4947448 5061189 5005819 4890180 4754748 4580605
8599 4580605 4391084 4218536 4083417 3936331 3816005 3701016 3586993 3520323 3456793 3399973
8589 3399973 3300048 3209956 3116863 3107065 3063207 3034944 2903104 2754319 2682245 2652241 2314932
8578 2314932 2527456 2866220 2693278 2661715 2614404 2581889 2541737 2469760 2428866 2412483 2343179
8567 2343179 2304641 2242413 2220696 2185811 2177981 2178490 2153885 2123906 2091329 2040897 2071563 2008789
8555 2008789 1943856 1899981 1871520 1855408 1883169 1845203 1822020 1783576 1837805 1825798 1792144
$$ packed form
8631G237927k44753j38602j25082j00879j15507j21716j96871j19228r6154j20730
8621E858405j27925o9425k6205j64705n0845l2317p3578q8830j44046r8445p1190
8610D910894l8888J6935k1146M6144L3835l26J13741n5370j15639j35432j74143
8599D580605j89521j72548j35119j47086j20326j14989j14023o6670o3530n6820
8589C399973r9925r0092r3093r798m3858k8263j31840j48785p2074l0004l37309
8578B314932K12524L38764j72942l1563m7311l2515m0152p1977m0894j6383o9304
8567B343179l8538o2228k1717l4885p830N09k4605k9979l2577n0432L0666o2774
8555B008789o4933m3875k8461j6112K7761l7966k3183l8444N4229j2007l3654
$$ plain form
8544 1792144 1736496 1662256 1732941 1758781 1678744 1692807 1698031 1787602 1829690 1855994 1930726 2019021
8532 2019021 2128124 2323805 2605125 3005838 3518238 4141896 4558319 4682039 4647824 4310774
8522 4310774 3964673 3629963 3189105 2809725 2405788 2022085 1811544 1701230 1649724 1573449
8512 1573449 1519263 1420698 1390521 1369676 1296644 1231054 1209085 1186088 1196001 1169055 1122988 1081383
8500 1081383 1042763 1032656 1052240 1022647 984636 919852 974455 948797 953619 912087 892512 884449
8488 884449 825824 891256 882733 817780 779977 781153 810762 835458 925523 836771 832176 795430
8476 795430 738741 720493 706782 663438 643546 653176 667086 720896 606026 596484 582480 632321
8464 632321 585509 568528 526925 442485 465303 486756 471030 476812 514496 534247 554094 467119
$$ packed form
8544A792144n5648p4240P0685K5840q0037J4063N224Q9571M2088K6304P4732Q8295
8532B019021J09103J95681K81320M00713N12400O23658M16423J23720l4215l37050
8522D310774l46101l34710m40858l79380m03937l83703k10541j10314n1506p6275
8512A573449n4186r8565l0177k0845p3032o5590k1969k2997R913k6946m6067m1605
8500A081383l8620j0107J9584k9593l8011o4784N4603k5658M822m1532j9575q063
8488H84449n8625O5432q523o4953l7803J176K9609K4696R0065q8752m595l6746
8476G95430n6689j8248j3711m3344j9892R630J3910N3810j14870r542j4004M9841
8464F32321m6812j6981m1603q4440K2818K1453j5726N782L7684J9751J9847q6975
$$ plain form
8452 467119 482853 533209 568362 481167 432811 445279 393815 405086 426485 324138 312981
8441 312981 388012 431531 421586 349844 289114 275544 261756 311832 320991 286896 241722 232670
8429 232670 284934 301312 285253 271740 263750 260528 256648 184729 242360 309308 314637 282080
8417 282080 247083 267465 322953 247865 191389 173165 182668 147712 188886 163094 176172 179766
8405 179766 146676 109031 142724 151635 167130 132948 128806 122358 139015 113589 71889 100913
8393 100913 69587 102517 138335 117253 146129 156174 156913 123737 37985 -963 -27328 72522
8381 72522 77595 60568 29679 31073 -5822 61042 84266 110823 71005 28664 -11554 -39001
8369 -39001 6670 45 -8225 -39925 3983 16023 -33151 -82803 -33573 14688 -4533 31531
$$ packed form
8452D67119J5734N0356L5153q7195m8356J2468n1464J1271K1399j02347j1157
8441C12981P5031M3519r945p1742o0730j3570j3788N0076R159l4095m5174r052
8429B32670N2264J6378j6059j3513p990l222l880p1919N7631O6948N329l2557
8417B82080l4997K0382N5488p5088n6476j8224R503l4956M1174k5792J3078L594
8405A79766l3090l7645L3693Q911J5495l4182m142o448J6657k5426m1700K9024
8393A00913l1326L2930L5818k1082K8876J0045P39l3176q5752l8948k6365R9850
8381G2522N073j7027l0889J394l6895O6864K3224K6557l9818m2341m0218k7447
8369c9001M5671o625q270l1700M3908J2040m9174m9652M9230M8261j9221L6064
$$ plain form
8357 31531 72156 -6437 557 35897 44885 75758 4556 7736 16897 -41698 -30862 -27355 17186
8344 17186 6583 -21251 -2899 132 111269 150430 57348 7527 -2142 45097 73157 76785
8332 76785 -3400 -89541 -50053 -20800 -96045 -51355 -34175 -97428 -11337 34385 487 -8097
8320 -8097 84939 178201 218865 248422 252287 279611 234630 179722 166344 116850 95785 47029
8308 47029 -34574 -94490 -40710 -31673 -48454 -65321 -81519 -117374 -121769 -89900 -12341 -11846 -81905
8295 -81905 -35718 -26959 6352 21520 -42305 -55856 -4928 -52971 -132330 -85741 -57677 -29309
8283 -29309 29407 16299 -19254 -51772 -96820 -121648 -157373 -147355 -176575 -172673 -210060 -204407
8271 -204407 -179175 -191297 -210758 -190066 -165784 -213448 -206308 -227276 -193358 -129409 -129882 -195196
$$ packed form
8357C1531M0625p8593O994L5340Q988L0873p1202L180R161n8595J0836L507M4541
8344A7186j0603k7834J8352L031J11137L9161r3082m9821r669M7239K8060L628
8332G6785q0185q6141L9488K9253p5245M4690J7180o3253Q6091M5722l3898q584
8320h097R3036R3262M0664K9557L865K7324m4981n4908j3378m9494k1065m8756
8308D7029q1603n9916N3780R037j6781j6867j6198l5855m395L1869P7559M95p0059
8295h1905M6187Q759L3311J5168o3825j3551N0928m8043p9359M6589K8064K8368
8283b9309N8716j3108l5553l2518m5048k4828l5725J0018k9220L902l7387N653
8271b04407K5232j2122j9461K0692K4282m7664P140k0968L3918O3949m73o5314
$$ plain form
8259 -195196 -158440 -170286 -161170 -185315 -187909 -164028 -225688 -206966 -223523 -169087 -101639 -44345
8247 -44345 -154144 -178852 -168873 -221588 -233656 -194301 -215595 -270517 -285697 -258114 -226249 -216311
8235 -216311 -266203 -211041 -105575 -140943 -221336 -206089 -196802 -273287 -218048 -175341 -136318 -133796
8223 -133796 -153330 -209254 -211466 -257717 -226152 -294248 -312856 -313620 -287067 -221697 -264142 -232537
8211 -232537 -199693 -270913 -271136 -254217 -302645 -327933 -336507 -329309 -264712 -267789 -275156 -384361 -279635
8198 -279635 -177426 -275499 -257553 -293430 -396922 -340864 -12030 -108069 -213674 -186100 -207515
8187 -207515 -191539 -261181 -241458 -200773 -266710 -354015 -270906 -234728 -236562 -270538 -228266 -276915
8175 -276915 -316464 -311317 -332486 -270062 -289293 -256725 -309333 -292912 -287213 -239173 -210686 -208522
$$ packed form
8259a95196L6756j1846R116k4145k594K3881o1660J8722j6557N4436O7448N7294
8247d4345j09799k4708R979n2715j2068L9355k1294n4922j5180K7583L1865R938
8235b16311m9892N5162J05466l5368q0393J5247R287p6485N5239M2707L9023K522
8223a33796j9534n5924k212m6251L1565o8096j8608p64K6553O5370m2445L1605
8211b32537L2844p1220k23J6919m8428k5288q574P198O4597l077p367j09205J04726
8198b79635J02209r8073J7946l5877j03492N6058L28834r6039j05605K7574k1415
8187b07515J5976o9642J9723M0685o5937q7305Q3109L6178j834l3976M2272m8649
8175b76915l9549N147k1169O2424j9231L2568n2608J6421N699M8040K8487K164
$$ plain form
8163 -208522 -203729 -255324 -235548 -207258 -239860 -252433 -191849 -147074 -187923 -179932 -126107 -100049
8151 -100049 -100287 -142699 -115593 -66593 -63483 -11125 34440 51012 124848 224944 423687 468941
8139 468941 621661 764088 841707 948521 807278 731622 709367 641455 577479 643241 717742
8128 717742 783850 864437 913254 949512 896566 761595 605230 503252 385823 314970 194073
8117 194073 122411 82765 48887 -24664 -97901 -132296 -169912 -121977 -119290 -118478 -179241 -120293
8105 -120293 -94528 -129052 -96685 -29750 -8914 -121620 -206334 -165184 -173260 -203477 -137622 -184251
8093 -184251 -200344 -141416 -180208 -212840 -176573 -216632 -171711 -196021 -206377 -193449 -184001 -175095
8081 -175095 -198419 -185163 -159078 -147075 -165821 -160843 -210580 -180679 -197961 -256242 -226429 -137046
$$ packed form
8163b08522M793n1595J9776K8290l2602j2573O0584M4775m0849P991N3825K6058
8151a00049k38m2412K7106M9000L110N2358M5565J6572P3836J00096J98743M5254
8139D68941J52720J42427P7619J06814j41243p5656k2255o7912o3976O5762P4501
8128G17742O6108Q0587M8817L6258n2946j34971j56365j01978j17429p0853j20897
8117A94073p1662l9646l3878p3551p3237l4395l7616M7935K687Q12o0763N8948
8105a20293K5765l4524L2367O6935K0836j12706q4714M1150q076l0217O5855m6629
8093a84251j6093N8928l8792l2632L6267m0059M4921k4310j0356J2928R448Q906
8081a75095k3324J3256K6085J2003j8746M978m9737K9901j7282n8281K9813Q9383
$$ plain form
8069 -137046 -113129 -62161 23715 77346 137654 268358 431926 527881 553037 610921 691802
8058 691802 661968 578159 535156 440723 492520 512465 520008 631948 654846 632432 711082 639403
8046 639403 534762 462866 403679 223051 132160 77602 14369 -2930 -100167 -140966 -197259
8035 -197259 -190745 -213821 -252041 -239433 -260128 -214856 -159156 -208641 -255329 -316676 -256713 -234141
8023 -234141 -238295 -270891 -269618 -227943 -245208 -242577 -272902 -278253 -257578 -258532 -237087 -226457 -221584
8010 -221584 -251014 -249133 -255615 -283599 -251820 -213652 -252370 -305539 -345454 -317201 -230342 -220738
7998 -220738 -214868 -213419 -290561 -266417 -270557 -295347 -235019 -298604 -343050 -265490 -247624 -256353
7986 -256353 -258489 -247223 -237293 -154538 -139317 -136982 -225614 -231929 -210007 -225956 -211601 -204093 -193179
$$ packed form
8069a37046K3917N0968Q5876N3631O0308J30704J63568R5955K5156N7884Q0881
8058F91802k9834q3809m3003r4433N1797J9945P543J11940K2898k2414P8650p1679
8046F39403j04641p1896n9187j80628r0891n4558o3233j7299r7237m0799n6293
8035a97259O514k3076l8220J2608k0695M5272N5700m9485m6688o1347N9963K2572
8023b34141m154l2596J273M1675j7265K631l0325n351K0675r54K1445J0630M873
8010b21584k9430J881o482k7984L1779L8168l8718n3169l9915K8253Q6859R604
7998b20738N870J449p7142K4144m140k4790O0328o3585m4446P7560J7866q729
7986b56353k136J1266R930Q2755J5221K335q8632o315K1922j5949J4355P508J0914
$$ plain form
7973 -193179 -174348 -206124 -138192 -87523 -102656 -57925 23447 94308 60364 215339 390565
7962 390565 512482 651310 791858 1084455 1291716 1510867 1742859 1984621 2313929 2660020
7952 2660020 3091551 3437326 3579572 3628615 3683060 3760440 3794988 3818182 3785343 3557222 3279737
7941 3279737 3086241 2805825 2485231 2171457 1957301 1671450 1434295 1239319 967448 764196
7931 764196 612223 560712 473697 313299 220034 252109 201337 134619 19876 4143 -12476
7920 -12476 -103942 -68801 -57715 -106541 -146920 -111340 -88748 -194005 -201955 -136873 -184958 -219158
7908 -219158 -232894 -239984 -227106 -242516 -195447 -213641 -137381 -138505 -232916 -236920 -212759 -237747
7896 -237747 -221077 -297385 -256484 -274129 -274038 -251807 -280837 -302701 -174906 -217778 -257290 -314491
$$ packed form
7973a93179J8831l1776O7932N0669j5133M4731Q1372P0861l3944J54975J75226
7962C90565J21917J38828J40548K92597K07261K19151K31992K41762L29308L46091
7952B660020M31531L45775J42246M9043N4445P7380L4548K3194l2839k28121k77485
7941C279737j93496k80416l20594l13774k14156k85851k37155j94976k71871k03252
7931G64196j51973n1511q7015j60398r3265L2075n0772o6718j14743j5733j6619
7920a2476r1466L5141J1086m8826m0379L5580K2592j05257p950O5082m8085l4200
7908b19158j3736p090J2878j5410M7069j8194P6260j124r4411m004K4161k4988
7896b37747J6670p6308M0901j7645R1K2231k9030k1864J27795m2872l9512n7201
$$ plain form
7884 -314491 -325876 -285815 -312782 -305068 -317861 -273484 -284185 -258028 -184889 -206139 -245161 -223301
7872 -223301 -309028 -335183 -361224 -438870 -414047 -361083 -382468 -374308 -347972 -370412 -412503 -411609
7860 -411609 -407939 -386796 -357160 -303545 -338637 -362589 -344362 -382116 -396188 -396551 -366326 -401588
7848 -401588 -412774 -419615 -442155 -381783 -365552 -379916 -384949 -339978 -344263 -346185 -361033 -405492
7836 -405492 -450868 -380056 -413060 -405032 -372842 -335988 -280487 -251099 -240908 -267177 -268670 -220959
7824 -220959 -161033 -205628 -190545 -141094 -114296 -104516 -130835 -39078 -851 -11412 -52046 -69715
7812 -69715 -210717 -248371 -274025 -232319 -274233 -209239 -3546 -292137 -389910 -365160 -405076
7801 -405076 -350103 -376905 -390724 -354588 -331900 -293037 -314188 -304803 -261327 -313648 -329557 -343493
$$ packed form
7884c14491j1385M0061k6967P714j2793M4377j0701K6157P3139k1250l9022K1860
7872b23301q5727k6155k6041p7646K4823N2964k1385Q160K6336k2440m2091Q94
7860d11609L670K1143K9636N3615l5092k3952J8227l7754j4072l63L0225l5262
7848d01588j1186o841k2540O0372J6231j4364n033M4971m285j922j4848m4459
7836d05492m5376P0812l3004Q028L2190L6854N5501K9388J0191k6269j493M7711
7824b20959N9926m4595J5083M9451K6798R780k6319R1757L8227j0561m0634j7669
7812f9715j41002l7654k5654M1706m1914O4994K05693k88591r7773K4750l9916
7801d05076N4973k6802j3819L6136K2688L8863k1151R385M3476n2321j5909j3936
$$ plain form
7789 -343493 -297476 -262970 -300117 -306311 -273781 -205051 -88241 -131598 -126059 -123311 -119100 -97648
7777 -97648 -117787 -107647 -74437 -13531 30603 6506 -74199 -59735 14653 15449 -73396 -65073
7765 -65073 -41687 -64892 -129474 -191214 -195087 -206539 -203500 -228411 -265034 -310731 -327229 -362372
7753 -362372 -348168 -261606 -307694 -355076 -391586 -343743 -320331 -334667 -318693 -312929 -328006 -370998
7741 -370998 -398968 -298937 -235266 -169896 -137169 -60731 3725 37249 68840 56999 -24949
7730 -24949 -77173 -116649 -166459 -242578 -304430 -280608 -286660 -318182 -336573 -381888 -416879 -375822
7718 -375822 -357519 -294966 -294159 -350451 -392091 -399859 -348380 -341276 -314653 -293881 -274432 -200821
7706 -200821 -117165 -51952 16865 57128 47268 45269 12567 -114711 -163110 -182101 -188420 -276240
$$ packed form
7789c43493M6017L4506l7147o194L2530O8730J16810m3357N539K748M211K1452
7777i7648k0139J0140L3210O0906M4134k4097q0705J4464P4388P96q8845Q323
7765f5073K3386k3205o4582o1740l873j1452L039k4911l6623m5697j6498l5143
7753c62372J4204Q6562m6088m7382l6510M7843K3412j4336J5974N764j5077m2992
7741c70998k7970J00031O3671O5370L2727P6438O4456L3524L1591j1841q1948
7730b4949n2224l9476m9810p6119o1852K3822o052l1522j8391m5315l4991M1057
7718c75822J8303O2553Q07n6292m1640p768N1479P104K6623K0772J9449P3611
7706b00821Q3656O5213O8817M0263r860j999l2702j27278m8399j8991o319q7820
$$ plain form
7694 -276240 -258826 -297267 -316013 -279317 -313114 -287629 -281785 -298833 -285779 -280777 -246862 -216546
7682 -216546 -250429 -288147 -307858 -273526 -264478 -248333 -228566 -182237 -207582 -255868 -249836 -274279
7670 -274279 -221187 -253667 -250495 -244311 -296601 -284402 -287827 -282037 -300400 -250469 -192105 -166908
7658 -166908 -164336 -113942 -174499 -174670 -64179 -63389 -59599 -75937 -101881 -67962 -47060 -46066 -52499
7645 -52499 -25897 -23386 -52480 -105131 -112306 -91335 -148568 -227145 -174877 -182439 -209873 -222865
7633 -222865 -251244 -255393 -189546 -265281 -281497 -261245 -347544 -341429 -325043 -319128 -295014 -331633
7621 -331633 -380029 -415143 -409908 -360687 -350389 -340390 -409635 -456878 -419468 -430066 -402579 -422287
7609 -422287 -388454 -375301 -408004 -454106 -414595 -366268 -416510 -360959 -366316 -426157 -485634 -463785
$$ packed form
7694b76240J7414l8441j8746L6696l3797K5485N844j7048J3054N002L3915L0316
7682b16546l3883l7718j9711L4332R048J6145J9767M6329k5345m8286O032k4443
7670b74279N3092l2480L172O184n2290J2199l425N790j8363M9931N8364K5197
7658a66908K572N0394o0557j71J10491P90L790j6338k5944L3919K0902R94o433
7645e2499K6602K511k9094n2651p175K0971n7233p8577N2268p562k7434j2992
7633b22865k8379m149O5847p5735j6216K0252q6299O115J6386N915K4114l6619
7621c31633m8396l5114N235M9221J0298R999o9245m7243L7410j0598K7487j9708
7609d22287L3833J3153l2703m6102L9511M8327n0242N5551n357n9841n9477K1849
$$ plain form
7597 -463785 -385646 -440913 -420646 -392075 -354521 -333877 -369985 -412049 -423789 -522991 -483379 -454957
7585 -454957 -451534 -397968 -400783 -394668 -495605 -462830 -389629 -406579 -405556 -404425 -418278 -361692
7573 -361692 -448610 -418549 -398257 -388450 -340643 -341433 -313522 -292154 -243288 -264717 -277550 -198764
7561 -198764 -272159 -281686 -273769 -220478 -207305 -181482 -166245 -184869 -205497 -312971 -397095 -428079
7549 -428079 -412474 -421201 -380541 -298848 -382765 -418692 -377657 -346344 -402329 -408547 -426962 -511574
7537 -511574 -476511 -463224 -401241 -377368 -452186 -452291 -464431 -390138 -395616 -525688 -444307 -392869
7525 -392869 -428871 -423915 -427689 -444973 -402026 -327707 -377405 -370357 -408756 -437751 -386508 -409099
7513 -409099 -444445 -453848 -455780 -419973 -397699 -374481 -320164 -344336 -341991 -274712 -257828 -257052 -269313
$$ packed form
7597d63785P8139n5267K0267K8571L7554K0644l6108m2064j1740r9202L9612K8422
7585d54957L423N3566k815O115j00937L2775P3201j6950J023J131j3853N6586
7573c61692q6918L0061K0292R807M7807p90K7911K1368M8866k1429j2833P8786
7561a98764p3395r527P917N3291J3173K5823J5237j8624k0628j07474q4124l0984
7549d28079J5605q727M0660Q1693q3917l5927M1035L1313n5985o218j8415q4612
7537e11574L5063J3287O1983K3873p4818j05j2140P4293n478j30072Q1381N1438
7525c92869l6002M956l774j7284M2947P4319m9698P048l8399k8995N1243k2591
7513d09099l5346r403j932L5807K2274K3218N4317k4172K345O7279J6884P76j2261
$$ plain form
7500 -269313 -288470 -247937 -261505 -264379 -271814 -213975 -221085 -166003 -196574 -232151 -300269 -406615
7488 -406615 -437279 -397053 -355775 -402436 -365888 -269412 -424648 -483782 -470311 -410062 -341756
7477 -341756 -377826 -435307 -432269 -400954 -419973 -414920 -366887 -282937 -320265 -345044 -321059 -276355
7465 -276355 -244885 -222894 -184765 -147578 -147059 -199431 -259231 -223850 -217308 -267942 -242478 -247132
7453 -247132 -308275 -279475 -320969 -369010 -374410 -360025 -384345 -444524 -505947 -499098 -491868 -491159 -517835
7440 -517835 -549863 -403436 -432903 -434859 -453658 -396576 -340724 -349661 -360763 -371741 -336145 -261089
7428 -261089 -221288 -273543 -322944 -400125 -401320 -404426 -446751 -465767 -396760 -437059 -443143 -406184
7416 -406184 -426219 -394195 -370797 -412043 -376216 -399167 -411245 -368571 -295514 -334775 -318612 -324695
$$ packed form
7500b69313j9157M0533j3568k874p435N7839p110N5082l0571l5577o8118j06346
7488d06615l0664M0226M1278m6661L6548R6476j55236n9134J3471O0249O8306
7477c41756l6070n7481L038L1315j9019N053M8033Q3950l7328k4779K3985M4704
7465b76355L1470K1991L8129L7187N19n2372n9800L5381O542n0634K5464m654
7453b47132o1143K8800m1494m8041n400J4385k4320o0179o1423O849P230P09k6676
7440e17835l2028J46427k9467j956j8799N7082N5852q937j1102j0978L5596P5056
7428b61089L9801n2255m9401p7181j195l106m2325j9016O9007m0299o084L6959
7416d06184k0035L2024K3398m1246L5827k2951j2078M2674P3057l9261J6163o083
$$ plain form
7404 -324695 -296502 -249621 -191108 -180576 -178576 -192759 -175939 -222930 -229841 -169945 -166206 -190326
7392 -190326 -178697 -103128 -119951 -67328 -105251 -183163 -156859 -91855 -142172 -201482 -211719 -158377
7380 -158377 -174626 -203161 -133420 -154830 -79282 -45296 -72180 -9036 61783 69488 85317 125811
7368 125811 140525 125557 177820 186195 128937 141048 158883 185160 141148 119919 117978 68740
7356 68740 85457 169873 88287 29603 32460 41892 17643 25700 36696 -50414 -90703 -154690
7344 -154690 -202550 -122038 -164376 -185285 -229491 -200897 -241124 -282143 -344980 -362328 -394346 -378493
7332 -378493 -354740 -374005 -376558 -368416 -329564 -259730 -275267 -315920 -312795 -348463 -370230 -358134
7320 -358134 -345906 -295743 -258990 -292745 -277169 -281409 -283223 -339276 -293692 -269733 -221203 -246224
$$ packed form
7404c24695K8193M6881N8513J0532K000j4183J6820m6991o911N9896L739k4120
7392a90326J1629P5569j6823N2623l7923p7912K6304O5004n0317n9310j0237N3342
7380a58377j6249k8535O9741k1410P5548L3986k6884O3144P0819P705J5829M0494
7368A25811J4714j4968N2263Q375n7258J2111J7835K6277m4012k1229j941m9238
7356F8740J6717Q4416q1586n8684K857R432k4249Q057J0996q7110m0289o3987
7344a54690m7860Q0512m2338k0909m4206K8594m0227m1019o2837j7348l2018J5853
7332c78493K3753j9265k553Q142L8852O9834j5537m0653L125l5668k1767J2096
7320c58134J2228N0163L6753l3755J5576m240j814n6053M5584K3959M8530k5021
$$ plain form
7308 -246224 -205887 -200747 -186178 -142543 -65688 -3094 -30004 16342 -5504 147340 326356
7297 326356 471475 664839 923929 1159309 1294327 1300090 1150682 1047142 945620 835123
7287 835123 677302 673337 656839 675697 899352 1116266 1480675 1957379 2412156 2966118
7277 2966118 3289362 3353344 3323947 3088617 2739842 2384834 2069973 1755084 1596549 1472292
7267 1472292 1413436 1484012 1530196 1677529 1733449 1706764 1661550 1607944 1597420 1549888 1563844
7256 1563844 1611086 1664315 1663711 1687466 1628037 1427456 1212298 970533 855067 744144 582799
7245 582799 449741 336850 221551 125359 35196 -11000 56785 65308 -30666 -1722 8888
7234 8888 -72050 -119904 -126041 -119193 -150128 -138304 -132248 -70692 -60760 -89618 -73590 -38003 -9039
$$ packed form
7308b46224M0337N140J4569M3635P6855O2594k6910M6346k1846J52844J79016
7297C26356J45119J93364K59090K35380J35018N763j49408j03540j01522j10497
7287H35123j57821l965j6498J8858K23655K16914L64409M76704M54777N53962
7277B966118L23244O3982k9397k35330l48775l55008l14861l14889j58535j24257
7267A472292n8856P0576M6184J47333N5920k6685m5214n3606j0524m7532J3956
7256A563844M7242N3229o04K3755n9429k00581k15158k41765j15466j10923j61345
7245E82799j33058j12891j15299r6192r0163m6196O7785Q523r5974K8944J0610
7234H888q0938m7854o137O848l0935J1824O056O1556R932k8858J6028L5587K8964
$$ plain form
7221 -9039 18392 166934 294733 383083 536966 647754 707636 636049 586413 567177 516315
7210 516315 458593 343680 302495 379820 541328 583099 616234 633734 565644 438009 400068
7199 400068 270658 267888 119393 -3343 -37985 -46529 -70174 -50875 -82246 -83994 -131651 -215094
7187 -215094 -127973 -71823 -96327 -101762 -113413 -164041 -145095 -111700 -128912 -102868 -19309 -76580
7175 -76580 -33726 84192 138406 147071 208715 183802 249422 353216 543028 701181 984425
7164 984425 1244646 1504618 1741885 1947146 2110145 2313879 2370072 2426674 2401578 2264440
7154 2264440 2114837 1901626 1642440 1427453 1173767 886697 766441 609198 449864 323469
7144 323469 222157 187796 143317 58565 50509 -889 -54177 -56006 -80776 -98807 -145441 -129939
$$ packed form
7221i039K7431J48542J27799Q8350J53883J10788N9882p1587m9636j9236n0862
7210E16315n7722j14913m1185P7325J61508M1771L3135J7500o8090j27635l7941
7199D00068j29410k770j48495j22736l4642q544k3645J9299l1371j748m7657q3443
7187b15094Q7121N6150k4504n435j1651n0628J8946L3395j7212K6044Q3559n7271
7175g6580M2854J17918N4214Q665O1644k4913O5620J03794J89812J58153K83244
7164I84425K60221K59972K37267K05261J62999K03734N6193N6602k5096j37138
7154B264440j49603k13211k59186k14987k53686k87070j20256j57243j59334j26395
7144C23469j01312l4361m4479q4752q056n1398n3288j829k4770j8031m6634J5502
$$ plain form
7132 -129939 -160204 -178576 -171609 -198016 -181270 -217072 -229925 -216919 -217904 -192466 -238510 -308008
7120 -308008 -292089 -290060 -304255 -358691 -332817 -338425 -345780 -386290 -406185 -366695 -308034 -300274
7108 -300274 -338517 -276630 -215936 -219454 -270228 -232753 -137525 -159033 -201321 -109787 -81996 -31956
7096 -31956 -55460 -36481 71479 80294 108736 158090 141757 65071 4292 -25142 -53727 -160181
7084 -160181 -203652 -194944 -180431 -203383 -244452 -207220 -198163 -215970 -185416 -198650 -224101 -173659
7072 -173659 -168820 -172782 -161552 -201032 -264076 -277131 -301595 -344330 -320226 -319429 -320860 -400659 -384521
7059 -384521 -361605 -406077 -365229 -397492 -477307 -398104 -384038 -396045 -470330 -382427 -308351 -275863
7047 -275863 -296153 -222867 -252970 -261102 -236743 -279550 -325320 -300887 -356297 -395275 -348927 -314224
$$ packed form
7132a29939l0265j8372O967k6407J6746l5802j2853J3006r85K5438m6044o9498
7120c08008J5919K029j4195n4436K5874n608p355m0510j9895L9490N8661P760
7108c00274l8243O1887O0694l518n0774L7475R5228k1508m2288R1534K7791N0040
7096c1956k3504J8979J07960Q815K8442M9354j6333p6686o0779k9434k8585j06454
7084a60181m3471Q708J4513k2952m1069L7232R057j7807L0554j3234k5451N0442
7072a73659M839l962J1230l9480o3044j3055k4464m2735K4104P97j431p9799J6138
7059c84521K2916m4472M0848l2263p9815P9203J4066j2007p4285Q7903P4076L2488
7047b75863k0290P3286l0103q132K4359m2807m5770K4433n5410l8978M6348L4703
$$ plain form
7035 -314224 -384874 -459726 -408846 -433618 -381609 -369325 -371541 -362869 -356520 -313354 -300047 -341447
7023 -341447 -363441 -348560 -311183 -333343 -361002 -478235 -446720 -389413 -427222 -430731 -377144 -412642
7011 -412642 -427983 -445309 -488818 -451689 -361768 -361119 -383084 -433258 -428685 -430583 -393786 -423861
6999 -423861 -414631 -357002 -288474 -314270 -294016 -293309 -320783 -366643 -367327 -323165 -271056 -214450 -268838
6986 -268838 -253091 -187244 -166562 -213174 -193926 -169858 -160079 -215806 -255006 -258603 -261592 -240077
6974 -240077 -171229 -117192 -64153 30534 127781 236789 401415 500175 677868 809762 919647
6963 919647 1099996 1195288 1329710 1369069 1202823 979926 810915 642223 558076 378288
6953 378288 202434 123310 77933 50844 22232 -60598 -89940 -96152 -92741 -47289 -68915 -89915
$$ packed form
7035c14224p0650p4852N0880k4772N2009J2284k216Q672O349M3166J3307m1400
7023c41447k1994J4881L7377k2160k7659j17233L1515N7307l7809l509N3587l5498
7011d12642j5341j7326m3509L7129Q9921O49k1965n0174M573j898L6797l0075
6999d23861R230N7629O8528k5796K0254P07k7474m5860o84M4162N2109N6606n4388
6986b68838J5747O5847K0682m6612J9248K4068R779n5727l9200l597k989K1515
6974b40077O8848N4037N3039R4687R7247J09008J64626R8760J77693J31894J09885
6963I19647J80349R5292J34422L9359j66246k22897j69011j68692q4147j79788
6953C78288j75854p9124m5377k7089k8612q2830k9342o212L411M5452k1626k1000
$$ plain form
6941 -89915 -213738 -227758 -167985 -96743 -18485 34139 -53556 -44501 32275 55727 23922 -47921
6929 -47921 -118022 -170954 -162012 -163180 -222832 -222102 -184217 -206718 -341089 -361265 -346579 -370117
6917 -370117 -357439 -345676 -372040 -367148 -340871 -397800 -405393 -351277 -324721 -334177 -372783 -420141
6905 -420141 -418275 -441087 -433261 -456460 -402605 -391694 -403836 -416638 -386029 -444634 -421791 -382805
6893 -382805 -379410 -416563 -420307 -441517 -519730 -508725 -446871 -455348 -420067 -471462 -480571 -432795
6881 -432795 -478927 -413023 -428505 -373535 -387196 -335790 -316097 -382503 -416422 -480865 -465751 -475069
6869 -475069 -473819 -470823 -364071 -357694 -414900 -468671 -427887 -439889 -519023 -429401 -481969 -414556
6857 -414556 -403827 -428572 -420346 -401540 -428546 -384201 -369025 -349840 -349048 -356151 -327421 -371558
$$ packed form
6941h9915j23823j4020N9773P1242P8258N2624q7695R055P6776K3452l1805p1843
6929d7921p0101n2932Q942j168n9652P30L7885k2501j34371k0176J4686k3538
6917c70117J2678J1763k6364M892K6277n6929p593N4116K6556r456l8606m7358
6905d20141J866k2812P826k3199N3855J0911j2142j2802L0609n8605K2843L8986
6893c82805L395l7153l744k1210p8213J1005O1854q477L5281n1395r109M7776
6881d32795m6132O5904j5482N4970j3661N1406J9693o6406l3919o4443J5114r318
6869d75069J250K996J06752O377n7206n3771M0784j2002p9134Q9622n2568O7413
6857d14556J0729k4745Q226J8806k7006M4345J5176J9185P92p103K8730m4137
$$ plain form
6845 -371558 -399906 -418689 -462825 -457052 -463843 -584982 -578723 -507215 -509932 -432117 -461609 -520763
6833 -520763 -525569 -501510 -510493 -543785 -511355 -481671 -441031 -458334 -456877 -448051 -465663 -450066
6821 -450066 -443632 -391688 -389121 -434035 -437388 -432033 -465710 -534022 -496326 -552978 -522203 -519078 -540347
6808 -540347 -465536 -402186 -414120 -456055 -427975 -471815 -483979 -473174 -503522 -509809 -475200 -481967
6796 -481967 -534284 -474538 -389620 -467558 -513252 -509500 -512239 -552142 -525337 -542091 -493483 -443599
6784 -443599 -460542 -392935 -426101 -456347 -469618 -419857 -441193 -425607 -445075 -487762 -536861 -549914
6772 -549914 -518373 -466639 -451365 -403675 -480265 -481832 -445403 -441320 -405665 -450060 -479418 -451675
6760 -451675 -418074 -458253 -402238 -314742 -240337 -193003 -250719 -301132 -260868 -285886 -267945 -306754
$$ packed form
6845c71558k8348j8783m4136N773o791j21139O259P1508k717P7815k9492n9154
6833e20763m806K4059q983l3292L2430K9684M0640j7303J457Q826j7612J5597
6821d50066O434N1944K567m4914l353N355l3677o8312L7696n6652L0775L125k1269
6808e40347P4811O3350j1934m1935K8080m3840j2164J0805l0348o287L4609o767
6796d81967n2317N9746Q4918p7938m5694L752k739l9903K6805j6754M8608M9884
6784d43599j6943O7607l3166l0246j3271M9761k1336J5586j9468m2687m9099j3053
6772e49914L1541N1734J5274M7690p6590j567L6429M083L5655m4395k9358K7743
6760d51675L3601m0179N6015Q7496P4405M7334n7716n0413M0264k5018J7941l8809
$$ plain form
6748 -306754 -252373 -259610 -327683 -335869 -352203 -345819 -364075 -348075 -355587 -419910 -422507 -437112 -409517
6735 -409517 -481644 -498930 -508185 -525827 -471041 -497818 -452220 -421629 -444692 -420508 -331536 -372424
6723 -372424 -321968 -296219 -261274 -183660 -253422 -362500 -394355 -441068 -478641 -440720 -461278
6712 -461278 -506667 -497301 -540543 -562866 -519307 -507771 -568325 -559060 -551743 -504073 -512443 -509258 -530314
6699 -530314 -600508 -557717 -563159 -524698 -487327 -520151 -571880 -558192 -548265 -567367 -534324 -574283
6687 -574283 -554351 -536181 -570074 -576141 -556989 -532645 -523148 -531371 -558876 -515517 -472231 -421901
6675 -421901 -472458 -498361 -513492 -453582 -423189 -452277 -492082 -475187 -447319 -401349 -357459 -318417
6663 -318417 -350180 -344984 -373932 -446998 -409942 -501328 -495637 -482124 -522064 -486180 -477936 -516524
$$ packed form
6748c06754N4381p237o8073q186j6334O384j8256J6000p512o4323k597j4605K7595
6735d09517p2127j7286r255j7642N4786k6777M5598L0591k3063K4184Q8972m0888
6723c72424N0456K5749L4945P7614o9762j09078l1855m6713l7573L7921k0558
6712d61278m5389R366m3242k2323M3559J1536o0554R265P317M7670q370L185k1056
6699e30314p0194M2791n442L8461L7371l2824n1729J3688R927j9102L3043l9959
6687e74283J9932J8170l3893o067J9152K4344R497q223k7505M3359M3286N0330
6675d21901n0557k5903j5131N9910L0393k9088l9805J6895K7868M5970M3890L9042
6663c18417l1763N196k8948p3066L7056r1386N691J3513l9940L5884Q244l8588
$$ plain form
6651 -516524 -525346 -505735 -456941 -427546 -416991 -454440 -481887 -595472 -561642 -542933 -520040 -505599
6639 -505599 -545013 -488866 -502613 -495360 -443921 -427624 -435294 -464816 -559603 -496512 -477542 -417860
6627 -417860 -455553 -475271 -415863 -361238 -326362 -359567 -327612 -359203 -358163 -331201 -364427 -423439
6615 -423439 -443264 -414805 -373666 -343682 -416570 -394887 -401616 -389575 -365259 -360103 -301809 -280026
6603 -280026 -265282 -317031 -315209 -296288 -382921 -413511 -420043 -431515 -450874 -438711 -438485 -463020
6591 -463020 -559532 -516168 -465344 -478135 -482717 -489706 -524519 -597307 -539443 -501137 -534062 -520787
6579 -520787 -441707 -457120 -420529 -427954 -430334 -505854 -536527 -479124 -425479 -428536 -492058 -476543
6567 -476543 -488476 -447722 -423295 -428252 -441003 -484047 -527329 -517054 -441505 -476826 -463204 -457515
$$ packed form
6651e16524q822J9611M8794K9395J0555l7449k7447j13585L3830J8709K2893J4441
6639e05599l9414N6147j3747P253N1439J6297p670k9522r4787O3091J8970N9682
6627d17860l7693j9718N9408N4625L4876l3205L1955l1591J040K6962l3226n9012
6615d23439j9825K8459M1139K9984p2888K1683o729J2041K4316N156N8294K1783
6603b80026J4744n1749J822J8921q6633l0590o532j1472j9359J2163K26k4535
6591d63020r6512M3364N0824j2791m582o989l4813p2788N7864L8306l2925J3275
6579e20787P9080j5413L6591p425k380p5520l0673N7403N3645l057o3522J5515
6567d76543j1933M0754K4427m957j2751m3044m3282J0275P5549l5321J3622N689
$$ plain form
6555 -457515 -502812 -458982 -381997 -368699 -387589 -433912 -427159 -481287 -523036 -467204 -437637 -447046
6543 -447046 -410874 -425815 -474999 -458605 -422049 -405109 -440408 -494506 -494439 -397974 -390753 -403457
6531 -403457 -393983 -417336 -416894 -449270 -419648 -435131 -445845 -485114 -500178 -555006 -549574 -554138 -557083
6518 -557083 -553741 -542203 -507384 -491236 -463580 -515940 -524981 -493845 -511920 -533309 -602859 -597305
6506 -597305 -547726 -519016 -462778 -529332 -564242 -505223 -441884 -456777 -485712 -554017 -534415 -517213
6494 -517213 -506200 -497886 -503942 -535633 -538731 -543851 -528325 -565618 -600768 -581973 -608588 -634649
6482 -634649 -605944 -621411 -617191 -587539 -611087 -600944 -620757 -634991 -622384 -581618 -558201 -588833
6470 -588833 -599186 -599719 -521504 -544359 -567671 -545280 -543583 -544631 -620142 -594985 -564457 -525142
$$ packed form
6555d57515m5297M3830P6985J3298j8890m6323O753n4128m1749N5832K9567r409
6543d47046L6172j4941m9184J6394L6556J6940l5299n4098O7R6465P221j2704
6531d03457R474k3353M42l2376K9622j5483j0714l9269j5064n4828N432m564k945
6518e57083L342J1538L4819J6148K7656n2360r041L1136j8075k1389o9550N554
6506e97305M9579K8710N6238o6554l4910N9019O3339j4893k8935o8305J9602J7202
6494e17213J1013Q314o056l1691l098n120J5526l7293l5150J8795k6615k6061
6482f34649K8705j5467M220K9652k3548J0143j9813j4234J2607M0766K3417l0632
6470e88833j0353n33P8215k2855k3312K2391J697j048p5511K5157L0528L9315
$$ plain form
6458 -525142 -495172 -506897 -497439 -547900 -628672 -605694 -546810 -550264 -604924 -579739 -545326 -539710
6446 -539710 -537796 -490550 -468325 -456842 -505218 -554653 -568865 -553367 -580870 -542532 -454134 -460678
6434 -460678 -433183 -454484 -564554 -673218 -624519 -568638 -561753 -558990 -462313 -394668 -432920 -492604
6422 -492604 -474944 -528596 -545975 -513560 -504474 -497831 -440391 -506897 -467393 -514311 -499880 -436677
6410 -436677 -459143 -477362 -491837 -527042 -494085 -477614 -454503 -421006 -473323 -472071 -515950 -509328
6398 -509328 -481801 -541734 -517642 -516153 -586348 -544620 -506943 -533864 -583409 -578704 -513154 -517856
6386 -517856 -490342 -448292 -524195 -529683 -571945 -586404 -616159 -549462 -526081 -505501 -475489 -449234
6374 -449234 -510856 -507956 -470062 -535513 -560133 -554501 -530742 -512325 -517422 -439776 -431266 -436825 -466415
$$ packed form
6458e25142K9970j1725R458n0461q0772K2978N8884l454n4660K5185L4413N616
6446e39710J914M7246K2225J1483m8376m9435j4212J5498k7503L8338Q8398o544
6434d60678K7495k1301j10070j08664M8699N5881O885K763R6677O7645l8252n9684
6422d92604J7660n3652j7379L2415R086O643N7440o6506L9504m6918J4431O3203
6410d36677k2466j8219j4475l5205L2957J6471K3111L3497n2317J252m3879O622
6398e09328K7527n9933K4092J489p0195M1728L7677k6921m9545M705O5550m702
6386e17856K7514M2050p5903n488m2262j4459k9755O6697K3381K0580L0012K6255
6374d49234o1622K900L7894o5451k4620N632K3759J8417n097P7646Q510n559k9590
$$ plain form
6361 -466415 -416719 -442206 -385941 -405157 -350522 -369961 -402542 -409562 -455496 -430879 -445307 -427269
6349 -427269 -412451 -474050 -487113 -479298 -600777 -617472 -548821 -523380 -540721 -460377 -500060 -509839
6337 -509839 -487940 -482700 -486142 -542316 -529779 -449018 -485030 -515411 -408375 -325733 -369969 -455712
6325 -455712 -490593 -499209 -465311 -443960 -482211 -427657 -390956 -348220 -343241 -401012 -437652 -382480
6313 -382480 -346859 -389419 -414542 -428122 -391677 -432276 -448346 -440769 -408628 -317162 -336440 -376998
6301 -376998 -370403 -423830 -516265 -489245 -473300 -439770 -430230 -414510 -389938 -439878 -483050 -468823
6289 -468823 -442235 -378640 -365022 -430218 -369393 -310852 -389496 -399078 -340958 -281028 -335267 -350428
6277 -350428 -333286 -310519 -335945 -361297 -325147 -303766 -195673 -179126 -187389 -210842 -260132 -253834
$$ packed form
6361d66415M9696k5487N6265j9216N4635j9439l2581p020m5934K4617j4428J8038
6349d27269J4818o1599j3063P815j21479j6695O8651K5441j7341Q0344l9683r779
6337e09839K1899N240l442n6174J2537Q0761l6012l0381J07036Q2642m4236q5743
6325d55712l4881q616L3898K1351l8251N4554L6701M2736M979n7771l6640N5172
6313c82480L5621m2560k5123j3580L6445m0599j6070P577L2141R1466j9278m0558
6301c76998O595n3427r2435K7020J5945L3530R540J5720K4572m9940m3172J4227
6289d68823K6588O3595J3618o5196O0825N8541p8644r582N8120N9930n4239j5161
6277c50428J7142K2767k5426k5352L6150K1381J08093J6547q263k3453m9290O298
$$ plain form
6265 -253834 -249121 -207433 -222051 -256759 -209872 -186756 -201002 -224752 -216356 -259792 -197480 -170768
6253 -170768 -174361 -133724 -202117 -207068 -129166 -57699 -1601 113174 97602 131918 209439 313551
6241 313551 423632 526163 598363 642936 697965 736532 684616 699909 788945 779708 769682
6230 769682 725695 651279 754953 814940 813733 745517 698192 628203 437771 349574 267456
6219 267456 154919 60563 33996 31020 -27305 -76111 11751 -7791 -2792 9631 -63452 -69331
6207 -69331 -49559 -42112 -6712 -16671 -7662 -26032 -26024 -87050 -167048 -139298 -96178 -46511 -10553
6194 -10553 -53615 -101702 -143794 -114055 -123082 -85331 -122508 -134888 -115255 -126849 -131987 -79468
6182 -79468 -62982 -64465 10211 32169 -17777 79031 104991 98659 58772 84621 59805 -16441
$$ packed form
6265b53834M713M1688j4618l4708M6887K3116j4246k3750Q396m3436O2312K6712
6253a70768l593M0637o8393m951P7902P1467N6098J14775j5572L4316P7521J04112
6241C13551J10081J02531P2200M4573N5029L8567n1916J5293Q9036r237j0026
6230G69682m3987p4416J03674N9987j207o8216m7325o9989j90432q8197q2118
6219B67456j12537r4356k6567k976n8325m8806Q7862j9542M999J2423p3083n879
6207f9331J9772P447L5400r959R009j8370Qo1026p9998K7750M3120M9667L5958
6194a0553m3062m8087m2092K9739r027L7751l7177j2380J9633j1594n138N2519
6182g9468J6486j483P4676K1958m9946R6808K5960o332l9887K5849k4816p6246
$$ plain form
6170 -16441 -61004 -115760 -53836 -3139 21823 -42461 -81275 -124572 -125585 -69091 -41444 -135641
6158 -135641 -194773 -291270 -248294 -185844 -239284 -247582 -202904 -175075 -179777 -163902 -110367 -3525
6146 -3525 67 -49052 -7312 92948 93661 32021 56231 15321 -55608 -21866 86437 7111
6134 7111 13825 48728 35786 29444 98855 82292 16218 -10549 -9989 11482 57569 87404 48607
6121 48607 74753 111328 74534 154638 316195 436507 533942 589603 687238 724372 718245 672385
6109 672385 654359 678751 763557 855439 958127 1025758 1151639 1264430 1312770 1337280 1203493
6098 1203493 1025232 900328 751256 664129 638637 483764 504355 529822 527373 521440 457039
6087 457039 451638 543169 635115 630528 710312 742796 791877 834069 753776 738900 771148 697826
$$ packed form
6170a6441m4563n4756O1924N0697K4962o4284l8814m3297j013N6494K7647r4197
6158a35641n9132r6497M2976O2450n3440q298M4678K7829m702J5875N3535J06842
6146c525L592m9119M1740J00260P13o1640K4210m0910p0929L3742J08303p9326
6134G111O714L4903j2942o342O9411j6563o6074k6767N60K1471M6087K9835l8797
6121D8607K6146L6575l6794Q0104J61557J20312R7435N5661R7635L7134o127m5860
6109F72385j8026K4392Q4806R1882J02688O7631J25881J12791M8340K4510j33787
6098A203493j78261j24904j49072q7127k5492j54873K0591K5467k449n933o4401
6087D57039n401R1531R1946m587P9784L2484M9081M2192q0293j4876L2248p3322
$$ plain form
6075 697826 647321 670844 715576 741998 794673 859927 901873 943686 937710 941051 864764 820951
6063 820951 716216 654116 602024 607573 583610 546776 511702 438705 532441 491171 579728 656038
6051 656038 670991 633815 665744 681358 655765 634275 623062 582509 549526 594068 654098 587841
6039 587841 550597 550538 587595 618165 639422 664288 679469 720723 746512 744788 764745 865607
6027 865607 997322 1048133 1152857 1197020 1295496 1336234 1338600 1378147 1385024 1353380 1384842 1431298
6015 1431298 1418980 1451084 1467881 1605442 1650291 1787659 1868191 2000487 2140329 2370163
6005 2370163 2651007 2829605 3108010 3269048 3295698 3313603 3123381 3008114 2840544 2614549
5995 2614549 2409959 2262742 2140833 2070796 2070163 2036758 2028092 2066472 2111649 2170403 2232019
$$ packed form
6075F97826n0505K3523M4732K6422N2675O5254M1946M1813n976L341p6287m3813
6063H20951j04735o2100n2092N549k3963l6834l5074p2997R3736m1270Q8557P6310
6051F56038J4953l7176L1929J5614k5593k1490j1213m0553l2983M4542O0030o6257
6039E87841l7244n9L7057L0570K1257K4866J5181M1254K5789j724J9957J00862
6027H65607J31715N0811J04724M4163R8476M0738K366L9547O877l1644L1462M6456
6015A431298j2318L2104J6797J37561M4849J37368Q0532J32296J39842K29834
6005B370163K80844J78598K78405J61038K6650J7905j90222j15267j67570k25995
5995B614549k04590j47217j21909p0037o33l3405q666L8380M5177N8754O1616
$$ plain form
5984 2232019 2409667 2464158 2495471 2577996 2662977 2779052 2896106 2974983 3012485 3171444 3334559
5973 3334559 3526049 3710551 3879414 4058956 4350379 4767343 5076185 5329917 5651509 6064245
5963 6064245 6486139 6981275 7586392 8325497 9309445 10515641 12024049 13678626 15097659
5954 15097659 16195298 16765020 16788964 16609100 16290252 16079183 15980299 16172392 16819580 17812927
5944 17812927 18927676 19919804 20394461 20388333 20050051 19527443 18952378 18323848 17924679 17795851
5934 17795851 18066750 18752404 19850423 21460579 23547682 25937621 28455422 30980931
5926 30980931 33324998 35521422 37832122 40592439 44431359 49622366 56386190 64827983
5918 64827983 74314395 83478921 90788450 95130507 96196096 94604997 91559777 88268051
$$ packed form
5984B232019J77648N4491L1313Q2525Q4981J16075J17054P8877L7502J58959J63115
5973C334559J91490J84502J68863J79542K91423M16964L08842K53732L21592M12736
5963F064245M21894M95136O05117P39105R83948J206196J508408J654577J419033
5954A5097659J097639N69722K3944j79864l18848k11069r8884J92093O47188R93347
5944A7812927J114749R92128M74657o128l38282n22608n75065o28530l99169j28828
5934A7795851K70899O85654J098019J610156K087103K389939K517801K525509
5926C0980931K344067K196424K310700K760317L838920N191007O763824Q441793
5918F4827983R486412R164526P309529M342057J065589j591099l045220l291726
$$ plain form
5910 88268051 85646161 84392194 84951085 87099954 89856834 91754173 91582769 88904398
5902 88904398 83787320 77049895 69460193 61581055 53959624 47083796 41099896 36237236
5894 36237236 32268035 29052634 26378917 24049682 22063323 20390703 18961867 17709005
5886 17709005 16606806 15605650 14682920 13974505 13285925 12562415 11874811 11402011 10907330
5877 10907330 10502821 10192821 9998245 9900480 9765300 9603099 9413828 9180022 8872534 8630011
5867 8630011 8527742 8322552 8028375 7778996 7509664 7229756 6901463 6650790 6416073 6148956
5857 6148956 5961630 5818141 5650689 5557322 5454277 5387617 5381849 5380586 5428781 5520815 5654132
5846 5654132 5809634 5861742 5968593 6041830 6071441 6113465 6246706 6342343 6496493 6681266
$$ packed form
5910H8268051k621890j253967N58891K148869K756880J897339j71404k678371
5902H8904398n117078o737425p589702p879138p621431o875828n983900m862660
5894C6237236l969201l215401k673717k329235j986359j672620j428836j252862
5886A7709005j102199j001156r22730p08415o88580p23510o87604m72800m94681
5877A0907330m04509l10000j94576r7765j35180j62201j89271k33806l07488k42523
5867H630011j02269k05190k94177k49379k69332k79908l28293k50673k34717k67117
5857F148956j87326j43489j67452r3367j03045o6660n768j263M8195R2034J33317
5846E654132J55502N2108J06851P3237K9611M2024J33241R5637J54150J84773
$$ plain form
5836 6681266 6850956 7025163 7317824 7584165 7914039 8227751 8567944 8967003 9271786 9556106
5826 9556106 9871937 10154812 10332471 10353497 10366465 10348417 10301555 10148893 10072448 9981912 9823386
5815 9823386 9743081 9784775 9896276 9950089 10073915 10221199 10430672 10670540 10937961 11358260
5805 11358260 11769864 12316158 12989415 13639367 14381896 15104834 15892513 16636267 17205370
5796 17205370 17719500 18158628 18583009 18967255 19365530 19860003 20495974 21350913 22424890
5787 22424890 23929043 25841476 28161196 30949751 34300928 38304516 43247478 49605506
5779 49605506 57928172 69242333 84599540 104191947 127281776 150101862 169049396
5772 169049396 184534475 195182878 201031154 201287262 194752655 181300225 161930723 141417696
$$ packed form
5836F681266J69690J74207K92661K66341L29874L13712L40193L99059L04783K84320
5826I556106L15831K82875J77659K1026J2968j8048m6862j52662p6445r0536j58526
5815I823386q0305M1694J11501N3813J23826J47284K09473K39868K67421M20299
5805A1358260M11604N46294O73257O49952P42529P22938P87679P43754N69103
5796A7205370N14130M39128M24381L84246L98275M94473O35971Q54939J073977
5787B2424890J504153J912433K319720K788555L351177M003588M942962O358028
5779D9605506Q322666J1314161J5357207J9592407K3089829K2820086J8947534
5772A69049396J5485079J0648403N848276K56108o534607j3452430j9369502k0513027
$$ plain form
5764 141417696 122792858 105834310 90399748 77112758 66292305 58331302 52571833
5757 52571833 48453796 45400660 43161204 41604829 40687532 40472606 40979315 42208388 44221117
5748 44221117 47295600 52167710 59352599 69729461 84111589 101616977 120085737 136433484
5740 136433484 145414772 146800210 141180085 129687163 116453699 102619620 88567731
5733 88567731 75372242 64153686 55486012 49220124 44592536 40922659 37846373 35209329
5725 35209329 32916111 31029932 29476695 28208199 27272020 26616525 26079107 25706228 25466381
5716 25466381 25465762 25548735 25631652 25930195 26272362 26719171 27238842 27898755 28647453 29404082
5706 29404082 30223169 31101348 32302221 34040818 36415273 39486109 43800824 49928550
$$ packed form
5764A41417696j8624838j6958548j5434562j3286990j0820453p961003n759469
5757E2571833m118037l053136k239456j556375r17297k14926N06709J229073K012729
5748D4221117L074483M872110P184889J0376862J4382128J7505388J8468760J6347747
5740A36433484Q981288J385438n620125j1492922j3233464j3834079j4051889
5733H8567731j3195489j1218556q667674o265888m627588l669877l076286k637044
5725C5209329k293218j886179j553237j268496r36179o55495n37418l72879k39847
5716B5466381o19Q2973Q2917K98543L42167M46809N19671O59913P48698P56629
5706B9404082Q19087Q78179J200873J738597K374455L070836M314715O127726
$$ plain form
5698 49928550 58237331 68508932 79683024 88971933 94037349 95135712 92036241 86740060
5690 86740060 81430655 76548500 72105212 68845317 67495537 68596513 71818863 76899439
5682 76899439 83858146 93459811 106967215 126587173 155293186 195685775 245933290
5675 245933290 300414236 343703725 365190322 365775951 343573803 308812515 271815577
5668 271815577 233354693 194254917 158363156 128817208 107363098 92385931 81505376
5661 81505376 72676689 64932121 58062311 52176497 46963866 42627838 39009345 35874781
5653 35874781 33148947 30610745 28417250 26429934 24746400 23239510 22047897 21142163
5645 21142163 20456522 19879809 19403403 18921369 18376757 17836696 17379346 16803683 16212105
$$ packed form
5698D9928550Q308781J0271601J1174092R288909N065416J098363l099471n296181
5690H6740060n309405m882155m443288l259895j349780J100976L222350N080576
5682G6899439O958707R601665J3507404J9619958K8706013M0392589N0247515
5675B45933290N4480946M3289489K1486597N85629k2202148l4761288l6996938
5668B71815577l8460884l9099776l5891761k9545948k1454110j4977167j0880555
5661H1505376q828687p744568o869810n885814n212631m336028l618493l134564
5653C5874781k725834k538202k193495j987316j683534j506890j191613r05734
5645B1142163o85641n76713m76406m82034n44612n40061m57350n75663n91578
$$ plain form
5636 16212105 15673868 15119189 14677035 14272166 13793794 13481993 13231047 13000824 12699857
5627 12699857 12398437 12197895 12093629 11881784 11595618 11340874 11195421 11036866 10877517
5618 10877517 10658806 10479273 10423837 10368670 10247562 10050055 9853025 9681347 9502115 9376349
5608 9376349 9274658 9185920 9109387 8963651 8745689 8628028 8422925 8284844 8124225 8010709
5598 8010709 7881667 7745673 7566139 7346515 7112099 6924144 6820852 6651553 6543116 6412503
5588 6412503 6243040 6064871 5931673 5835706 5716027 5586559 5399803 5249846 5061059 4867646
5578 4867646 4772592 4659437 4545347 4388678 4326836 4321246 4219095 4128778 4080938 4004079 3933845
5567 3933845 3925404 3862884 3863387 3848538 3806129 3729461 3705626 3646815 3627826 3577100 3537286 3562195
$$ packed form
5636A6212105n38237n54679m42154m04869m78372l11801k50946k30223l00967
5627A2699857l01420k00542j04266k11845k86166k54744j45453j58555j59349
5618A0877517k18711j79533n5436n5167j21108j97507j97030j71678j79232j25766
5608I376349j01691q8738p6533j45736k17962j17661k05103j38081j60619j13516
5598H010709j29042j35994j79534k19624k34416j87955j03292j69299j08437j30613
5588F412503j69463j78169j33198r5967j19679j29468j86756j49957j88787j93413
5578D867646r5054j13155j14090j56669o1842n590j02151r0317m7840p6859p0234
5567C933845q441o2520N03j4849m2409p6668k3835n8811j8989n0726l9814K4909
$$ plain form
5555 3562195 3518324 3480371 3434038 3467478 3448716 3448061 3359829 3220653 3113845 3031724 2928388
5544 2928388 2784542 2762964 2748839 2784810 2761713 2728817 2732928 2765097 2780714 2701635 2763464
5533 2763464 2730227 2671731 2602758 2536538 2461812 2341474 2244377 2057901 2011419 1895293 1805988
5522 1805988 1799663 1795801 1829359 1877953 1925160 1927430 1978209 1912662 1953010 1999690 1968200 1971207
5510 1971207 2063860 2003766 1964269 1926521 1782126 1759567 1739378 1724660 1669520 1588517 1557674
5499 1557674 1571509 1558870 1518324 1547376 1625701 1689017 1706330 1689699 1666985 1671205 1673988 1658056
5487 1658056 1607063 1554122 1495325 1399003 1359416 1363606 1269160 1201608 1227713 1292041 1234877 1207232
5475 1207232 1201613 1188999 1211592 1259852 1267596 1342236 1393599 1330341 1387308 1383272 1308833 1298961
$$ packed form
5555C562195m3871l7953m6333L3440j8762o55q8232j39176j06808q2121j03336
5544B928388j43846k1578j4125L5971k3097l2896M111L2169J5617p9079O1829
5533B763464l3237n8496o8973o6220p4726j20338r7097j86476m6482j16126q9305
5522A805988o325l862L3558M8594M7207K270N0779o5547M0348M6680l1490L007
5510A971207R2653o0094l9497l7748j44395k2559k0189j4718n5140q1003l0843
5499A557674J3835j2639m0546K9052P8325O3316J7313j6631k2714M220K783j5932
5487A658056n0993n2941n8797r6322l9587M190r4446o7552K6105O4328n7164k7645
5475A207232n619j2614K2593M8260P744P4640N1363o3258N6967m036p4439r872
$$ plain form
5463 1298961 1246438 1247105 1285497 1363338 1375959 1366919 1372402 1353915 1311237 1280197 1303986 1315178
5451 1315178 1317038 1281886 1324102 1293577 1236277 1255051 1330115 1414550 1499197 1608824 1675543
5440 1675543 1816645 2048290 2169420 2292889 2424818 2465673 2506522 2573024 2609524 2669924
5430 2669924 2610024 2556305 2495206 2388222 2279937 2144177 2018505 1952070 1866525 1770094 1709258
5419 1709258 1628787 1603906 1572435 1514154 1554940 1460054 1485031 1619796 1701919 1749469 1819276
5408 1819276 1959148 2118028 2261323 2332193 2441216 2438439 2459501 2626893 2838182 3158956
5398 3158956 3558551 3849116 4056252 4160709 4154765 4028827 3795310 3488901 3140391 2836486
5388 2836486 2543565 2319856 2087884 1921219 1907390 1761751 1648731 1569905 1504444 1442134
$$ packed form
5463A298961n2523O67L8392P7841J2621r040N483j8487m2678l1040K3789J1192
5451A315178J860l5152M2216l0525n7300J8774P5064Q4435Q4647J09627O6719
5440A675543J41102K31645J21130J23469J31929M0855M0849O6502L6500O0400
5430B669924n9900n3719o1099j06984j08285j35760j25672o6435q5545r6431o0836
5419A709258q0471k4881l1471n8281M0786r4886K4977J34765Q2123M7550O9807
5408A819276J39872J58880J43295P0870J09023k777K1062J67392K11289L20774
5398C158956L99595K90565K07136J04457n944j25938k33517l06409l48510l03905
5388B836486k92921k23709k31972j66665j3829j45639j13020p8826o5461o2310
$$ plain form
5378 1442134 1482825 1493861 1522685 1480429 1477582 1527582 1503052 1553192 1519359 1520314 1461978 1474947
5366 1474947 1497880 1512093 1594366 1568011 1595752 1628885 1614054 1657019 1632641 1625043 1580786 1596006
5354 1596006 1609881 1616867 1651245 1660035 1740414 1863018 1947472 2044829 2184849 2440625 2728877
5343 2728877 3034362 3468880 3874174 4179996 4391441 4535506 4421241 4274604 4035416 3741199
5333 3741199 3391921 2978219 2710485 2508130 2279873 2115103 2012854 1947977 1813400 1703729
5323 1703729 1613718 1580037 1534285 1510180 1554819 1535269 1554490 1504641 1498524 1489396 1587473 1628002
5311 1628002 1568715 1553332 1597880 1581320 1634264 1583141 1520908 1496020 1518225 1513105 1500293 1502583
5299 1502583 1484320 1545683 1540948 1590962 1653739 1656055 1588675 1555671 1565066 1530860 1591211 1508317
$$ packed form
5378A442134M0691J1036K8824m2256k847N0000k4530N0140l3833R55n8336J2969
5366A474947K2933J4213Q2273k6355K7741L3133j4831M2965k4378p598m4257J5220
5354A596006J3875O986L4378Q790Q0379J22604Q4454R7357J40020K55776K88252
5343B728877L05485M34518M05294L05822K11445J44065j14265j46637k39188k94217
5333C741199l49278m13702k67734k02355k28257j64770j02249o4877j34577j09671
5323A703729r0011l3681m5752k4105M4639j9550J9221m9849o117r128R8077M0529
5311A628002n9287j5383M4548j6560N2944n1123o2233k4888K2205n120j2812K290
5299A502583j8263O1363m735N0014O2777K316o7380l3004R395l4206O0351q2894
$$ plain form
5287 1508317 1448655 1508062 1502619 1509453 1506022 1510358 1515401 1557167 1658476 1757475 1756732 1761335 1761755
5274 1761755 1802852 1892328 1930730 1976597 1967546 1950661 1978194 1972030 1959208 1961998 1988558 2081979
5262 2081979 2115061 2127154 2113612 2158983 2252256 2169589 2122282 2127115 2174344 2085798 2099893 2123121
5250 2123121 2134517 2182021 2173260 2179898 2162213 2195882 2288152 2323798 2253828 2278858 2337549 2322034
5238 2322034 2356214 2359856 2343721 2316852 2331750 2351132 2390527 2416623 2452486 2500896 2540496 2564498
5226 2564498 2620726 2655930 2707902 2753686 2767116 2789489 2798594 2735673 2789594 2856519 2940253 3010085
5214 3010085 2954517 3027240 3109456 3102609 3129277 3180465 3262223 3379149 3426323 3412591 3449297
5203 3449297 3440245 3490769 3611621 3650053 3657911 3773168 3841815 3918410 3990961 4016029 4085226
$$ packed form
5287A508317n9662N9407n443O834l431M336N043M1766J01309R8999p43M603M20
5274A761755M1097Q9476L8402M5867r051j6885K7533o164j2822K790K6560R3421
5262B081979L3082J2093j3542M5371R3273q2667m7307M833M7229q8546J4095K3228
5250B123121J1396M7504q761O638j7685L3669R2270L5646o9970K5030N8691j5515
5238B322034L4180L642j6135k6869J4898J9382L9395K6096L5863M8410L9600K4002
5226B564498N6228L5204N1972M5784J3430K2373R105o2921N3921O6925Q3734O9832
5214C010085n5568P2723Q2216o847K6668N1188Q1758J16926M7174j3732L6706
5203C449297r052N0524J20852L8432P858J15257O8647P6595P2551K5068O9197
$$ plain form
5192 4085226 4077073 4000496 4068105 4223724 4215862 4282698 4384304 4494946 4516291 4493882 4613751
5181 4613751 4763253 4768546 4852600 4970915 5064281 5139431 5299840 5342300 5382621 5536462 5617373
5170 5617373 5611485 5666542 5769739 5804675 5878879 6014745 6024575 6136061 6215891 6313748 6453332
5159 6453332 6556054 6554297 6665947 6765326 6859353 6921323 6969865 7130474 7200875 7282894 7350512
5148 7350512 7489769 7631206 7697703 7816638 7854840 7877494 7985877 8158537 8285429 8336176
5138 8336176 8416319 8517152 8639918 8624822 8630832 8648066 8741548 8785959 8896932 8969285 9057920
5127 9057920 9077777 9075353 9150958 9156060 9154142 9171448 9193587 9215447 9243622 9207565 9234207 9296009
5115 9296009 9318119 9204134 9208336 9150237 9080754 9113836 9038931 8970477 8966859 8929263 8867077 8799547
$$ packed form
5192D085226q153p6577O7609J55619p862O6836J01606J10642K1345k2409J19869
5181D613751J49502N293Q4054J18315R3366P5150J60409M2460M0321J53841Q0911
5170E617373n888N5057J03197L4936P4204J35866R830J11486P9830R7857J39584
5159F453332J02722j757J11650R9379R4027O1970M8542J60609P0401Q2019O7618
5148G350512J39257J41437O6497J18935L8202K2654J08383J72660J26892N0747
5138H336176Q0143J00833J22766j5096O010J7234R3482M4411J10973P2353Q8635
5127I057920J9857k424P5605N102j918J7306K2139K1860K8175l6057K6642O1802
5115I296009K2110j13985M202n8099o9483L3082p4905o8454l618l7596o2186o7530
$$ plain form
5103 8799547 8770807 8727816 8623365 8545966 8482313 8467941 8453095 8367214 8250607 8176420 8056859
5092 8056859 7919240 7823733 7854037 7821595 7702274 7575177 7565327 7459124 7337134 7179740
5082 7179740 7032487 7030658 6930395 6811128 6703038 6652460 6563284 6374079 6377470 6341744 6264648
5071 6264648 6221167 6151557 6074394 6037595 6046162 6020312 6046562 6032210 6038561 6068605 5996815 5883228
5059 5883228 5774758 5672994 5582748 5541514 5495768 5427795 5344961 5371308 5311904 5311735 5299138
5048 5299138 5188866 5099403 4981108 4826930 4701563 4630303 4508057 4507336 4441989 4325346 4301311
5037 4301311 4246912 4119572 4108495 4089537 3990870 3952904 3917031 3898036 3853748 3726162 3614922
5026 3614922 3590693 3517830 3432692 3481853 3444285 3438059 3507077 3444920 3398664 3385328 3381547 3365786
$$ packed form
5103H799547k8740m2991j04451p7399o3653j4372j4846q5881j16607p4187j19561
5092H056859j37619r5507L0304l2442j19321j27097r850j06203j21990j57394
5082G179740j47253j829j00263j19267j08090n0578q9176j89205L391l5726p7096
5071F264648m3481o9610p7163l6799Q567k5850K6250j4352O351L0044p1790j13587
5059E883228j08470j01764r0246m1234m5746o7973q2834K6347n9404j69j2597
5048E299138j10272q9463j18295j54178j25367p1260j22246p21o5347j16643k4035
5037D301311n4399j27340j1077j8958r8667l7966l5873j8995m4288j27586j11240
5026C614922k4229p2863q5138M9161l7568o226O9018o2157m6256j3336l781j5761
$$ plain form
5014 3365786 3370252 3389756 3321552 3323296 3331254 3344007 3349766 3380291 3408790 3352570 3319061 3290481
5002 3290481 3294468 3273262 3249878 3267219 3307480 3393086 3346083 3320817 3357296 3363926 3323104 3352540
4990 3352540 3418577 3546659 3735014 3848054 3984403 4187005 4222492 4330157 4351373 4311529
4980 4311529 4304041 4323227 4328835 4272295 4339751 4402898 4456096 4415901 4381541 4240374 4065524
4969 4065524 3904208 3713632 3491903 3318611 3239930 3191099 3132214 3140860 3064516 3070817 3075405
4958 3075405 3121031 3026602 2945959 2957366 2964106 2937245 2781186 2773833 2788604 2833872 2771002 2824560
4946 2824560 2791325 2721592 2770138 2782621 2736175 2730007 2758804 2775683 2779366 2807666 2815797 2846133
4934 2846133 2907295 2936095 2940701 2954170 2956575 2978562 3087086 3132413 3168992 3243435 3338918 3425854
$$ packed form
5014C365786M466J9504o8204J744P958J2753N759L0525K8499n6220l3509k8580
5002C290481L987k1206k3384J7341M0261Q5606m7003k5266L6479O630m0822K9436
4990C352540O6037J28082J88355J13040J36349K02602L5487J07665K1216l9844
4980D311529p488J9186N608n6540O7456O3147N3198m0195l4360j41167j74850
4969D065524j61316j90576k21729j73292p8681m8831n8885Q646p6344O301M588
4958C075405M5626r4429q0643J1407O740k6861j56059p353J4771M5268o2870N3558
4946B824560l3235o9733M8546J2483m6446o168K8797J6879L683K8300Q131L0336
4934B846133O1162K8800M606J3469K405K1987J08524M5327L6579P4443R5483Q6936
$$ plain form
4922 3425854 3506665 3658643 3751045 3771667 3783117 3846290 3827553 3853308 3880798 3943463 4078282
4911 4078282 4077002 4126660 4210860 4300052 4405029 4465516 4511639 4558084 4620559 4673909 4766250
4900 4766250 4790744 4826868 4912394 5001132 4995733 5032051 5037617 5002133 5029319 4985203 4980408 4958809
4888 4958809 4974478 4909843 4879843 4828913 4779774 4765514 4711608 4716542 4724409 4737536 4834106 4846750
4876 4846750 4821940 4825234 4892547 4905709 4949070 4944062 4950334 4919586 4976144 4935677 4900730 4913479
4864 4913479 4856067 4887930 4899689 4984718 4975909 4952708 5013205 5044846 5045766 5067693 5157545 5283149
4852 5283149 5398556 5509864 5552941 5565572 5626336 5719542 5753747 5805107 5796361 5918249 6097544
4841 6097544 6148535 6278706 6435291 6552678 6761275 7016646 7173726 7352941 7687596 8044785
$$ packed form
4922C425854Q0811J51978R2402K0622J1450O3173j8737K5755K7490O2665J34819
4911D078282j280M9658Q4200Q9192J04977O0487M6123M6445O2475N3350R2341
4900D766250K4494L6124Q5526Q8738n399L6318N566l5484K7186m4116m795k1599
4888D958809J5669o4635l0000n0930m9139j4260n3906M934P867J3127R6570J2644
4876D846750k4810L294O7313J3162M3361n008O272l0748N6558m0467l4947J2749
4864D913479n7412L1863J1759Q5029q809k3201O0497L1641R20K1927Q9852J25604
4852E283149J15407J11308M3077J2631O0764R3206L4205N1360q746J21888J79295
4841F097544N0991J30171J56585J17387K08597K55371J57080J79215L34655L57189
$$ plain form
4831 8044785 8380015 8756168 9010434 9206728 9384094 9587977 9865330 10116167 10417279 10927583
4821 10927583 11642478 12625968 14023428 15840087 17875290 19864848 20958798 21330369 20992864
4812 20992864 19974527 18867981 17820912 16752669 15705162 14978031 14510037 14352272 14395913
4803 14395913 14613609 14929767 15194027 15542025 16050317 16601192 17293288 17990538 18818959
4794 18818959 19725508 20598751 21658402 22931659 24413721 26189916 28487727 31195776
4786 31195776 34191310 37192689 39958939 42243114 43834326 44918703 45738198 46555402
4778 46555402 47782042 49853970 52934038 57055604 61516808 65269733 67722927 68723640
4770 68723640 68059919 66587509 65010428 63366463 62127100 61424976 61473669 62191411 63010634
$$ packed form
4831H044785L35230L76153K54266J96294J77366K03883K77353K50837L01112N10304
4821A0927583P14895R83490J397460J816659K035203J989558J093950L71571l37505
4812B0992864j018337j106546j047069j068243j047507p27131m67994j57765M3641
4803A4395913K17696L16158K64260L47998N08292N50875O92096O97250Q28421
4794A8818959R06549Q73243J059651J273257J482062J776195K297811K708049
4786C1195776K995534L001379K766250K284175J591212J084377Q19495Q17204
4778D6555402J226640K071928L080068M121566M461204L752925K453194J000713
4770F8723640o63721j472410j577081j643965j239363p02124M8693P17742Q19223
$$ plain form
4761 63010634 63575674 63599484 63122155 62167082 61048097 59815147 58578389 57532139 56850435
4752 56850435 56305197 55963857 55791435 55669078 55568961 55522939 55516189 55611897 55929875 56372478
4742 56372478 56845229 57640715 58607724 59848696 61363536 62792360 64241846 65669164 66915954
4733 66915954 68085992 69544267 71081104 72990735 75336146 78217073 81630340 84959161
4725 84959161 87927035 90486345 92314477 93538570 94558094 95386328 96033673 96626586 97304593
4716 97304593 98254132 99317879 100300687 101207656 101976566 102551793 103098835 103699066 104291063
4707 104291063 104696418 104977220 105339915 105758045 106178470 106584512 107171428 107994106 109033033
4698 109033033 110270144 111580776 113029214 114623291 116329293 118024757 119573450 120911402
$$ packed form
4761F3010634N65040K3810m77329r55073j118985j232950j236758j046250o81704
4752E6850435n45238l41340j72422j22357j00117m6022o750R5708L17978M42603
4742E6372478M72751P95486R67009J240972J514840J428824J449486J427318J246790
4733F6915954J170038J458275J536837J909631K345411K880927L413267L328821
4725H4959161K967874K559310J828132J224093J019524Q28234O47345N92913O78007
4716I7304593R49539J063747R82808R06969P68910N75227N47042O00231N91997
4707A04291063M05355K80802L62695M18130M20425M06042N86916Q22678J038927
4698A09033033J237111J310632J448438J594077J706002J695464J548693J337952
$$ plain form
4690 120911402 122150695 123283326 124395790 125503181 126780678 128115920 129197556 129665274
4682 129665274 129382276 128209865 126299514 124079085 121733493 119337847 117058365 114944871
4674 114944871 113010425 111172064 109238263 107050044 104384602 101505696 98560621 95611794
4666 95611794 92926163 90459673 88193480 86114586 84267919 82538823 80866692 79083138
4658 79083138 77070547 74730744 72195280 69484384 66556197 63517617 60510280 57650803
4650 57650803 54996835 52576029 50387295 48426856 46563953 44736373 42918032 41182227
4642 41182227 39548843 38076462 36744316 35646393 34641158 33816140 33150701 32642507 32178858
4633 32178858 31666015 31162011 30762505 30354529 30049373 29871140 29926177 30029818 30156962 30374392
$$ packed form
4690A20911402J239293J132631J112464J107391J277497J335242J081636M67718
4682A29665274k82998j172411j910351k220429k345592k395646k279482k113494
4674A14944871j934446j838361j933801k188219k665442k878906k945075k948827
4666I5611794k685631k466490k266193k078894j846667j729096j672131j783554
4658G9083138k012591k339803k535464k710896k928187l038580l007337k859477
4650E7650803k653968k420806k188734j960439j862903j827580j818341j735805
4642D1182227j633384j472381j332146j097923j005235q25018o65439n08194m63649
4633C2178858n12843n04004l99506m07976l05156j78233N5037J03641J27144K17430
$$ plain form
4623 30374392 30322027 30198127 29963596 29728782 29562869 29358408 29236896 29283179 29429420 29616867
4613 29616867 29944438 30270598 30517804 30843183 31101010 31157361 31142026 31127123 30953368 30709759
4603 30709759 30544230 30385537 30263695 30209776 30135848 29923956 29671283 29474722 29344260 29349710
4593 29349710 29470767 29784164 30063308 30259466 30336264 30385214 30379582 30403784 30518101 30745341
4583 30745341 31010129 31268517 31404008 31319501 31095756 30864585 30784043 30798821 30957003 31315233
4573 31315233 31770520 32499745 33537065 34560803 35564857 36659789 37776995 38895083
4565 38895083 40125971 41418067 42823147 44152235 45624284 47186031 48668976 50040200
4557 50040200 51265339 52187793 53056173 53678645 54248800 54780244 55361178 56117333 57268314
$$ packed form
4623C0374392n2365j23900k34531k34814j65913k04461j21512M6283J46241J87447
4613B9616867L27571L26160K47206L25379K57827N6351j5335j4903j73755k43609
4603C0709759j65529j58693j21842n3919p3928k11892k52673j96561j30462N450
4593B9349710J21057L13397K79144J96158P6798M8950n632K4202J14317K27240
4583C0745341K64788K58388J35491q4507k23745k31171q0542J4778J58182L58230
4573C1315233M55287P29225J037320J023738J004054J094932J117206J118088
4565C8895083J230888J292096J405080J329088J472049J561747J482945J371224
4557E0040200J225139R22454Q68380O22472N70155N31444N80934P56155J150981
$$ plain form
4548 57268314 58802847 60670025 62930502 65502975 68164374 70674933 73030397 75101583
4540 75101583 76865130 78351382 79534833 80331295 80662765 80599589 80088511 79119913 77851102
4531 77851102 76332023 74592390 72756287 70655584 68312841 65864019 63256702 60613016
4523 60613016 57991552 55522802 53200879 51173309 49555017 48326397 47426362 46816405
4515 46816405 46320687 46075516 45947019 45722038 45441427 45009170 44390507 43524633 42460179
4506 42460179 41251306 39927918 38649303 37191876 35766400 34343631 32903142 31360575
4498 31360575 29740255 28021977 26303036 24560844 22913274 21328719 19940165 18694913
4490 18694913 17477883 16451847 15664775 14921466 14203010 13561116 12965025 12471717 11968545
$$ packed form
4548E7268314J534533J867178K260477K572473K661399K510559K355464K071186
4540G5101583J763547J486252J183451P96462L31470o3176n11078r68598j268811
4531G7851102j519079j739633j836103k100703k342743k448822k607317k643686
4523F0613016k621464k468750k321923k027570j618292j228620r00035o09957
4515D6816405m95718k45171j28497k24981k80611m32257o18663q65874j064454
4506D2460179j208873j323388j278615j457427j425476j422769j440489j542567
4498C1360575j620320j718278j718941j742192j647570j584555j388554j245252
4490A8694913j217030j026036p87072p43309p18456o41894n96091m93308n03172
$$ plain form
4481 11968545 11529797 11284423 11007085 10708723 10409830 10140939 9889345 9606790 9427532
4472 9427532 9247159 9070337 8851636 8685392 8505080 8391224 8190291 8033028 7947107 7863639
4462 7863639 7799530 7684840 7624108 7558682 7454175 7353595 7341427 7332491 7261130 7100987 6984639
4451 6984639 6961661 6878255 6869960 6902773 6804098 6783205 6786728 6766125 6749087 6693153 6668895 6655212
4439 6655212 6491429 6465562 6472291 6471253 6401618 6321198 6338812 6276204 6306859 6334158 6313997 6219492
4427 6219492 6241328 6228910 6292113 6357868 6365441 6338697 6325347 6357601 6289348 6296466 6259874 6326995
4415 6326995 6373274 6330090 6282415 6210451 6226506 6164755 6064364 5970247 5947611 5934142 5919752
4404 5919752 5841984 5772714 5669503 5691831 5629806 5553329 5489285 5417065 5395058 5382597 5345443
$$ packed form
4481A1968545m38748k45374k77338k98362k98893k68891k51594k82555j79258
4472I427532j80373j76822k18701j66244j80312j13856k00933j57263q5921q3468
4462G863639o4109j14690o0732o5426j04507j00580j2168q936p1361j60143j16348
4451F984639k2978q3406q295L2813r8675k0893L523k0603j7038n5934k4258j3683
4439F655212j63783k5867O729j038o9635q0420J7614o2608L0655K7299k0161r4505
4427F219492K1836j2418O3203O5755P573k6744j3350L2254o8253P118l6592O7121
4415F326995M6279m3184m7675p1964J6055o1751j00391r4117k2636j3469j4390
4404E919752p7768o9270j03211K2328o2025p6477o4044p2220k2007j2461l7154
$$ plain form
4393 5345443 5302388 5293750 5286157 5330597 5282451 5230658 5228225 5195668 5161730 5015531 5029935 5073716
4381 5073716 4976798 4976133 4918596 4823384 4738631 4708142 4724078 4738979 4709644 4766726 4752863 4702645
4369 4702645 4595946 4628188 4701297 4758108 4799881 4795788 4770051 4770282 4750453 4740766 4783506 4758138
4357 4758138 4798561 4831825 4831646 4951558 5026676 5089020 5241307 5456168 5711904 5882728 6103578
4346 6103578 6194938 6247029 6184284 6111924 6091169 5998000 5912310 5856547 5786947 5700391 5759053
4335 5759053 5761932 5759843 5734085 5652132 5681842 5745175 5764255 5790289 5835528 5884487 5955574 5976879
4323 5976879 6008979 6043194 6084778 6097644 6121506 6212551 6201761 6187299 6136683 6141666 6097108 6029782
4311 6029782 5978907 5942426 5919646 5871111 5843353 5776914 5735394 5656688 5603291 5512542 5382540
$$ packed form
4393E345443m3055q638p593M4440m8146n1793k433l2557l3938j46199J4404M3781
4381E073716r6918o65n7537r5212q4753l0489J5936J4901k9335N7082j3863n0218
4369D702645j06699L2242P3109N6811M1773m093k5737K31j9829r687M2740k5368
4357D758138M0423L3264j79J19912P5118O2344J52287K14861K55736J70824K20850
4346F103578R1360N2091o2745p2360k0755r3169q5690n5763o9600q6556N8662
4335E759053K879k089k5758q1953K9710O3333J9080K6034M5239M8959P1087K1305
4323E976879L2100L4215M1584J2866K3862R1045j0790j4462n0616M983m4558o7326
4311F029782n0875l6481k2780m8535k7758o6439m1520p8706n3397r0749j30002
$$ plain form
4300 5382540 5332402 5247682 5201007 5204948 5167755 5176972 5173625 5155586 5211872 5252647 5188103 5123721
4288 5123721 5090594 5116775 5194274 5147458 5181717 5272484 5362456 5555421 5774559 5994933 6281796
4277 6281796 6770046 7332382 8145420 9263250 10687266 12366598 14200681 15748026 16843431
4268 16843431 17618088 18090922 18528013 18951600 19164470 18809700 17963033 16690512 15228042
4259 15228042 13759544 12321096 10983749 9679190 8690376 7841621 7239352 6764405 6386055
4250 6386055 6152177 5923390 5699017 5450881 5270442 5133473 4962664 4893726 4819887 4761108
4240 4761108 4685043 4588395 4535912 4543126 4561678 4561189 4568966 4581478 4581201 4613414 4627071 4631589 4670499
4227 4670499 4690064 4752434 4756140 4873953 4950746 4951022 5073242 5181907 5177841 5205840 5223137 5250602
$$ packed form
4300E382540n0138q4720m6675L941l7193R217l347j8039N6286M0775o4544o4382
4288E123721l3127K6181P7499m6816L4259R0767Q9972J92965K19138K20374K86863
4277F281796M88250N62336Q13038J117830J424016J679332J834083J547345J095405
4268A6843431P74657M72834M37091M23587K12870l54770q46667j272521j462470
4259A5228042j468498j438448j337347j304559r88814q48755o02269m74947l78350
4250F386055k33878k28787k24373k48136j80439j36969j70809o8938p3839n8779
4240D761108p6065r6648n2483P214J8552m89P777J2512k77L2213J3657M518L8910
4227D670499J9565O2370L706J17813P6793K76J22220J08665m066K7999J7297K7465
$$ plain form
4215 5250602 5153716 5134205 5112046 5021661 4954845 4995201 5006410 5003195 5047307 5091837 5069940 5115892
4203 5115892 5152646 5156293 5164201 5232810 5126601 5030391 4988256 4981465 4918951 4896492 4831498 4732629
4191 4732629 4727964 4699337 4610640 4506549 4449913 4407574 4445144 4416300 4324924 4273331 4238118
4180 4238118 4209863 4258827 4252686 4187346 4176275 4183610 4168651 4152729 4117704 4136899 4095950 4063888
4168 4063888 3959199 3904697 3915501 3913215 3799762 3815063 3763388 3668919 3564290 3498701 3525884
4157 3525884 3519564 3509846 3505399 3520906 3476726 3504227 3499588 3542875 3609507 3634579 3744632 3741600
4145 3741600 3807427 3849498 3874368 3954452 3935641 3920357 3867488 3857151 3833344 3806940 3833756
4134 3833756 3889279 3872195 3791844 3865058 3871191 3907377 3967720 4002191 4012696 4108029 4135645 4205035
$$ packed form
4215E250602r6886j9511k2159r0385o6816M0356J1209l215M4112M4530k1897M5952
4203E115892L6754L647P908O8609j06209r6210m2135o791o2514k2459o4994r8869
4191D732629m665k8627q8697j04091n6636m2339L7570k8844r1376n1593l5213
4180D238118k8255M8964o141o5340j1071P335j4959j5922l5025J9195m0949l2062
4168D063888j04689n4502J0804k286j13453J5301n1675r4469j04629o5589K7183
4157C525884o320r718m447J5507m4180K7501m639M3287O6632K5072J10053l032
4145C741600O5827M2071K4870Q0084j8811j5284n2869j0337k3807k6404K6816
4134C833756N5523j7084q0351P3214O133L6186O0343L4471J0505R5333K7616O9390
$$ plain form
4122 4205035 4380492 4546594 4667777 4832791 4951976 5037108 5172330 5330654 5527067 5567100
4112 5567100 5589338 5549562 5364832 5180333 4987043 4872789 4837109 4658898 4536204 4539310
4102 4539310 4536648 4527765 4565455 4635273 4684791 4823396 4861041 4956335 4995771 5052516 5059724 5083171
4090 5083171 5174524 5279700 5354457 5385821 5507579 5572303 5733941 5908390 6075419 6252739
4080 6252739 6429125 6612589 6760265 6834224 6945594 7012483 7064578 7191242 7383826 7470749
4070 7470749 7625745 7828962 7955446 8045257 8231988 8324173 8385626 8542363 8604970 8628380
4060 8628380 8722675 8864668 9027180 9171089 9235793 9289921 9301265 9201220 9221908 9244369 9128875
4049 9128875 8999999 8969725 8928044 8879120 8786498 8687169 8632730 8599143 8597915 8678752 8702840
$$ packed form
4122D205035J75457J66102J21183J65014J19185Q5132J35222J58324J96413M0033
4112E567100K2238l9776j84730j84499j93290j14254l5680j78211j22694L106
4102D539310k662q883L7690O9818M9518J38605L7645R5294L9436N6745P208K3447
4090E083171R1353J05176P4757L1364J21758O4724J61638J74449J67029J77320
4080F252739J76386J83464J47676P3959J11370O6889N2095J26664J92584Q6923
4070G470749J54996K03217J26484Q9811J86731R2185O1453J56737O2607K3410
4060H628380R4295J41993J62512J43909O4704N4128J1344j00045K0688K2461j15494
4049I128875j28876l0274m1681m8924r2622r9329n4439l3587j228Q0837K4088
$$ plain form
4038 8702840 8686854 8644093 8714643 8741548 8823163 8937396 9050244 9127885 9173657 9280443 9328920
4027 9328920 9394171 9538432 9645240 9747111 9921096 10148972 10317669 10499930 10674958 10799252
4017 10799252 11056302 11328619 11617838 11853825 12056469 12337467 12603123 12904918 13215185
4008 13215185 13551757 13896324 14228548 14601854 15027655 15384587 15709551 16145348 16520726
3999 16520726 16919645 17274835 17725575 18092327 18423544 18900128 19371498 19815239 20247699
3990 20247699 20736641 21223119 21662858 22114877 22583194 23157825 23770449 24356713 25025015
3981 25025015 25823482 26539688 27199933 27889191 28674038 29400765 30160776 30876923 31764191
3972 31764191 32663767 33627769 34832603 35982117 37279504 38706188 40108299 41513210
$$ packed form
4038H702840j5986m2761P0550K6905Q1615J14233J12848P7641M5772J06786M8477
4027I328920O5251J44261J06808J01871J73985K27876J68697J82261J75028J24294
4017A0799252K57050K72317K89219K35987K02644K80998K65656L01795L10267
4008A3215185L36572L44567L32224L73306M25801L56932L24964M35797L75378
3999A6520726L98919L55190M50740L66752L31217M76584M71370M43741M32460
3990B0247699M88942M86478M39739M52019M68317N74631O12624N86264O68302
3981B5025015P98467P16206O60245O89258P84847P26727P60011P16147Q87268
3972C1764191Q99576R64002J204834J149514J297387J426684J402111J404911
$$ plain form
3964 41513210 42918155 44264321 45623058 46995844 48410260 49874654 51427682 53022043
3956 53022043 54735271 56543988 58287748 60183337 62207496 64339977 66457266 68651856
3948 68651856 70860156 73067125 75432785 77784914 80268288 82874370 85559928 88337263
3940 88337263 90923985 93445734 96009405 98521831 100975733 103469092 105802760 107932120
3932 107932120 109785251 111406343 112919547 114390297 115732536 117169705 118985101 121008535
3924 121008535 123304718 125782650 128353957 130746783 132944259 134875130 136462245 137817174
3916 137817174 138898794 139815664 140573844 141134149 141724456 142214578 142620915 143085328 143455384
3907 143455384 143694738 143827692 143940080 144200196 144601075 145192207 146184420 147637932 149593020
$$ packed form
3964D1513210J404945J346166J358737J372786J414416J464394J553028J594361
3956E3022043J713228J808717J743760J895589K024159K132481K117289K194590
3948F8651856K208300K206969K365660K352129K483374K606082K685558K777335
3940H8337263K586722K521749K563671K512426K453902K493359K333668K129360
3932A07932120J853131J621092J513204J470750J342239J437169J815396K023434
3924A21008535K296183K477932K571307K392826K197476J930871J587115J354929
3916A37817174J081620R16870P58180N60305N90307M90122M06337M64413L70056
3907A43455384K39354J32954J12388K60116M00879N91132R92213J453512J955088
$$ plain form
3898 149593020 152025389 154794906 157539262 159888436 161654141 162646606 162892820 162440151
3890 162440151 161472998 160366795 159230986 158066464 157033160 156104234 155125554 154057724
3882 154057724 152735190 151284585 149672335 147778499 145778194 143748339 141766208 139791631
3874 139791631 138205923 136892282 135884062 135075231 134296332 133341370 131939451 129897126
3866 129897126 127126615 123549260 119416683 114818159 110036228 105279422 100694967 96357147
3858 96357147 92365305 88843756 85589426 82719825 80099715 77716500 75520923 73577500
3850 73577500 71809725 70152575 68601747 67165903 65848274 64575648 63331373 62003844
3842 62003844 60633044 59173366 57574672 55865841 54145330 52333975 50650963 49119059
$$ packed form
3898A49593020K432369K769517K744356K349174J765705R92465K46214m52669
3890A62440151r67153j106203j135809j164522j033304r28926r78680j067830
3882A54057724j322534j450605j612250j893836k000305k029855j982131j974577
3874A39791631j585708j313641j008220q08831p78899r54962j401919k042325
3866A29897126k770511l577355m132577m598524m781931m756806m584455m337820
3858I6357147l991842l521549l254330k869601k620110k383215k195577j943423
3850G3577500j767775j657150j550828j435844j317629j272626j244275j327529
3842F2003844j370800j459678j598694j708831j720511j811355j683012j531904
$$ plain form
3834 49119059 47622194 46180934 44755055 43339993 41875685 40521246 39170423 37826095
3826 37826095 36532526 35395633 34282428 33390012 32573532 31912176 31313642 30783818 30345982
3817 30345982 29986791 29655767 29340657 28928341 28450274 27991730 27323240 26685381 26006517
3808 26006517 25319109 24630682 23994278 23376957 22703218 22038689 21455585 20857013 20210764
3799 20210764 19646633 19190783 18727449 18324404 17924646 17514398 17072221 16648219 16206016
3790 16206016 15747700 15341744 14858011 14384495 14009973 13655458 13339038 13032651 12774229
3781 12774229 12558098 12339251 12163996 11980111 11746100 11542115 11259371 11026946 10855133
3772 10855133 10676327 10481896 10187075 10087307 9928657 9830942 9691912 9520623 9356727 9199473
$$ packed form
3834D9119059j496865j441260j425879j415062j464308j354439j350823j344328
3826C7826095j293569j136893j113205q92416q16480o61356n98534n29824m37836
3817C0345982l59191l31024l15110m12316m78067m58544o68490o37859o78864
3808B6006517o87408o88427o36404o17321o73739o64529n83104n98572o46249
3799B0210764n64131m55850m63334m03045l99758m10248m42177m24002m42203
3790A6206016m58316m05956m83733m73516l74522l54515l16420l06387k58422
3781A2774229k16131k18847j75255j83885k34011k03985k82744k32425j71813
3772A0855133j78806j94431k94821r9768j58650r7715j39030j71289j63896j57254
$$ plain form
3762 9199473 9070989 8872236 8665512 8448540 8288851 8261640 8209115 7987077 7869318 7740705
3752 7740705 7585521 7470121 7314756 7184582 7039843 6934726 6850783 6741396 6658585 6532960
3742 6532960 6449411 6314245 6207402 6145857 6017042 5847729 5727672 5694523 5567407 5436092
3732 5436092 5380898 5323831 5271240 5167524 5140936 5105496 5064644 4984312 4926303 4820770 4760497
3721 4760497 4745827 4633959 4623055 4568618 4515942 4453879 4434148 4330134 4310324 4254188 4174760
3710 4174760 4122579 4020810 3974673 3957366 3951588 3922073 3835567 3774802 3780727 3731006 3729110 3667280
3698 3667280 3652690 3599501 3552850 3607670 3623246 3542679 3510890 3490639 3454692 3475572 3441926
3687 3441926 3419643 3354818 3318036 3343746 3418332 3361078 3284162 3320022 3292882 3300488 3287878 3210203
$$ packed form
3762I199473j28484j98753k06724k16972j59689k7211n2525k22038j17759j28613
3752G740705j55184j15400j55365j30174j44739j05117q3943j09387q2811j25625
3742F532960q3549j35166j06843o1545j28815j69313j20057l3149j27116j31315
3732E436092n5194n7067n2591j03716k6588l5440m0852q0332n8009j05533o0273
3721D760497j4670j11868j0904n4437n2676o2063j9731j04014j9810n6136p9428
3710D174760n2181j01769m6137j7307n778k9515q6506o0765N925m9721j896o1830
3698C667280j4590n3189m6651N4820J5576q0567l1789k0251l5947K0880l3646
3687C441926k2283o4825l6782K5710P4586n7254p6916L5860k7140P606j2610p7675
$$ plain form
3675 3210203 3172440 3218200 3238182 3167949 3143500 3115649 3106259 3174926 3137633 3076570 3091258 3091473
3663 3091473 3145084 3092661 2991085 2963338 2987344 2952967 2902235 2893630 2927416 2992518 2974755
3652 2974755 2997254 2972239 2879072 2872200 2910528 2937683 2985563 2977548 3046980 3089704 3052505 3031535
3640 3031535 3053607 3143648 3121280 3094269 3046748 3085787 3120978 3079790 3038352 3071976 3099206
3629 3099206 3079630 3110398 3115872 3037716 3012171 3002831 3003185 2972094 2953429 3017100 2993657 2990691
3617 2990691 3077241 3090680 2997583 3025769 3051812 3028701 2985923 2909913 2946384 3003741 3021420
3606 3021420 3035094 2992123 2985606 2982683 3025854 3044446 3041084 2938415 2982333 3028034 2998659 2952606
3594 2952606 2940734 3012193 3004299 2982330 3036289 3036621 3057225 3087309 3099856 3055014 3073645 3073988
$$ packed form
3675C210203l7763M5760J9982p0233k4449k7851r390O8667l7293o1063J4688K15
3663C091473N3611n2423j01576k7747K4006l4377n0732q605L3786O5102j7763
3652B974755K2499k5015r3167o872L8328K7155M7880q015O9432M2724l7199k0970
3640C031535K2072R0041k2368k7011m7521L9039L5191m1188m1438L3624K7230
3629C099206j9576L0768N474p8156k5545r340L54l1091j8665O3671k3443k966
3617B990691Q6550J3439r3097K8186K6043k3111m2778p6010L6471N7357J7679
3606C021420J3674m2971o517k923M3171J8592l362j02669M3918M5701k9375m6053
3594B952606j1872P1459p894k1969N3959L32K0604L0084J2547m4842J8631L43
$$ plain form
3582 3073988 3027490 3094298 3080108 3133911 3226246 3233247 3199987 3214110 3255776 3237977 3310869 3358240
3570 3358240 3410883 3496176 3473050 3446226 3486467 3476013 3502597 3493406 3460928 3484108 3456013 3485323
3558 3485323 3528287 3600479 3628566 3630767 3625737 3569766 3605676 3769225 3840761 3985578 4106081
3547 4106081 4136968 4260217 4357482 4399133 4468454 4645945 4729249 4843945 5082269 5195758
3537 5195758 5268698 5309743 5254960 5171741 5191903 5185824 5141922 5107708 5036403 5011770 5052314 5105519
3525 5105519 5135757 5127199 5171093 5306677 5467641 5615917 5805686 5973613 6135700 6275245
3515 6275245 6481557 6665914 6874597 7099307 7294832 7501088 7697028 7942820 8144206 8398133
3505 8398133 8720506 8880730 9000758 9136775 9178661 9188432 9253502 9266433 9181319 9213090 9358344
$$ packed form
3582C073988m6498O6808j4190N3803R2335P001l3260J4123M1666j7799P2892M7371
3570C358240N2643Q5293k3126k6824M0241j0454K6584r191l2478K3180k8095K9310
3558C485323M2964P2192K8087K201n030n5971L5910J63549P1536J44817J20503
3547D106081L0887J23249R7265M1651O9321J77491Q3304J14696K38324J13489
3537E195758P2940M1045n4783q3219K0162o079m3902l4214p1305k4633M0544N3205
3525E105519L0238q558M3894J35584J60964J48276J89769J67927J62087J39545
3515F275245K06312J84357K08683K24710J95525K06256J95940K45792K01386K53927
3505H398133L22373J60224J20028J36017M1886R771O5070J2931q5114L1771J45254
$$ plain form
3494 9358344 9458549 9632801 9836094 10125479 10397799 10703345 11002359 11253719 11492616 11795586
3484 11795586 12134493 12519992 12884756 13245494 13745408 14536389 15401678 16266788 17331985
3475 17331985 18619136 20006797 21465681 22998746 24457001 25939566 27223789 28300511
3467 28300511 29067736 29461276 29539586 29374501 28937302 28283760 27560273 26856025 26092804 25501551
3457 25501551 25078903 24660080 24329203 24036719 23780615 23564337 23363451 23014597 22624773
3448 22624773 21989313 21155718 20218377 19188473 18053020 16898519 15718950 14671424 13718208
3439 13718208 12810941 12036907 11304478 10739960 10187910 9704034 9198709 8855239 8483080
3430 8483080 8143751 7814730 7521729 7265639 6983366 6730488 6574633 6321087 6172766 6032148
$$ packed form
3494I358344J00205J74252K03293K89385K72320L05546K99014K51360K38897L02970
3484A1795586L38907L85499L64764L60738M99914P90981Q65289Q65110J065197
3475A7331985J287151J387661J458884J533065J458255J482565J284223J076722
3467B8300511P67225L93540P8310j65085m37199o53542p23487p04248p63221n91253
3457B5501551m22648m18823l30877k92484k56104k16278k00886l48854l89824
3448B2624773o35460q33595r37341j029904j135453j154501j179569j047526r53216
3439A3718208r07267p74034p32429n64518n52050m83876n05325l43470l72159
3430H483080l39329l29021k93001k56090k82273k52878j55855k53546j48321j40618
$$ plain form
3420 6032148 5842593 5721828 5535466 5372383 5303836 5224054 5049803 4929687 4795698 4694965
3410 4694965 4601743 4541736 4532230 4471928 4412206 4308225 4251018 4136652 4058098 4017976 3893476
3399 3893476 3778687 3723813 3617258 3497282 3368400 3318066 3367664 3300082 3214202 3189258 3144130
3388 3144130 3110778 3057369 3031114 3006402 2910778 2827387 2838468 2870812 2775960 2777893 2695566 2635801
3376 2635801 2620457 2607815 2616891 2542922 2512688 2488235 2537168 2504901 2435504 2455077 2505970 2424266
3364 2424266 2424389 2368073 2289458 2312988 2274252 2204327 2164002 2126750 2107733 2071251 2091796 2089285
3352 2089285 2044145 1992575 1911538 1955238 1949454 1952837 1931759 1898723 1863558 1856711 1832686 1886342
3340 1886342 1862216 1831732 1822223 1849500 1873766 1905756 1861277 1872606 1819314 1781398 1761339 1835358
$$ packed form
3420F032148j89555j20765j86362j63083o8547p9782j74251j20116j33989j00733
3410D694965r3222o0007r506o0302n9722j03981n7207j14366p8554m0122j24500
3399C893476j14789n4874j06555j19976j28882n0334M9598o7582q5880k4944m5128
3388C144130l3352n3409k6255k4712r5624q3391J1081L2344r4852J933q2327n9765
3376B635801j5344j2642R076p3969l0234k4453M8933l2267o9397J9573N0893q1704
3364B424266J23n6316p8615K3530l8736o9925m0325l7252j9017l6482K0545k511
3352B089285m5140n1570q1037M3700n784L383k1078l3036l5165o847k4025N3656
3340A886342k4126l0484r509K7277K4266L1990m4479J1329n3292l7916k0059P4019
$$ plain form
3328 1835358 1838830 1812955 1847795 1851255 1859545 1797182 1785651 1762913 1710757 1685545 1658083 1631923
3316 1631923 1673543 1649387 1584898 1612105 1636778 1636967 1622983 1601330 1591045 1565126 1557566 1551526
3304 1551526 1531899 1630328 1601716 1616154 1616837 1573571 1597984 1620675 1647215 1729729 1749125 1640484
3292 1640484 1619324 1599012 1571685 1546969 1584824 1619977 1608754 1592982 1544666 1572315 1564619 1509205
3280 1509205 1468514 1430347 1447693 1436867 1433700 1508152 1530865 1564884 1635816 1629574 1562841 1523457
3268 1523457 1564674 1545212 1540760 1496055 1510397 1504661 1489183 1456436 1464473 1529606 1551184 1524939
3256 1524939 1493388 1442591 1433426 1459208 1455510 1413709 1458055 1523876 1458012 1491070 1554918 1494388
3244 1494388 1521919 1533888 1557507 1561381 1580593 1552580 1591343 1641759 1633430 1665681 1693322 1733945
$$ packed form
3328A835358L472k5875L4840L460Q290o2363j1531k2738n2156k5212k7462k6160
3316A631923M1620k4156o4489K7207K4673J89j3984k1653j0285k5919p560o040
3304A551526j9627R8429k8612J4438O83m3266K4413K2691K6540Q2514J9396j08641
3292A640484k1160k0312k7327k4716L7855L5153j1223j5772m8316K7649p696n5414
3280A509205m0691l8167J7346j0826l167P4452K2713L4019P0932o242o6733l9384
3268A523457M1217j9462m452m4705J4342n736j5478l2747Q037O5133K1578k6245
3256A524939l1551n0797r165K5782l698m1801M4346O5821o5864L3058O3848o0530
3244A494388K7531J1969K3619L874J9212k8013L8763N0416q329L2251K7641M0623
$$ plain form
3232 1733945 1716138 1730434 1727579 1719550 1852830 1874087 1892601 1933149 2012793 2094011 2082775 2155058
3220 2155058 2261830 2361826 2483329 2595195 2752784 2840634 2862606 2904558 2964737 3021543 3065755
3209 3065755 3051841 3044673 3054236 3048925 3046604 2999492 2950151 2936526 2919788 2909543 2867873 2840930
3197 2840930 2831505 2847442 2873662 2890255 2906538 2878011 2943357 3062510 3149532 3273579 3467954
3186 3467954 3631944 3862788 4055763 4291471 4498416 4700876 5034025 5304092 5517123 5766195
3176 5766195 5913066 6007839 5985926 5959212 5971628 6005091 5968673 5949418 5967171 5948490 5974521
3165 5974521 5984054 6105979 6273616 6479358 6786457 7102446 7477314 7927139 8428330 8950214
3155 8950214 9520844 10037227 10479689 10816398 11026860 11223355 11396039 11496629 11563729 11723561
$$ packed form
3232A733945j7807J4296k855q029J33280K1257J8514M0548P9644Q1218j1236P2283
3220B155058J06772R9996J21503J11866J57589Q7850K1972M1952O0179N6806M4212
3209C065755j3914p168R563n311k321m7112m9341j3625j6738j0245m1670k6943
3197B840930r425J5937K6220J6593J6283k8527O5346J19153Q7022J24047J94375
3186C467954J63990K30844J92975K35708K06945K02460L33149K70067K13031K49072
3176E766195J46871R4773k1913k6714J2416L3463l6418j9255J7753j8681K6031
3165E974521R533J21925J67637K05742L07099L15989L74868M49825N01191N21884
3155H950214N70630N16383M42462L36709K10462J96495J72684J00590O7100J59832
$$ plain form
3145 11723561 11895230 11981341 11977895 11989373 12042774 12072872 12023346 12097566 12148988 12193431 12348571
3134 12348571 12399194 12486431 12715259 13139579 13714209 14582036 15851178 17501628 19349807
3125 19349807 20891603 21863674 22149012 21615966 20553524 19273362 17812836 16239086 14708885
3116 14708885 13358451 12227270 11366854 10767195 10263360 9782165 9429603 9162049 8920863
3107 8920863 8718574 8598221 8476105 8461256 8481052 8460058 8655018 8832555 9052055 9421428
3097 9421428 9807469 10172191 10460900 10629627 10641219 10563230 10346854 9979346 9513593 8984331
3087 8984331 8428130 7819198 7307119 6830279 6424146 6124658 5838878 5516429 5199277 4944414
3077 4944414 4751103 4577278 4444061 4271711 4152005 4039109 3957472 3828556 3734071 3712837
$$ packed form
3145A1723561J71669Q6111l446J1478N3401L0098m9526P4220N1422M4443J55140
3134A2348571N0623Q7237K28828M24320N74630Q67827J269142J650450J848179
3125A9349807J541796R72071K85338n33046j062442j280162j460526j573750j530201
3116A4708885j350434j131181q60416n99659n03835m81195l52562k67554k41186
3107H920863k02289j20353j22116j4849J9796k0994J94960J77537K19500L69373
3097I421428L86041L64722K88709J68727J1592p7989k16376l67508m65753n29262
3087H984331n56201o08932n12079m76840m06133k99488k85780l22449l17152k54863
3077D944414j93311j73825j33217j72350j19706j12896q1637j28916r4485k1234
$$ plain form
3067 3712837 3608696 3558484 3453335 3398436 3323279 3207514 3098617 3028980 3002808 2884810
3057 2884810 2821082 2748993 2667414 2536572 2461952 2387152 2285423 2244257 2257885 2178603 2084824
3046 2084824 2030947 1939562 1889668 1836890 1889023 1792286 1728169 1674911 1698233 1725958 1703675
3035 1703675 1631114 1575194 1541590 1575325 1546311 1468630 1509706 1511857 1519733 1521062 1500731 1470863
3023 1470863 1456910 1391371 1307488 1262074 1289812 1281579 1291051 1255288 1218751 1273887 1284484 1279751
3011 1279751 1257324 1216128 1244627 1226087 1120096 1143648 1122921 1024182 1016562 1023163 1023718 1115668
2999 1115668 1036747 1007622 1007361 947520 941201 917418 964164 1033411 942070 874430 928839 912744
2987 912744 883337 909814 897306 851472 843029 787732 780844 834246 828952 834154 830074 876537 874359
$$ packed form
3067C712837j04141n0212j05149n4899p5157j15765j08897o9637k6172j17998
3057B884810o3728p2089q1579j30842p4620p4800j01729m1166J3628p9282r3779
3046B084824n3877r1385m9894n2778N2133r6737o4117n3258K3322K7725k2283
3035A703675p2561n5920l3604L3735k9014p7681M1076K151P876J329k0331k9868
3023A470863j3953o5539q3883m5414K7738q233R472l5763l6537N5136J0597m733
3011A279751k2427m1196K8499j8540j05991K3552k0727r8739p620O601N55R1950
2999A115668p8921k9125k61n9841o319k3783M6746O9247r1341o7640N4409j6095
2987I12744k9407K6477j2508m5834q443n5297o888N3402n294N202m080M6463k178
$$ plain form
2974 874359 822444 877404 855521 872065 795592 812243 880771 850820 787490 716414 742423 799489
2962 799489 828117 778073 827868 816959 835175 808988 796057 781395 816973 848419 875225 850389
2950 850389 719640 763553 825428 815192 786370 770920 771574 693972 715861 708802 699560 710650
2938 710650 653811 726971 773815 729736 669920 667587 701143 752088 726585 707805 652776 679048
2926 679048 707901 724425 690810 628747 697120 743542 706159 663206 678556 745918 758584 711856
2914 711856 750636 704813 647564 688898 707260 736904 720696 679056 688326 732884 742742 735254
2902 735254 710138 744745 750965 686248 667591 656435 656313 740278 708421 682328 650497 649979 637482
2889 637482 673585 727098 728689 736265 686233 731228 797087 740904 716323 692779 717122 723570
$$ packed form
2974H74359n1915N4960k1883J6544p6473J6651O8528k9951o3330p1076K6009N7066
2962G99489K8628n0044M9795j0909J8216k6187j2931j4662L5578L1446K6806k4836
2950H50389j30749M3913O1875j0236k8822j5450O54p7602K1889p059r242J1090
2938G10650n6839P3160M6844m4079n9816k333L3556N0945k5503j8780n5029K6272
2926F79048K8853J6524l3615o2063O8373M6422l7383m2953J5350O7362J2666m6728
2914G11856L8780m5823n7249M1334J8362K9644j6208m1640R270M4558R858p488
2902G35254k5116L4607O220o4717j8657j1156j22Q3965l1857k6093l1831n18j2497
2889F37482L6103N3513J591P576n0032M4995O5859n6183k4581k3544K4343O448
$$ plain form
2877 723570 626190 682462 728315 698181 737962 797423 777000 768034 774596 756244 789190 824872
2865 824872 905515 868194 862422 836430 800420 846634 922612 932650 904968 896910 892087 957824
2853 957824 1087243 1043783 948425 986982 1014417 1062949 1015130 993624 1019868 1006649 1030775
2842 1030775 1021844 1053653 1113346 1152642 1031312 1114109 1142778 1122645 1116430 1185101 1184128 1088478
2830 1088478 1155015 1222676 1313953 1314904 1342803 1330067 1438070 1469552 1477335 1390385 1441237 1510251
2818 1510251 1537130 1538761 1525923 1481357 1454675 1386610 1405518 1451307 1470870 1463663 1491401 1525985
2806 1525985 1456573 1471900 1426921 1473686 1466428 1392727 1464368 1486349 1587736 1598968 1675065
2795 1675065 1696262 1671782 1645415 1692529 1766467 1785974 1711422 1788644 1802077 1709000 1700542 1643180
$$ packed form
2877G23570r7380N6272M5853l0134L9781N9461k0423q966O562j8352L2946L5682
2865H24872Q0643l7321n772k5992l6010M6214P5978J0038k7682q058m823O5737
2853I57824J29419m3460r5358L8557K7435M8532m7819k1506K6244j3219K4126
2842A030775q931L1809N9693L9296j21330Q2797K8669k0133o215O8671r73r5650
2830A088478O6537O7661R1277R51K7899j2736J08003L1482P783q6950N0852O9014
2818A510251K6879J631j2838m4566k6682o8065J8908M5789J9563p207K7738L4584
2806A525985o9412J5327m4979M6765p258p3701P1641K1981J01387J1232P6097
2795A675065K1197k4480k6367M7114P3938J9507p4552P7222J3433r3077q458n7362
$$ plain form
2783 1643180 1637085 1609346 1511668 1444821 1393751 1430494 1444740 1386887 1361590 1412021 1403363 1376740
2771 1376740 1408660 1381160 1407738 1460493 1421396 1312891 1308861 1304294 1308470 1328627 1383450 1365038
$$ packed form
2783A643180o095k7739r7678o6847n1070L6743J4246n7853k5297N0431q658k6623
2771A376740L1920k7500K6578N2755l9097j08505m030m567M176K0157N4823j8412
$$ [...]
##END NTUPLES=NMR SPECTRUM
##END=
