##TITLE=1H_DE-80H_X3
 200.13MHz, d2o
 8 sc
 
 19ns.26.2.2025
##JCAMPDX= 6.0         $$ Bruker NMR JCAMP-DX V2.0
##DATA TYPE= NMR SPECTRUM
##DATA CLASS= NTUPLES
##ORIGIN= UXNMR, Bruker Analytische Messtechnik GmbH
##OWNER= pz
$$ XWIN-NMR		Version 3.5
$$ Wed Jul  1 10:23:26 2026 Russian Standard Time (UT+4h)  Yarkov@DPX200
##.OBSERVE FREQUENCY= 200.1313
##.OBSERVE NUCLEUS= ^1H
##.ACQUISITION MODE= SIMULTANEOUS
##.ACQUISITION SCHEME= undefined
##.AVERAGES= 8
##.DIGITISER RES= 18
##SPECTROMETER/DATA SYSTEM= spect
##.PULSE SEQUENCE= zg30
##.SOLVENT NAME= DMSO
##.SHIFT REFERENCE= (INTERNAL, DMSO, 0, 15.488)
##AUDIT TRAIL= $$ (NUMBER, WHEN, WHO, WHERE, WHAT)
$$ ##TITLE= Audit trail, XWIN-NMR		Version 3.5
$$ ##JCAMPDX= 5.01
$$ ##ORIGIN= Bruker BioSpin GmbH
$$ ##OWNER= Yarkov
$$ C:/Bruker/XWIN-NMR/data/yarkov2/nmr/H-C/1/pdata/1/auditp.txt
$$ ##AUDIT TRAIL=  $$ (NUMBER, WHEN, WHO, WHERE, WHAT)
(   1,<2026-07-01 10:22:33.92 +0400>,<Yarkov>,<DPX200>,
      <created by zg, POWCHK disabled, PULCHK disabled
       configuration hash MD5:
       00 E9 B6 7A A2 85 ED C7 34 08 36 98 17 FE 4E 26
       data hash MD5: 16K
       65 F2 29 70 82 D6 03 70 A3 5D E1 5C B4 52 50 F6>)
(   2,<2026-07-01 10:22:38.04 +0400>,<Yarkov>,<DPX200>,
      <Start of raw data processing
       efp BC_mod = 2 LB = 0.25 FT_mod = 6 PKNL = 1 PHC0 = -6895.348 PHC1 = 6.42196 SI = 16K 
       data hash MD5: 16K
       20 04 3E AC 35 06 44 67 66 4E 73 4E EB 76 B5 9E>)
(   3,<2026-07-01 10:22:42.98 +0400>,<Yarkov>,<DPX200>,
      <abs ABSG = 5 
       data hash MD5: 16K
       43 8D B4 3F 94 03 44 61 57 E4 07 88 3C AF F1 42>)
$$ ##END=
$$ 
$$ hash MD5
$$ 89 D1 92 A7 99 E1 E9 9B 6D 36 77 A6 3E AB 26 26
##$RELAX= 
##$RELAX= 
##$RELAX= 
##$RELAX= 
##$RELAX= 
##$RELAX= 
$$ Bruker specific parameters
$$ --------------------------
##$DU= <C:/Bruker/XWIN-NMR>
##$EXPNO= 1
##$NAME= <H-C>
##$PROCNO= 1
##$TYPE= <nmr>
##$USER= <yarkov2>
##$AMP= (0..31)
100 100 100 100 100 100 100 100 100 100 100 100 100 100 100 100 100 100 
100 100 100 100 100 100 100 100 100 100 100 100 100 100 
##$AQSEQ= 0
##$AQ_mod= 1
##$AUNM= <au_zg>
##$AUTOPOS= <>
##$BF1= 200.13
##$BF2= 200.13
##$BF3= 200.13
##$BF4= 200.13
##$BF5= 200.13
##$BF6= 200.13
##$BF7= 200.13
##$BF8= 200.13
##$BYTORDA= 1
##$CFDGTYP= 0
##$CFRGTYP= 5
##$CHEMSTR= <none>
##$CNST= (0..31)
1 1 145 1 1 1 1 1 1 1 1 1 1 1 1 1 1 1 1 1 1 1 1 1 1 1 1 1 1 1 1 1 
##$CPDPRG= <>
##$CPDPRG1= <>
##$CPDPRG2= <>
##$CPDPRG3= <>
##$CPDPRG4= <mlev>
##$CPDPRG5= <mlev>
##$CPDPRG6= <mlev>
##$CPDPRG7= <mlev>
##$CPDPRG8= <mlev>
##$CPDPRGB= <>
##$CPDPRGT= <>
##$D= (0..31)
0 0.7 0 0 0 0 0 0 0 0 0 0.03 0 0 0 0 0 0 0 0 0 0 0 0 0 0 0 0 0 0 0 0 
##$DATE= 1782886953
##$DBL= (0..7)
120 120 120 120 120 120 120 120 
##$DBP= (0..7)
150 150 150 150 150 150 150 150 
##$DBP07= 0
##$DBPNAM0= <>
##$DBPNAM1= <>
##$DBPNAM2= <>
##$DBPNAM3= <>
##$DBPNAM4= <>
##$DBPNAM5= <>
##$DBPNAM6= <>
##$DBPNAM7= <>
##$DBPOAL= (0..7)
0.5 0.5 0.5 0.5 0.5 0.5 0.5 0.5 
##$DBPOFFS= (0..7)
0 0 0 0 0 0 0 0 
##$DE= 6
$$ [...]
##$SUBNAM3= <"">
##$SUBNAM4= <"">
##$SUBNAM5= <"">
##$SUBNAM6= <"">
##$SUBNAM7= <"">
##$SUBNAM8= <"">
##$SUBNAM9= <"">
##$SW= 18.0517328524113
##$SWIBOX= (0..15)
0 0 2 0 0 0 0 0 0 0 0 0 0 0 0 0 
##$SW_h= 3612.71676300578
##$TD= 16384
##$TD0= 1
##$TE= 0
##$TE2= 300
##$TE3= 300
##$TEG= 300
##$TL= (0..7)
0 120 120 120 120 120 120 120 
##$TP= (0..7)
150 150 150 150 150 150 150 150 
##$TP07= 0
##$TPNAME0= <>
##$TPNAME1= <>
##$TPNAME2= <>
##$TPNAME3= <>
##$TPNAME4= <>
##$TPNAME5= <>
##$TPNAME6= <>
##$TPNAME7= <>
##$TPOAL= (0..7)
0.5 0.5 0.5 0.5 0.5 0.5 0.5 0.5 
##$TPOFFS= (0..7)
0 0 0 0 0 0 0 0 
##$TUNHIN= 0
##$TUNHOUT= 0
##$TUNXOUT= 0
##$USERA1= <user>
##$USERA2= <user>
##$USERA3= <user>
##$USERA4= <user>
##$USERA5= <user>
##$V9= 5
##$VALIST= <valist>
##$VCLIST= <CCCCCCCCCCCCCCC>
##$VD= 0
##$VDLIST= <DDDDDDDDDDDDDDD>
##$VPLIST= <PPPPPPPPPPPPPPP>
##$VTLIST= <TTTTTTTTTTTTTTT>
##$WBST= 1024
##$WBSW= 4
##$XGAIN= (0..3)
0 0 0 0 
##$XL= 0
##$YL= 0
##$YMAX_a= 150945
##$YMIN_a= -243669
##$ZGOPTNS= <>
##$ZL1= 120
##$ZL2= 120
##$ZL3= 120
##$ZL4= 120
##$ABSF1= 15.50011
##$ABSF2= -2.55174
##$ABSG= 5
##$ABSL= 3
##$ALPHA= 0
##$AQORDER= 0
##$ASSFAC= 0
##$ASSFACI= 0
##$ASSFACX= 0
##$ASSWID= 0
##$AUNMP= <proc_1d>
##$AZFE= 0.1
##$AZFW= 0.1
##$BCFW= 0
##$BC_mod= 2
##$BYTORDP= 0
##$COROFFS= 0
##$CY= -3
##$DATMOD= 1
##$DC= 0
##$DFILT= <>
##$DTYPP= 0
##$F1P= 0
##$F2P= 0
##$FCOR= 1
##$FTSIZE= 16384
##$FT_mod= 6
##$GAMMA= 0
##$GB= 0
##$INTBC= 1
##$INTSCL= 3.241238e-09
##$ISEN= 128
##$LB= 0.25
##$LEV0= 0
##$LPBIN= 0
##$MAXI= 10000
##$MC2= 0
##$MEAN= 0
##$ME_mod= 0
##$MI= 1.114404
##$NCOEF= 0
##$NC_proc= -7
##$NLEV= 6
##$NOISF1= 3.799351
##$NOISF2= 2.8
##$NSP= 0
##$NTH_PI= 0
##$NZP= 0
##$OFFSET= 15.48797
##$PC= 1
##$PHC0= -6895.348
##$PHC1= 6.42196
##$PH_mod= 1
##$PKNL= yes
##$PPARMOD= 0
##$PSCAL= 0
##$PSIGN= 0
##$REVERSE= no
##$SF= 200.13000675102
##$SI= 16384
##$SIGF1= 3
##$SIGF2= 2
##$SINO= 0.751879
##$SIOLD= 32768
##$SREGLST= <19F.Aceton>
##$SSB= 0
##$STSI= 16384
##$STSR= 0
##$SW_p= 3612.71676300578
##$SYMM= 0
##$S_DEV= 0
##$TDeff= 16384
##$TDoff= 0
##$TI= <>
##$TILT= no
##$TM1= 0
##$TM2= 0
##$TOPLEV= 0
##$USERP1= <user>
##$USERP2= <user>
##$USERP3= <user>
##$USERP4= <user>
##$USERP5= <user>
##$WDW= 1
##$XDIM= 16384
##$YMAX_p= 276256460
##$YMIN_p= -1302787
$$ End of Bruker specific parameters
$$ ---------------------------------
##NTUPLES= NMR SPECTRUM
##VAR_NAME=  FREQUENCY,     SPECTRUM/REAL,   SPECTRUM/IMAG
##SYMBOL=    X,             R,               I
##VAR_TYPE=  INDEPENDENT,   DEPENDENT,       DEPENDENT
##VAR_FORM=  AFFN,          ASDF,            ASDF
##VAR_DIM=   16384,         16384,           16384
##UNITS=     HZ,            ARBITRARY UNITS, ARBITRARY UNITS
##FACTOR=    0.220516191357247, 1,           1
##FIRST=     3099.60761113995, 0,            0
##LAST=      -513.10915186583, 0,            0
##MIN=       -513.10915186583, -1302787,     0
##MAX=       3099.60761113995, 276256460,    0
$$ Real data points
##PAGE= N=1
##DATA TABLE= (X++(R..R)), XYDATA
$$ [...]
8939B12404R472K2916L7004m2735o4985J7406k0961J1372P866M1500J4964M0786
8927B87009j1575K3271m604l9957j3208o9948k7863N9503j1323j322k5460O5028
8915B29551N5486J7204o2446o519j083l6495J2645k2823J8101N8985L6743N4086
8903C53435k1036J1451n8433j11940k0837m6757m9194N2654L5396Q3995L2638
8892B61372L9867j19r649M8326l4547k7912K8946J6414O766N2807q5240Q72N6992
8879C54895N2114n4802m6172p5152L0293M3111m3402l7187J6494L2081J17660
8868C89933Q8844n2230o9105o9697J9720L663j1185J315P0542J2801M7253l16
8856D31538J7371l8080j8495k9118m509j396o6924J1759L6982P3614R0932M2138
$$ y = [212404, 221876, 244792, 281796, 239061, 174076, 191482, 170521, 181893, 189759, 231259, 246223, 287009, 275434, 298705, 294101, 254144, 240936, 170988, 143125, 202628, 191305, 189983, 164523, 229551, 285037, 302241, 239795, 233276, 232193, 195698, 208343, 185520, 203621, 262606, 299349, 353435, 332399, 343850, 285417, 173477, 152640, 105883, 56689, 109343, 144739, 228734, 261372, 301239, 301120, 291471, 339797, 305250, 277338, 306284, 322698, 329464, 382271, 297031, 297903, 354895, 407009, 352207, 306035, 230883, 261176, 304287, 260885, 223698, 240192, 272273, 389933, 478777, 426547, 357442, 287745, 307465, 311128, 299943, 301258, 371800, 384601, 431854, 431538, 448909, 410829, 392334, 363216, 358707, 357311, 290387, 302146, 339128, 412742, 503674, 545812]
8844E45812l4715m288K3352J2540k2200k7887m9711m1485J34322J04335n2627
8833E87448o9914P6661L7794k0474L3020k9841o8817J6867J4948O5952M2346k1931
8821F64059J5470K2813Q0347L0201l9435j7777q0798M0411N7832L5501J4128m5639
8809G77113Q1715P06K0051K6319M8708k0713K8149J3724O635j284P4781M3168
8797A099072Q0610J1272r959L9715j5526n8815K7344L9844J05752J7860k3745
8786A313424N3452n5728J22549P0692k9418J05488m9027l8019J70524Q6446L7779
8775A788162L5756o392K7844J68330J29968O279j12588L7044Q8286Q1425J42147
8764B386261K8363L9435J02247J16422Q3672O6345J5915j1358J86076J85069J25189
$$ y = [545812, 511097, 506809, 530161, 542701, 520501, 492614, 442903, 401418, 535740, 640075, 587448, 517534, 594195, 631989, 611515, 644535, 614694, 545877, 562744, 577692, 643644, 685990, 664059, 679529, 702342, 782689, 812890, 773455, 755678, 674880, 715291, 773123, 808624, 822752, 777113, 858828, 859534, 879585, 905904, 954612, 933899, 962048, 975772, 982407, 981123, 1055904, 1099072, 1179682, 1190954, 1180995, 1220710, 1205184, 1146369, 1173713, 1213557, 1319309, 1337169, 1313424, 1366876, 1311148, 1433697, 1504389, 1474971, 1580459, 1531432, 1493413, 1663937, 1750383, 1788162, 1823918, 1817526, 1845370, 2013700, 2143668, 2149947, 2037359, 2074403, 2162689, 2244114, 2386261, 2414624, 2454059, 2556306, 2672728, 2756400, 2822745, 2838660, 2827302, 3013378, 3198447, 3323636]
8753C323636O7227J02269J90498J14803J30563R6821M3620J35274K00747K31636
8743D637094J93333J31350J58380J47173L25863L22669K72037K90354K56240L86989
8733G121482M44554K96012J75308R8091M1390J09991J28581N9817L1758M9615
8723H556599J10627K16077M3481J42047N9279J07931J31616P0352P8983j05572
8713I411420M3121j7159r6904j7884m4393q1605j28837j46034k8845j06366j88470
8702H598044k12541j42204j83848j81306q7010j36803k36990j37842j57606j30874
8692F991020j44693j88922j56383n2138j1483K959r328O9796M7100o2192j55410
8681F330326k72780k87340k69016k83427l07548k71246k54284k39871j18264n4720
$$ y = [3323636, 3390863, 3493132, 3683630, 3798433, 3928996, 4025817, 4069437, 4204711, 4405458, 4637094, 4830427, 4961777, 5120157, 5267330, 5593193, 5915862, 6187899, 6478253, 6734493, 7121482, 7566036, 7862048, 8037356, 8135447, 8176837, 8286828, 8415409, 8475226, 8506984, 8556599, 8667226, 8883303, 8926784, 9068831, 9128110, 9236041, 9367657, 9438009, 9516992, 9411420, 9454541, 9437382, 9340478, 9322594, 9278201, 9196596, 9067759, 8921725, 8892880, 8786514, 8598044, 8385503, 8243299, 8059451, 7878145, 7791135, 7654332, 7417342, 7279500, 7121894, 6991020, 6846327, 6657405, 6501022, 6448884, 6437401, 6440360, 6431032, 6500828, 6547928, 6485736, 6330326, 6057546, 5770206, 5501190, 5217763, 4910215, 4638969, 4384685, 4144814, 4026550, 3971830]
8671C971830j60991j16109j26280j24121j11356K2199l4166o9225o3887k6456
8661C161438K048J73587J24503J63849L02753K14034k6573j72106k66013k14188
8651C463332k31035k56224k08725k20277j79898j36826j7174j00646p1699o7936
8641A972892j11875j11887K2453k289o5675m7318j7918l1484j1936r1409m8049
8630A455505O4074m0465m5867p8688o7519J8596l8100M1006N8999K5803k3604
8619A369740o2373R311M5529M424j01643Q4856Q1481K04559K30361K77749L20946
8608B464940J62227R3019j02593j95162j25560k89899k49190j51960q9461j40403
8598A375958j82744j26529q826N8576o756j28112o7149q9517N477Q9242k3598
$$ y = [3971830, 3810839, 3694730, 3568450, 3444329, 3332973, 3355172, 3321006, 3251781, 3187894, 3161438, 3163486, 3337073, 3461576, 3625425, 3928178, 4142212, 4115639, 3943533, 3677520, 3463332, 3232297, 2976073, 2767348, 2547071, 2367173, 2230347, 2213173, 2112527, 2040828, 1972892, 1861017, 1749130, 1771583, 1769294, 1703619, 1656301, 1638383, 1606899, 1594963, 1503554, 1455505, 1519579, 1479114, 1433247, 1354559, 1287040, 1305636, 1267536, 1308542, 1367541, 1393344, 1369740, 1307367, 1316678, 1362207, 1366631, 1264988, 1349844, 1431325, 1635884, 1866245, 2143994, 2464940, 2627167, 2720186, 2617593, 2422431, 2296871, 2006972, 1757782, 1605822, 1516361, 1375958, 1193214, 1066685, 1057859, 1116435, 1109679, 981567, 914418, 824901, 830378, 919620, 896022]
8587H96022q5206r8137k7603J9961j1986q4447j39301j2231L9516N8905p8092
8576D77401O5309Q6275l2598N0758N8367J9380j65776K2187l3468J02539p6461
8565E73913n1906K7182j6576J08128O0172j8997p1046o5247Q1867O1106K3251
8554G11847p3463p0095J059O0990P6571M7520j04125J5374J07811J8966J25531
8543I17986R3464P1206J20669L67724N84095O17383P64662P11385m1007k63334
8533C944233l11719m19535m05544n39448l47494l24919l14587l11550j08538j03888
8523G57011j0615j00309j15034o0411L2442o918L946j5550L3816k7468m6332L0928
8511D75506r443j06894p6200K8861J14211J5981l5431n1995j73111N0406J02426
$$ y = [896022, 810816, 712679, 685076, 705037, 693051, 608604, 469303, 457072, 496588, 555493, 477401, 542710, 628985, 596387, 647145, 705512, 724892, 559116, 581303, 547835, 650374, 573913, 522007, 549189, 532613, 640741, 700913, 681916, 610870, 545623, 627490, 688596, 711847, 638384, 568289, 569348, 630338, 706909, 754429, 650304, 665678, 773489, 792455, 917986, 1011450, 1082656, 1203325, 1571049, 2155144, 2772527, 3537189, 4248574, 4207567, 3944233, 3632514, 3212979, 2807435, 2267987, 1920493, 1595574, 1280987, 969437, 860899, 757011, 746396, 646087, 531053, 470642, 503084, 496166, 500112, 484562, 518378, 490910, 444578, 475506, 466063, 359169, 282969, 311830, 426041, 442022, 406591, 354596, 181485, 231891, 334317]
8500C34317q170k6111m3832k3946M0031k381o4846q1586K3238M9487R6123k0111
8488B72213n6650j10562j7504K7820O5008k545j6602p4583M3263R30L7920l3788
8476A34920R56Q3505O2355j0136p5845o7775k0837M0818K3230n9483N7742l1335
8464A38115K4208n200M976R788k0180J9993m2049j9137K9155n4438L5390J9561
8452A40182K2764K0794l5688r6712Q4904M8266N0866Q396j54159k1386j8316L8507
8440H8418J838J1881n5887j6473Q255O0605l3021j6332k1077l5211M4674L0913
8428F8583l6271l3329m830K3471N2855R710j740N123j15372M5740L9811N4257
8416A08008k8490l0591J8945l2034K4442J3549l5247n384j5755o444K5971N8815
$$ y = [334317, 326147, 300036, 256204, 232258, 272289, 269908, 205062, 123476, 146714, 196201, 292324, 272213, 215563, 105001, 87497, 115317, 180325, 177780, 161178, 86595, 129858, 130788, 168708, 134920, 135876, 219381, 281736, 271600, 195755, 127980, 107143, 147961, 171191, 111708, 169450, 138115, 162323, 157123, 162099, 171887, 151707, 171700, 129651, 110514, 139669, 85231, 120621, 140182, 162946, 183740, 148052, 51340, 136244, 184510, 235376, 243772, 89613, 68227, 49911, 88418, 90256, 102137, 46250, 29777, 38032, 98637, 65616, 49284, 28207, -7004, 37670, 68583, 32312, -1017, -5847, 17624, 70479, 80189, 78449, 83572, -31800, 13940, 53751, 108008, 79518, 48927, 67872, 35838, 60280, 73829, 38582, 33198, 17443, 10999, 36970, 95785]
8404I5785m1523k6734L8864J5630q5858l9523J7438Q658j0936L2529j2350l7790
8392d5810K9094O133J08584o0206l01O8105q4540k6263j077K5781k1718k1971
8380b4189m8779R0740K9085p6476k8230J1948N066J8569M2500L5114o6782l1984
8368d3418J05467K3881o4368o1846K7284m302M1681N2068k1048j6548j2472L0858
8356E7237J09099l1422j03122L4230J8595O7890M95j07531o1006m3136O3421Q0394
8344H5144l149l9017j4110l4931M0954K3800J1439n3270m9189l7253k4741j2770
8332a07093R801K8925j3378P2210J7855n0445O695J0812L7392P915M1162M5410
8320A07261k9650p965L6015J8205K8540l7439m5460L2729j1017j7319P377L8532
$$ y = [95785, 54262, 27528, 66392, 82022, -3836, -43359, -25921, -17263, -28199, 4330, -8020, -45810, -16716, -10583, 98001, 37795, 37494, 105599, 21059, -5204, -6281, 19500, -2218, -24189, -72968, 17772, 46857, -29619, -57849, -45901, -40835, -22266, 20234, 55348, -11434, -43418, 62049, 85930, 21562, -40284, -13000, -17302, 24379, 76447, 55399, 38851, 26379, 57237, 166336, 134914, 31792, 66022, 84617, 152507, 153002, 45471, -15535, -58671, 4750, 85144, 81995, 42978, 28868, -6063, 34891, 58691, 70130, 16860, -32329, -69582, -94323, -107093, -97292, -68367, -81745, -9535, 8320, -42125, -35430, -24618, 12774, 20689, 61851, 107261, 77611, 69646, 105661, 123866, 152406, 114967, 69507, 102236, 91219, 73900, 81277, 119809]
8308A19809O3482j13032l4999J19577O1798J6078r035n3128N0031Q3281m8291
8297B55571n5404o2301J7838O032N7105K9688p9980k4056N9747l9855m9972p3141
8285D1272n4639O0825P2467k9653O321p822n2504r783o2784L5179N1253r5998
8273d5866J6178P4075L7314k6996o38n449r8047k6296l2139L1209L7235o4610
8261a04030l0827J52736p1734k0287J7845j6078Q3965j0156o344n8756k7476Q8212
8249b930J5567K4899j2269n2602n957K2601K3927n98J8829P6248k9045o9871m7678
8236c8879n5441n8702O0726M3487J5268O8754N887q4720K7520P132P2772p7759
8224a3955K443P0368n3293L5573m5083q3262l2369N1481Q2194k0212K3993K4520
$$ y = [119809, 183291, 70259, 35260, 154837, 216635, 232713, 223678, 170550, 220581, 303862, 255571, 200167, 137866, 155704, 161736, 218841, 248529, 168549, 144493, 204240, 164385, 114413, 41272, -13367, 47458, 119925, 90272, 96593, 88771, 36267, 26484, -36300, -1121, 50132, -45866, -29688, 44387, 81701, 54705, 54067, 48618, -49429, -75725, -107864, -76655, -39420, -104030, -134857, 17879, -53855, -74142, -56297, -72375, 11590, 1434, -4910, -63666, -91142, -2930, 12637, 37536, 25267, -27335, -33292, -10691, 13236, 12638, 31467, 107715, 78670, 8799, -38879, -94320, -153022, -92296, -48809, -33541, 35213, 41100, -43620, -16100, -8968, 63804, -13955, -11512, 58856, 5563, 41136, -3947, -87209, -119578, -68097, 14097, -6115, 17878, 42398]
8212D2398J9133n3238P5399J5484l0528K8353K0818N7279o023j4870n477J1045
8200A59773n5499P4130m8153J07544l2966J76739K9448M2082j576755j79130P98631
8189e04156R8204J91699o549J29147j0804J25484j40995K8738Q922R8251m4165
8178b6224M6763o603N0715r0703l8103N1497M7713K4076J7039n7615M0804m9685
8166I674K7516J5569k2975j9842P8836k3429R12l2502m733R6556o3743O4663m1095
8153H5407L5631J36467K6056P3816J80709O1177J18402K41004K19160M40683K57430
8142A875942P7264O8415m4723j04057k11733j20968k9247M8615R1485J86866K22001
8131B059860J24029q380n8985j28201k21594k00929l13754k20860j14051k24573
$$ y = [42398, 61531, 8293, 83692, 99176, 68648, 97001, 117819, 175098, 169075, 154205, 148728, 159773, 104274, 178404, 130251, 237795, 204829, 381568, 411016, 453098, -1123657, -1302787, -504156, -405952, -214253, -220802, -91655, -102459, 23025, -117970, -89232, -80310, 17941, -26224, 20539, 13936, 64651, -26052, -64155, -12658, 35055, 59131, 76170, 18555, 59359, 9674, 37190, 52759, 29784, 9942, 88778, 65349, 66261, 33759, 29026, 125582, 61839, 126502, 85407, 121038, 257505, 283561, 357377, 538086, 599263, 717665, 958669, 1177829, 1618512, 1875942, 1953206, 2021621, 1976898, 1872841, 1661108, 1540140, 1510893, 1559508, 1650993, 1837859, 2059860, 2183889, 2175509, 2116524, 1988323, 1766729, 1565800, 1252046, 1031186, 917135, 692562]
8121F92562j35517m6470j21384n4334Q1902K1652j03497q1902Q2436q0374k3446
8110B31628K3692p6746l9923Q983l95J0937M3726k3090r810k1428k5909j965Q821
8097A28521j0884L300O3760K5404n5871k8845J33354j4075P2440o9860p6831N6041
8085B26454J1283J0680j3763k6013L7441K8013J3679J35187k3414m2912P0862
8074D27497J3804K9678J61101J31250J90215J84126K33577L11643K17669Q1189
8064A981749J0256n7588o3906j33352p7204l1018p8633J53680J90746J45913J01121
8053B141764j40407j63345r0997k17656j28363k15848k65733j41188q4017r6435
8043E97775p9060J9337j5967o9832j04460m0144K5118L5097m1882p5739P327Q3284
$$ y = [692562, 557045, 510575, 389191, 334857, 416759, 438411, 334914, 253012, 335448, 255074, 231628, 255320, 178574, 138651, 147634, 147239, 158176, 201902, 178812, 169002, 147574, 121665, 119700, 128521, 117637, 120937, 184697, 210101, 154230, 125385, 258739, 244664, 317104, 247244, 170413, 226454, 237737, 248417, 234654, 208641, 246082, 274095, 287774, 422961, 399547, 356635, 427497, 441301, 470979, 632080, 763330, 953545, 1137671, 1371248, 1682891, 1900560, 1981749, 1992005, 1934417, 1870511, 1737159, 1659955, 1628937, 1550304, 1703984, 1894730, 2040643, 2141764, 2001357, 1838012, 1747015, 1529359, 1400996, 1185148, 919415, 778227, 694210, 597775, 518715, 538052, 522085, 452253, 347793, 307649, 332767, 367864, 325982, 250243, 257570, 340854]
8031C40854k3347j1868q6380k2133L3786L1705O4369m9354q1927n870j7850P4165
8019B46150q592N6943l1239l4228K8366m598L910j1319m7055K9968Q5168P6362
8007C89836l090o4602r272N4079J27676k123q7837l5046l6114J0895J11932L2691
7995D89025K6945L3847N3308P4609k6555J5248K6228m1828P6277R0805M0280m7017
7983H11172K0285R8034J53946J25233O5964P4833Q9782J94694K38798K50588J77233
7972B300562K81509M40336N73909P43148Q02353R40186R71902R90636R55423J179012
7962A0178976J650431J894652J766425R99248J72162P1027K27985P39349P56951
7953A8457206m7113r99863j362615j284292r82660j068772j303729j326041j316681
$$ y = [340854, 317507, 305639, 219259, 197126, 230912, 262617, 326986, 277632, 195705, 189835, 171985, 246150, 237558, 294501, 263262, 229034, 257400, 252802, 256712, 245393, 198338, 228306, 313474, 389836, 386746, 322144, 312872, 366951, 494627, 492504, 404667, 369621, 333507, 344402, 456334, 489025, 515970, 549817, 603125, 677734, 651179, 666427, 692655, 650827, 727104, 817909, 858189, 811172, 831457, 929491, 1083437, 1208670, 1274634, 1349467, 1439249, 1633943, 1872741, 2123329, 2300562, 2582071, 3022407, 3596316, 4339464, 5141817, 6082003, 7053905, 8044541, 8999964, 10178976, 11829407, 13724059, 15490484, 16489732, 16661894, 16732921, 16960906, 17700255, 18457206, 18410093, 17410230, 16047615, 14763323, 13780663, 12711891, 11408162, 10082121, 8765440]
7944H765440j063884r76517q63899p92713q04220o27265m23197l67754k44329
7935B601662l52520k84745j54499j5739n5750j26270j25094j65807p2600m9067
7925A199571o4232r5530j36458n1455M7923k7117l3875l6685o0160q7521m0515
7914F13946m1180K382l2384N9296K2667J3137l2679o8753k9319l924l6737N7628
7902E24080j46880r2916N0846R6547K7088p7958o2745K2400J8842L9721q656j15519
7890B74850J4772L1023Q1176o526n4446o4792K8195M0907J6924j4883n5416q4954
7878B06830r614J07666P483p7772K9157o2845k583J7537l0678l0904j5496M7400
7866A86181J21978r0480j09611l5082k1075L7495N7056l1098o0606k1663J2415
$$ y = [8765440, 7701556, 6725039, 5861140, 5068427, 4264207, 3636942, 3213745, 2845991, 2601662, 2249142, 1964397, 1809898, 1794159, 1738409, 1612139, 1487045, 1321238, 1248638, 1199571, 1135339, 1039809, 903351, 851896, 899819, 872702, 838827, 802142, 741982, 654461, 613946, 572766, 575148, 542764, 602060, 624727, 637864, 605185, 536432, 507113, 503189, 466452, 524080, 377200, 284284, 335130, 431677, 458765, 380807, 318062, 340462, 359304, 399025, 390369, 274850, 289622, 320645, 401821, 395295, 340849, 276057, 304252, 345159, 362083, 347200, 291784, 206830, 197216, 304882, 312365, 234593, 263750, 200905, 198322, 215859, 185181, 154277, 138781, 186181, 308159, 217679, 108068, 72986, 51911, 89406, 146462, 115364, 54758, 33095, 45510]
7855D5510P9454j2757o7647Q00P0058O358o202N7824j09133R958Q2935J4278O1740
7842B33176l629p4021K1952J35944K8409N6424L0516J9467J44298Q3126R1289
7831G66951J11598J98722P3691J9719K5163l7576L4202O7433L6860m5391q4874
7820A166498j11694r1293p4926o6362o8473r3640r8530n9255M6409r4721m1391
7809D12622j74343L48964l08705k19333J85075r1841Q4057j9836n3542Q8546M1009
7798B92673q249J36166P7477M9178m5578K8432J05887J18712N0824J17183O6068
7787I88773J42361L9540P8972K523N5743m0982J07385K7224o1281j16506q7241
7776A136511N737k2536l9034j17446j27775p5157l6340j22961q8236q7556r8533
$$ y = [45510, 124964, 112207, 44560, 45360, 115418, 121776, 115574, 173398, 64265, 74223, 157158, 171436, 233176, 229547, 155526, 177478, 313422, 341831, 398255, 428771, 448238, 592536, 675662, 766951, 878549, 1077271, 1150962, 1170681, 1195844, 1158268, 1192470, 1259903, 1296763, 1251372, 1166498, 1054804, 963511, 888585, 822223, 753750, 660110, 561580, 502325, 548734, 454013, 412622, 238279, 587243, 278538, 59205, 244280, 152439, 236496, 216660, 163118, 251664, 292673, 284424, 420590, 498067, 547245, 501667, 530099, 635986, 754698, 805522, 922705, 988773, 1131134, 1170674, 1249646, 1252169, 1307912, 1266930, 1374315, 1401539, 1340258, 1223752, 1136511, 1142248, 1119712, 1080678, 963232, 835457, 760300, 723960, 600999, 512763, 425207, 326674]
7765C26674L1942R754j7989j10453r582J6221N1184K032k690j21584n1492K7527
7753A51544J3970q168K1536l7958K9726N3680R0128m5554K3796L8237J8354J76633
7741E25924P3549o4900O097J4948k2741m6442j24901r7119j28291o7814K2881
7730I1191j6808o811O6554m5485R2230l85j24980L326m834M3717P7440l7081j12646
7717B5428k1945R2919J04817R4676J30295Q3987k3613l477j33348p7620m5028
7706B27091m3056k7856J11176P0395j6024r6334J6739J9992o9490p0434k5513
7695I6686k2733L2684K8744M4853M7542Q076M1646M6163j8024j4995p6009k9939
7683A84694N651J02251O3582J9118J6986L9795J8328p3235l6171o2883r6714l1830
$$ y = [326674, 358616, 368370, 350381, 239928, 230346, 246567, 297751, 299783, 297093, 175509, 124017, 151544, 165514, 157346, 178882, 140924, 170650, 224330, 314458, 268904, 292700, 330937, 349291, 525924, 599473, 534573, 540670, 555618, 532877, 486435, 361534, 264415, 136124, 68310, 91191, 74383, 67572, 134126, 88641, 180871, 180486, 55506, 58832, 53998, 97715, 175155, 138074, 25428, 3483, 96402, 201219, 295895, 426190, 510177, 486564, 483087, 349739, 272119, 227091, 184035, 156179, 267355, 337750, 321726, 225392, 242131, 262123, 192633, 122199, 96686, 73953, 106637, 135381, 180234, 227776, 235852, 277498, 323661, 305637, 290642, 214633, 184694, 190345, 292596, 356178, 375296, 392282, 432077, 450405, 377170, 340999, 278116, 181402, 149572]
7671A49572O7186L8812L8764L4385O2267J50918O5288j2072o0319M0541Q2285
7660F57627P6488O2225J20957J22626P2507J53742O2742q386L735q3363n475R3773
7648A329198l9694m2514o9447r4695k0594J6234q1528q0504j34618m6594m9742
7637F85502j71693j16653p4400k5782l0685P1921K8194j07316r6887P593J2699
7626A82493l1349k1477p4556K4509Q8553O7008J8274j1720n0910l0145J2664K3433
7614A96777l3287j10715l6162L9057L0318M2578K6636N8205N7817N896K2600o4122
7602B35598j47869j61562j51P603O2073M9113r528m1729M5932M7520m7504p835
7590C1661r7511k3132n4731J22030J2766J7000R1729j0421Q3714m862n7K3709
$$ y = [149572, 216758, 255570, 294334, 328719, 390986, 541904, 607192, 595120, 534801, 575342, 657627, 734115, 796340, 917297, 1039923, 1112430, 1266172, 1328914, 1320528, 1324263, 1240900, 1235425, 1329198, 1289504, 1246990, 1177543, 1082848, 1062254, 1078488, 996960, 916456, 781838, 735244, 685502, 513809, 397156, 322756, 296974, 266289, 338210, 366404, 259088, 162201, 169794, 182493, 151144, 129667, 55111, 79620, 168173, 235181, 253455, 241735, 190825, 160680, 173344, 196777, 163490, 52775, 16613, 55670, 85988, 128566, 155202, 213407, 271224, 277120, 299720, 235598, 87729, -73833, -73984, -66381, -4308, 44805, 35277, -6452, 39480, 87000, 39496, 31661, -65850, -88982, -143713, -21683, -8917, 8083, 99812, 89391, 173105, 168243, 168186, 191895]
7578A91895m8920O0831J72431J25225k8981J9835m3541R9595N3103m0407J5690
7567E76756p7963k2707n415j5217N1461q9586j32545l64J0932j0150p9740n3735
7555A51727o5878m828o2177m8923l7495Q138M4564R9858N8155K248K5724n9488
7543A11625j50379j2923O5669j2082l9510l685P9061L1146P7254k2445j18902
7532D829M717K7374K1741Q283j45303J8887J09586K2807N0345p2852r3585J4216
7520b8955j7892K8457o6447Q081n0444K1330J13228Q3362J6827o4189k4746N507
7508B4119M8850J4811j29998o2605P5724L9163K1213K3543M1943p8325J686k519
7496A7605n9168k9182r145j806J4955J9338N0430k4339o3477o496R5488P2283
$$ y = [191895, 142975, 203806, 376237, 501462, 472481, 492316, 448775, 548370, 601473, 561066, 576756, 498793, 476086, 470671, 455454, 506915, 417329, 284784, 284420, 295352, 285202, 205462, 151727, 85849, 81021, 18844, -30079, -67574, -59436, -14872, 84986, 143141, 145389, 171113, 111625, -38754, -51677, 13992, 1910, -37600, -41285, 37776, 68922, 146176, 123731, 4829, 9546, 36920, 58661, 66944, -78359, -59472, 50114, 72921, 123266, 50414, -43171, -28955, -46847, -18390, -84837, -76756, -127200, -105870, 7358, 90720, 107547, 43358, 18612, 24119, 72969, 87780, -42218, -104823, -29099, 10064, 31277, 54820, 96763, 18438, 20124, 17605, -41563, -70745, -79890, -81696, -66741, -47403, 3027, -21312, -84789, -91285, 4203, 76486]
7484G6486k3515q6202j11840N4429R9982k7109O5950J7826J23138O1471N7969
7473C08585k2783K0432J35795J4271K7537M5441O52l5611L834K9801J11384M3258
7461F82596o7638j01332q0374k6486j866q6606j26417l5049J9722N3285l0125
7450A99710q0813n8893p091q099L6809M889p8679O3051K9205Q2376N2254K441
7438B37160j888P3342L0800N1852l0831n6552P3360k7648m7371N7864J6427p6600
7426B99915J0695k6065l7506N510r3507k3653K6539P9312P9408N7672j4767o617
7414C56936R3061O5884l3468j2543M211m8633J33762J14438N3141N2181N4465
7403H33435j4642o4495j06603l3482n3096K3032N9160k86J9944L1859Q3761K04553
$$ y = [76486, 52971, -33231, -145071, -90642, 9340, -17769, 48181, 66007, 189145, 250616, 308585, 285802, 306234, 442029, 456300, 483837, 529278, 529930, 494319, 498153, 527954, 639338, 682596, 614958, 513626, 433252, 406766, 404900, 318294, 191877, 156828, 176550, 229835, 199710, 118897, 60004, 52913, 44814, 81623, 86512, 7833, 70884, 100089, 182465, 234719, 237160, 235272, 308614, 339414, 391266, 360435, 303883, 377243, 349595, 302224, 360088, 376515, 299915, 310610, 284545, 247039, 252549, 159042, 135389, 161928, 241240, 320648, 378320, 363553, 356936, 449997, 515881, 482413, 469870, 474081, 425448, 559210, 673648, 726789, 778970, 833435, 818793, 754298, 647695, 614213, 561117, 584149, 643309, 643023, 662967, 694826, 778587, 983140]
7391I83140L3917j08933m6186p7109m5666N1609R7133M7149K0568J46440K56811
7380A358873J51482J25022J82277M7430L8193l2911O2313K321J2682N6558N2839
7369B057079P7143j9900J6925k9757K6366k4554K3295o6107j4054j6090j3051
7358B017295L4824n5656m0950J969p8475j16127j27576j35928k2003r4157j21105
7347A262111o8173r5388q1170j7417j02971r89l6j51907m2830q2882m7641M2105
7335F12812n859M9879J8752O1875P5175n6895M162o2000n2852K6311J14675L8175
7323H24210O7868L6327q492N5920R6041M0975J0079J633J11890J46212J76366
7312A559029J72819J98875L13278K08105L09844L96752M24469O01859J042321
$$ y = [983140, 1017057, 908124, 861938, 784829, 739163, 790772, 887905, 935054, 955622, 1102062, 1358873, 1510355, 1635377, 1817654, 1865084, 1903277, 1870366, 1932679, 1935000, 1947682, 2004240, 2057079, 2134222, 2114322, 2131247, 2101490, 2127856, 2103302, 2126597, 2060490, 2046436, 2030346, 2017295, 2052119, 1996463, 1955513, 1957482, 1879007, 1762880, 1635304, 1499376, 1477373, 1383216, 1262111, 1193938, 1098550, 1017380, 999963, 896992, 896003, 895967, 744060, 701230, 618348, 570707, 612812, 606953, 656832, 675584, 737459, 812634, 755739, 759901, 697901, 645049, 671360, 786035, 824210, 892078, 928405, 919913, 975833, 1071874, 1112849, 1122928, 1124561, 1236451, 1382663, 1559029, 1731848, 1930723, 2244001, 2452106, 2761950, 3158702, 3583171, 4185030, 5227351]
7303E227351J526034K473560L409698M069502K421944o91730j341397j460063
7295A5634899j566974j781362k305679j770231j004590o52623l16393L5550N20458
7286F793055J221207J683739K026925J869863J070008Q1375o71675j046732j336947
7277A1690818j550660j479622j166930j012193o64906n06861k19080m0160l0385
7268E020021J59520K3853j79176m5931O4721K48279L26396K17471j00499k45354
7258E489301p7693j01788k40414n24501n04020m65369l32482l00172l69718l49953
7248B223191k87834j76426j63867j09920j18065j70185q1194o9175N020L1747
7238A083292p297p3499n968m1615L8727l5129o7769l3677L6810K09723O3148J584
$$ y = [5227351, 6753385, 9226945, 12636643, 16706145, 19128089, 18436359, 17094962, 15634899, 14067925, 12286563, 9980884, 8210653, 7206063, 6553440, 6237047, 6272597, 6793055, 8014262, 9698001, 11724926, 13594789, 14664797, 14746172, 14074497, 13027765, 11690818, 10140158, 8660536, 7493606, 6481413, 5816507, 5309646, 5090566, 5050406, 5020021, 5179541, 5203394, 5024218, 4978287, 5043008, 5291287, 5617683, 5835154, 5734655, 5489301, 5411608, 5309820, 5069406, 4544905, 4040885, 3575516, 3243034, 2942862, 2573144, 2223191, 1935357, 1758931, 1595064, 1485144, 1367079, 1196894, 1115700, 1046525, 1051545, 1083292, 1075995, 1002496, 996528, 954913, 993640, 958511, 890742, 857065, 893875, 1103598, 1166746, 1168330]
7226A168330p781N5254J84311K15314K62970K17017J02827Q5012R7119n1915j47850
7215B180608k47058j66590J5069J26417P0311J32804R6698J9762N9464p4668j65900
7204B046917k51952j75804j41655q9332j01014j76623j37658j10054M1474K7274
7194I31573N2120o2774j08035J26498K5779N0654R8999m9711k1186l0050M8641
7183A062508N6041j1102Q9247J49486O2185J47680K46481J66139K83176M44376
7173B696217N89798P83925Q22262R74261J113735J038029Q52846N63879M57150
7164I892102L46316J65890j26244m99448q05478q60946r66000r25453q10396q15560
7154D594783p71403n23184m34908l84999l55469k53473k02676j57253j01834r0884
$$ y = [1168330, 1160549, 1215803, 1400114, 1615428, 1878398, 2095415, 2198242, 2283254, 2380373, 2328458, 2180608, 1933550, 1766960, 1782029, 1908446, 1978757, 2111561, 2208259, 2228021, 2287485, 2212817, 2046917, 1794965, 1619161, 1477506, 1388174, 1287160, 1110537, 972879, 862825, 904299, 931573, 983693, 920919, 812884, 939382, 965161, 1015815, 1114814, 1065103, 1043917, 1013867, 1062508, 1118549, 1107447, 1196694, 1346180, 1408365, 1556045, 1802526, 1968665, 2251841, 2696217, 3286015, 4069940, 4892202, 5866463, 6980198, 8018227, 8871073, 9434952, 9892102, 10238418, 10404308, 10278064, 9778616, 8973138, 8112192, 7146192, 6220739, 5410343, 4594783, 3823380, 3300196, 2865288, 2480289, 2124820, 1871347, 1668671, 1511418, 1409584, 1318700]
7144A318700p486m3784n3633l0675q8025q3394J2027j17107o6309P200q193o6971
7132G72350o7243j5279N2615p257p7454l7378n4963j9398k8693j4714J2104j7069
7120D97621J23761R3125l4724Q3245o0332r4015Q2920N1763L7071J36618M5534
7109I62587J22592J03953O5012Q1221J48212J09310J01990K28534K06846J92271
7099B322528J16517P3488n2110j11275j41085k50824k11257k09894j90906j75447
7089A169735r6274K8730o5047J9522Q3466M8634m2746m2270l1256K5028J8501
7078A116023k4337J167p0944o4591j06413o5211k7055j27076j06768l4819k2476
7067D67500J543l74k1755n2603r6061P920M0741L9416Q188o7395J08083J46009
$$ y = [1318700, 1311214, 1267430, 1213797, 1183122, 1095097, 1011703, 1023730, 906623, 840314, 847514, 839321, 772350, 705107, 689828, 742443, 735186, 657732, 620354, 565391, 545993, 517300, 502586, 514690, 497621, 621382, 714507, 679783, 763028, 702696, 608681, 691601, 743364, 780435, 917053, 962587, 1085179, 1189132, 1254144, 1335365, 1483577, 1592887, 1694877, 1923411, 2130257, 2322528, 2439045, 2512533, 2460423, 2349148, 2208063, 1957239, 1745982, 1536088, 1345182, 1169735, 1073461, 1102191, 1037144, 1056666, 1140132, 1188766, 1146020, 1103750, 1072494, 1097522, 1116023, 1091686, 1092853, 1021909, 957318, 850905, 785694, 758639, 631563, 524795, 489976, 467500, 469043, 468669, 446914, 394311, 298250, 306170, 346911, 386327, 394515, 327120, 435203, 581212]
7055E81212Q9055J09430J06690O0332l2797J0166O9004j16369j56024j64907o5596
7044D90196m071m7637j24825j03475l8565JL9289K1124j27139j16160J03700J68590
7032B61028l11r8242m9014k2772Q2005R5974K6120o6898m7703O1616M7856J2622
7020C02281p3653j02632L1436J10924J39447r0859j75878l8414J52640J97759
7010D53051K2946p2682q0727N6446R5234R1025k9788j31381q9077R7844K45464
6999F58355r021j24410r3777m2349J28543J51426k4324l9270m8863J31116L35004
6988A022430K51135j8122j15611r6527J55457N4863k9795m4291q2568J66845K99925
6977A563741K45280K02775L22488M49071O23081O30712N60302M97624O25772P93244
$$ y = [581212, 670267, 779697, 886387, 946719, 913922, 924088, 993092, 876723, 720699, 555792, 490196, 486125, 438488, 313663, 210188, 171623, 171624, 210913, 232037, 104898, -11262, 92438, 261028, 260717, 162475, 113461, 90689, 172694, 268668, 294788, 227890, 180187, 241803, 289659, 302281, 228628, 125996, 157432, 268356, 407803, 316944, 141066, 102652, 255292, 453051, 475997, 403315, 322588, 379034, 474268, 565293, 535505, 404124, 315047, 412891, 658355, 649334, 524924, 431147, 388798, 517341, 668767, 644443, 605173, 556310, 687426, 1022430, 1273565, 1255443, 1139832, 1043305, 1198762, 1253625, 1223830, 1179539, 1096971, 1263816, 1563741, 1809021, 2011796, 2334284, 2783355, 3406436, 4037148, 4597450, 5095074, 5720846, 6514090]
6967F514090O79023L08299l31943o83986p51785o88317o95336o93878o79133n94552
6957B382482l50921j98032j83384j73651o2985Q7979N0101Q1444r0110j92382
6947A350541j10844J4153Q9209Q0918J58969R5472J66476J69649R2283N0528J4791
6936B172145r5007j97075j71487k29409j36744k08144j89899l0719j9708j27360
6926G66593j29177j27731m1936l9695o6861M0354q2086L4198o584n2975k8845
6915B65255o8382j26025k8115L0890o279l691J9969P60Q6604j2122j5618j06181
6903C7065n0136K9653m870j870r058n6193O6914J10133J2498l3210k7521K508
6891G5913j40P1389J8191p6835l8692M6496O9822O1357R682j25260p2686j0019
$$ y = [6514090, 7193113, 7501412, 7169469, 6485483, 5733698, 5045381, 4350045, 3656167, 2977034, 2382482, 2031561, 1833529, 1650145, 1476494, 1413509, 1501488, 1551589, 1633033, 1542923, 1350541, 1239697, 1253850, 1343059, 1423977, 1582946, 1678418, 1844894, 2014543, 2106826, 2157354, 2172145, 2077138, 1880063, 1708576, 1479167, 1342423, 1134279, 944380, 913661, 893953, 766593, 637416, 509685, 467749, 428054, 361193, 401547, 319461, 353659, 347075, 294100, 265255, 196873, 70848, 42733, 73623, 67344, 63653, 83622, 84382, 170986, 158864, 143246, 37065, -13071, 16582, 11712, 9842, 784, -55409, 11505, 121638, 134136, 100926, 73405, 75913, 75773, 147162, 165353, 88518, 49826, 96322, 166144, 227501, 237183, 111923, 39237, 29218]
6879B9218K171O2831R424o3442L1663n0383k2717n4467r193M0970l9463o2772
6867a26160l8889O4102K6745q0556R8072R2254R684M6434m6166n8205M5446M2380
6855G5141m2835p0555J1122L6468m2900J1270m226l8372k9550M8039r071l5378
6843i0847N0l7596k6212K8472j6922N4690O5244K762n4146j3778J9264R571k4706
6830h4154o1580n1477M7488O5960P0519l4261m3571l4637P1274K803p8229l991
6818a33856n3922L0841k3864L427M8017L2236L7010N6861j0931r8149j8229j7902
6806a48461j6734j952J7183L5543J2120K4352N3221k5047P03n5515J1922L0581
6794f2084o4119J6213N2823j1205j7600L7672N9379l9502o4661M7036k7205o6272
$$ y = [29218, 31389, 94220, 103644, 40202, 71865, 21482, -1235, -55702, -64895, -23925, -63388, -126160, -165049, -100947, -74202, -154758, -56686, 35568, 45252, 91686, 45520, -12685, 32761, 75141, 32306, -38249, -27127, 9341, -33559, -22289, -26515, -64887, -94437, -46398, -55469, -90847, -90797, -128393, -154605, -126133, -143055, -88365, -23121, -20359, -74505, -88283, -69019, -59448, -84154, -145734, -197211, -149723, -83763, -13244, -47505, -91076, -125713, -54439, -51636, -129865, -133856, -187778, -156937, -180801, -177374, -129357, -97121, -60111, -3250, -14181, -112330, -130559, -148461, -165195, -167147, -149964, -114421, -102301, -77949, -24728, -49775, -49072, -104587, -92665, -62084, -126203, -109990, -57167, -68372, -85972, -48300, 11079, -28423, -93084, -46048, -73253, -139525]
6782a39525L329o138L4677l9060M6346M0447J8617p1929L4174M5436o3504l5194
6770a32324Q467Q6614p7n717j0081k4550J33599Q0364Q5000P6546M6699Q431o6914
6757B86057R83K6828N2982K9606L7135M7741j3986j20538l356l4860m0086r3772
6745A74734r4511j55265q3790K5927J21767P7391J6184l7759m4090K8121m3089
6734a4380R0272Q0877L7561J42502N7335O9687M4190n6057N1081N7395m1666j39264
6722C79533j42037j12450K638P0341n3306p2388o1266o2868R9830M7440j42270
6711d6803j08407m7233j7598J08720J2491J5971j7543M192R9953K8339q0454m0850
6699h9222l291l6848J21247p233o9108n9424L9051K7985L2858l950m3657j00580
$$ y = [-139525, -136196, -142334, -107657, -146717, -100371, -59924, -41307, -113236, -79062, -33626, -97130, -132324, -123857, -37243, -37320, -43037, -53118, -77668, 55931, 136295, 221295, 297841, 344540, 352971, 286057, 287040, 313868, 366850, 396456, 433591, 481332, 467346, 346808, 343452, 308592, 268506, 174734, 80223, -75042, -158832, -132905, -11138, 66253, 82437, 44678, 588, 28709, -14380, 75892, 156769, 194330, 336832, 394167, 463854, 508044, 451987, 503068, 560463, 518797, 379533, 237496, 125046, 127684, 198025, 144719, 72331, 11065, -51803, 48027, 95467, -46803, -155210, -202443, -220041, -111321, -98830, -82859, -100402, -96210, 3743, 32082, -48372, -89222, -92513, -129361, -8114, -15347, -84455, -143879, -104828, -76843, -43985, -47935, -91592, -192172]
6687a92172N2344J48891J1425n2352j0487R589N8561N5187M1069j08719o2338
6676d9002J34292k2565L1762k9060n4886J08296J28463O4860m0771p1851o3064
6665A36474K2676m2926m6612K2809n4067j6371M433J0308K700o7457M742L9078
6653A5787j4163n3296j03460n4474L8044j2125k793j8251m9806L8982O4754O8709
6641h2092J3427j01699p3210k528P5779N4341k0312L9359o174j0498J8685l3487
6629a28409P144j283L001m354j6225k3473m0774J0876M6088O0235k5922j6108
6617a29204K3139k0691O5624k8973q8204l3618N5566J5720K8645J0559J0661j06018
6605a96794m1047J37404j3171o9330o9047K6534M5430J5576j20367L2136k162
$$ y = [-192172, -139828, 9063, 20488, -31864, -42351, -32762, 25799, 80986, 122055, 13336, -49002, 85290, 62725, 94487, 65427, 10541, 118837, 247300, 312160, 271389, 199538, 136474, 159150, 116224, 69612, 92421, 38354, 21983, 26416, 36724, 39424, -28033, -23291, 15787, 1624, -51672, -155132, -209606, -171562, -183687, -186480, -204731, -254537, -215555, -150801, -82092, -68665, -170364, -243574, -246102, -170323, -115982, -136294, -96935, -103109, -113607, -94922, -128409, -121265, -122548, -119547, -123901, -140126, -163599, -204373, -193497, -147409, -87174, -113096, -129204, -106065, -126756, -61132, -90105, -178309, -211927, -156361, -140641, -111996, -101437, -90776, -196794, -237841, -100437, -113608, -182938, -251985, -225451, -180021, -164445, -284812, -252676, -254838]
6594b54838P6478M945l4329m1588l2529M975R1968L884m8967L4228N7776J5830
6582a22167n478o5382r2771K3950O7905J7415j3591j03812P5688L3452j6405L0716
6570a70480J0281K590k2275M8310N1971m7873l0859l0329k7067j3495n235K6132
6558b08329K0261J9555N6719k628m1331N9171J5834J9295k1587m3021k6806N9806
6546i3061m0254j0481j8964K8866k8926M1057N8862n975o1908r087J5824p1793
6534a95840n958L0651K4057j814p2422Q129k3955R013m311N4913L6331j2265q4935
6521b38406l3130k3516J5158O886L5111n7806l4080R7150K8751K1595l8390o2299
6509b82976q7023R3228J107K385j0061m810R682L8549P744p5769j7484m5326L6175
$$ y = [-254838, -178360, -173415, -207744, -249332, -281861, -276886, -184918, -181034, -230001, -195773, -137997, -122167, -127645, -193027, -285798, -261848, -193943, -176528, -190119, -293931, -218243, -184791, -201196, -170480, -160199, -157609, -179884, -131574, -79603, -127476, -158335, -188664, -215731, -229226, -234461, -208329, -188068, -168513, -111794, -114422, -155753, -96582, -80748, -61453, -83040, -126061, -152867, -93061, -133315, -143796, -162760, -133894, -162820, -121763, -62901, -68876, -130784, -139871, -124047, -195840, -201798, -171147, -147090, -148904, -221326, -213197, -237152, -228139, -232450, -177537, -141206, -153471, -238406, -271536, -295052, -279894, -273008, -237897, -295703, -329783, -232633, -203882, -182287, -220677, -282976, -369999, -276771, -275664, -273279, -283340, -288150, -278468, -239919, -232175, -307944, -325428, -370754, -334579]
6496c34579J07417K2686l6620K7985K4266r489k6778o4279k3977m6260R0601J6903
6484b52124m3653r627L874N5457l5276r985k4060n6648K0684J9417j4912l4827
6472c81680k7101o519O7514N8961k5243J9470l0046J7262l5581l6101M897k4032
6460c98199O3239Q2029O0120J3261P545q1766L1115l6082r1698L430m002K122
6448c48886k904O015o1674O0458N524M8893r189m3789k9118r5829m2344N4168
6436d58675N6936J2968K3217j0145O7795J4729P4951k4088q3817j9514j2861r200
6424c67704L7354l6877o3321j4066R7320R8414r2004o8454l0001j7733P2745k8659
6412d12986p2658O6994O7850K4540n0545q5176j3405p636O6855P6793j6873k3384
$$ y = [-334579, -227162, -204476, -241096, -213111, -188845, -198334, -225112, -289391, -313368, -359628, -269027, -252124, -295777, -305404, -301530, -246073, -281349, -291334, -315394, -372042, -351358, -331941, -346853, -381680, -408781, -415300, -347786, -288825, -314068, -294598, -324644, -307382, -342963, -379064, -374167, -398199, -334960, -252931, -192811, -179550, -172005, -253771, -222656, -258738, -350436, -347006, -351008, -348886, -351790, -345775, -407449, -346991, -341467, -292574, -301763, -345552, -374670, -470499, -512843, -458675, -401739, -388771, -365554, -375699, -307904, -293175, -218224, -242312, -326129, -345643, -358504, -367704, -330350, -367227, -430548, -444614, -347294, -248880, -340884, -409338, -439339, -457072, -384327, -412986, -485644, -418650, -350800, -326260, -376805, -461981, -475386, -483022, -416167, -339374, -356247, -379631]
6400c79631J9211l7355N3096P6688j02430m2399l4227m584J5025K4970m8955R137
6388d51454M116L8941O9159j7122j739M5492L2196M6369k9705j0252n8771l3064
6376c65834M6797M6388l3867m8025j56m3162l0991J8329K7965k2657j792K6601
6364c80404P936l6896l218k9794L5007L4481M2341p5226K3993L5709j5721Q377
6352c53415j4129l1080j7201O4283K7050m5024j5438P8875l55J2028K8136l6019
6340c02289j9770j3437o6775N2740N107P456M454K8608N2292L0443k1019j3498
6328b55688L4473j8713K6847R323M5776k7086N1805K0235J05830M3664j8823n5840
6316c8197q1510n870J7999O727p32p6487j6290M8837m8235n1127m6133K5214j1322
$$ y = [-379631, -360420, -397775, -344679, -267991, -370421, -412820, -447047, -451631, -436606, -411636, -460591, -451454, -447338, -408397, -339238, -356360, -358099, -312607, -280411, -234042, -263747, -273999, -332770, -365834, -319037, -272649, -306516, -354541, -354697, -397859, -428850, -410521, -382556, -405213, -407005, -380404, -372468, -409364, -412582, -442376, -407369, -372888, -330547, -405773, -381780, -346071, -361792, -353415, -367544, -398624, -415825, -351542, -324492, -369516, -384954, -306079, -306434, -294406, -266270, -302289, -322059, -335496, -402271, -349531, -344424, -336968, -332514, -303906, -251614, -221171, -242190, -255688, -221215, -239928, -213081, -203758, -157982, -185068, -133263, -113028, -7198, 36466, 17643, -38197, -119707, -125577, -107578, -100851, -101583, -178070, -194360, -145523, -193758, -244885, -291018, -265804, -277126]
6303b77126j8370N0742N24m0261l5709j022R2050J8306J2139N2646o767m7222
6291b00070J7734L52o8423j043J6646n532N3933O604J0525R652K7186K9334J1077
6278i2025o499j53592q5882N2513J35787K0003J942P637R676K4947R261J8060
6266e8172n6800q0738L296L5921J26001n566k4652K7893N2999k9373J146k1574
6254b9619j42161J7708Q7355N7011J0267J02297K1216J29144J26510N1430r026
6243D22132N2670M2700P2701Q5089K5536p8630j2152R728L4466M5874j5211m8448
6231F36455k9834j0284j9143o1643r8243j06642N7993l6893p8971j0228j27491
6220A15076p9715M4959M8747p5218k5333l2914P0220M6170L3993M0417p8341o597
$$ y = [-277126, -295496, -244754, -244230, -284491, -320200, -321222, -229172, -210866, -198727, -146081, -152848, -200070, -182336, -181984, -250407, -251450, -234804, -240336, -186403, -179799, -169274, -159622, -132436, -103102, -92025, -98524, -252116, -337998, -285485, -149698, -129695, -127753, -120116, -110440, -85493, -76232, -58172, -114972, -195710, -192414, -156493, -30492, -36058, -60710, -32817, 20182, -9191, -8045, -29619, -171780, -154072, -66717, -9706, 561, 102858, 124074, 253218, 379728, 431158, 422132, 474802, 517502, 590203, 675292, 700828, 622198, 610046, 619774, 654240, 700114, 684903, 636455, 606621, 596337, 577194, 515551, 417308, 310666, 368659, 331766, 252795, 242567, 115076, 35361, 80320, 129067, 53849, 28516, -4398, 65822, 111992, 145985, 186402, 108061, 101464]
6208A01464O8521J6872n0319l4353q4798n3681k6257m674k8218M6944M1921J7327
6196A0749p5102L6330n3461n3513N1150l0297L9269j6671M5858k472J27535R0454
6184A69829p840M2192L8417m265J54943N2666n4284o5203m663L9314J1270N4131
6172D26507p127k6358J10M2106p2500j28910o9972J415j6411j5773q154Q961L8691
6159A72585O7622P0690m4241M0775l5603K1925n7483J13617J93168K0216L0232
6148E93503j0882l2394j3325q8011l9935L5791N7808l953P7558R1766Q605m0629
6136F35902m974M1026k4573q0959r7439o1158J17m438j6895L2950p46K5021M7537
6123D91371N9165M5766m6570q7445J88528R7046k8982n2251K0865J06247J50115
$$ y = [101464, 169985, 186857, 136538, 102185, 17387, -36294, -62551, -67225, -95443, -48499, -6578, 10749, -64353, -28023, -81484, -134997, -83847, -114144, -74875, -91546, -45688, -48160, 79375, 169829, 161989, 204181, 242598, 238333, 393276, 445942, 391658, 326455, 321792, 361106, 372376, 426507, 419380, 393022, 393132, 435238, 362738, 233828, 163856, 165271, 148860, 133087, 124933, 133894, 172585, 240207, 310897, 266656, 307431, 271828, 293753, 236270, 349887, 543055, 563271, 593503, 582621, 550227, 536902, 448891, 408956, 444747, 502555, 498602, 576160, 667926, 676531, 635902, 630928, 671954, 647381, 566422, 468983, 407825, 407942, 403504, 386609, 419559, 418813, 443834, 491371, 550536, 596302, 549732, 462287, 650815, 747861, 718879, 666628, 687493, 793740, 943855]
6112I43855J58306J02695J65070J22507J33739K16362J69999M3165j83485j01710
6102A770503j16452p9141j09739k28524j17162K746j7876o2514k9946l8219l3504
6091I40172j6328M2104R5404Q9433Q5105P2347J5580K2382M3467q4903k6842P0697
6079A348618M969J26021J60159J09625J14991J11216R1150k4198j99340j29012
6069A714199q3110m9731p1439j37918p8424m6256m0803k0227l0879r0580p1534
6058I93298k3812l5414J8386J0598q860P6238O2588P4828R528q792J3881l7258
6046A145209m1572R7879k3760j2007J45930N1702J4707P9360J26735J27378R0622
6035A802183n3817P0028J01525J48765J83044K00300L36291K99079J44671J53681
$$ y = [943855, 1102161, 1204856, 1369926, 1492433, 1626172, 1842534, 2012533, 2055698, 1872213, 1770503, 1654051, 1574910, 1465171, 1236647, 1119485, 1122231, 1104355, 1041841, 1011895, 973676, 940172, 923844, 965948, 1061352, 1150785, 1235890, 1308237, 1323817, 1346199, 1389666, 1304763, 1277921, 1348618, 1353587, 1479608, 1639767, 1749392, 1864383, 1975599, 2066749, 2042551, 1843211, 1714199, 1631089, 1581358, 1509919, 1372001, 1293577, 1247321, 1206518, 1186291, 1155412, 1064832, 993298, 969486, 934072, 952458, 963056, 954196, 1030434, 1093022, 1167850, 1177378, 1168586, 1182467, 1145209, 1103637, 1201516, 1177756, 1165749, 1311679, 1363381, 1378088, 1457448, 1584183, 1711561, 1802183, 1748366, 1818394, 1919919, 2068684, 2251728, 2452028, 2788319, 3087398, 3232069, 3385750]
6025C385750K8402N8365N0549k0973L7150N3477O3302J39970L7171Q7078Q830
6014C929071j20983p0515p8427n2906l1971j5613J1256M3267N1761N9948N9419
6003C784307N1051N015J1331J0040M8196N3592R9716J00500J95659K34034J66082
5992D759523J20471J93699J99866K09507K04281R3684m8467R8423J44875J43249
5982F119111M7291L7828N2732Q5508R2452R8373Q8559J48378K71532L06612K83362
5971G631738L69599L37724M04145N54043O97319R00453R36877J209637J758430
5962A4799965K317577K953008L379740L421290K609334J216485J90506l76072
5954C0511833p54629p47512n37771R9495J089905J938338K441874K142795J081825
$$ y = [3385750, 3414152, 3472517, 3523066, 3502093, 3539243, 3592720, 3656022, 3795992, 3833163, 3920241, 3929071, 3808088, 3737573, 3659146, 3606240, 3574269, 3558656, 3569912, 3613179, 3664940, 3724888, 3784307, 3835358, 3840373, 3851704, 3861744, 3909940, 3963532, 4063248, 4163748, 4359407, 4593441, 4759523, 4879994, 5073693, 5273559, 5483066, 5687347, 5781031, 5732564, 5830987, 5975862, 6119111, 6166402, 6204230, 6256962, 6342470, 6434922, 6533295, 6621854, 6770232, 7041764, 7348376, 7631738, 8001337, 8339061, 8743206, 9297249, 9994568, 10895021, 11831898, 13041535, 14799965, 17117542, 20070550, 23450290, 26871580, 29480914, 30697399, 30887905, 30511833, 29757204, 29009692, 28471921, 28571416, 29661321, 31599659, 34041533, 36184328, 37266153]
5945C7266153p0287p12299j145601j251311j321397j091978n48930L6792O57691
5936C1818833J397481K278601L360337M267312M888797M565865L689204L139177
5928E9405607L307113M078430N186587P337888J0293933J3692489J6635307J7144805
5920A37082159J4048598P625637J033627l417114n640183o340187n652994l070224
5912A35669319P66465M453958O180151M588128J64462m685699q413086j0789692
5904A27934006j2140532j2888362j2595659j1421806r870733q245318o731121
5897E4040475n464920m468133l582374k927789k603232k227590j867829j647699
5889B9250909j481797j541920j427054j312349j191242j037091r98671q35382
$$ y = [37266153, 37195866, 36483567, 35337966, 34086655, 32765258, 31673280, 31124350, 31161142, 31818833, 33216314, 35494915, 38855252, 43122564, 48011361, 52577226, 56266430, 59405607, 62712720, 66791150, 71977737, 79315625, 89609558, 103302047, 119937354, 137082159, 151130757, 158756394, 159790021, 156372907, 150732724, 144392537, 138739543, 135669319, 136435784, 140889742, 147069893, 151658021, 151822483, 147136784, 138723698, 127934006, 115793474, 102905112, 90309453, 78887647, 69016914, 60771596, 54040475, 48575555, 44107422, 40525048, 37597259, 34994027, 32766437, 30898608, 29250909, 27769112, 26227192, 24800138, 23487789, 22296547, 21259456, 20260785, 19425403]
5881A9425403p67134o28062n16904m98925n73549o33027n75163m29220m48241
5872A4355178n48052n33476n12496m69541l85050m48562l12969k98125l38419
5863A0508488j64734q2426k51217k75685k29953j00754m5945j15389j47831j18038
5853H976516m4689M0828J6041K705p1093p7906P4046Q7417L7804J02553J26189
5842I270411K09918L23009K82714L97825K39316L74299M74145M38447N00159N00201
5832A3010444O38584P57987N11526K45420p8801k44646l28004m25460m63199m00364
5822A3223487l55165k07822o2079J09010J82920J88277K91871L42367M00167M16948
5812A4529981M29238O16219O03600P28381O69033P04296Q57927J133543J147771
$$ y = [19425403, 18658269, 18030207, 17513303, 17014378, 16440829, 15807802, 15232639, 14803419, 14355178, 13807126, 13273650, 12761154, 12291613, 11906563, 11458001, 11145032, 10846907, 10508488, 10343754, 10261328, 10010111, 9734426, 9504473, 9403719, 9357774, 9242385, 9094554, 8976516, 8931827, 8972655, 8988696, 8991401, 8920308, 8842402, 8916448, 9003865, 9041669, 9144222, 9270411, 9480329, 9803338, 10086052, 10483877, 10723193, 11097492, 11571637, 12010084, 12510243, 13010444, 13649028, 14407015, 14918541, 15163961, 15085160, 14840514, 14512510, 14087050, 13623851, 13223487, 12868322, 12660500, 12598421, 12707431, 12890351, 13078628, 13370499, 13712866, 14113033, 14529981, 14959219, 15575438, 16179038, 16907419, 17576452, 18280748, 19138675, 20272218, 21419989]
5803B1419989R25644N29685K19738K22279L38781L87895L30948M64183N86688
5794B5425830Q63823J191148J608271K058653K425011L003508L762560M604625
5786D4943429N610228O862990Q848306J1963791J6636400K3331231L1229847L7140913
5778A86567135L3212969J8985058J2546729J3970022J0974547l151205k1406315
5771B51698940k6768604k6237931k5092954k4861389k3833961j9443140j5126754
5764I0334207j1710703q924477o411950m528710l068033k131922j178784l23618
5756E2056010M46174J312634K489208L810694N740166Q554491J2234412J6724266
5748A03368055K0283480K4892608L1541693L1515908J6432049m763829j4140407
$$ y = [21419989, 22345633, 22875318, 23095056, 23317335, 23656116, 24044011, 24374959, 24839142, 25425830, 26289653, 27480801, 29089072, 31147725, 33572736, 36576244, 40338804, 44943429, 50553657, 57416647, 66264953, 78228744, 94865144, 118196375, 149426222, 186567135, 219780104, 238765162, 251311891, 265281913, 276256460, 273105255, 251698940, 224930336, 198692405, 173599451, 148738062, 124904101, 105460961, 90334207, 78623504, 69699027, 63287077, 58758367, 55690334, 53558412, 52379628, 52056010, 52502184, 53814818, 56304026, 60114720, 65854886, 74409377, 86643789, 103368055, 123651535, 148544143, 180085836, 211601744, 228033793, 223269964, 209129557]
5741B09129557j7371470j8929154k1162800k3409499k0661530j6844316j3567921
5734G7182867j0713685q289135o499105m855090m066339l325500k569789k177201
5726C4687023j694742j464291j231704j029228q89521n97150m60746k70418j5263
5717B7033960J76991M30779R06672J444784J946761K064370J494603R15989R38925
5708C7353834J339815J847413K406500L658399N702454Q706412J3095318J8669752
5700I2779897K3780327K3751129J1811595l342557r104846j1743978j2860583
5693A15070984j4651909j5634652j2810497r855049p328856n143169l163264j811356
5685D4672232q04742M2141J379758L067780N380632Q366733J1907140J4435947
$$ y = [209129557, 191758087, 172828933, 151666133, 128256634, 107595104, 90750788, 77182867, 66469182, 58180047, 51680942, 46825852, 42759513, 39434013, 36864224, 34687023, 32992281, 31527990, 30296286, 29267058, 28377537, 27780387, 27319641, 27049223, 27033960, 27210951, 27641730, 28548402, 29993186, 31939947, 34004317, 35498920, 36414909, 37353834, 38693649, 40541062, 42947562, 46605961, 52308415, 61014827, 74110145, 92779897, 116560224, 140311353, 152122948, 148780391, 139675545, 127931567, 115070984, 100419075, 84784423, 71973926, 62118877, 54790021, 49646852, 46483588, 44672232, 43867490, 43909631, 45289389, 48357169, 53737801, 62104534, 74011674, 88447621]
5677H8447621J1685394K028324m971283p279488q540905r186589j0535735r928543
5669E1718796q125412o472664n124175m025238l035418k335012j926929j679118
5661A8994830j367479j169873r68176q11290p18308p26698n85994n83305m44371
5652A1619336m34714l38552k89586l08611l72784k38227k16077k02457j56169
5643I062159k17431k20502p5018j32562j13068p7801p8566k2653K519R3025L69760
5632H589862M50694N46801O87531O45538N68750L97228J83824M2453K3528n3859
5622A2082350j39388l81108n42348o68795p51613p49460p51501o03418n77957
5613F916762n22809k93801k66174k34496o0685n7794j10414j01051j95828q3560
$$ y = [88447621, 100133015, 102161339, 97190056, 89910568, 81369663, 72183074, 61647339, 51718796, 43593384, 37120720, 31996545, 27971307, 24935889, 22600877, 20673948, 18994830, 17627351, 16457478, 15489302, 14678012, 13959704, 13233006, 12647012, 12063707, 11619336, 11184622, 10846070, 10556484, 10247873, 9875089, 9636862, 9420785, 9218328, 9062159, 8844728, 8624226, 8549208, 8416646, 8303578, 8225777, 8147211, 8124558, 8127077, 8220102, 8589862, 9040556, 9587357, 10274888, 10920426, 11489176, 11886404, 12070228, 12112681, 12136209, 12082350, 11942962, 11561854, 11019506, 10350711, 9599098, 8849638, 8098137, 7494719, 6916762, 6393953, 6100152, 5833978, 5599482, 5538797, 5481003, 5370589, 5269538, 5073710, 4990150]
5603D990150o4133m6215j37277l4852k4867M0148K1827r5620m3308n6876o8907
5592D480070n2190j13511j29435m5558k9489q2713J4846M8912m4954m4719N946
5581D007205J2748j5932o1328n4059R310R3926K29616J5255p6486p6518n4611
5570D029126m5417j34716j21600j91206k63724m3772l9509j56174j26842r3608
5560B812558j0414L2633M2901J36776Q2280K6204J12426R2317o6440q4923r8472
5549C077846q7929j13952j18911L6897r1506o2601q0767r3923o8655k7492j49142
5538B219865n6534p4376p9615K6245r8309k31352r6476K775K740N796p7965n5901
5526A486893J9304L5630L5182j03119j1715k733o1371k6805N693l9194m3012k0751
$$ y = [4990150, 4926017, 4879802, 4742525, 4707673, 4682806, 4722954, 4744781, 4649161, 4605853, 4548977, 4480070, 4427880, 4314369, 4184934, 4139376, 4109887, 4027174, 4042020, 4090932, 4045978, 4001259, 4007205, 4019953, 4004021, 3942693, 3888634, 3897944, 3991870, 4221486, 4236741, 4160255, 4083737, 4029126, 3983709, 3848993, 3727393, 3536187, 3272463, 3228691, 3189182, 3033008, 2906166, 2812558, 2802144, 2834777, 2877678, 3014454, 3096734, 3122938, 3235364, 3327681, 3261241, 3176318, 3077846, 2989917, 2875965, 2757054, 2793951, 2702445, 2639844, 2559077, 2465154, 2396499, 2369007, 2219865, 2163331, 2088955, 2009340, 2035585, 1937276, 1705924, 1609448, 1612223, 1614963, 1620759, 1542794, 1486893, 1506197, 1541827, 1577009, 1473890, 1462175, 1459442, 1398071, 1371266, 1376959, 1337765, 1294753, 1274002]
5514A274002L5735J01381J366j00892j27856Q0834J14739P5748n8217q8946q0153
5503A227741M8557Q8459l386o1277j04737N7171K2280M1886O9682j02601r7896
5492A185879l6237M5209J25999p889p5365p935N3111Q1821O9207l0498p6098m501
5480A322703J10261J02690j67406j73033j47603P427J42341K5723k7757j56846
5470A038500m3928P4728Q5882K3723j00844n9703J4834Q6039O0816n944k09177
5459I64926n7411L3669J08666M2574j37541r8123J23570L2399R9769R7369n7029
5448A152838M5205J22488J41818K05719J27910J27376J34614J18560J54171J05817
5438B436516L4290M6266k5631j06124o5173k68188j92383k4095k9083l3403j35173
$$ y = [1274002, 1309737, 1411118, 1412484, 1311592, 1183736, 1264570, 1379309, 1455057, 1396840, 1307894, 1227741, 1276298, 1364757, 1361371, 1300094, 1195357, 1252528, 1274808, 1316694, 1386376, 1283775, 1185879, 1149642, 1194851, 1320850, 1312961, 1237596, 1229661, 1282772, 1364593, 1433800, 1403302, 1327204, 1322703, 1432964, 1535654, 1368248, 1195215, 1047612, 1055039, 1197380, 1223103, 1195346, 1038500, 994572, 1069300, 1155182, 1178905, 1078061, 1018358, 1033192, 1119231, 1180047, 1174103, 964926, 907515, 941184, 1049850, 1092424, 954883, 856760, 980330, 1012729, 1112498, 1209867, 1152838, 1198043, 1320531, 1462349, 1668068, 1795978, 1923354, 2057968, 2176528, 2330699, 2436516, 2470806, 2517072, 2491441, 2385317, 2320144, 2051956, 1859573, 1835478, 1806395, 1772992, 1637819]
5427A637819o2999j1613Q466R9838m0027m3701R3734J31590J04943J36229K18777
5416B273056J55108J00691K86978L32884L01899L98098M63520N52964Q24227R02046
5406F591471J054248J069572Q91520O35894J9019l02772o89860r69352r39009
5397G360731j010513q69398q17462p66103n17904l41114k94548k27909k62359
5388B253421k16234o3268l5859j01054j57809j49953J6957l0960n2872m6357j29809
5377A286203r4460R9024k6168L2920l3475o3534K8895K2060J06631J05223P7616
5366A540935P7403Q7497J03183J26721p3289m5766j2995J499P3035L96L9781L9054
5354A957454R4334K41085K53976K50013L70504N40167Q03866R70947Q07218O38821
$$ y = [1637819, 1574820, 1563207, 1571673, 1671511, 1631484, 1587783, 1681517, 1813107, 1918050, 2054279, 2273056, 2428164, 2528855, 2815833, 3148717, 3450616, 3848714, 4312234, 4865198, 5689425, 6591471, 7645719, 8715291, 9606811, 10242705, 10261724, 9958952, 9269092, 8299740, 7360731, 6350218, 5480820, 4663358, 3897255, 3379351, 3038237, 2743689, 2515780, 2253421, 2037187, 1973919, 1938060, 1837006, 1679197, 1529244, 1546201, 1515241, 1462369, 1416012, 1286203, 1191743, 1290767, 1264599, 1297519, 1264044, 1200510, 1229405, 1251465, 1358096, 1463319, 1540935, 1618338, 1705835, 1809018, 1935739, 1862450, 1816684, 1803689, 1805188, 1878223, 1878619, 1918400, 1957454, 2051788, 2292873, 2546849, 2796862, 3167366, 3707533, 4511399, 5482346, 6289564, 6928385]
5344F928385L01682m0239k82865n61363o38631o87897o90335o38804m79280m01768
5334B808885k78150k32515j24846j04868j69846r2466j49421j19254n1591L823
5324A489751m9582k5548j06724j66990j44353o2715L8101K687L3996m9432n7674
5313I01517L1841J3348O741n6103q9174P5155N9680j3364O9816q0971J3492J07121
5301A039099O8311j0963o4124J0208q493m0515R6261k8139q2470n2237J1357N4276
5289I92571J5243m8919j8854m3540J1450J09538L7504l5027L4342L3294J86011
5278A273613J04750L1321j2495j2926Q7970J26606m4031r9792p9604K226Q1060
5267A458698M4594J0890l5314q518J40066J77360k9035j16987p0683l291l2585
$$ y = [6928385, 7230067, 7189828, 6906963, 6345600, 5706969, 5019072, 4328737, 3689933, 3210653, 2808885, 2530735, 2298220, 2173374, 2068506, 1898660, 1806194, 1656773, 1537519, 1485928, 1489751, 1440169, 1414621, 1307897, 1140907, 996554, 933839, 971940, 974627, 1008623, 959191, 901517, 933358, 946706, 953447, 897344, 808170, 883325, 943005, 929641, 999457, 918486, 931978, 1039099, 1107410, 1096447, 1032323, 1042531, 1034038, 993523, 1089784, 1061645, 979175, 926938, 938295, 992571, 1007814, 958895, 940041, 896501, 907951, 1017489, 1054993, 1019966, 1054308, 1087602, 1273613, 1378363, 1409684, 1397189, 1384263, 1472233, 1598839, 1554808, 1455016, 1375412, 1377638, 1458698, 1503292, 1514182, 1478868, 1470350, 1610416, 1787776, 1758741, 1641754, 1571071, 1567780, 1535195]
5256A535195P7851j18093n6459n7912n150J9838l7941r2698q848P7623J8438L8512
5244A390356q6991j44782L6176k4675K5149l1413l0451j32342q0534J4946M4108
5233I79547J2398L3560P2510l224l2822m3618l5622l9105K4833l0182n8185k0945
5221H59145n2908M793N0757J5645K1193n0894j1903m6217M8560n7433L3525O5967
5209H80230p6166K1247L1472l8158k5841L7567M5112L9209n1460M2306J2422l2952
5197H84988M129n815N5591Q3471J4670k3606j686m0488O3279j0691J547M8036
5185A073425O5940K7652m3698J4087N4499p890k6745N702J7214M682n1946M306
5173A137228K3570K4535Q4585K2213N123j119J5032N3806N7276J0776q3943J2847
$$ y = [1535195, 1613046, 1494953, 1438494, 1380582, 1375432, 1395270, 1357329, 1264631, 1255783, 1333406, 1351844, 1390356, 1303365, 1158583, 1194759, 1170084, 1195233, 1163820, 1133369, 1001027, 920493, 935439, 979547, 991945, 1025505, 1098015, 1094791, 1061969, 1018351, 982729, 943624, 968457, 938275, 880090, 859145, 806237, 811030, 861787, 877432, 898625, 847731, 835828, 789611, 838171, 780738, 814263, 880230, 804064, 825311, 856783, 818625, 792784, 830351, 875463, 914672, 863212, 905518, 917940, 884988, 889117, 883302, 938893, 1022364, 1037034, 1013428, 1011742, 971254, 1034533, 1023842, 1025389, 1073425, 1139365, 1167017, 1123319, 1137406, 1191905, 1184015, 1157270, 1162972, 1180186, 1184868, 1132922, 1137228, 1160798, 1185333, 1269918, 1292131, 1297254, 1296135, 1311167, 1364973, 1422249, 1433025, 1349082, 1361929]
5161A361929L9840O0535P258J9748M344M3921J53171l3477K7484Q676K8049R2773
5149A814251L329L5049K8490J1565P1021L3951K3421J53320R3502k3633K6517
5138B270783N2071N5670P877O337J02139L4957J01752Q0883P0603J45197R8846
5127C027115P0728N4745K1489J29858J12407R8504J18500N7323J34516J29195
5117C954380J15350J08195P3618K07164J94284P5860J28492R0143J72570K41927
5107E361983K54074J73324J61959J66502K23097L07542K54730K06624J77334K51222
5097G538391L49249L00660L49309K92794K05046L84696L85188L69773M01598K76254
5087A0852958K31453L92164L82192M49475L06514K84146K89413L37538L68439
$$ y = [1361929, 1401769, 1462304, 1469562, 1489310, 1493654, 1537575, 1690746, 1657269, 1684753, 1693429, 1721478, 1814251, 1817580, 1852629, 1881119, 1892684, 1963705, 1997656, 2021077, 2174397, 2267899, 2244266, 2270783, 2322854, 2378524, 2386401, 2392738, 2494877, 2529834, 2631586, 2712469, 2783072, 2928269, 3027115, 3097843, 3152588, 3174077, 3303935, 3416342, 3514846, 3633346, 3690669, 3825185, 3954380, 4069730, 4177925, 4251543, 4458707, 4652991, 4728851, 4857343, 4947486, 5120056, 5361983, 5616057, 5789381, 5951340, 6117842, 6340939, 6648481, 6903211, 7109835, 7287169, 7538391, 7887640, 8188300, 8537609, 8830403, 9035449, 9420145, 9805333, 10175106, 10576704, 10852958, 11084411, 11476575, 11858767, 12308242, 12614756, 12898902, 13188315, 13525853, 13894292]
5078A3894292J53063J62956J42578R2619L02663L05501J71210K44666J79898Q4501
5068A5733947j9465k37853l56342m08920l94496l42902l61338k06156j43098r7019
5058A3166358O866n7064l54483m03011m98658n32717m46463n54804n64924m53360
5048I307740m20246l84003m55250k27069j91076l15498j94684k09848k55113j74684
5038F480269k31045k41698k25685j40547j32728j79635l3848p7019k26796p9959
5028D911309j07293j74711j5370q5452p8251l9518j5529J4703l1584j66890K073
5017D213487o1859j7652L0744l7287n7669j07320r0359O7474j4578j9979L863
5006C908865k5038R8571J51322Q6323L7378Q5217J62149J61613J30489K74417
$$ y = [13894292, 14047355, 14210311, 14352889, 14445508, 14748171, 15053672, 15224882, 15469548, 15649446, 15733947, 15714482, 15476629, 15120287, 14711367, 14316871, 13973969, 13612631, 13406475, 13263377, 13166358, 13173224, 13116160, 12761677, 12358666, 11860008, 11327291, 10880828, 10326024, 9761100, 9307740, 8887494, 8503491, 8048241, 7821172, 7630096, 7314598, 7119914, 6910066, 6654953, 6480269, 6249224, 6007526, 5781841, 5641294, 5508566, 5328931, 5295083, 5218064, 4991268, 4911309, 4804016, 4629305, 4613935, 4528483, 4450232, 4410714, 4395185, 4409888, 4378304, 4211414, 4213487, 4151628, 4133976, 4164720, 4127433, 4069764, 3962444, 3872085, 3939559, 3924981, 3905002, 3908865, 3883827, 3982398, 4133720, 4220043, 4257421, 4342638, 4504787, 4666400, 4796889, 5071306]
4996E071306K96762M17413O42218P25947N47397J69711j00920o2217j51717k06677
4986G349223j27265k27106k6343J50649L67351N27308K52362j12946l62145m00229
4976G390859k80432m49967o35656n78455m10826k15447j51821k19367k05783j58951
4966D084154m1674Q5083j13244r3805r0550j9525K9338J6800n1657M551p5062
4955C734409m372M7896l5218p5717j56663j7229R4280L9290o4013j23875o8618
4944C370170Q8016M5050M9066K8783o1576J18958J33263O4785Q3704k7582P0815
4933C963452J62098J52979L6702L8605Q3051J72202L7152L5266J41698q54M8600
4922D870951R8712M0482K7218j03601k754J47281K9171J72845J35434O7866J04615
$$ y = [5071306, 5368068, 5785481, 6427699, 7153646, 7701043, 7870754, 7769834, 7707617, 7555900, 7349223, 7221958, 6994852, 6968509, 7119158, 7486509, 8013817, 8266179, 8153233, 7791088, 7390859, 7110427, 6660460, 6024804, 5446349, 5035523, 4820076, 4668255, 4448888, 4243105, 4084154, 4042480, 4127563, 4014319, 3920514, 3829964, 3810439, 3839777, 3856577, 3804920, 3809471, 3734409, 3730037, 3777933, 3742715, 3666998, 3510335, 3493106, 3587386, 3626676, 3562663, 3438788, 3370170, 3458186, 3503236, 3552302, 3581085, 3519509, 3638467, 3771730, 3836515, 3920219, 3892637, 3963452, 4125550, 4278529, 4315231, 4353836, 4436887, 4609089, 4646241, 4681507, 4823205, 4822351, 4870951, 4969663, 5010145, 5037363, 4933762, 4931008, 5078289, 5107460, 5280305, 5415739, 5483605, 5588220]
4911E588220Q3532Q0232Q3722J46654J34203O7722J49189J83406N5266O8369M924
4900F645439N4859m0628l6676k2847l9364j1829r5852j55149l5404j2677l3253
4889F216619k3092j09021q8826n5579n0989R791n256j19935m1961L9007J01895
4878E872653L1727m9546j8368K1962L8276R4018m1007j7540N2006J61101J24715
4867F269997L8026l5018m4134P2678P0991J14114j3157r806J23044Q8955K01838
4856F877528J21046J21561J14755J02501R7317Q7399K1657r2305P5670J61292
4846G688421J32788K14157K25361J76142M16421N54325O74043P10689P09109P01195
4836A2202651O25339L68532P1385K4713N625O9386K10698L66248N65235Q92304
$$ y = [5588220, 5671752, 5751984, 5835706, 5982360, 6116563, 6184285, 6333474, 6516880, 6572146, 6640515, 6645439, 6700298, 6659670, 6622994, 6600147, 6560783, 6548954, 6453102, 6297953, 6262549, 6249872, 6216619, 6193527, 6084506, 5995680, 5940101, 5889112, 5898903, 5893647, 5773712, 5731751, 5770758, 5872653, 5904380, 5854834, 5836466, 5858428, 5896704, 5990722, 5949715, 5932175, 5984181, 6145282, 6269997, 6308023, 6273005, 6228871, 6301549, 6372540, 6486654, 6473497, 6463691, 6586735, 6675690, 6877528, 6998574, 7120135, 7234890, 7337391, 7434708, 7522107, 7543764, 7451459, 7527129, 7688421, 7821209, 8035366, 8260727, 8436869, 8853290, 9407615, 10081658, 10792347, 11501456, 12202651, 12827990, 13196522, 13267907, 13292620, 13298245, 13367631, 13578329, 13944577, 14509812, 15402116]
4826A5402116J296703J735430K115570K299142K580619J722541l77727j133019
4818B5641375j201561j235715j253805j461386j219831p80236m61295l65156m8663
4809A7613727L02353L70572L88449L97449N55415Q03284Q60049R07026R95288
4800B3193612R96380J124271J311539J476519J667319J859069K301145K992628
4792C6922482L768701M439913M921278N133523M635840L307101J976116J110054
4784F6215008P58901R80250J802764L451895N575676P781596R047610P349090
4776A02962790K584054r24871k440889l018818k944049l176093k235308p33238
4768I0073578O35728J340501J232136O14114l55931j329597j735949j929597j745772
$$ y = [15402116, 16698819, 18434249, 20549819, 22848961, 25429580, 27152121, 26774394, 25641375, 24439814, 23204099, 21950294, 20488908, 19269077, 18488841, 18027546, 17662390, 17613727, 17916080, 18286652, 18675101, 19072550, 19627965, 20431249, 21291298, 22198324, 23193612, 24189992, 25314263, 26625802, 28102321, 29769640, 31628709, 33929854, 36922482, 40691183, 45131096, 50052374, 55185897, 59821737, 63128838, 65104954, 66215008, 66973909, 67954159, 69756923, 73208818, 78784494, 86566090, 95613700, 102962790, 105546844, 104621973, 102181084, 99162266, 96218217, 93042124, 90806816, 90073578, 90709306, 92049807, 93281943, 93896057, 93540126, 92210529, 90474580, 88544983, 86799211]
4759H6799211j635348j524955j294505r92474m73047k26650j32701j48873j80328
4750H0190330q683L48791N46847N71499N73289P69541J202836J836783K465861
4741H8497094K893866K607919J964207J790647J839333J888660J953291K264692
4733A05699709L028290M153064N362381O212603N558670K869545Q67098K06957
4725A33958317m33121r32254j577345j552607r32000m09950j59529p1583n92102
4716A27297826j059564j071794j057990r52172o88942l88209q7048L25347L25553
4707A22643007M44631N76297O28307O96345N75599K80205J27441j89098m15906
4698A25366828n79691q38333p20593n38431j13170M97487J281390K120311K228702
$$ y = [86799211, 85163863, 83638908, 82344403, 81351929, 80878882, 80652232, 80519531, 80370658, 80190330, 80181647, 80530438, 81077285, 81648784, 82222073, 82991614, 84194450, 86031233, 88497094, 91390960, 93998879, 95963086, 97753733, 99593066, 101481726, 103435017, 105699709, 108727999, 112881063, 118243444, 124456047, 130014717, 132884262, 133751360, 133958317, 133525196, 132592942, 131015597, 129462990, 128530990, 128121040, 127961511, 127889928, 127297826, 126238262, 125166468, 124108478, 123156306, 122467364, 122079155, 121992107, 122317454, 122643007, 123087638, 123663935, 124292242, 124988587, 125564186, 125844391, 125971832, 125782734, 125366828, 124787137, 123948804, 123228211, 122689780, 122576610, 123074097, 124355487, 126475798, 128704500]
4689A28704500J056395r21382k195452k663345k882561l038320k695275k004181
4681A13360379o57253P04590J649973J510863O97k110255m099411n052187n518075
4672I9789321n711049n654807n234860m526259l795093l090007k564223k183245
4664F7029778j775092j408083j310770j476420j815491j938208j953056j766882
4656E3585776j689121j522838j293601j014550o32361j74783r6590n11569j152838
4647D5497525j209406j067023r52243q58335q57805n58249k84987p7318O6857
4638C9699016J9854j35969l55394l42955l92772m47712m66407m18586o9857Q5233
4628C7174451L60529N37245P68906Q24570N80454K85961K81567J80702L05809
$$ y = [128704500, 129760895, 128839513, 126644061, 123980716, 121098155, 118059835, 115364560, 113360379, 112703126, 113407716, 115057689, 116568552, 116569249, 114458994, 110359583, 105307396, 99789321, 94078272, 88423465, 83188605, 78662346, 74867253, 71777246, 69213023, 67029778, 65254686, 63846603, 62535833, 61059413, 59243922, 57305714, 55352658, 53585776, 51896655, 50373817, 49080216, 48065666, 47433305, 47258522, 47161932, 46650363, 45497525, 44288119, 43221096, 42268853, 41410518, 40552713, 39994464, 39709477, 39632159, 39699016, 39718870, 39582901, 39227507, 38884552, 38491780, 38044068, 37577661, 37159075, 37089218, 37174451, 37534980, 38072225, 38841131, 39665701, 40246155, 40532116, 40813683, 40994385, 41300194]
4619D1300194L44813M55502N71936M76302L02313K62146N0558j07628j61878l54671
4609D3139587l11235m31268o18413n77208o94243p47184o78215n19178m23594
4600C8139049l34805k63004l69335l23373o7188R0606K12717M61644O38785O29363
4590C8814459N33904N31654P64121Q27680Q32969M56687l29508q13330q92317
4581D0726319j045442j192206j072410p05835k7430P67044J529284J755197N69945
4572D1304466o25651j169918j436831j367821j545271j394563j081577m39582
4564C2243252k9925K97221O95229M51196m4337k38859l88515k92688k97319k25563
4554C2169692J45797L83358P36289J299245K073713K483209K390629J846812J330121
$$ y = [41300194, 41645007, 42100509, 42672445, 43148747, 43451060, 43713206, 43763764, 43656136, 43494258, 43139587, 42828352, 42397084, 41778671, 41201463, 40507220, 39760036, 39081821, 38562643, 38139049, 37804244, 37541240, 37171905, 36848532, 36781344, 36871950, 37084667, 37546311, 38185096, 38814459, 39348363, 39880017, 40644138, 41471818, 42304787, 42761474, 42431966, 41618636, 40726319, 39680877, 38488671, 37416261, 36710426, 36682996, 37450040, 38979324, 40734521, 41304466, 40678815, 39508897, 38072066, 36704245, 35158974, 33764411, 32682834, 32243252, 32213327, 32510548, 33205777, 33656973, 33612636, 33373777, 32985262, 32692574, 32395255, 32169692, 32315489, 32698847, 33435136, 34734381, 36808094, 39291303, 41681932, 43528744, 44858865]
4545D4858865J011205K29510p26206j352723j546186j649390j664715j635915
4537C7524445j592313j387692j260667j143068r40207r52005r75720r83373j007931
4528B7281469r89320r18835r40695r56735p49946o58233m72236l88406m03894
4519B0803169l68853k33625j86842k11447l03530l07865l81720m14201m36678
4510A7958408n26412m20878n41384n76409m75139n67319o35824n08947n82181
4501A3123915m77033m69864n52604n32164n10995l19582k44697k98722k04926
4492I513328k72345k18666p9477j09303k03607j38170q1532l3832m182r4882j23512
4481H153820j96530k9271J3727J2770J8641p7032n3113J886K0838k470p081L7973
$$ y = [44858865, 45870070, 46099580, 45373374, 44020651, 42474465, 40825075, 39160360, 37524445, 35932132, 34544440, 33283773, 32140705, 31200498, 30248493, 29272773, 28289400, 27281469, 26292149, 25373314, 24432619, 23475884, 22725938, 22067705, 21595469, 21207063, 20803169, 20434316, 20200691, 20013849, 19802402, 19498872, 19191007, 18809287, 18395086, 17958408, 17431996, 17011118, 16469734, 15893325, 15418186, 14850867, 14215043, 13706096, 13123915, 12646882, 12177018, 11624414, 11092250, 10581255, 10261673, 10016976, 9718254, 9513328, 9240983, 9022317, 8942840, 8833537, 8629930, 8491760, 8410228, 8376396, 8372214, 8277332, 8153820, 7957290, 7928019, 7941746, 7954516, 7973157, 7896125, 7843012, 7844898, 7865736, 7863266, 7856185, 7894158]
4469G894158J34977Q7510J7981P2079Q9549J6295J14484J63664K06834O4819L209
4458H865559J28771J39437J97590J49491K4013J02085J74004J60223J59102N3995
4448A0154270L0857j5339N7511N18n6916N1972N7489Q4092J28517J31157O7726
4437A0691854J14040M5431J39457K17528J8310J86478J86505K33553K12029J33600
4427A2178785J14261J05017J50827J80536J76817R5713K4185L3851P6866N5414
4417A3192272j12920j49404j64218j79239p8010j29010j05304j50462j76293j95606
4407A1751806j58106q2770j19438j51875q9342k1513r9724j35426l9125p6138
4397A0778349j4435K7060P449j00339q9398n6783j60791l6087m3734r0331m6644
$$ y = [7894158, 8029135, 8116645, 8134626, 8206705, 8296254, 8312549, 8427033, 8590697, 8797531, 8862350, 8865559, 8994330, 9133767, 9331357, 9480848, 9504861, 9606946, 9780950, 9941173, 10100275, 10154270, 10185127, 10169788, 10227299, 10227817, 10170901, 10222873, 10280362, 10364454, 10492971, 10624128, 10691854, 10805894, 10851325, 10990782, 11208310, 11226620, 11413098, 11599603, 11833156, 12045185, 12178785, 12293046, 12398063, 12548890, 12729426, 12906243, 13001956, 13026141, 13059992, 13136858, 13192272, 13079352, 12929948, 12765730, 12586491, 12508481, 12379471, 12274167, 12123705, 11947412, 11751806, 11593700, 11510930, 11391492, 11239617, 11150275, 11128762, 11029038, 10893612, 10854487, 10778349, 10763914, 10790974, 10798423, 10698084, 10608686, 10551903, 10391112, 10355025, 10311291, 10220960, 10174316]
4386A0174316m9115m3252n8170q0602j27057n7891q5774j7529N5948J9350Q1914
4375I812138K3165J45782J21625J10820N0810Q133r8945q064P2075R6864K0788
4364A0355191r299k5581J05688J80482Q4499J03242P0755K11554L69227M21806
4354A1867564L80458N08434L44345L22889M23810K66026K98306J96495J44598
4345A4752925J26720J95009P1548O7287j3618k0569J24240J44414J77345P7754
4335A5703055P1638K71629K67688J44478J50762R6661J95656K21336L36970J67805
4325A7627678J21107O6535J6990k7727q7042r0482j45998r6406n6855l7877o6755
4314A7223168j24098j27110j48308p3108j97089l05595k69240l10478k09276j88542
$$ y = [10174316, 10125201, 10081949, 10023779, 9943177, 9816120, 9758229, 9672455, 9654926, 9710874, 9730224, 9812138, 9835303, 9981085, 10102710, 10213530, 10264340, 10272473, 10173528, 10165464, 10237539, 10334403, 10355191, 10345892, 10320311, 10425999, 10606481, 10690980, 10794222, 10864977, 11076531, 11445758, 11867564, 12248022, 12756456, 13100801, 13423690, 13847500, 14113526, 14411832, 14608327, 14752925, 14879645, 15074654, 15146202, 15213489, 15199871, 15179302, 15303542, 15447956, 15625301, 15703055, 15774693, 16046322, 16314010, 16458488, 16609250, 16705911, 16901567, 17122903, 17459873, 17627678, 17748785, 17815320, 17832310, 17804583, 17717541, 17627059, 17481061, 17384655, 17327800, 17289923, 17223168, 17099070, 16971960, 16823652, 16750544, 16553455, 16247860, 15978620, 15668142, 15458866, 15270324]
4304A5270324k30571k09766j16618J2105K7201L0348n7958r5838M2601J31589
4294A4803417J1975L5695n9116J31410K76328L63812M01129M85786O33986Q94358
4284A7978780J281687J619615K003116K853993M112979N818349P797939R182014
4276E2648472Q085310M280811J465955J257250K030029K970094K389140p82847
4268G4344214m405689o067504o351485o345732o428351o273382n320307m276610
4260B8875154l370774k788216k064856j503710j228916j104895r05608p72019
4252A5136160o24125n38117m19196n25665m47239l17336k84004j49543j87052
4243A1643883j36989J780l1463J0497n4803N523l8411P1606J52400M1701J5544
$$ y = [15270324, 15039753, 14829987, 14713369, 14725474, 14752675, 14783023, 14725065, 14629227, 14671828, 14803417, 14815392, 14851087, 14791971, 14923381, 15199709, 15563521, 15964650, 16450436, 17084422, 17978780, 19260467, 20880082, 22883198, 25737191, 29850170, 35668519, 43466458, 52648472, 60733782, 65014593, 66480548, 67737798, 69767827, 72737921, 75127061, 74344214, 69938525, 63871021, 57519536, 51173804, 44745453, 38472071, 33151764, 28875154, 25504380, 22716164, 20651308, 19147598, 17918682, 16813787, 15908179, 15136160, 14512035, 13973918, 13554722, 13029057, 12581818, 12264482, 11980478, 11830935, 11643883, 11506894, 11508674, 11477211, 11487708, 11432905, 11438428, 11400017, 11471623, 11624023, 11665724, 11681268]
4232A1681268O4116J51775L38648L77303L61758R3139k9909M6255l8508L4482
4222A3080327m0429j14483j90480k61657j73783j76632k84099j61462m3985J777
4212A1635094M619K1543P8742J12074L7938J06580o8929j09894j05522j02584
4202A1609661p1774j47642j32817k01297j76449j78315j76849k59803k52027q4657
4192I928031q4158j16607p5126j55414j51166j87361j80990j73705k07706j32976
4182H462822j20093j13003j52208j94939j92014j68293j53334j23984j67839k13783
4172F863332j42369p4255o6711q8830j37750j80381k01727p9392j03039k20304
4162E568574r1082l7751o0237K4998P453O3698Q7395M1255J25583Q1748Q6312
$$ y = [11681268, 11745384, 11897159, 12235807, 12613110, 12974868, 13068007, 13038098, 13084353, 13045845, 13080327, 13039898, 12925415, 12734935, 12473278, 12299495, 12122863, 11838764, 11677302, 11633317, 11635094, 11639713, 11661256, 11739998, 11852072, 11890010, 11996590, 11927661, 11817767, 11712245, 11609661, 11537887, 11390245, 11257428, 11056131, 10879682, 10701367, 10524518, 10264715, 10012688, 9928031, 9843873, 9727266, 9652140, 9496726, 9345560, 9158199, 8977209, 8803504, 8595798, 8462822, 8342729, 8229726, 8077518, 7882579, 7690565, 7522272, 7368938, 7244954, 7077115, 6863332, 6720963, 6646708, 6579997, 6491167, 6353417, 6173036, 5971309, 5891917, 5788878, 5568574, 5477492, 5439741, 5379504, 5404502, 5411955, 5475653, 5563048, 5604303, 5729886, 5811634, 5897946]
4151E897946J62759K05032L67934L08466P6532j45409j14584p8782j08410j29744
4141F441740q3872r9246n638L2531J2436n395j62758l4029J53300J29137J03895
4130F482101J38403J39194M60570O99851O09427N67799L09566K6353O9543J83986
4120I686793M25797L28749j81999l03591l48948m49437n08361n03216m61657l27924
4110G356206j94020j44049p1683q2750Q2041J41098P5742J26619M5471J1392Q5297
4099G431364R6181R0121L8451M0215N9435J33724J35502J02033J52210J91891
4089H471127K53523K84490K91224K74994K79973K50196K74438J52310P9422J82814
4079A0794511J98134K52928K75661Q0380J92325J97447J87615K25450J94194O7886
$$ y = [5897946, 6060705, 6265737, 6633671, 6942137, 7018669, 6873260, 6758676, 6679894, 6571484, 6441740, 6357868, 6258622, 6252984, 6285515, 6297951, 6292556, 6129798, 6095769, 6249069, 6378206, 6482101, 6620504, 6759698, 7220268, 7920119, 8529546, 9097345, 9406911, 9433264, 9502807, 9686793, 10112590, 10441339, 10259340, 9955749, 9606801, 9157364, 8649003, 8145787, 7684130, 7356206, 7162186, 7018137, 6946454, 6863704, 6945745, 7086843, 7162585, 7289204, 7334675, 7346067, 7431364, 7527545, 7617666, 7656117, 7696332, 7755767, 7889491, 8024993, 8127026, 8279236, 8471127, 8724650, 9009140, 9300364, 9575358, 9855331, 10105527, 10379965, 10532275, 10611697, 10794511, 10992645, 11245573, 11521234, 11601614, 11793939, 11991386, 12179001, 12404451, 12598645, 12666531]
4069A2666531Q4019O7993K5539m4350l2341n4251j2422J05512J80688K54645K74060
4058A3515623L48475K43771K43664n0732j08068j74133k35095j47321r2492k27447
4048A3316245j42300r0739l3819m4638j05177r0189p7635M5034J69561P3683O6699
4037A3086725J20414J86962K50912K01113J53450K25600J67281L04524K66534
4028A4963515K15451K25209R2622K97480M45814L59262K60489K12182L39603M40138
4018A7851765K96990L52821L89171L86056M89085N70398N59786N85943N92876
4009B2074891O79236O89640O05709N94735M54249M62111N82849N68648N77904
4000B7289972M44793M88236O98376O94448O26675N83781M85936N79323O98952
$$ y = [12666531, 12750550, 12818543, 12844082, 12799732, 12767391, 12713140, 12700718, 12806230, 12986918, 13241563, 13515623, 13864098, 14107869, 14351533, 14300801, 14192733, 14018600, 13783505, 13636184, 13543692, 13316245, 13173945, 13083206, 13049387, 13004749, 12899572, 12809383, 12731748, 12776782, 12946343, 13020026, 13086725, 13207139, 13394101, 13645013, 13846126, 13999576, 14225176, 14392457, 14696981, 14963515, 15178966, 15404175, 15496797, 15794277, 16240091, 16599353, 16859842, 17072024, 17411627, 17851765, 18148755, 18501576, 18890747, 19276803, 19765888, 20336286, 20896072, 21482015, 22074891, 22754127, 23443767, 24049476, 24644211, 25098460, 25560571, 26143420, 26712068, 27289972, 27734765, 28223001, 28921377, 29615825, 30242500, 30826281, 31312217, 31891540, 32590492]
3991C2590492P59525P36351O96047Q96751R87037J094893J064032R76085R07734
3982D0708947Q66085Q42787P33538P77875O03519P56541R71924J241838J414532
3973D8917586J420814J524093J600645J673441J717471J565014J516951J535244
3965F1471259J586208J869911J970274K025212K201042K216689K276618K354791
3957G7972004K228630K299172K317174K511295K700187K788406K900072L101747
3949I8818687L438606L857577M012854L652488L292123L091910L223547L168015
3941A26555807K947574K879164K661073K288989J943699J487761J025078P60092
3933A42549237O73620P56696P66191Q56763J156176J258180J354625J409567J330701
$$ y = [32590492, 33350017, 34086368, 34782415, 35679166, 36666203, 37761096, 38825128, 39801213, 40708947, 41575032, 42417819, 43151357, 43929232, 44532751, 45289292, 46261216, 47503054, 48917586, 50338400, 51862493, 53463138, 55136579, 56854050, 58419064, 59936015, 61471259, 63057467, 64927378, 66897652, 68922864, 71123906, 73340595, 75617213, 77972004, 80200634, 82499806, 84816980, 87328275, 90028462, 92816868, 95716940, 98818687, 102257293, 106114870, 110127724, 113780212, 117072335, 120164245, 123387792, 126555807, 129503381, 132382545, 135043618, 137332607, 139276306, 140764067, 141789145, 142549237, 143222857, 143979553, 144745744, 145602507, 146758683, 148016863, 149371488, 150781055, 152111756]
3924A52111756J340686J188892J134925J273304J059683Q60396O62707M67746
3916A60100095K44181j16029p95017j442901j805436j940242k196276k564450
3908A49483925k907877l104333l020462k657891k364222k052412j660326j369878
3900A30346524j040937r71328r22011j057020j175485j127789j004100r73727
3892A22074127j016107j098334j196185j440792j700510j948633k373285k798767
3884A08501514k950332l108287l005870l006923k893689k725742k452166k116439
3876H6242066j912912j733256j572550j582445j519634j463323j706353j731026
3868G3020567j870546j889251j820001j822838j672920j517038j439773j487162
$$ y = [152111756, 153452442, 154641334, 155776259, 157049563, 158109246, 158969642, 159632349, 160100095, 160344276, 160228247, 159433230, 157990329, 156184893, 154244651, 152048375, 149483925, 146576048, 143471715, 140451253, 137793362, 135429140, 133376728, 131716402, 130346524, 129305587, 128334259, 127412248, 126355228, 125179743, 124051954, 123047854, 122074127, 121058020, 119959686, 118763501, 117322709, 115622199, 113673566, 111300281, 108501514, 105551182, 102442895, 99437025, 96430102, 93536413, 90810671, 88358505, 86242066, 84329154, 82595898, 81023348, 79440903, 77921269, 76457946, 74751593, 73020567, 71150021, 69260770, 67440769, 65617931, 63945011, 62427973, 60988200, 59501038]
3860E9501038j415189j474457j374256j194599j099300j010123j110166p79749
3852E0043199p22202p81927q16335q54115r28974p53151q23695p05505q50986
3843D2806309r38647p25802q19139p50998q24075r05508q65345o97994o84799
3834C5594002o51551p73376o88944o13591n94199n31302n09518m16447k96522
3825C0518552j73234l8813J4485L6982j2692m0968o3526j16983k63110m50490
3815B9410203m78965n83121m09126n13508n79202n26996o76020l99738l00220
3806B4943307l95318m33261m37639k74181q7575j70247j00335k91686k35045j23713
3796B2394307j98858k81673l84109m48411m25580k76936k07958j67251k26006
$$ y = [59501038, 58085849, 56611392, 55237136, 54042537, 52943237, 51933114, 50822948, 50043199, 49320997, 48539070, 47722735, 46868620, 45939646, 45186495, 44362800, 43657295, 42806309, 41867662, 41141860, 40322721, 39571723, 38747648, 37842140, 36976795, 36278801, 35594002, 34942451, 34169075, 33480131, 32866540, 32272341, 31741039, 31231521, 30815074, 30518552, 30345318, 30306505, 30320990, 30357972, 30345280, 30304312, 30240786, 30123803, 29860693, 29410203, 28931238, 28348117, 27938991, 27425483, 26846281, 26319285, 25643265, 25243527, 24943307, 24547989, 24114728, 23677089, 23402908, 23315333, 23145086, 23044751, 22753065, 22518020, 22394307, 22195449, 21913776, 21529667, 21081256, 20655676, 20378740, 20170782, 20003531, 19777525]
3787A9777525j93226o0656n3708o4349j76442k50605k26572k81370k07992l94573
3777A7868032l82471k35301j79025r5258j79233k32761k00578j91206k34712k03614
3767A5733873l32817l83257l72451l57213j78019k49152l80867j57604j65515
3758A3156978j45434j58814l23045k57545j87907k25759j69239k40355k80213
3749A1168667k22375j82511j70030k20557k32618l35776l32326k85887k85756
3740H900831l92119k73150l14428j64699o1512q7181j39176j05494p9386j4598
3730G269088p2107j13896k67906k51681p6526j30517j04137j07130j37667j19987
3720E887534j03394k28587j23237k01941j77647j16290j95366o0463p6078M5519
$$ y = [19777525, 19584299, 19523643, 19469935, 19405586, 19229144, 18978539, 18751967, 18470597, 18262605, 17868032, 17485561, 17250260, 17071235, 16975977, 16796744, 16563983, 16363405, 16172199, 15937487, 15733873, 15401056, 15017799, 14645348, 14288135, 14110116, 13860964, 13480097, 13322493, 13156978, 13011544, 12852730, 12529685, 12272140, 12084233, 11858474, 11689235, 11448880, 11168667, 10946292, 10763781, 10593751, 10373194, 10140576, 9804800, 9472474, 9186587, 8900831, 8508712, 8235562, 7921134, 7756435, 7694923, 7607742, 7468566, 7363072, 7283686, 7269088, 7196981, 7083085, 6815179, 6563498, 6486972, 6356455, 6252318, 6145188, 6007521, 5887534, 5784140, 5555553, 5432316, 5230375, 5052728, 4936438, 4741072, 4680609, 4604531, 4650050]
3710D650050l2340j06830j12344o7821j96346p9398r1925q4036k2922n9295j13759
3699C683034K3446l6766l4133j7204j15643j1446j26928m1872r2273m6857k0774
3688C162584Q009N3050R12m5467p729p918M349p0537r0971j03086p213n6192j0413
3675B829378l885o8787R5462k1972p5782l6284j24524k2515l9264o1176M5952
3664B516603J0959M030Q630K8884j7020k1335R997n3980o1563n9658q0896R132
3652B293783L6989J8773Q0539Q3494J758k2221L4529j39392n5641M892j7486Q862
3640B328879L6850M1920J50K6227J9744j7383o242p8148j07608j05716N5912O5416
3628B260001P2711n5462O517J03586N5332k3442j05296k9551O7623J6210L3824
$$ y = [4650050, 4617710, 4510880, 4398536, 4330715, 4134369, 4054971, 3963046, 3879010, 3856088, 3796793, 3683034, 3706480, 3669714, 3635581, 3618377, 3502734, 3491288, 3364360, 3322488, 3230215, 3183358, 3162584, 3170593, 3223643, 3224555, 3179088, 3171359, 3163441, 3167790, 3097253, 3006282, 2903196, 2895983, 2839791, 2829378, 2825493, 2756706, 2852168, 2830196, 2754414, 2718130, 2593606, 2571091, 2531827, 2470651, 2516603, 2527562, 2531592, 2540222, 2569106, 2552086, 2530751, 2540748, 2486768, 2425205, 2365547, 2284651, 2293783, 2330772, 2349545, 2430084, 2513578, 2515336, 2493115, 2527644, 2388252, 2332611, 2337503, 2320017, 2328879, 2365729, 2407649, 2407799, 2434026, 2453770, 2436387, 2430145, 2351997, 2244389, 2138673, 2194585, 2260001, 2332712, 2277250, 2283767, 2387353, 2442685, 2419243, 2313947, 2284396, 2352019, 2368229, 2402053]
3617B402053k8624k7294K1372q358J1552M0900q9605r6671j3590L4579L5256r056
3605B272514K2059j6947P7400M0087Q3032M7341n909o5108k4427m6549k7908j6863
3593B338722J1624O5852R8343M4356N5885M4836m9906P184J47757O7712p1831
3582B760534m4455J02203J05040N6738N6122Q8313Q0226M8727R8096M9966m9076
3571C352434r6671N9447M418K786M360l1975P449P3211j1875m8835O397J20034
3559C441180N7113M9416R2555J3J69284K35731J79940K25932J74394J27903K13550
3548D967011K28850J94923J60905J17105K41763K27047J13310J58233p884j11629
3538F289634m9305o5164j65580q9478o5748O2183K7102L5445P8504k0111R7359
$$ y = [2402053, 2373429, 2346135, 2367507, 2359149, 2370701, 2411601, 2321996, 2225325, 2211735, 2246314, 2281570, 2272514, 2294573, 2277626, 2355026, 2395113, 2478145, 2525486, 2519577, 2454469, 2430042, 2383493, 2355585, 2338722, 2350346, 2416198, 2514541, 2558897, 2614782, 2659618, 2609712, 2616896, 2764653, 2832365, 2760534, 2716079, 2818282, 2923322, 2980060, 3036182, 3124495, 3204721, 3253448, 3351544, 3401510, 3352434, 3255763, 3315210, 3319628, 3322414, 3326774, 3294799, 3302248, 3375459, 3363584, 3314749, 3321146, 3441180, 3498293, 3547709, 3640264, 3640277, 3809561, 4045292, 4225232, 4451164, 4625558, 4753461, 4967011, 5195861, 5390784, 5551689, 5668794, 5910557, 6137604, 6250914, 6409147, 6401263, 6289634, 6240329, 6175165, 6009585, 5920107, 5854359, 5916542, 5943644, 5979089, 6057593, 6037482, 6134841]
3527F134841K55167K19110K18921J39846K84873M66857M16645K81434L45248L00515
3517I063457K91120L22172M03191L05395J95005K00665L43811L08520K71019K30315
3507A1934670M9062O9360J61409k0345k1745M4297K34090K65637L27488M24673
3497A3468596L79438N00547O32323N83251N34980M79826M39516M88521N95958
3488A8102956O17199O79079P14955P08983R59079J207980J527972J603669J944603
3479B8066475K259072K647360K881915K820112K702172K682057K342082J863517
3471D8264762J140944L88501k93073q72589j446643j829690k169172k226552k068368
3462C8888120j841289j666834j640554j553555j463516j354201j299105j171991
$$ y = [6134841, 6390008, 6609118, 6828039, 6967885, 7252758, 7719615, 8136260, 8417694, 8762942, 9063457, 9354577, 9676749, 10079940, 10385335, 10580340, 10781005, 11124816, 11433336, 11704355, 11934670, 11983732, 12053092, 12214501, 12194156, 12172411, 12216708, 12450798, 12716435, 13043923, 13468596, 13848034, 14348581, 14980904, 15564155, 16099135, 16578961, 17018477, 17506998, 18102956, 18720155, 19399234, 20114189, 20823172, 21782251, 22990231, 24518203, 26121872, 28066475, 30325547, 32972907, 35854822, 38674934, 41377106, 44059163, 46401245, 48264762, 49405706, 49794207, 49501134, 48628545, 47181902, 45352212, 43183040, 40956488, 38888120, 37046831, 35379997, 33739443, 32185888, 30722372, 29368171, 28069066, 26897075]
3454B6897075j108338j234250j246717j224661j151967j197615j225545j201177
3446A7306805j104653j121637r39757q58036q34534p22972o92604o08548n18549
3437I905515m49032m42219m29980l70252l66771l74097l08940l36571k81101j98093
3427F348459k07180k31084k04278k08871k31573j60037k87568j97871j05807j48809
3417D365381q8929m1967m8765p0831j24369j04550j50466k07273j05772r3677
3407C328782q0698j4104j36192j11764O5474o0563o8757k00285j45708j30838
3397B445347j4882j8118q5351j5862j00344N6690M8087o9926o2293j92510l7982
3386A952856k7178j00874r7581n7654L6809L1028L0718O3777p0096p9878j11930
$$ y = [26897075, 25788737, 24554487, 23307770, 22083109, 20931142, 19733527, 18507982, 17306805, 16202152, 15080515, 14140758, 13282722, 12448188, 11725216, 11032612, 10424064, 9905515, 9456483, 9014264, 8584284, 8214032, 7847261, 7473164, 7164224, 6827653, 6546552, 6348459, 6141279, 5910195, 5705917, 5497046, 5265473, 5105436, 4817868, 4619997, 4514190, 4365381, 4276452, 4234485, 4185720, 4114889, 3990520, 3885970, 3735504, 3528231, 3422459, 3328782, 3248084, 3233980, 3097788, 2986024, 3051498, 2990935, 2922178, 2721893, 2576185, 2445347, 2430465, 2412347, 2326996, 2311134, 2210790, 2267480, 2315567, 2245641, 2183348, 1990838, 1952856, 1925678, 1824804, 1727223, 1669569, 1706378, 1737406, 1768124, 1831901, 1761805, 1681927, 1569997]
3375A569997r6153N9143J4940r6897r8650M3492L4754P4718l5835l9835o9542
3364A360132j0870J9265j66449m3913j04991N6782Q3377j0446J2978M2642P482
3353A245989l7950j25397o1833m9161l2937l4635N547l4871K6673P7965L2251
3342A011641K9436n2910n5900o8073K197K018M2776O894L9243R4220J13904L4528
3330A199974j07007n5439r2966q9892N0881l7249j33816L9697O1065M1218N5720
3319I32186q028l2900r2179k2708K9488o8485q7343j4299M7038Q4072R7671n314
3307H59199q0267k2868R8379m2559J08J5312j39331R2508J69465R3089r6901l6959
3295I09175K7322R343m8904m5260r5490l4118k5902K8742N4092m3926K2391J6001
$$ y = [1569997, 1473844, 1532987, 1547927, 1451030, 1352380, 1395872, 1430626, 1505344, 1469509, 1429674, 1360132, 1349262, 1368527, 1202078, 1158165, 1053174, 1109956, 1193333, 1182887, 1195865, 1238507, 1245989, 1208039, 1082642, 1020809, 971648, 938711, 904076, 909623, 874752, 901425, 979390, 1011641, 1041077, 988167, 932267, 864194, 866391, 868409, 911185, 918079, 957322, 1051542, 1165446, 1199974, 1092967, 1037528, 944562, 854670, 905551, 868302, 734486, 774183, 835248, 876466, 932186, 924158, 891258, 799079, 776371, 805859, 737374, 650031, 635732, 682770, 766842, 864513, 859199, 778932, 756064, 854443, 811884, 811992, 827304, 687973, 780481, 949946, 1043035, 946134, 909175, 936497, 945840, 896936, 851676, 756186, 722068, 696166, 724908, 779000, 735074, 757465, 773466]
3283G73466N9659N0673n4002n2996j06578o9425P2636J09624K2030l8480K5590
3272G92197n7628N1048j6925l5351L4317m4659K0371j8045l70N8743Q9787K9658
3260I03143K3849n449k2995p493o4482J2551k1959L1559N2308k694k3325j2922
3248H62091P2117L4948k9213n0278n657J1667J26789k4849N504N5056P50O8104
3236A127029M9300j8658j9341n5512k0400l165J1953R4752k0635j1596N3168O9223
3224A256118M5248P1936K0625m4578J9764N1947J10427N3866N9317K1342J5226
3213A681238Q6158l8367o7517n5708N6855R5293M3574k1534J842M3343P5352J33660
3201B034189O449o7992L7790J03485P9676l775K2898K823K5541J61736J17250
$$ y = [773466, 833125, 883798, 829796, 776800, 670222, 600797, 673433, 783057, 805087, 766607, 792197, 734569, 785617, 768692, 733341, 767658, 722999, 743370, 725325, 724955, 783698, 873485, 903143, 926992, 921543, 898548, 891055, 826573, 839124, 817165, 848724, 901032, 898338, 875013, 862091, 934208, 969156, 939943, 889665, 884008, 895675, 1022464, 997615, 1003119, 1058175, 1058925, 1127029, 1176329, 1157671, 1138330, 1082818, 1062418, 1059253, 1071206, 1165958, 1145323, 1133727, 1186895, 1256118, 1301366, 1373302, 1393927, 1349349, 1369113, 1421060, 1531487, 1585353, 1644670, 1666012, 1681238, 1767396, 1729029, 1661512, 1605804, 1662659, 1757952, 1801526, 1779992, 1781834, 1825177, 1900529, 2034189, 2040638, 1972646, 2010436, 2113921, 2193597, 2189822, 2212720, 2215543, 2241084, 2402820, 2520070]
3190B520070J17604L3382j5965J17031J72921P5711K5055Q0270R3593K65131K95152
3179C779955K44498N4517M6809J59857J65001K20013K57533J85964L24679M15807
3169E854633L96720M52040L77254M62715P00464Q00022Q72159Q76119R02828R40108
3159A2635062J067416J048758Q25734N35448K12028J61986J18832O7623j49280
3150A6523607j12508j03027n5354l7437l4051l7459n6J6688J66777J88799J49086
3139A6665065J34259K55944M95862O42739Q28224J169295J638733K465254L513310
3130B7808685M250751M060499K026472j67438j289038k032424k585914l029507
3122B9042086l246758k945781k407256j879672j488812j219560j029234p94540
$$ y = [2520070, 2637674, 2671056, 2655091, 2772122, 2945043, 3020754, 3045809, 3126079, 3219672, 3484803, 3779955, 4024453, 4078970, 4125779, 4285636, 4450637, 4670650, 4928183, 5114147, 5438826, 5854633, 6251353, 6703393, 7080647, 7543362, 8243826, 9043848, 9916007, 10792126, 11694954, 12635062, 13702478, 14751236, 15576970, 16112418, 16324446, 16486432, 16605264, 16672887, 16523607, 16411099, 16308072, 16252718, 16215281, 16181230, 16143771, 16143715, 16160403, 16327180, 16515979, 16665065, 16799324, 17055268, 17551130, 18193869, 19022093, 20191388, 21830121, 24295375, 27808685, 32059436, 36119935, 38146407, 37978969, 36689931, 34657507, 32071593, 29042086, 25795328, 22849547, 20442291, 18562619, 17073807, 15854247, 14825013, 14030473]
3114A4030473o92593m97139m48342m15354k14305j01117q5599m199N6067J58790
3104A1786682K84418N20808N72597N09453O40543P05365M71671J32467l01333
3095A5322671o00580p66911r62945r07981r67586j039968r68506q21380o90583
3086G596231n52847n11067m63867m29208l14730k61355k50700l12413k95345k25994
3076C978705k11079j64550k22314j80389j76737k6326j60420j59767j35737r2313
3066B449073p5213j82940j08799m0098k9843j62811r3541r253M466K7897m7243
3055A731695j36817l1250m0239j13529q2422K653l3002q716k7317m6591l9710
3044A174755o6635r5298o8928M2391k2144j5659o9077k2586M6507O0628L136q2800
$$ y = [14030473, 13337880, 12840741, 12392399, 11977045, 11762740, 11661623, 11576024, 11571825, 11627892, 11786682, 12071100, 12591908, 13164505, 13673958, 14314501, 15019866, 15491537, 15624004, 15322671, 14722091, 13955180, 12992235, 12084254, 11116668, 10076700, 9108194, 8286814, 7596231, 7043384, 6532317, 6068450, 5639242, 5324512, 5063157, 4812457, 4500044, 4204699, 3978705, 3767626, 3603076, 3380762, 3200373, 3023636, 2997310, 2836890, 2677123, 2541386, 2449073, 2373860, 2190920, 2082121, 2042023, 2012180, 1849369, 1755828, 1746575, 1751041, 1778938, 1731695, 1594878, 1563628, 1523389, 1409860, 1327438, 1330091, 1297089, 1288373, 1261056, 1214465, 1174755, 1108120, 1012822, 943894, 986285, 964141, 948482, 879405, 856819, 903326, 963954, 967090, 884290]
3032H84290r7889o5670L1480J57010p1563p4302r3312j2508P8544J7622l9911
3021G13791j4668l6587j342P1090r1928p0157r5607M2983P0694j4700j12770r6720
3009C64079l1507J11318J44396J7721j38872q3751L9400J15014l1561j7862n8568
2998D29807k9851N0826j9197P0309k0251r9179P1765M1657M6896r5789j50023
2987B96970j2268L9179P7916K6263j41182m8273O8480R4406O5410j47536o8024
2976B51341l2554K0498J27820M3420j31630n7318M5087R2579R5988O448p5543
2965C86136o7945J402K5951o099n2789m7478l8122J24804J20136j01798j40533
2954B03665M6633K0591O5820M2360q5615j36106l2238J24620L0054l9410k3308
$$ y = [884290, 786401, 720731, 752211, 909221, 837658, 763356, 670044, 657536, 736080, 753702, 713791, 699123, 662536, 661194, 732284, 640356, 570199, 474592, 517575, 588269, 573569, 460799, 364079, 332572, 443890, 588286, 606007, 467135, 383384, 422784, 537798, 506237, 488375, 429807, 399956, 450782, 431585, 501894, 481643, 382464, 454229, 495886, 542782, 446993, 296970, 284702, 323881, 401797, 428060, 286878, 238605, 307085, 401491, 466901, 319365, 251341, 218787, 239285, 367105, 410525, 278895, 221577, 266664, 359243, 455231, 461679, 386136, 318191, 319593, 345544, 339445, 286656, 239178, 201056, 325860, 445996, 344198, 203665, 250298, 270889, 336709, 379069, 293454, 157348, 125110, 249730, 279784, 240374, 217066]
2943B17066k9948L8485R1041N6057m6980j41940n3372M8505N2376K6223j0289
$$ y = [217066, 187118, 225603, 316644, 372701, 325721, 183781, 130409, 178914, 231290, 257513, 247224]
$$ [...]
##END NTUPLES=NMR SPECTRUM
##END=
