##TITLE=1H_DE-80H_X3
 200.13MHz, d2o
 8 sc
 
 19ns.26.2.2025
##JCAMPDX= 6.0         $$ Bruker NMR JCAMP-DX V2.0
##DATA TYPE= NMR SPECTRUM
##DATA CLASS= NTUPLES
##ORIGIN= UXNMR, Bruker Analytische Messtechnik GmbH
##OWNER= pz
$$ XWIN-NMR		Version 3.5
$$ Thu Jun 25 12:39:29 2026 Russian Standard Time (UT+4h)  Yarkov@DPX200
##.OBSERVE FREQUENCY= 200.1313
##.OBSERVE NUCLEUS= ^1H
##.ACQUISITION MODE= SIMULTANEOUS
##.ACQUISITION SCHEME= undefined
##.AVERAGES= 8
##.DIGITISER RES= 18
##SPECTROMETER/DATA SYSTEM= spect
##.PULSE SEQUENCE= zg30
##.SOLVENT NAME= DMSO
##.SHIFT REFERENCE= (INTERNAL, DMSO, 0, 15.4902)
##AUDIT TRAIL= $$ (NUMBER, WHEN, WHO, WHERE, WHAT)
$$ ##TITLE= Audit trail, XWIN-NMR		Version 3.5
$$ ##JCAMPDX= 5.01
$$ ##ORIGIN= Bruker BioSpin GmbH
$$ ##OWNER= Yarkov
$$ C:/Bruker/XWIN-NMR/data/yarkov2/nmr/H-C/1/pdata/1/auditp.txt
$$ ##AUDIT TRAIL=  $$ (NUMBER, WHEN, WHO, WHERE, WHAT)
(   1,<2026-06-25 12:38:41.23 +0400>,<Yarkov>,<DPX200>,
      <created by zg, POWCHK disabled, PULCHK disabled
       configuration hash MD5:
       00 E9 B6 7A A2 85 ED C7 34 08 36 98 17 FE 4E 26
       data hash MD5: 16K
       25 D3 A6 3F 81 44 75 49 C1 CB 9A 17 E0 E5 06 A9>)
(   2,<2026-06-25 12:38:46.28 +0400>,<Yarkov>,<DPX200>,
      <Start of raw data processing
       efp BC_mod = 2 LB = 0.25 FT_mod = 6 PKNL = 1 PHC0 = -6900.419 PHC1 = 13.42196 SI = 16K 
       data hash MD5: 16K
       B8 EE 15 0B 02 52 F7 E9 F3 62 E0 DB 32 4B 60 E0>)
(   3,<2026-06-25 12:38:54.67 +0400>,<Yarkov>,<DPX200>,
      <abs ABSG = 5 
       data hash MD5: 16K
       F5 13 4D 71 BE F3 A1 38 1E EB 31 32 77 D5 75 B8>)
$$ ##END=
$$ 
$$ hash MD5
$$ 63 E7 83 EB 19 2A 9E B5 3B B2 96 81 D5 F4 26 09
##$RELAX= 
##$RELAX= 
##$RELAX= 
##$RELAX= 
##$RELAX= 
##$RELAX= 
$$ Bruker specific parameters
$$ --------------------------
##$DU= <C:/Bruker/XWIN-NMR>
##$EXPNO= 1
##$NAME= <H-C>
##$PROCNO= 1
##$TYPE= <nmr>
##$USER= <yarkov2>
##$AMP= (0..31)
100 100 100 100 100 100 100 100 100 100 100 100 100 100 100 100 100 100 
100 100 100 100 100 100 100 100 100 100 100 100 100 100 
##$AQSEQ= 0
##$AQ_mod= 1
##$AUNM= <au_zg>
##$AUTOPOS= <>
##$BF1= 200.13
##$BF2= 200.13
##$BF3= 200.13
##$BF4= 200.13
##$BF5= 200.13
##$BF6= 200.13
##$BF7= 200.13
##$BF8= 200.13
##$BYTORDA= 1
##$CFDGTYP= 0
##$CFRGTYP= 5
##$CHEMSTR= <none>
##$CNST= (0..31)
1 1 145 1 1 1 1 1 1 1 1 1 1 1 1 1 1 1 1 1 1 1 1 1 1 1 1 1 1 1 1 1 
##$CPDPRG= <>
##$CPDPRG1= <>
##$CPDPRG2= <>
##$CPDPRG3= <>
##$CPDPRG4= <mlev>
##$CPDPRG5= <mlev>
##$CPDPRG6= <mlev>
##$CPDPRG7= <mlev>
##$CPDPRG8= <mlev>
##$CPDPRGB= <>
##$CPDPRGT= <>
##$D= (0..31)
0 0.7 0 0 0 0 0 0 0 0 0 0.03 0 0 0 0 0 0 0 0 0 0 0 0 0 0 0 0 0 0 0 0 
##$DATE= 1782376720
##$DBL= (0..7)
120 120 120 120 120 120 120 120 
##$DBP= (0..7)
150 150 150 150 150 150 150 150 
##$DBP07= 0
##$DBPNAM0= <>
##$DBPNAM1= <>
##$DBPNAM2= <>
##$DBPNAM3= <>
##$DBPNAM4= <>
##$DBPNAM5= <>
##$DBPNAM6= <>
##$DBPNAM7= <>
##$DBPOAL= (0..7)
0.5 0.5 0.5 0.5 0.5 0.5 0.5 0.5 
##$DBPOFFS= (0..7)
0 0 0 0 0 0 0 0 
##$DE= 6
$$ [...]
##$SUBNAM3= <"">
##$SUBNAM4= <"">
##$SUBNAM5= <"">
##$SUBNAM6= <"">
##$SUBNAM7= <"">
##$SUBNAM8= <"">
##$SUBNAM9= <"">
##$SW= 18.0517328524113
##$SWIBOX= (0..15)
0 0 2 0 0 0 0 0 0 0 0 0 0 0 0 0 
##$SW_h= 3612.71676300578
##$TD= 16384
##$TD0= 1
##$TE= 0
##$TE2= 300
##$TE3= 300
##$TEG= 300
##$TL= (0..7)
0 120 120 120 120 120 120 120 
##$TP= (0..7)
150 150 150 150 150 150 150 150 
##$TP07= 0
##$TPNAME0= <>
##$TPNAME1= <>
##$TPNAME2= <>
##$TPNAME3= <>
##$TPNAME4= <>
##$TPNAME5= <>
##$TPNAME6= <>
##$TPNAME7= <>
##$TPOAL= (0..7)
0.5 0.5 0.5 0.5 0.5 0.5 0.5 0.5 
##$TPOFFS= (0..7)
0 0 0 0 0 0 0 0 
##$TUNHIN= 0
##$TUNHOUT= 0
##$TUNXOUT= 0
##$USERA1= <user>
##$USERA2= <user>
##$USERA3= <user>
##$USERA4= <user>
##$USERA5= <user>
##$V9= 5
##$VALIST= <valist>
##$VCLIST= <CCCCCCCCCCCCCCC>
##$VD= 0
##$VDLIST= <DDDDDDDDDDDDDDD>
##$VPLIST= <PPPPPPPPPPPPPPP>
##$VTLIST= <TTTTTTTTTTTTTTT>
##$WBST= 1024
##$WBSW= 4
##$XGAIN= (0..3)
0 0 0 0 
##$XL= 0
##$YL= 0
##$YMAX_a= 141871
##$YMIN_a= -217523
##$ZGOPTNS= <>
##$ZL1= 120
##$ZL2= 120
##$ZL3= 120
##$ZL4= 120
##$ABSF1= 15.55959
##$ABSF2= -2.492261
##$ABSG= 5
##$ABSL= 3
##$ALPHA= 0
##$AQORDER= 0
##$ASSFAC= 0
##$ASSFACI= 0
##$ASSFACX= 0
##$ASSWID= 0
##$AUNMP= <proc_1d>
##$AZFE= 0.1
##$AZFW= 0.1
##$BCFW= 0
##$BC_mod= 2
##$BYTORDP= 0
##$COROFFS= 0
##$CY= -3
##$DATMOD= 1
##$DC= 0
##$DFILT= <>
##$DTYPP= 0
##$F1P= 0
##$F2P= 0
##$FCOR= 1
##$FTSIZE= 16384
##$FT_mod= 6
##$GAMMA= 0
##$GB= 0
##$INTBC= 1
##$INTSCL= 3.241238e-09
##$ISEN= 128
##$LB= 0.25
##$LEV0= 0
##$LPBIN= 0
##$MAXI= 10000
##$MC2= 0
##$MEAN= 0
##$ME_mod= 0
##$MI= 1.114404
##$NCOEF= 0
##$NC_proc= -8
##$NLEV= 6
##$NOISF1= 3.799351
##$NOISF2= 2.8
##$NSP= 0
##$NTH_PI= 0
##$NZP= 0
##$OFFSET= 15.49017
##$PC= 1
##$PHC0= -6900.419
##$PHC1= 13.42196
##$PH_mod= 1
##$PKNL= yes
##$PPARMOD= 0
##$PSCAL= 0
##$PSIGN= 0
##$REVERSE= no
##$SF= 200.130006311051
##$SI= 16384
##$SIGF1= 3
##$SIGF2= 2
##$SINO= 0.751879
##$SIOLD= 32768
##$SREGLST= <19F.Aceton>
##$SSB= 0
##$STSI= 16384
##$STSR= 0
##$SW_p= 3612.71676300578
##$SYMM= 0
##$S_DEV= 0
##$TDeff= 16384
##$TDoff= 0
##$TI= <>
##$TILT= no
##$TM1= 0
##$TM2= 0
##$TOPLEV= 0
##$USERP1= <user>
##$USERP2= <user>
##$USERP3= <user>
##$USERP4= <user>
##$USERP5= <user>
##$WDW= 1
##$XDIM= 16384
##$YMAX_p= 288138787
##$YMIN_p= -586405
$$ End of Bruker specific parameters
$$ ---------------------------------
##NTUPLES= NMR SPECTRUM
##VAR_NAME=  FREQUENCY,     SPECTRUM/REAL,   SPECTRUM/IMAG
##SYMBOL=    X,             R,               I
##VAR_TYPE=  INDEPENDENT,   DEPENDENT,       DEPENDENT
##VAR_FORM=  AFFN,          ASDF,            ASDF
##VAR_DIM=   16384,         16384,           16384
##UNITS=     HZ,            ARBITRARY UNITS, ARBITRARY UNITS
##FACTOR=    0.220516191357247, 1,           1
##FIRST=     3100.04772482682, 0,            0
##LAST=      -512.669038178964, 0,           0
##MIN=       -512.669038178964, -586405,     0
##MAX=       3100.04772482682, 288138787,    0
$$ Real data points
##PAGE= N=1
##DATA TABLE= (X++(R..R)), XYDATA
$$ [...]
$$ plain form
7952 16219913 15285412 14186839 13091499 12172096 11335661 10334690 9233963 8195042 7303840
7943 7303840 6467825 5683369 4944324 4402750 3806686 3237389 2887071 2647170 2458409 2252911
7933 2252911 2044750 2096726 1837785 1643013 1446783 1359005 1177405 1068394 970070 1007903
7923 1007903 1015676 820070 716249 817146 771366 683941 585663 494715 512133 664230 590931
7912 590931 516299 441532 393883 356441 278777 320888 285601 285162 357462 379653 226376 61486
7900 61486 -10807 121649 292731 329929 274327 213463 158800 259412 316547 382426 363957
7889 363957 119639 229110 272208 215469 309509 292760 233096 113623 151980 98808 172123
7878 172123 316934 87737 -78619 114041 86696 -9664 -24216 -72878 -91431 18118 84599
$$ packed form
7952A6219913r34501j098573j095340r19403q36435j000971j100727j038921q91202
7943G303840q36015p84456p39045n41574n96064n69297l50318k39901j88761k05498
7933B252911k08161N1976k58941j94772j96230q7778j81600j09011r8324L7833
7923A007903P773j95606j03821J00897m5780q7425r8278r0948J7418J52097p3299
7912E90931p4632p4767m7649l7442p7664M2111l5287m39P2300K2191j53277j64890
7900F1486p2293J32456J71082L7198n5602o0864n4663J00612N7135O5879j8469
7889C63957k44318J09471M3098n6739R4040j6749n9664j19473L8357n3172P3315
7878A72123J44811k29197j66356J92660k7345r6360j4552m8662j8553J09549O6481
$$ plain form
7867 84599 34056 -49855 11578 -7865 67562 2162 -135637 -159810 -94525 -46483 70161
7856 70161 156193 173341 68033 29374 8948 45786 79059 105996 42586 54704 158445
7845 158445 199234 301173 305518 201329 419591 481796 498021 390596 374058 528264 582759
7834 582759 752373 739477 872903 1133520 1208695 1230541 1252610 1243138 1210696 1231981 1325306
7823 1325306 1138752 1168854 1134307 1038672 906098 920347 696886 774348 617285 544125 537999
7812 537999 530975 467487 421862 506062 472856 494527 634566 510283 1380223 586546 -419365
7801 -419365 -113878 -77194 180563 111035 194782 328380 364317 429991 541867 607614 652216
7790 652216 728237 878937 821077 883468 1007620 1264673 1180657 992980 1027007 1118313 1137774
$$ packed form
7867H4599n0543q3911O1433j9443P5427o5400j37799k4173O5285M8042J16644
7856G0161Q6032J7148j05308l8659k0426L6838L3273K6937o3410J2118J03741
7845A58445M0789J01939M345j04189K18262O2205J6225j07425j6538J54206N4495
7834E82759J69614j2896J33426K60617P5175K1846K2069r472l2442K1285R3325
7823A325306j86554L0102l4547r5635j32574J4249k23461P7462j57063p3160o126
7812E37999p024o3488m5625Q4200l3206K1671J40039j24283Q69940p93677j005911
7801d19365L05487L6684K57757o9528Q3747J33598L5937O5674J11876O5747M4602
7790F52216P6021J50700n7860O2391J24152K57053q4016j87677L4027R1306J9461
$$ plain form
7779 1137774 1050490 1104114 1206368 1159722 1151942 1079608 1157130 1079758 1011204 816450 545658
7768 545658 523964 516990 499189 428432 485344 558111 543024 530939 418236 398769 188940
7757 188940 123788 250498 150360 255887 373105 289007 434764 467607 478128 602133
7747 602133 615541 560433 677832 834225 952140 959981 1022587 1099177 1101758 946151 778337
7736 778337 699128 788019 700534 754426 662339 684026 774353 651931 626187 748392 615634
7725 615634 542769 459066 619387 591577 578621 517834 315540 343535 303098 408911 562629
7714 562629 586943 709429 902154 1123652 1128755 951688 779305 749703 792527 665910 722398
7703 722398 647896 424222 300324 410152 398557 344365 304606 326778 358994 392508 305147
$$ packed form
7779A137774q7284N3624J02254m6646p780p2334P7522p7372o8554j94754k70792
7768E45658k1694o974j7801p0757N6912P2767j5087j2085j12703j9467k09829
7757A88940o5152J26710j00138J05527J17218q4098J45757L2843J0521J24005
7747F02133J3408n5108J17399J56393J17915P841O2606P6590K581j55607j67814
7736G78337p9209Q8891q7485N3892r2087K1687R0327j22422k5744J22205j32758
7725F15634p2865q3703J60321k7810j2956o0787k02294K7995m0437J05813J53718
7714E62629K4314J22486J92725K21498N103j77067j72383k9602M2824j26617N6488
7703G22398p4502k23674j23898J09828j1595n4192l9759K2172L2216L3514q7361
$$ plain form
7692 305147 280907 233461 292708 329209 385242 401862 379250 313267 312487 316499 326953 424955
7680 424955 413171 362299 487792 424713 405485 438660 325311 382138 448184 542751 503689
7669 503689 336996 475621 386069 435712 494185 565494 577680 613885 671858 717598 702400
7658 702400 838827 929540 1069818 1180012 1064639 1098949 1015045 1192948 1277242 1212555 1256900
7647 1256900 1215176 1203700 1256346 1157492 1034069 1004866 971723 961894 899887 808817 838620
7636 838620 732354 625411 574386 637591 633798 512104 375035 338588 214576 145718 222428
7625 222428 174267 338564 304730 149315 164650 234261 136596 165579 106929 47341 124261
7614 124261 164119 160199 169337 194866 200269 255347 112370 26320 245744 202937 164780 202329
$$ packed form
7692C05147k4240m7446N9247L6501N6033J6620k2612o5983p80M012J0454R8002
7680D24955j1784n0872J25493o3079j9228L3175j13349N6827O6046R4567l9062
7669E03689j66693J38625q9552M9643N8473P1309J2186L6205N7973M5740j5198
7658G02400J36427R0713J40278J10194j15373L4310q3904J77903Q4294o4687M4345
7647A256900m1724j1476N2646r8854j23423k9203l3143r829o2007r1070K9803
7636H38620j06266j06943n1025O3205l793j21694j37069l6447j24012o8858P6710
7625B22428m8161J64297l3834j55415J5335O9611r7665K8983n8650n9588P6920
7614A24261L9858l920R138K5529N403N5078j42977q6050K19424m2807l8157L7549
$$ plain form
7602 202329 145832 227033 211549 -12334 8828 78479 35524 12162 -14863 -105990 -7262
7591 -7262 143330 204585 145246 35049 -5631 133261 274353 249980 159478 25326 74686
7580 74686 121714 233020 304822 284964 353980 548889 536923 441889 409978 485887 531044
7569 531044 585699 643752 677053 604921 537427 641739 644747 563963 389948 268105 319643
7558 319643 275469 306466 184738 123373 118055 164652 227870 316975 201665 143480 44952
7547 44952 -34737 86766 189309 119156 -37865 -26262 41064 79297 246561 273774 200416
7536 200416 181470 233038 211305 95736 90599 92597 96033 55580 -31697 67237 27774 40056
7524 40056 115514 50110 53014 88675 68225 179984 227287 219039 134990 129363 148703 236017
$$ packed form
7602B02329n6497Q1201j5484k23883K1162O9651m2955k3362k7025r1127R8728
7591g262J50592O1255n9339j10197m0680J38892J41092k4373r0502j34152M9360
7580G4686M7028J11306P1802j9858O9016J94909j1966r5034l1911P5909M5157
7569E31044N4655N8053L3301p2132o7494J04312L008q0784j74015j21843N1538
7558C19643m4174L0997j21728o1365n318M6597O3218Q9105j15310n8185r8528
7547D4952p9689J21503J02543p0153j57021J1603O7326L8233J67264K7213p3358
7536B00416j8946N1568k1733j15569n137J998L436m0453q7277R8934l9463J2282
7524D0056P5458o5404K904L5661k0450J11759M7303q248q4049n627J9340Q7314
$$ plain form
7512 236017 -11532 -157270 72272 151063 160873 147135 95945 43690 192235 230224 210521
7501 210521 186022 233223 167834 122938 255069 136682 110331 163417 99770 115310 56598
7490 56598 98235 163271 115178 126426 27773 -57061 137653 214559 367334 433468 241173
7479 241173 243233 172869 121778 232244 183585 341495 341872 423767 499327 579374 550771 673456
7467 673456 771754 754480 820843 798526 793680 855624 847901 802839 794368 703013 654692 526548
7455 526548 526230 493284 483926 491113 440264 439469 425851 420163 380486 237469 207183 241734 353898
7442 353898 360284 381397 517776 503461 564362 522293 647022 656021 574732 569390 637625 748686
7430 748686 740521 646029 585712 600078 668464 587390 634145 751483 818974 828036 882979 852709
$$ packed form
7512B36017k47549j45738K29542P8791R810j3738n1190n2255J48545L7989j9703
7501B10521k4499M7201o5389m4896J32131j18387k6351N3086o3647J5540n8712
7490E6598M1637O5036m8093J1248r8653q4834J94714P6906J52775O6134j92295
7479B41173K060p0364n1091J10466m8659J57910L77Q1895P5560Q0047k8603J22685
7467F73456R8298j7274O6363k2317m846O1944p723m5062q471r1355m8321j28144
7455E26548l18l2946r358P187n0849p95j3618n688l9677j43017l0286L4551J12164
7442C53898O386K1113J36379j4315O0901m2069J24729Q999q1289n342O8235J11061
7430G48686q165r4492o0317J4366O8386q1074M6755J17338O7491R062N4943l0270
$$ plain form
7418 852709 847631 846119 896527 967809 1008367 977948 934123 922249 1024535 1273883 1330364 1265141
7406 1265141 1214286 1417573 1390394 1246021 1328987 1285539 1266483 1273589 1189577 1206893 1227846
7395 1227846 1247406 1357873 1436955 1356743 1375790 1599246 1754206 1739421 1650161 1658781 1711532
7384 1711532 1798543 2015495 2070706 2094642 2216346 2346621 2399364 2457713 2615450 2627992 2766905
7373 2766905 2831065 2953857 2867642 2787266 2821411 2711777 2796199 2910446 3085943 3158631 3111942
7362 3111942 3093876 3133719 3285441 3305803 3396030 3331742 3101099 3163719 3196891 3095348 2914820
7351 2914820 2968120 2965490 2915368 2829224 2770192 2785258 2623009 2698163 2750931 2692056 2676277
7340 2676277 2588070 2759413 2676687 2778650 2873639 2915840 2946579 3027766 3026680 3037637 3201109
$$ packed form
7418H52709n078j512N0408P1282M0558l0419m3825j1874J02286K49348N6481o5223
7406A265141n0855K03287k7179j44373Q2966m3448j9056P106q4012J7316K0953
7395A227846J9560J10467P9082q0212J9047K23456J54960j4785q9260Q620N2751
7384A711532Q7011K16952N5211K3936J21704J30275N2743N8349J57737J2542J38913
7373B766905O4160J22792q6215q0376L4145j09634Q4422J14247J75497P2688m6689
7362C111942j8066L9843J51722K0362R0227o4288k30643O2620L3172j01543j80528
7351B914820N3300k630n0122q6144n9032J5066j62249P5154N2768n8875j5779
7340B676277q8207J71343q2726J01963R4989M2201L0739Q1187j086J0957J63472
$$ plain form
7329 3201109 3233158 3367947 3400315 3404144 3557243 3761681 3929585 4092324 4251633 4490697
7319 4490697 4808278 4943824 5468097 5865205 6163652 6663067 7236822 7894268 8770857 9779320
7309 9779320 10935317 12346040 14166196 16216467 18555152 21779330 26629898 33701529
7301 33701529 43291819 52361927 55662471 52866431 48269216 44507324 40644106 35871755
7293 35871755 31000291 26590939 22823378 19601627 17079587 15433355 14382109 13854551
7285 13854551 13613847 13619297 14209966 15345662 16332250 16854048 16673938 15869811 14938858 13963373
7275 13963373 12937816 11946340 10979626 10079710 9389671 8855448 8386198 8026154 7861498
7266 7861498 7649682 7332362 7168788 6931391 7006783 7153909 7207966 7195414 6965646 6721004
$$ packed form
7329C201109L2049J34789L2368L829J53099K04438J67904J62739J59309K39064
7319D490697L17581J35546N24273L97108K98447M99415N73755O57446Q76589J008463
7309I779320J155997J410723J820156K050271K338685L224178M850568P071631
7301C3701529R590290R070108L300544k796040m597215l761892l863218m772351
7293C5871755m871464m409352l767561l221751k522040j646232j051246n27558
7285A3854551k40704N450N90669J135696R86588N21798j80110q04127r30953r75485
7275A3963373j025557r91476r66714q99916o90039n34223m69250l60044j64656
7266G861498k11816l17320j63574k37397P5392J47126N4057j2552k29768k44642
$$ plain form
7256 6721004 6506683 6130817 5817958 5405564 5078467 4653038 4303008 3946444 3395715 3123762
7246 3123762 2972548 2878157 2685051 2598910 2458999 2280913 2067304 1965601 1950212 1815233
7236 1815233 1834273 1897401 1992381 1962779 1922918 1940011 2048909 2018626 2014066 1970298 1938758
7225 1938758 2008550 2169688 2239161 2403186 2684082 3001308 2991183 2853057 2787993 2665162
7215 2665162 2520553 2520095 2412679 2536780 2626319 2669833 2773610 2887611 2862802 2638300 2545853
7204 2545853 2375944 2209666 2057361 2020816 1962216 1799732 1606006 1665936 1714554 1736769
7194 1736769 1764683 1621671 1627425 1690018 1827208 1837790 1854847 1814077 1830758 2057776 1969606
7183 1969606 1844837 2045844 2161838 2196755 2237218 2398552 2655813 2826517 3150457 3503671
$$ packed form
7256F721004k14321l75866l12859m12394l27097m25429l50030l56564n50729k71953
7246C123762j51214r4391j93106q6141j39911j78086k13609j01703j5389j34979
7236A815233J9040O3128R4980k9602l9861J7093J08898l0283m560m3768l1540
7225A938758O9792J61138O9473J64025K80896L17226j0125j38126o5064j22831
7215B665162j44609m58j07416J24101Q9539M3514J03777J14001k4809k24502r2447
7204B545853j69909j66278j52305l6545n8600j62484j93726N9930M8618K2215
7194A736769K7914j43012N754O2593J37190J0582J7057m0770J6681K27018q8170
7183A969606j24769K01007J15994L4917M0463J61334K57261J70704L23940L53214
$$ plain form
7173 3503671 3902671 4444580 5017569 5735255 6567034 7338323 8098928 8621002 9067619 9637537
7163 9637537 9985776 10037556 9800846 9413739 8808975 8014201 7295684 6605851 5905453 5238068
7153 5238068 4572900 4020922 3663789 3327167 3042040 2816750 2582342 2321040 2204079 1994034
7143 1994034 1923856 1789072 1612724 1585936 1621468 1385786 1395791 1309330 1343658 1387945 1430973
7132 1430973 1302073 1275914 1356425 1255129 1192636 1199646 1157719 942737 826629 954597 952286
7121 952286 937502 1043713 909046 793881 1046172 1091226 1075856 1306473 1348912 1377618 1357272
7110 1357272 1423626 1590572 1587169 1698336 1836939 1933501 1905321 2119863 2248709 2324885 2459980
7099 2459980 2466871 2563063 2480030 2383733 2320396 2263990 2077450 1692124 1641727 1720203 1485149
$$ packed form
7173C503671L99000N41909N72989P17686Q31779P71289P60605N22074M46617N69918
7163I637537L48239N1780k36710l87107o04764p94774p18517o89833p00398o67385
7153E238068o65168n51978l57133l36622k85127k25290k34408k61302j16961k10045
7143A994034p0178j34784j76348k6788L5532k35682J0005q6461L4328M4287M3028
7132A430973j28900k6159Q0511j01296o2493P010m1927k14982j16108J27968k311
7121I52286j4784J06211j34667j15165K52291M5054j5370K30617M2439K8706k0346
7110A357272O6354J66946l403J11167J38603R6562k8180K14542J28846P6176J35095
7099B459980O891R6192q3033r6297o3337n6406j86540l85326n0397P8476k35054
$$ plain form
7088 1485149 1531692 1367102 1462020 1492230 1450385 1399519 1307493 1283308 1229287 1380584 1313439
7077 1313439 1264940 1201923 1154823 1133008 1047669 1022190 1002202 850316 783662 711939 552219
7066 552219 501698 536706 540617 733584 740487 575406 618036 503976 668488 702964 796672
7055 796672 903096 971596 1191876 1177430 1076872 1036761 1011187 920826 908546 803204 680471
7044 680471 814501 853047 669468 487917 524686 431448 444186 552785 635093 494481 405564
7033 405564 367439 378936 488605 488847 471753 466516 457744 431069 449728 633106 734591 624468
7021 624468 554887 540318 500790 502784 482630 489375 535908 564777 557209 461209 486142 570486
7009 570486 580227 566457 574626 592676 567054 623646 817399 790288 811882 889003 782608 768085
$$ packed form
7088A485149M6543j64590R4918L0210m1845n0866r2026k4185n4021J51297o7145
7077A313439m8499o3017m7100k1815q5339k5479j9988j51886o6654p1723j59720
7066E52219n0521L5008L911J92967O903j65081M2630j14060J64512L4476R3708
7055G96672J06424O8500K20280j4446j00558m0111k5574r0361j2280j05342j22733
7044F80471J34030L8546j83579j81551L6769r3238J2738J08599Q2308j40612q8917
7033D05564l8125J1497J09669K42j7094n237q772k6675J8659J83378J01485j10123
7021F24468o9581j4569l9528J994k0154O745M6533K8869p568r6000K4933Q4344
7009E70486R741j3770Q169J8050k5622N6592J93753k7111K1594P7121j06395j4523
$$ plain form
6997 768085 883380 898059 873107 943245 942383 1003745 1060655 1157772 1292404 1534527 1555781
6986 1555781 1554011 1522618 1607803 1592998 1510056 1750180 1777409 1878891 1853621 1980437 2334072
6975 2334072 2514606 2905475 3278116 3725219 4203147 4594185 5118705 5743046 6235611 6602306
6965 6602306 6682480 6545110 6094477 5505330 5161441 4591278 4128163 3599910 3128559 2780134
6955 2780134 2430546 2214169 2166925 2160399 2143023 2085252 2125148 1910581 1705417 1713142 1766394
6944 1766394 1820958 1869327 1857245 1964821 2176341 2162336 2214657 2338203 2311824 2148350 2036174
6933 2036174 2000512 1715562 1623771 1398202 1422048 1345192 1205485 1116694 1071371 986188 850122
6922 850122 803373 620411 576591 576769 573021 515720 530251 549387 552756 570433 331266 306170
$$ packed form
6997G68085J15295J4679k4952P0138q62O1362N6910R7117J34632K42123K1254
6986A555781j770l1393Q5185j4805q2942K40124K7229J01482k5270J26816L53635
6975B334072J80534L90869L72641M47103M77928L91038N24520O24341M92565L66695
6965F602306Q0174j37370m50633n89147l43889n70163m63115n28253m71351l48425
6955B780134l49588k16377m7244o526j7376n7771L9896k14567k05164P725N3252
6944A766394N4564M8369j2082J07576K11520j4005N2321J23546k6379j63474j12176
6933B036174l5662k84950r1791k25569K3846p6856j39707q8791m5323q5183j36066
6922H50122m6749j82962m3820J78l748n7301J4531J9136L369J7677k39167k5096
$$ plain form
6910 306170 355726 503208 552784 569587 506743 280654 255028 328437 259616 217772 267346
6899 267346 249066 253836 200288 297579 399268 488038 407700 441267 532652 466993 467846 536072
6887 536072 465936 544744 501853 457306 466902 365332 361723 314413 323046 439322 446128 280695
6875 280695 109004 207117 198164 241036 114144 208428 159705 242262 315454 185405 156877
6864 156877 151686 160014 201794 329478 370094 319818 269210 203695 250623 292679 418541 424777
6852 424777 301354 214358 258808 309684 312012 255422 167040 255460 358074 203037 293435
6841 293435 303176 280483 258858 306733 270757 108968 176505 184752 77221 50224 35274 -26921
6829 -26921 -24611 32852 144644 233171 245253 52860 120440 79977 171612 127863 121126 147468
$$ packed form
6910C06170M9556J47482M9576J6803o2844k26089k5626P3409o8821m1844M9574
6899B67346j8280M770n3548R7291J01689Q8770q0338L3567R1385o5659Q53O8226
6887E36072p0136P8808m2891m4547R596j01570l609m7310Q633J16276O806j65433
6875B80695j71691R8113q953M2872j26892R4284m8723Q2557P3192j30049k8528
6864A56877n191Q328M1780J27684M0616n0276n0608o5515M6928M2056J25862O236
6852D24777j23423q6996M4450N0876K328n6590q8382Q8420J02614j55037R0398
6841B93435R741k2693k1625M7875l5976j61789O7537Q247j07531k6997j4950o2195
6829b6921K310N7463J11792Q8527J2082j92393O7580m0463R1635m3749o737K6342
$$ plain form
6817 147468 -42952 -18300 85838 71105 99322 18758 100135 122549 17747 21792 77268
6806 77268 200651 181743 190577 165556 211798 226333 105879 115327 176324 220633 80483 194439
6794 194439 103278 79511 45901 18537 53475 203669 171855 140307 85646 132896 49308
6783 49308 132287 55103 7349 -37329 -852 -41656 -66998 -7445 -121705 28838 163627
6772 163627 159752 26778 94158 127554 164603 208458 324657 322211 329124 408128 403751 231978
6760 231978 360053 602168 771120 976895 1054557 968245 927598 958869 894777 844823 804120
6749 804120 821996 722300 596806 667925 648094 583332 517321 507045 468118 575188 632561
6738 632561 579293 598459 653670 664563 753523 726115 747126 881259 946496 810584 639435
$$ packed form
6817A47468j90420K4652J04138j4733K8217q0564Q1377K2414j04802M045N5476
6806G7268J23383j8908Q834k5021M6242J4535j20454R448O0997M4309j40150J13956
6794A94439r1161k3767l3610k7364L4938J50194l1814l1548n4661M7250q3588
6783D9308Q2979p7184m7754m4678L6477m0804k5342N9553j14260J50543J34789
6772A63627l875j32974O7380L3396L7049M3855J16199k446O913P9004m377j71773
6760B31978J28075K42115J68952K05775P7662q6312m0647L1271o4092m9954m0703
6749H04120J7876r9696j25494P1119j9831o4762o6011j0276l8927J07070N7373
6738F32561n3268J9166N5211J0893Q8960k7408K1011J34133O5237j35912j71149
$$ plain form
6727 639435 735415 906863 998995 1093422 934921 765163 590945 558216 536702 470816 423592
6716 423592 500312 398689 351310 314413 471504 688858 614525 440858 446700 487368 363905
6705 363905 356071 256892 230333 232056 198646 239429 305479 318202 193412 197906 299753 286852
6693 286852 176161 113673 108859 182473 141647 74801 31383 122195 161031 252410 160171 237760
6681 237760 308849 289724 344673 301246 296950 470425 536170 424475 484239 618839 488816
6670 488816 321763 390093 341609 404162 477713 344974 284645 381446 357674 268004 248556
6659 248556 288951 389851 416792 339760 243188 252659 315062 238865 196780 164879 264162 213877
6647 213877 130475 87462 138691 97725 192176 298698 312478 152807 215586 135255 94439
$$ packed form
6727F39435R5980J71448R2132R4427j58501j69758j74218l2729k1514o5886m7224
6716D23592P6720j01623m7379l6897J57091K17354p4333j73667N842M0668j23463
6705C63905p834r9179k6559J723l3410M0783O6050J2723j24790M494J01847j2901
6693B86852j10691o2488m814P3614m0826o6846m3418R0812L8836R1379r2239P7589
6681B37760P1089j9125N4949m3427m296J73475O5745j11695N9764J34600j30023
6670D88816j67053O8330m8484O2553P3551j32739o0329R6801k3772q9670j9448
6659B48556M0395J00900K6941p7032r6572R471O2403p6197m2085l1901R9283n0285
6647B13877q3402m3013N1229m0966R4451J06522J3780j59671O2779q0331m0816
$$ plain form
6636 94439 20142 44085 -29537 26589 85281 204255 209578 131427 124043 134645 134347 173950
6624 173950 258038 225856 201903 235253 272515 245375 232662 371270 427564 220444 186053
6613 186053 146946 160504 204422 229336 241511 221420 59453 35004 387661 476404 471001
6602 471001 526690 389197 177758 282712 263816 151051 208566 148708 44726 47234 223745
6591 223745 336292 351953 269387 67490 58204 11286 108666 215636 207593 236392 193528
6580 193528 181607 155814 135943 95781 166411 194072 189571 182422 160487 115814 230209 134347
6568 134347 142823 202233 287589 232428 202768 63278 135454 273859 87764 190606 244435
6557 244435 158848 226674 201293 330792 234598 116423 180069 258879 358992 373651 438017
$$ packed form
6636I4439p4297K3943p3622N6126N8692J18974N323p8151p384J0602k98L9603
6624A73950Q4088l2182k3953L3350L7262k7140j2713J38608N6294k07120l4391
6613A86053l9107J3558M3918K4914J2175k0091j61967k4449L52657Q8743n403
6602D71001N5689j37493k11439J04954j8896j12765N7515n9858j03982K508J76511
6591B23745J12547J5661q2566k01897r286m6918R7380J06970q043K8799m2864
6580A93528j1921k5793j9871m0162P0630K7661m501p149k1935m4673J14395r5862
6568A34347Q476N9410Q5356n5161k9660j39490P2176J38405j86095J02842N3829
6557B44435q5587O7826k5381J29499r6194j18175O3646P8810J00113J4659O4366
$$ plain form
6546 438017 367393 198570 179270 169474 263721 292992 348031 380742 237431 215495 189337
6535 189337 251815 213760 166881 159839 94168 56608 105648 277379 163988 228754 162139
6524 162139 200763 264931 296328 290664 67597 115642 -2476 -71158 -84966 18287 176251
6513 176251 -25323 8109 -23371 126960 224657 226768 177384 118745 133539 145422 71822
6502 71822 -127 10456 128636 95165 -18129 -34543 108527 170277 136249 166579 126654
6491 126654 275294 346490 238746 151982 173837 172841 245581 129808 141786 121352 262655
6480 262655 175847 168991 145450 111781 135351 215659 312635 267529 315173 409317 194537 221083
6468 221083 166195 349166 390922 238514 293360 223222 190138 172478 21135 -25689 164975
$$ packed form
6546D38017p0624j68823j9300r796R4247K9271N5039L2711j43311k1936k6158
6535A89337O2478l8055m6879p042o5671l7560M9040J71731j13391O4766o6615
6524A62139L8624O4168L1397n664k23067M8045j18118o8682j3808J03253J57964
6513A76251k01574L3432l1480J50331R7697K111m9384n8639J4794J1883p3600
6502G1822p1949J0583J18180l3471j13294j6414J43070O1750l4028L0330l9925
6491A26654J48640P1196j07744q6764K1855r96P2740j15773J1978k0434J41303
6480B62655q6808o856k3541l3669K3570Q0308R6976m5106M7644R4144k14780K6546
6468B21083n4888J82971M1756j52408N4846p0138l3084j7660j51343m6824J90664
$$ plain form
6457 164975 305322 271865 227746 254621 224688 178678 118750 103523 69581 139780 139394 206290
6445 206290 353407 358027 223839 378622 352258 203632 203943 293803 417082 377392 349922
6434 349922 270444 158534 180246 381859 425331 364349 294465 335532 427302 350615 475440
6423 475440 444351 432501 447578 438888 383977 380999 456049 541546 480801 503060 505897 308958
6411 308958 226983 189770 368175 362984 246243 319045 348758 334392 375257 349716 386201
6400 386201 372043 365441 447331 438810 432610 414790 403947 370554 374168 411615 532479 399344
6388 399344 126141 225718 389731 399713 281884 314614 408098 468358 486963 515058 564208
6377 564208 508484 531774 587381 471179 551340 556058 525859 590700 560016 502631 511494 557961
$$ packed form
6457A64975J40347l3457m4119K6875k9933m6010n9928j5227l3942P0199l86O6896
6445B06290J47117M620j34188J54783k6364j48626L11Q9860J23279l9690k7470
6434C49922p9478j11910K1712K01613M3472o0982o9884M1067R1770p6687J24825
6423D75440l1089j1850J5077q690n4911k978P5050Q5497o0745K2259K837j96939
6411C08958q1975l7213J78405n191j16741P2802K9713j4366M0865k5541L6485
6400C86201j4158o602Q1890q521o200j7820j0843l3393L614L7447J20864j33135
6388C99344k73203R9577J64013R982j17829L2730R3484O0260J8605K8095M9150
6377E64208n5724K3290N5607j16202Q0161M718l0199O4841l0684n7385Q863M6467
$$ plain form
6365 557961 512706 528473 662839 581339 575622 550826 599172 717660 601593 516588 591720
6354 591720 603415 570292 604186 451004 341095 575294 750887 474272 405809 536298
6344 536298 548273 469232 471061 509031 464136 370266 447447 590749 546164 527112 634968
6333 634968 696036 649370 705248 815299 766436 769852 668983 630455 616265 672511 698715
6322 698715 581701 675719 787128 796422 690225 673918 789422 846673 767587 775476 722567
6311 722567 646426 664189 711033 754457 695555 584170 665432 599308 802298 662181 553455
6300 553455 802491 759095 691466 688788 783312 705970 739780 765826 1043159 1031815 938679
6289 938679 886606 936761 994344 1075868 1064520 1182171 1188285 1139662 1172002 1235518 1268845 1239729
$$ packed form
6365E57961m5255J5767J34366q1500n717k4796M8346J18488j16067q5005P5132
6354E91720J1695l3123L3894j53182j09909K34199J75593k76615o8463J30489
6344E36298J1975p9041J829L7970m4895r3870P7181J43302m4585j9052J07856
6333F34968O1068m6666N5878J10051m8863L416j00869l8528j4190N6246K6204
6322F98715j17014R4018J11409R294j06197j6307J15504N7251p9086P889n2909
6311G22567p6141J7763M6844M3424n8902j11385Q1262o6124K02990j40117j08726
6300E53455K49036m3396o7629k678R4524p7342L3810K6046K77333j1344r3136
6289I38679n2073N0155N7583Q1524j1348J17651O114m8623L2340O3516L3327k9116
$$ plain form
6277 1239729 1303643 1322320 1284097 1262908 1199403 1094475 1112966 1272420 1336490 1253924 1291355
6266 1291355 1281020 1412857 1301074 1362882 1515005 1378421 1486803 1566386 1496468 1559714
6256 1559714 1765765 1810123 1790926 1939306 2062112 2100339 2245984 2423707 2552059 2667388
6246 2667388 2841560 2983110 3104466 3231724 3554847 3999007 4364598 4438208 4414200 4269791
6236 4269791 4237479 4310638 4393286 4435607 4462669 4457674 4397087 4481435 4454584 4275702 4124569
6225 4124569 4092156 3898662 3641386 3349808 3176557 2962669 2796731 2647243 2458718 2355367
6215 2355367 2334035 2366291 2256055 2213945 2272039 2404690 2432088 2179669 2073370 1980096 2094922
6204 2094922 2245132 2196511 2086202 2185208 2015581 1969518 2083056 2054262 1980500 2078908 2029979
$$ packed form
6277A239729O3914J8677l8223k1189o3505j04928J8491J59454O4070q2566L7431
6266A291355j0335J31837j11783O1808J52123j36584J08382P9583o9918O3246
6256A559714K06051M4358j9197J48380J22806L8227J45645J77723J28352J15329
6246B667388J74172J41550J21356J27258L23123M44160L65591P3610k4008j44409
6236D269791l2312P3159Q2648M2321K7062m995o0587Q4348k6851j78882j51133
6225D124569l2413j93494k57276k91578j73251k13888j65938j49488j88525j03351
6215B355367k1332L2256j10236m2110N8094J32651K7398k52419j06299r3274J14826
6204B094922J50210m8621j10309R9006j69627m6063J13538k8794p3762R8408m8929
$$ plain form
6193 2029979 2002996 2035156 1971508 1992339 2120365 2033694 2023774 2021096 2110774 2050126 2180236
6182 2180236 2257424 2063881 1984722 2101812 2054181 2229824 2314383 2361516 2405129 2206433 2240594
6171 2240594 2377710 2474609 2202584 2056109 1937148 1887828 1919558 1947288 1905665 1903976 1791605
6160 1791605 1912569 1875765 1815479 1802773 1882084 1874956 1755335 1822408 2070231 2061207 2046479
6149 2046479 2344771 2368226 2467017 2533209 2433709 2328596 2425146 2587849 2626886 2655911 2694335
6138 2694335 2907729 3035005 3188931 3230731 3209156 3120736 3103570 3131029 3067357 3050768 3136917
6127 3136917 3111986 3283477 3408838 3533799 3502962 3554856 3504991 3458975 3473034 3403525 3507129
6116 3507129 3647018 3511882 3481908 3516374 3635083 3866522 4011429 4054622 4040370 4102533
$$ packed form
6193B029979k6983L2160o3648K0831J28026q6671r920k678Q9678o0648J30110
6182B180236P7188j93543p9159J17090m7631J75643Q4559M7133M3613j98696L4161
6171B240594J37116R6899k72025j46475j18961m9320L1730K7730m1623j689j12371
6160A791605J20964l6804o0286j2706P9311p128j19621O7073K47823r024j4728
6149B046479K98292K3455R8791O6192r9500j05113R6550J62703L9037K9025L8424
6138B694335K13394J27276J53926M1800k1575q8420j7166K7459o3672j6589Q6149
6127C136917k4931J71491J25361J24961l0837N1894m9865m6016J4059o9509J03604
6116C507129J39889j35136k9974L4466J18709K31439J44907M3193j4252O2163
$$ plain form
6106 4102533 4188458 4273752 4385178 4397747 4270541 4194166 4063446 3861772 3792243 3944431
6096 3944431 3820045 3843247 3873757 3915974 4047480 4215386 4130797 4117478 4195164 4196278 4365870
6085 4365870 4336266 4455186 4402136 4305248 4193074 4174003 4272258 4130069 4099338 4120071 4234595
6074 4234595 4341446 4364114 4258196 4367680 4322264 4349408 4296673 4063641 4021116 3990515 3889215
6063 3889215 3828648 3838104 3898347 3896596 3851485 3973818 3966580 3993803 4071965 4170333 4209835 4177622
6051 4177622 4207303 4149170 4167554 4250786 4352212 4436196 4480218 4505784 4678964 4816742 4706912
6040 4706912 4805218 4748801 4844622 5093049 5048237 5160857 5216124 5283575 5435009 5643686 5887943
6029 5887943 6064317 6247717 6336088 6488854 6745334 6843583 6851983 6931857 7070472 7224002
$$ packed form
6106D102533Q5925Q5294J11426J2569j27206p6375j30720k01674o9529J52188
6096C944431j24386K3202L0510M2217J31506J67906q4589j3319P7686J114J69592
6085D365870k9604J18920n3050r6888j12174j9071R8255j42189l0731K0733J14524
6074D234595J06851K2668j05918J09484m5416K7144n2735k33032m2525l0601j01300
6063C889215o0567R456O0243j751m5111J22333p238K7223P8162R8368L9502l2213
6051D177622K9681n8133J8384Q3232J01426Q3984M4022K5566J73180J37778j09830
6040D706912R8306n6417R5821K48427m4812J12620N5267O7451J51434K08677K44257
6029E887943J76374J83400Q8371J52766K56480R8249Q400P9874J38615J53530
$$ plain form
6019 7224002 7323782 7361083 7489500 7392212 7645315 7809365 7875484 8229441 8273451 8313626 8309908
6008 8309908 8435997 8805657 8977399 9120780 9319410 9363300 9374001 9250895 9257087 9450343
5998 9450343 9439247 9458587 9521545 9721716 9945168 10065951 10191873 10333625 10609113 10932498
5988 10932498 11112712 11210925 11489416 11712136 11896158 12157477 12260022 12431503 12637559 12874170
5978 12874170 13182217 13520805 13660979 13942667 14376099 14729907 15255885 15744990 16437031
5969 16437031 17118659 17992819 18928146 20002857 21136106 22386901 23989503 25977854 28380748
5960 28380748 31034950 33858881 36412419 38003624 38776219 39071007 39231922 39314002 39362928
5951 39362928 39703000 40560065 41947198 43619518 45116871 46183786 46504140 46108934 45792997
$$ packed form
6019G224002R9780L7301J28417r7288K53103J64050O6119L53957M4010M0175l718
6008H309908J26089L69660J71742J43381J98630M3890J0701j23106O192J93256
5998I450343j1096J9340O2958K00171K23452J20783J25922J41752K75488L23385
5988A0932498J80214R8213K78491K22720J84022K61319J02545J71481K06056K36611
5978A2874170L08047L38588J40174K81688M33432L53808N25978M89105O92041
5969A6437031O81628Q74160R35327J074711J133249J250795J602602J988351K402894
5960B8380748K654202K823931K553538J591205P72595K94788J60915Q2080M8926
5951C9362928L40072Q57065J387133J672320J497353J066915L20354l95206l15937
$$ plain form
5942 45792997 45200236 44528723 44196285 43951393 44083696 44735489 45934610 47833955 50383122
5933 50383122 53723938 57680464 61478683 64991992 68109518 71000842 74304623 78310996
5925 78310996 83191860 89407190 97316967 107418971 119770652 133345902 145417109 153938876
5917 153938876 157864983 157791880 155513283 152295281 149016207 146633622 145699849 146735009
5909 146735009 149586755 152298128 152980925 150214954 144043569 135797903 126624408 116781268
5901 116781268 106696780 96576084 87094282 78399962 70858473 64285977 58879512 54178912
5893 54178912 50073541 46670936 43743898 41047468 38790480 36720291 34788981 33129525
5885 33129525 31590941 30240134 29057264 27900958 27013336 26342109 25527236 24671878 24131994
$$ packed form
5942D5792997n92761o71513l32438k44892J32303O51793J199121J899345K549167
5933E0383122L340816L956526L798219L513309L117526K891324L303781M006373
5925G8310996M880864O215330P909777J0102004J2351681J3575250J2071207Q521767
5917A53938876L926107p3103k278597l218002l279074k382585r33773J035160
5909A46735009K851746K711373O82797k765971o171385q245666r173495r843140
5901A16781268j0084488j0120696r481802q694320p541489o572496n406465m700600
5893E4178912m105371l402605k927038k696430k256988k070189j931310j659456
5885C3129525j538584j350807j182870j156306q87622o71227q14873q55358n39884
$$ plain form
5876 24131994 23588627 22975162 22468579 21971753 21288829 20771575 20411395 19872212 19358555
5867 19358555 18932732 18495913 18069452 17803220 17549227 17285632 16987637 16861072 16643787
5858 16643787 16559986 16522356 16631620 16457302 16411602 16520709 16506735 16495335 16546415 16630866 16680290
5847 16680290 16853468 17062713 17067502 17228375 17481887 17917052 18320517 18836164 19373087 19865175
5837 19865175 20492869 21194338 21666563 22257663 22817120 23407555 24003775 24533310 24890519
5828 24890519 24992485 25127391 25247469 25422608 25512269 25628267 25682367 25738653 26094022 26360698
5818 26360698 26598532 27018721 27453522 28089336 28704818 29452825 30261846 31111330 32059993
5809 32059993 33086536 34182667 35515064 36949840 38475421 40334847 42267407 44133644
$$ packed form
5876B4131994n43367o13465n06583m96826o82924n17254l60180n39183n13657
5867A9358555m25823m36819m26461k66232k53993k63595k97995j26565k17285
5858A6643787q3801l7630J09264j74318m5700J09107j3974j1400N1080Q4451M9424
5847A6680290J73178K09245M789J60873K53512M35165M03465N15647N36923M92088
5837A9865175O27694P01469M72225N91100N59457N90435N96220N29535L57209
5828B4890519J01966J34906J20078J75139Q9661J15998N4100N6286L55369K66676
5818B6360698K37834M20189M34801O35814O15482P48007Q09021Q49484R48663
5809C2059993J026543J096131J332397J434776J525581J859426J932560J866237
$$ plain form
5801 44133644 46137179 47871507 49372209 50478411 51184002 51934206 52837068 54068381 55637356
5792 55637356 57583469 60244219 63477724 67299561 72000432 77517875 84010603 91649446
5784 91649446 101049664 113055089 128751859 149661204 176103478 203354820 223275788
5777 223275788 232828775 237769917 245672905 255991612 261953967 256899381 241393370 222005140
5769 222005140 203062145 184725406 166519724 149465647 134382175 121416409 110453857
5762 110453857 101743262 95178060 90443561 87044164 84840504 83730935 83730119 84805476 87079691
5753 87079691 90641048 95970486 103420476 113524066 126051233 139301538 153001735 169947181
5745 169947181 192515026 214792995 226939451 224033541 212228698 198635245 184399169
$$ packed form
5801D4133644K003535J734328J500702J106202P05591P50204R02862J231313J568975
5792E5637356J946113K660750L233505L821837M700871N517443O492728P638843
5784I1649446R400218J2005425J5696770K0909345K6442274K7251342J9920968
5777B23275788R552987M941142P902988J0318707N962355n054586j5506011j9388230
5769B22005140j8942995j8336739j8205682j7054077j5083472j2965766j0962552
5762A10453857q710595o565202m734499l399397k203660j109569q16J075357K274215
5753H7079691L561357N329438P449990J0103590J2527167J3250305J3700197J6945446
5745A69947181K2567845K2277969J2146456k905910j1804843j3593453j4236076
$$ plain form
5738 184399169 169057114 152480066 136268647 121587223 108589183 97300457 88207739
5731 88207739 80771901 74792303 70020459 66193319 63124225 60634243 58704081 57302744
5723 57302744 56287660 55708502 55485801 55832877 56630286 57494813 58245272 58502100 58959643
5714 58959643 59793052 60960690 62568069 64203913 65496634 66698295 68241440 70399619
5706 70399619 73267387 77050926 81822999 88098305 96658823 108662693 125123830 144428756
5698 144428756 160129475 165954251 162193678 155105942 147996605 140314184 131827352 123463125
5690 123463125 116364392 111229992 107897823 106547480 107429273 110339709 115253207 121862100
5682 121862100 131380008 144547489 163223056 189643778 224406414 259139428 279177426
$$ packed form
5738A84399169j5342055j6577048j6211419j4681424j2998040j1288726r092718
5731H8207739p435838n979598m771844l827140l069094k489982j930162j401337
5723E7302744j015084n79158k22701L47076P97409Q64527P50459K56828M57543
5714E8959643Q33409J167638J607379J635844J292721J201661J543145K158179
5706G0399619K867768L783539M772073O275306Q560518J2003870J6461137J9304926
5698A44428756J5700719N824776l760573p087736p109337p682421q486832q364227
5690A23463125p098733n134400l332169j350343Q81793K910436M913498O608893
5682A21862100R517908J3167481J8675567K6420722L4762636L4733014K0037998
$$ plain form
5675 279177426 277086114 261356776 243036382 223653814 202278487 179022405 156561436
5668 156561436 136406922 118820063 103773978 91277038 81547379 73691696 67148921
5661 67148921 61360017 56372391 52058474 48176701 44803739 41667168 39181243 36924964
5653 36924964 34822875 32999371 31172718 29842725 28725147 27706928 26702526 25856466
5645 25856466 25108474 24175398 23349199 22377501 21596468 21058332 20520442 20088271 19882057
5636 19882057 19420587 19255555 19221455 19104301 19198308 19466556 19746750 20105386 20610072 20701288
5626 20701288 20629372 20621522 20555896 20270872 20021677 19609842 19041733 18405168 17780958 16966647
5616 16966647 16322198 15878063 15310734 14933770 14589500 14301789 14229672 14003450 13823462 13520080
$$ packed form
5675B79177426k091312j5729338j8320394j9382568k1375327k3256082k2460969
5668A56561436k0154514j7586859j5046085j2496940r729659p855683o542775
5661F7148921n788904m987626m313917l881773l372962l136571k485925k256279
5653C6924964k102089j823504j826653j329993j117578j018219j004402q46060
5645B5856466p47992r33076q26199r71698p81033n38136n37890m32171k06214
5636A9882057m61470j65032l4100j17154R4007K68248K80194L58636N04686R1216
5626B0701288p1916p850o5626k85024k49195m11835n68109o36565o24210q14311
5616A6966647o44449m44135n67329l76964l44270k87711p2117k26222j79988l03382
$$ plain form
5606 13520080 13384190 13102831 12794323 12633205 12292468 11986219 11700457 11331278 11085561
5597 11085561 10908155 10535265 10158150 10055103 9984496 9775202 9475702 9409122 9421179 9351653
5587 9351653 9047870 8677957 8635736 8563845 8421907 8233504 8271242 8181671 8158612 8184699 8023698
5576 8023698 7911476 8066503 8013426 7825531 7847228 7785097 7686203 7664582 7637268 7494036 7281433
5565 7281433 7015820 6898266 6847771 6676776 6515184 6342951 6330079 6305866 6321500 6212353
5555 6212353 6096309 6186497 6188576 6261907 6452235 6347691 6221941 6105590 5987914 5833062
5545 5833062 5625956 5440691 5219200 5150263 5030968 5060525 5055776 5043982 4889406 4709509
5535 4709509 4665456 4701102 4594853 4394129 4517215 4477114 4265823 4237744 4158719 3981563
$$ packed form
5606A3520080j35890k81359l08508j61118l40737l06249k85762l69179k45717
5597A1085561j77406l72890l77115j03047p0607k09294k99500o6580J2057o9526
5587I351653l03783l69913m2221p1891j41938j88403L7738q9571k3059K6087j61001
5576H023698j12222J55027n3077j87895K1697o2131r8894k1621k7314j43232k12603
5565G281433k65613j17554n0495j70995j61592j72233j2872k4213J5634j09147
5555F212353j16044R0188K079P3331J90328j04544j25750j16351j17676j54852
5545E833062k07106j85265k21491o8937j19295K9557m749j1794j54576j79897
5535D709509m4053L5646j06249k00724J23086m0101k11291k8079p9025j77156
$$ plain form
5525 3981563 3913364 3888099 3845613 3810976 3694265 3533009 3553623 3642465 3554940 3416190 3444181
5514 3444181 3365996 3305928 3230710 3144831 3022546 3095460 3091508 2980857 2917986 2825585 2877934
5503 2877934 3053045 3056498 2973020 3026920 3053951 2920326 2811444 2782328 2767333 2731376 2878951
5492 2878951 2940985 2830125 2803612 2784780 2733403 2662649 2739286 2723178 2819551 2968169 2937442
5481 2937442 2826314 2928811 2808520 2771915 2753588 2521128 2582439 2628225 2521250 2501331
5471 2501331 2613787 2591704 2641956 2588388 2562851 2524744 2622150 2656074 2728716 2753057 2655389
5460 2655389 2649031 2616913 2655704 2742617 2762021 2741935 2695481 2702361 2859829 2868241 2950473 3149144
5448 3149144 3304983 3370038 3444459 3476387 3691502 3822577 3815962 3851771 4074138 4132604 4216760
$$ packed form
5525C981563o8199k5265m2486l4637j16711j61256K0614Q8842q7525j38750K7991
5514C444181p8185o0068p5218q5879j22285P2914l952j10651o2871r2401N2349
5503B877934J75111L453q3478N3900K7031j33625j08882k9116j4995l5957J47575
5492B878951O2034j10860k6513j8832n1377p0754P6637j6108R6373J48618l0727
5481B937442j11128J02497j20291l6605j8327k32460O1311M5786j06975j9919
5471B501331J12456k2083N0252n3568k5537l8107R7406L3924P2642K4341r7668
5460B655389o358l2118L8791Q6913J9404k0086m6454O880J57468Q412Q2232J98671
5448C149144J55839O5055P4421L1928K15115J31075o615L5809K22367N8466Q4156
$$ plain form
5437 4216760 4271799 4377581 4314618 4099671 3853320 3890292 3825117 3801586 3710789 3598524 3539198
5426 3539198 3359269 3402862 3428775 3441018 3438327 3611652 3604859 3615227 3782877 3995276 4401201
5415 4401201 4582135 4887626 5189990 5478841 5958940 6283519 6710698 7174892 7706313 8626053
5405 8626053 9508093 10166567 10748650 11014740 10952644 10468078 9833452 9246496 8671010 8021860
5395 8021860 7452954 6772756 6010987 5601399 5270866 4888022 4624355 4466973 4360030 4132747
5385 4132747 4020795 3855940 3908092 3849189 3781727 3773054 3822381 3852056 3780985 3674157 3690212
5374 3690212 3705544 3648839 3726847 3801741 3688911 3611994 3682702 3828478 3822882 3853752 3878059
5363 3878059 4077413 3916346 3951902 4066141 4164732 4115829 4046811 4123296 4344196 4598744
$$ packed form
5437D216760N5039J05782o2963k14947k46351L6972o5175k3531r0797j12265n9326
5426C539198j79929M3593K5913J2243k691J73325o793J0368J67650K12399M05925
5415D401201J80934L05491L02364K88851M80099L24579M27179M64194N31421R19740
5405H626053Q82040O58474N82083K66090o2096m84566o34626n86956n75486o49150
5395H021860n68906o80198p61769m09588l30533l82844k63667j57382j06943k27283
5385D132747j11952j64855N2152n8903o7462q673M9327K9675p1071j06828J6055
5374C690212J5332n6705P8008P4894j12830p6917P0708J45776n596L0870K4307
5363C878059J99354j61067L5556J14239R8591m8903o9018P6485K20900K54548
$$ plain form
5353 4598744 4609929 4703323 4840764 5272228 5582884 6052511 6712311 7491327 8091374 8544951
5343 8544951 8712807 8658676 8280398 7839549 7348313 6958088 6356709 5808576 5339449 4947872
5333 4947872 4543512 4289669 4032163 3839132 3616879 3597617 3538175 3379455 3320200 3221467
5323 3221467 3081452 2892110 3024822 2999679 2890825 2829571 2787235 2796344 2771068 2749706 2642652
5312 2642652 2669775 2600211 2475524 2586153 2568500 2695602 2770644 2728660 2737987 2905126 2964212
5301 2964212 3067936 3294831 3499099 3702356 3846714 4018631 4155907 4055831 3878051 3877814
5291 3877814 3801502 3697396 3430694 3294839 3081717 3122348 3010619 2846812 2849120 2892384
5281 2892384 2861562 2920698 3018011 3134711 3124037 3049621 3159125 3126114 3189948 3246165 3358410
$$ packed form
5353D598744J1185R3394J37441M31464L10656M69627O59800P79016O00047M53577
5343H544951J67856n4131l78278m40849m91236l90225o01379n48133m69127l91577
5333D947872m04360k53843k57506j93031k22253j9262n9442j58720n9255r8733
5323C221467j40015j89342J32712k5143j08854o1254m2336R109k5276k1362j07054
5312B642652K7123o9564j24687J10629j7653J27102P5042m1984R327J67139N9086
5301B964212J03724K26895K04268K03257J44358J71917J37276j00076j77780k37
5291C877814p6312j04106k66702j35855k13122M0631j11729j63807K308M3264
5281B892384l0822N9136R7313J16700j0674p4416J09504l3011O3834N6217J12245
$$ plain form
5270 3358410 3288475 3454128 3489846 3331087 3368665 3400472 3242793 3236772 3312955 3346754 3418610
5259 3418610 3491597 3372825 3416946 3474496 3497539 3533644 3458282 3300421 3313715 3212343 3094524
5248 3094524 3201632 3252241 3060006 3126830 3230072 3283991 3190338 3116908 3208271 3190781 3072424
5237 3072424 3080339 3051108 2948258 2926549 2904614 2916396 2972393 2941917 2954538 3040468 2957557
5226 2957557 2963907 2962003 2846800 2672489 2642809 2750375 2884535 2818526 2849719 2871307 2870923
5215 2870923 2828044 2770737 2756018 2868541 2953328 2989927 3018177 3064199 3131414 3160410 3288944
5204 3288944 3318766 3282397 3293001 3283751 3308104 3327995 3356527 3350595 3340189 3375699 3503871 3539555
5192 3539555 3573635 3693109 3758726 3896258 3991023 4029220 4127465 4079358 4060165 4016124 4056724
$$ packed form
5270C358410o9935J65653L5718j58759L7578L1807j57679o021P6183L3799P1856
5259C418610P2987j18772M4121N7550K3043L6105p5362j57861J3294j01372j17819
5248C094524J07108N0609j92235O6824J03242N3919r3653p3430R1363j7490j18357
5237C072424P915k9231j02850k1709k1935J1782N5997l0476J2621Q5930q2911
5226B957557O350j904j15203j74311k9680J07566J34160o6009L1193K1588l84
5215B870923m2879n7307j4719J12523Q4787L6599K8250M6022O7215K8996J28534
5204C288944K9822l6369J0604r250K4353J9891K8532n932j0406L5510J28172L5684
5192C539555L4080J19474O5617J37532R4765L8197R8245m8107j9193m4041M0600
$$ plain form
5181 4056724 4070198 4016754 4066402 3916624 4179096 4362720 4403443 4367854 4466133 4672636 4924311
5170 4924311 5069748 5131810 5482302 5935006 6172135 6175666 6153947 6211461 6055753 6043168 6142535
5159 6142535 6020878 5886690 5694514 5579280 5506034 5568357 5576868 5701456 5731474 5884469
5149 5884469 5902705 5986405 6114783 6272478 6339608 6469188 6518985 6633814 6805036 6706362
5139 6706362 6718600 6799729 6896607 7041130 7187686 7268369 7405961 7550818 7706933 7849074
5129 7849074 7982418 8225567 8418594 8637143 8791400 9109034 9292672 9502185 9726031 9779083
5119 9779083 9896933 10214905 10389803 10377507 10510563 10778978 11017648 11366683 11577194 11755604
5109 11755604 12192127 12450570 12790145 13061743 13245538 13458645 13866024 14213833 14554771
$$ packed form
5181D056724J3474n3444M9648j49778K62472J83624M0723l5589R8279K06503K51675
5170D924311J45437O2062L50492M52704K37129L531k1719N7514j55708j2585R9367
5159F142535j21657j34188j92176j15234p3246O2323Q511J24588L0018J52995
5149E884469J8236Q3700J28378J57695O7130J29580M9797J14829J71222r8674
5139F706362J2238Q1129R6878J44523J46556Q0683J37592J44857J56115J42141
5129G849074J33344K43149J93027K18549J54257L17634J83638K09513K23846N3052
5119I779083J17850L17972J74898j2296J33056K68415K38670L49035K10511J78410
5109A1755604M36523K58443L39575K71598J83795K13107M07379L47809L40938
$$ plain form
5100 14554771 14883594 15266928 15731583 16331774 16831337 17330808 17876661 18426912 19072280
5091 19072280 19778739 20578790 21429480 22198129 22900798 23659308 24549580 25541968 26590401
5082 26590401 27702591 28843681 29942202 31297562 32643307 33907731 35193816 36456592
5074 36456592 37618469 38775611 39785760 40772630 41774477 42622150 43350909 43881109 44178380
5065 44178380 44227568 44109900 43844122 43552401 43145525 42594289 42050141 41373598 40638054 39804651
5055 39804651 38826994 37785459 36691319 35790512 34813293 33726489 32613446 31815533 30925393
5046 30925393 30035921 29365467 28600233 27897460 27484488 26842884 26188003 25823676 25451697
5037 25451697 25161912 24915460 24654627 24530182 24312757 24138037 23940891 23876072 23821650 23703623
$$ packed form
5100A4554771L28823L83334M64655O00191M99563M99471N45853N50251O45368
5091A9072280P06459Q00051Q50690P68649P02669P58510Q90272R92388J048433
5082B6590401J112190J141090J098521J355360J345745J264424J286085J262776
5074C6456592J161877J157142J010149R86870J001847Q47673P28759N30200K97271
5065D4178380M9188j17668k65778k91721m06876n51236n44148o76543p35544q33403
5055C9804651r77657j041535j094140r00807r77219j086804j113043p97913q90140
5046C0925393q89472o70454p65234p02773m12972o41604o54881l64327l71979
5037B5451697k89785k46452k60833j24445k17425j74720j97146o4819n4422j18027
$$ plain form
5027 23703623 23766204 23688721 23760637 23871750 24110804 24433796 24633450 24722416 24871384 25000953
5017 25000953 25127719 25465992 25953051 26326360 27007553 27657581 28290865 28929237 29706985
5008 29706985 30498045 31408443 32743812 34288447 36025100 37991936 40329904 43206449
5000 43206449 46418929 50230596 54892806 60421426 66965220 74730948 83822759 94644140
4992 94644140 108215063 126066495 150811197 184075699 223094711 259276680 282466017
4985 282466017 288138787 277925692 258207723 235557746 211902258 187697321 163753121
4978 163753121 141162727 121280823 104653566 90794193 79762645 71111564 64094666
4971 64094666 58160500 53189703 48800898 44968324 41734626 38995716 36653617 34635709
$$ packed form
5027B3703623O2581p7483P1916J11113K39054L22992J99654Q8966J48968J29569
5017B5000953J26766L38273M87059L73309O81193O50028O33284O38372P77748
5008B9706985P91060R10398J335369J544635J736653J966836K337968K876545
5000D3206449L212480L811667M662210N528620O543794P765728R091811J0821381
4992I4644140J3570923J7851432K4744702L3264502L9019012L6181969K3189337
4985B82466017N672770j0213095j9717969k2649977k3655488k4204937k3944200
4978A63753121k2590394j9881904j6627257j3859373j1031548q651081p016898
4971F4094666n934166m970797m388805l832574l233698k738910k342099k017908
$$ plain form
4963 34635709 32923131 31434299 30217437 29255505 28228902 27414929 26874402 26287395 25552127
4954 25552127 24887975 24179041 23563302 22913735 22387394 22050632 21582612 21198480 20945477
4945 20945477 20590172 20102858 19862909 19626835 19356391 19264514 19141122 19140448 19158225 19034927
4935 19034927 19100560 18970174 18844577 18847108 18874753 18839641 18819410 18889465 19000465 18965712 18901574
4924 18901574 18985779 19079680 19144787 19303963 19523185 19770642 19999552 20267664 20620591 20901185
4914 20901185 21157326 21381628 21548823 21658696 21809491 22075804 22362618 22500649 22661256
4905 22661256 22946728 23213453 23491590 23899901 24247669 24462354 24574139 24953763 25071228
4896 25071228 25234145 25424708 25730742 26085255 26339095 26669864 26944858 27142388 27404997
$$ packed form
4963C4635709j712578j488832j216862r61932j026603q13973n40527n87007p35268
4954B5552127o64152p08934o15739o49567n26341l36762m68020l84132k53003
4945B0945477l55305m87314k39949k36074k70444r1877j23392o74J7777j23298
4935A9034927O5633j30386j25597K531K7645l5112k0231P0055J11000l4753o4138
4924A8901574Q4205R3901O5107J59176K19222K47457K28910K68112L52927K80594
4914B0901185K56141K24302J67195J09873J50795K66313K86814J38031J60607
4905B2661256K85472K66725K78137M08311L47768K14685J11785L79624J17465
4896B5071228J62917J90563L06034L54513K53840L30769K74994J97530K62609
$$ plain form
4887 27404997 27792287 28075449 28511693 29142994 29830006 30511990 31256516 32072994 32883154
4878 32883154 33838015 34969148 36142748 37388997 38837945 40641015 42643597 45041207
4870 45041207 47658454 50890186 54645098 59029900 64400446 70805636 78242853 87070596
4862 87070596 97963623 111844564 130539987 156729277 190452415 225656230 254605474
4855 254605474 273511465 281074458 274911909 256816462 234080697 210746741 187671913
4848 187671913 164717734 143286009 124359469 108618886 96094944 85955130 78213605
4841 78213605 72231013 67645221 63960186 60958951 58579226 56509267 54714438 53034154
4833 53034154 51551036 50414749 49521280 48934196 48849848 49052157 49438871 50302972 51617710
$$ packed form
4887B7404997L87290K83162M36244O31301O87012O81984P44526Q16478Q10160
4878C2883154R54861J131133J173600J246249J448948J803070K002582K397610
4870D5041207K617247L231732L754912M384802N370546O405190P437217Q827743
4862H7070596J0893027J3880941J8695423K6189290L3723138L5203815K8949244
4855B54605474J8905991P562993o162549j8095447k2735765k3333956k3074828
4848A87671913k2954179k1431725j8926540j5740583j2523942j0139814p741525
4841G8213605n982592m585792l685035l001235k379725k069959j794829j680284
4833E3034154j483118j136287q93469n87084q4348K02309L86714Q64101J314738
$$ plain form
4824 51617710 53451607 56076255 59402075 62028202 62560232 61011996 59190610 57551627
4816 57551627 56098078 54530682 52840831 51410283 50175649 49432332 48892560 48827380 49022030
4807 49022030 49465044 49975131 50674866 51576197 52571713 53863216 55120368 56495428 58138225
4798 58138225 59934742 62174991 64713233 67583335 71154008 75459758 80401765 85279228
4790 85279228 89757546 93332078 96012596 98058769 100096744 102145485 104726769 108332227
4782 108332227 113407580 120112277 127263348 132653994 134771803 133987560 132348054 130680859
4774 130680859 128788135 126756370 125122442 124233105 124168789 124427740 124503646 123999848 122881035
4765 122881035 121389244 119733829 118030698 116187865 114573139 113331002 112385730 111540492
$$ packed form
4824E1617710J833897K624648L325820K626127N32030j548236j821386j638983
4816E7551627j453549j567396j689851j430548j234634p43317n39772o5180J94650
4807D9022030M43014N10087O99735R01331R95516J291503J257152J375060J642797
4798E8138225J796517K240249K538242K870102L570673M305750M942007M877463
4790H5279228M478318L574532K680518K046173K037975K048741K581284L605458
4782A08332227N075353O704697P151071N390646K117809p84243j639506j667195
4774A30680859j892724k031765j633928q89337o4316K58951P5906n03798j118813
4765A22881035j491791j655415j703131j842833j614726j242137r45272q45238
$$ plain form
4757 111540492 110916126 110513529 110387632 110537400 110874521 111337491 111959778 112774243 113826977
4748 113826977 114995094 116169084 117581078 119145518 121037399 123324024 125498094 127338880
4740 127338880 128671131 130279645 132169424 134075040 136235625 138985603 142454629 146897402
4732 146897402 152289466 157506255 161360120 163631353 165240636 166723747 167972932 168868995
4724 168868995 169421307 170240395 171123028 172159240 172820772 173191948 173000384 172535746 171937772
4715 171937772 171790723 171447505 171206638 171265191 171291257 171410535 171606285 171795082 172094422 172689107
4705 172689107 173150574 173764834 174115462 174562729 174947055 175369475 175808170 176090839 176474736
4696 176474736 176698676 176989273 177396294 177710826 178423774 179595030 181342133 183173901 184132440
$$ packed form
4757A11540492o24366m02597j25897J49768L37121M62970O22287Q14465J052734
4748A13826977J168117J173990J411994J564440J891881K286625K174070J840786
4740A27338880J332251J608514J889779J905616K160585K749978L469026M442773
4732A46897402N392064N216789L853865K271233J609283J483111J249185Q96063
4724A68868995N52312Q19088Q82633J036212O61532L71176j91564m64638n97974
4715A71937772j47049l43218k40867N8553K6066J19278J95750J88797K99340N94685
4705A72689107M61467O14260L50628M47267L84326M22420M38695K82669L83897
4696A76474736K23940K90597M07021L14532P12948J171256J747103J831768R58539
$$ plain form
4687 184132440 183590443 181934264 179575642 176858302 173879194 171064105 168537717 166468577
4679 166468577 165200584 164206250 163263124 161238089 157850952 153407801 148618446 143787416
4671 143787416 138624970 133680322 128890757 124674527 120893898 117412337 114305164 111629794
4663 111629794 108728605 105958454 102963700 100038594 97055646 93921454 90861909 87871918
4655 87871918 85136466 82843761 80665825 78831262 77285450 75544677 73531356 71439412
4647 71439412 69673417 67912847 66337622 65118498 63927029 62873498 62178922 61642788
4639 61642788 61205325 60556592 59980677 59519113 59041697 58556410 58142388 57780451 57527641
4630 57527641 57424398 57588646 57946333 58802049 59754434 60762896 61267433 61362047 61639271
$$ packed form
4687A84132440n41997j656179k358622k717340k979108k815089k526388k069140
4679A66468577j267993r94334r43126k025035l387137m443151m789355m831030
4671A43787416n162446m944648m789565m216230l780629l481561l107173k675370
4663A11629794k901189k770151k994754k925106k982948l134192l059545k989991
4655H7871918k735452k292705k177936j834563j545812j740773k013321k091944
4647G1439412j765995j760570j575225j219124j191469j053531o94576n36134
4639F1642788m37463o48733n75915m61564m77416m85287m14022l61937k52810
4630E7527641j03243J64248L57687Q55716R52385J008462N04537R4614K77224
$$ plain form
4621 61639271 61786239 61778154 61860698 62194251 62401369 62425989 62510814 62585326 62633413 62683505 62640954
4610 62640954 62420472 62520984 62432505 61949251 61586159 61215321 60878644 60555783 60439841 60627644
4600 60627644 60852784 60990024 61144218 60971418 61142532 61438604 61856894 62770069 63924762
4591 63924762 64930253 65654116 66373633 67103163 67615914 67616199 67172156 66816030 66383095 65886206
4581 65886206 65144170 64410236 64305483 64398903 65095840 66401126 67337368 67402386 66798622 66164938
4571 66164938 65678138 65090734 64453726 64087698 64263866 64625902 65121021 66018908 66928591
4562 66928591 67503373 67950119 68098419 68208440 68466622 68616092 69058283 69765709 70624217
4553 70624217 71850311 73535149 75901999 78471215 80811096 82697072 84384730 85539361
$$ packed form
4621F1639271J46968q085Q2544L33553K07118K4620Q4825P4512M8087N0092m2551
4610F2640954k20482J00512q8479m83254l63092l70838l36677l22861j15942J87803
4600F0627644K25140J37240J54194j72800J71114K96072M18290R13175J154693
4591F3924762J005491P23863P19517P29530N12751K85m44043l56126m32935m96889
4581F5886206p42036p33934j04753R3420O96937J305286R36242O5018o03764o33684
4571F6164938m86800n87404o37008l66028J76168L62036M95119Q97887R09683
4562F6928591N74782M46746J48300J10021K58182J49470M42191P07426Q58508
4553G0624217J226094J684838K366850K569216K339881J885976J687658J154631
$$ plain form
4545 85539361 86138862 86258891 86042784 85819507 85361141 84764850 83908756 82694385 81330743
4536 81330743 79811286 78164952 76510197 74971617 73084289 71154022 69153475 66905366
4528 66905366 64639631 62530349 60487462 58550358 56763883 55109524 53846226 52802372
4520 52802372 51819858 51006759 50441599 49891604 49436687 48894291 48083462 47373089 46559722
4511 46559722 45635110 44592010 43639302 42372505 41096134 39963898 38720686 37462278
4503 37462278 36168996 34778396 33232937 31645244 30234116 28920031 27567507 26353581
4495 26353581 25300449 24328788 23562242 23004183 22189791 21543602 20939825 20425247 20066736
4486 20066736 19633188 19286343 19041699 18917742 18674668 18289269 18119791 18054027 17949099 17709953
$$ packed form
4545H5539361N99501J20029k16107k23277m58366n96291q56094j214371j363642
4536H1330743j519457j646334j654755j538580j887328j930267k000547k248109
4528F6905366k265735k109282k042887j937104j786475j654359j263298j043854
4520E2802372r82514q13099n65160n49995m54917n42396q10829p10373q13367
4511D6559722r24612j043100r52708j266797j276371j132236j243212j258408
4503C7462278j293282j390600j545459j587693j411128j314085j352524j213926
4495B6353581j053132r71661p66546n58059q14392o46189o03777n14578l58511
4486B0066736m33548l46845k44644j23957k43074l85399j69478o5764j04928k39146
$$ plain form
4476 17709953 17600346 17599152 17525141 17483568 17482340 17356298 17418144 17357305 17426622 17605208 17557779
4465 17557779 17660506 17996966 18294862 18492172 18859115 19227254 19496988 19953479 20356133
4456 20356133 21082732 21898213 22701888 23756896 24800003 26002751 27717563 29801820 32413390
4447 32413390 35694886 39468935 43495171 47253512 50285628 52301768 53263035 52927844
4439 52927844 51395584 48889647 46008525 42776525 39364729 36337410 33767475 31547013
4431 31547013 29639307 28112787 26881740 25898747 25149886 24456302 23882526 23505919 23165704
4422 23165704 22782401 22528584 22285826 21931827 21784769 21499648 21138034 20781330 20663451
4413 20663451 20399439 20152941 19995832 19793660 19452808 19136016 18908560 18716235 18398554
$$ packed form
4476A7709953j09607j194p4011m1573j228j26042O1846o0839O9317J78586m7429
4465A7557779J02727L36460K97896J97310L66943L68139K69734M56491M02654
4456B0356133P26599Q15481Q03675J055008J043107J202748J714812K084257K611570
4447C2413390L281496L774049M026236L758341L032116K016140R61267l35191
4439E2927844j532260k505937k881122l232000l411796l027319k569935k220462
4431C1547013j907706j526520j231047r82993p48861o93584n73776l76607l40215
4422B3165704l83303k53817k42758l53999j47058k85121l61614l56704j17879
4413B0663451k64012k46498j57109k02172l40852l16792k27456j92325l17681
$$ plain form
4404 18398554 18352209 18411107 18251087 18129852 17977392 17852392 17927977 17803682 17716097 17665196
4394 17665196 17599429 17594994 17465256 17270213 17062647 17005062 16888344 16992475 16916827 16744361
4384 16744361 16650039 16705102 16439398 16190091 16193171 16214286 16207569 16376702 16423021 16479640 16464213
4373 16464213 16468735 16667988 16577560 16497784 16513547 16578920 16580873 16665360 16766860 16775871 16733399
4362 16733399 16775005 16935111 17044452 17227974 17342794 17317710 17558859 17877977 18141832 18386141
4352 18386141 18644476 18951604 19198162 19462515 19759671 20094517 20379241 20636375 20705744 21043582
4342 21043582 21418121 21749422 21945759 21996915 22117593 22128726 22179563 22424635 22566412 22727094
4332 22727094 22933058 23250957 23354791 23522735 23958278 24255354 24652305 25124831 25506143
$$ packed form
4404A8398554m6345N8898j60020j21235j52460j25000P5585j24295q7585n0901
4394A7665196o5767m435j29738j95043k07566n7585j16718J04131p5648j72466
4384A6744361r4322N5063k65704k49307L080K1115o717J69133M6319N6619j5427
4373A6464213M522J99253r0428p9776J5763O5373J953Q4487J01500R011m2472
4362A6733399M1606J60106J09341J83522J14820k5084K41149L19118K63855K44309
4352A8386141K58335L07128K46558K64353K97156L34846K84724K57134O9369L37838
4342B1043582L74539L31301J96337N1156J20678J1133N0837K45072J41777J60682
4332B2727094K05964L17899J03834J67944M35543K97076L96951M72526L81312
$$ plain form
4323 25506143 25755405 25774313 25649348 25422119 25149141 25119310 25062712 24862878 24640417 24545671
4313 24545671 24391971 24250629 24163767 23730089 23406988 23053350 22706436 22370897 22313311 22120809
4303 22120809 22109691 22077971 21942068 21784243 21700912 21506767 21529338 21401520 21159920 21136914
4293 21136914 21183447 21334439 21506579 21778379 22025835 22570299 23068655 23874863 24709997 25786774
4283 25786774 27256254 28890809 30942224 33647587 37124699 41910723 47907658 54356231
4275 54356231 59466575 62168275 63404586 64687014 66629733 68920991 70192627 69084581
4267 69084581 65278565 60548356 55810187 51091647 46675987 42348526 38242883 34689519
4259 34689519 31657465 29078780 27035509 25464838 24017232 22866136 21800856 20929019
$$ packed form
4323B5506143K49262J8908j24965k27229k72978k9831n6598j99834k22461r4746
4313B4545671j53700j41342q6862m33678l23101l53638l46914l35539n7586j92502
4303B2120809j1118l1720j35903j57825q3331j94145K2571j27818k41600k3006
4293B1136914M6533J50992J72140K71800K47456N44464M98356Q06208Q35134J076777
4283B5786774J469480J634555K051415K705363L477112M786024N996935O448573
4275E4356231N110344K701700J236311J282428J942719K291258J271636j108046
4267F9084581l806016m730209m738169m718540m415660m327461m105643l553364
4259C4689519l032054k578685k043271j570671j447606j151096j065280q71837
$$ plain form
4251 20929019 20181648 19451496 18834065 18329788 17887803 17635283 17298823 16975805 16798389
4242 16798389 16724717 16646864 16554848 16505486 16488409 16371561 16308000 16302579 16448295 16491689 16662942
4231 16662942 16892926 16915923 17105160 17256425 17458509 17627195 17896135 18192248 18228247 18278496
4221 18278496 18405480 18296064 18220273 18164291 18013752 17856060 17751302 17684495 17583966 17570602
4211 17570602 17532398 17504196 17511813 17424629 17415378 17124834 16978947 17016715 16837398 16718936 16593047
4200 16593047 16469549 16279639 16181771 15839329 15703977 15639451 15424977 15263627 15258612 15126509
4190 15126509 14773489 14712979 14623481 14450123 14347008 14179215 13944251 13733571 13496918 13472935
4180 13472935 13512931 13316192 13237190 13018472 12840965 12849826 12844942 12761246 12597639 12566219 12447780
$$ packed form
4251B0929019p47371p30152o17431n04277m41985k52520l36460l23018j77416
4242A6798389p3672p7853r2016m9362j7077j16848o3561n421J45716M3394J71253
4231A6662942K29984K2997J89237J51265K02084J68686K68940K96113L5999N0249
4221A8278496J26984j09416p5791n5982j50539j57692j04758o6807j00529j3364
4211A7570602l8204k8202P617q7184r251k90544j45887L7768j79317j18462j25889
4200A6593047j23498j89910r7868l42442j35352o4526k14474j61350n015j32103
4190A5126509l53020o0510q9498j73358j03115j67793k34964k10680k36653k3983
4180A3472935L9996j96739p9002k18718j77507Q861m884q3696j63607l1420j18439
$$ plain form
4169 12447780 12661165 12574067 12173328 11862260 11802864 11659112 11446361 11274668 11220236 11268609
4159 11268609 11125899 11037237 10949171 11021291 11089672 11235524 11427814 11563677 11547912 11528114
4149 11528114 11643087 11725983 12005646 12162999 12275146 12113877 12083647 11928786 11940812 11935186
4139 11935186 11810828 11995692 11908184 11901307 12052944 12076873 12189046 12276737 12326686 12381130 12666783
4128 12666783 12869359 13271809 13824402 14402252 14754422 14919164 15028015 15243691 15500288
4119 15500288 15827061 16286628 16280748 15879154 15482438 15157741 14813968 14575342 14319913 14073335
4109 14073335 13920790 13658242 13623945 13652806 13683730 13728344 13824224 13978809 14073102 14106381 14219708
4098 14219708 14398577 14585660 14849913 14828476 14966264 15142655 15403667 15655885 15969908 16401207
$$ packed form
4169A2447780K13385q7098m00739l11068n9396j43752k12751j71693n4432M8373
4159A1268609j42710q8662q8066P2120O8381J45852J92290J35863j5765j9798
4149A1528114J14973Q2896K79663J57353J12147j61269l0230j54861J2026n626
4139A1935186j24358J84864q7508o877J51637K3929J12173Q7691M9949N4444K85653
4128A2666783K02576M02450N52593N77850L52170J64742J08851K15676K56597
4119A5500288L26773M59567n880m01594l96716l24697l43773k38626k55429k46578
4109A4073335j52545k62548l4297K8861L0924M4614R5880J54585R4293L3279J13327
4098A4219708J78869J87083K64253k1437J37788J76391K61012K52218L14023M31299
$$ plain form
4088 16401207 16759682 17123595 17304525 17652692 17794667 18128523 18499133 18639491 18874758
4079 18874758 19120629 19408175 19738254 20220237 20522643 20734607 20856498 21041778 21358998
4070 21358998 21633238 21674407 21786243 21975605 22075283 22050042 22162113 22305180 22479060 22743641
4060 22743641 22991071 23441701 23995866 24350935 24492998 24492533 24458141 24392557 24470112 24338072
4050 24338072 24326685 24270947 24208753 24280448 24191866 24263130 24506479 24532318 24678109 24737626 25062193
4039 25062193 25316467 25587995 25802110 26088469 26395754 26608263 26939072 27496870 27766217
4030 27766217 28142074 28757740 29186964 29660148 30192379 30696666 31230495 31747314 32390029
4021 32390029 32990681 33510923 34108034 34723085 35353213 35934710 36638841 37350766 38264620
$$ packed form
4088A6401207L58475L63913J80930L48167J41975L33856L70610J40358K35267
4079A8874758K45871K87546L30079M81983L02406K11964J21891J85280L17220
4070B1358998K74240M1169J11836J89362R9678k5241J12071J43067J73880K64581
4060B2743641K47430M50630N54165L55069J42063m65l4392o5584P7555j32040
4050B4338072j1387n5738o2194P1695q8582P1264K43349K5839J45791N9517L24567
4039B5062193K54274K71528K14115K86359L07285K12509L30809N57798K69347
4030B7766217L75857O15666M29224M73184N32231N04287N33829N16819O42715
4021C2390029O00652N20242N97111O15051O30128N81497P04131P11925R13854
$$ plain form
4012 38264620 39191006 40031676 40724262 41508096 42324768 42979923 43852889 44818226 45600108
4003 45600108 46513750 47359896 48169587 49151679 50042453 50706744 51683511 52664906 53547321
3994 53547321 54605740 55507466 56442996 57491631 58863198 60164294 61325987 62687986
3986 62687986 63931134 65174447 66463470 67929573 69261427 70660352 71967962 73141936
3978 73141936 74437240 75984934 77374732 79214919 81085131 83059940 85209743 87249381
3970 87249381 89364408 91644145 93912754 96263872 98597168 101008820 103366855 105938203
3962 105938203 108525978 111144834 113806650 116432628 119137336 121993253 124865461 127742907
3954 127742907 130854547 134107423 137441266 140911319 144544215 148318955 152576096 157097428
$$ packed form
4012C8264620R26386Q40670O92586P83834Q16672O55155Q72966R65337P81882
4003D5600108R13642Q46146Q09691R82092Q90774O64291R76767R81395Q82415
3994E3547321J058419R01726R35530J048635J371567J301096J161693J361999
3986F2687986J243148J243313J289023J466103J331854J398925J307610J173974
3978G3141936J295304J547694J389798J840187J870212J974809K149803K039638
3970H7249381K115027K279737K268609K351118K333296K411652K358035K571348
3962A05938203K587775K618856K661816K625978K704708K855917K872208K877446
3954A27742907L111640L252876L333843L470053L632896L774740M257141M521332
$$ plain form
3946 157097428 161469984 165173360 168762112 172185839 175647371 179089977 182152452 184853497
3938 184853497 187207007 189304304 191297674 192947877 194549556 196134604 197735590 199454895
3930 199454895 201255873 203116679 205067393 207118983 209184554 210754589 212423636 214111351
3922 214111351 215275785 216557251 217753297 218789190 219743542 220413731 220903090 221110366 220628050
3913 220628050 219695740 218618598 217354597 215676904 213814680 211958231 210303997 208865126
3905 208865126 207720391 207129453 206909145 207197461 207706812 208328090 208488516 208370689 207981199
3896 207981199 207060893 205993719 204630593 203221307 201731342 199996918 198199768 196172830
3888 196172830 193881473 191530039 188787410 185875463 182743799 179731698 176382881 173255775
$$ packed form
3946A57097428M372556L703376L588752L423727L461532L442606L062475K701045
3938A84853497K353510K097297J993370J650203J601679J585048J600986J719305
3930A99454895J800978J860806J950714K051590K065571J570035J669047J687715
3922B14111351J164434J281466J196046J035893R54352O70189M89359K07276m82316
3913B20628050r32310j077142j264001j677693j862224j856449j654234j438871
3905B08865126j144735n90938k20308K88316N09351O21278J60426j17827l89490
3896B07981199r20306j067174j363126j409286j489965j734424j797150k026938
3888A96172830k291357k351434k742629k911947l131664l012101l348817l127106
$$ plain form
3880 173255775 170125955 167115301 164272738 161628711 159356300 157167393 155183670 153126476
3872 153126476 150724968 147880322 144925746 141514354 137585805 133542533 129449353 125312424
3864 125312424 121500541 117699000 114125597 110700950 107491143 104679017 101970671 99352577
3856 99352577 96932883 94648341 92612786 90708029 88919613 87135793 85462766 83881105
3848 83881105 82348969 80829259 79173390 77552936 75896217 74104468 72277403 70530212
3840 70530212 68994287 67110812 65488475 64133963 62638009 61236911 59704988 58209772
3832 58209772 56702740 55360961 54077183 53023038 52147743 51143006 50288568 49570691 49094930
3823 49094930 48549322 48177630 47731404 47264379 46809329 46274078 45727718 45041649 44335001
$$ packed form
3880A73255775l129820l010654k842563k644027k272411k188907j983723k057194
3872A53126476k401508k844646k954576l411392l928549m043272m093180m136929
3864A25312424l811883l801541l573403l424647l209807k812126k708346k618094
3856I9352577k419694k284542k035555j904757j788416j783820j673027j581661
3848H3881105j532136j519710j655869j620454j656719j791749j827065j747191
3840G0530212j535925j883475j622337j354512j495954j401098j531923j495216
3832E8209772j507032j341779j283778j054145q75295j004737q54438p17877m75761
3823D9094930n45608l71692m46226m67025m55050n35251n46360o86069p06648
$$ plain form
3814 44335001 43512570 42669514 41862645 41147782 40205195 39379979 38613474 37806529 37091628
3805 37091628 36386477 35692468 35047594 34455596 34002595 33650014 32978071 32542445 32032306
3796 32032306 31613016 31108860 30436844 29734718 29129839 28533310 28089828 27750266 27399061
3787 27399061 27182693 26850093 26528907 26110379 25760430 25498891 25154383 24666888 24340251
3778 24340251 23949067 23446976 23093407 22789168 22603655 22452704 21985473 21689933 21384168
3769 21384168 20937113 20560091 20162231 19805592 19542906 19190257 18769441 18429972 18095435
3760 18095435 17771543 17568842 17214613 16856986 16586873 16285447 16062898 15800597 15315784
3751 15315784 15033232 14808673 14492980 14216528 13946239 13561456 13294657 12966381 12667634
$$ packed form
3814D4335001q22431q43056q06869p14863r42587q25216p66505q06945p14901
3805C7091628p05151o94009o44874n91998m53001l52581o71943m35626n10139
3796C2032306m19290n04156o72016p02126o04879n96529m43482l39562l51205
3787B7399061k16368l32600l21186m18528l49949k61539l44508m87495l26637
3778B4340251l91184n02091l53569l04239j85513j50951m67231k95540l05765
3769B1384168m47055l77022l97860l56639k62686l52649m20816l39469l34537
3760A8095435l23892k02701l54229l57627k70113l01426k22549k62301m84813
3751A5315784k82552k24559l15693k76452k70289l84783k66799l28276k98747
$$ plain form
3742 12667634 12417611 12073758 11795470 11493007 11330767 11083688 10831212 10741837 10619693 10499055
3732 10499055 10220365 10031508 9742895 9603395 9542051 9340777 9340268 9205416 8831432 8669186
3722 8669186 8346558 8247582 8174345 7970093 7679443 7526247 7386584 7123506 6991990 6806015
3712 6806015 6691066 6755277 6646203 6400347 6338519 6178543 5992835 6028805 5958151 5651542
3702 5651542 5701430 5686232 5714646 5632792 5559688 5431079 5354725 5300443 5242630 5023825 4891119
3691 4891119 4986387 4924362 4914404 4723855 4634592 4663702 4631825 4649794 4645066 4635991 4484662 4453895
3679 4453895 4401298 4357785 4392030 4255758 4095749 4096621 3989245 3966095 3850769 3790881 3825714
3668 3825714 3804536 3751734 3688204 3771782 3755478 3685955 3594138 3486504 3486326 3606888 3489375
$$ packed form
3742A2667634k50023l43853k78288l02463j62240k47079k52476q9375j22144j20638
3732A0499055k78690j88857k88613j39500o1344k01274n09j34852l73984j62246
3722H669186l22628r8976p3237k04252k90650j53196j39663k63078j31516j85975
3712F806015j14949O4211j09074k45856o1828j59976j85708L5970p0654l06609
3702E651542M9888j5198K8414q1854p3104j28609p6354n4282n7813k18805j32706
3691D891119R5268o2025r958j90549q9263K9110l1877J7969m728r075j51329l0767
3679D453895n2597m3513L4245j36272j60009Q72j07376k3150j15326n9888L4833
3668C825714k1178n2802o3530Q3578j6304o9523r1817j07634j78J20562j17513
$$ plain form
3657 3489375 3283711 3290184 3205591 3206725 3196406 3284229 3269852 3204505 3026022 3075902 3084587 3019181
3645 3019181 3068180 3168812 3123766 3072563 3043499 2938465 3064150 3002571 2991541 2948456 2763190
3634 2763190 2906212 2888270 2863351 2937735 2801328 2812954 2842959 2786574 2547807 2703444 2817413
3623 2817413 2780628 2781744 2794397 2796988 2720322 2792431 2760052 2635983 2629814 2785933 2759194 2729950
3611 2729950 2684617 2683955 2727388 2576845 2597356 2554969 2542683 2611144 2558714 2521132 2578361 2579927
3599 2579927 2587249 2586889 2564795 2438114 2567221 2552956 2579796 2598384 2593451 2567754 2596508 2609141
3587 2609141 2678202 2640381 2616552 2589422 2651845 2762899 2769484 2676149 2474532 2399077 2541576
3576 2541576 2598652 2738691 2613031 2553969 2756182 2696699 2703089 2631337 2577068 2663565 2544863
$$ packed form
3657C489375k05664O473q4593J134j0319Q7823j4377o5347j78483M9880Q685o5406
3645C019181M8999J00632m5046n1203k9064j05034J25685o1579j1030m3085j85266
3634B763190J43022j7942k4919P4384j36407J1626L0005n6385k38767J55637J13969
3623B817413l6785J116J2653K591p6666P2109l2379j24069o169J56119k6739k9244
3611B729950m5333o62M3433j50543K0511m2387j2286O8461n2430l7582N7229J566
3599B579927P322l60k2094j26681J29107j4265K6840J8588m933k5697K8754J2633
3587B609141O9061l7821k3829k7130O2423J11054O585r3335k01617p5455J42499
3576B541576N7076J40039j25660n9062K02213n9483O390p1752n4269Q6497j18702
$$ plain form
3565 2544863 2398480 2355761 2411806 2503039 2434334 2427157 2418588 2492635 2468354 2547447 2467714 2581717
3553 2581717 2675194 2797983 2797239 2783139 2879573 2954299 2927713 2836208 2921727 3203222 3278771
3542 3278771 3307143 3383183 3424337 3459550 3275347 3157634 3110266 2993462 2701073 2598980
3532 2598980 2669677 2574265 2450705 2431230 2554098 2534509 2474392 2316388 2300075 2402708 2390358
3521 2390358 2473168 2508580 2553907 2529468 2572043 2582052 2651324 2826291 2869813 2840458 2765597
3510 2765597 3007463 3207663 3265291 3229548 3288450 3200038 3033289 2914123 2785736 2704751
3500 2704751 2532027 2456891 2287965 2096317 2161167 2131597 2081154 2117559 2182702 2163801 2071171
3489 2071171 2078145 2104489 2125865 2034717 2161405 2120762 1862946 1871425 2042349 2176340 2383177
$$ packed form
3565B544863j46383m2719N6045R1233o8705p177q569P4047k4281P9093p9733J14003
3553B581717R3477J22789p44j4100R6434P4726k6586r1505Q5519K81495P5549
3542C278771K8372P6040M1154L5213j84203j17713m7368j16804k92389j02093
3532B598980P0697r5412j23560j9475J22868j9589o0117j58004j6313J02633j2350
3521B390358Q2810L5412M5327k4439M2575J0009O9272J74967M3522k9355p4861
3510B765597K41866K00200N7628l5743N8902q8412j66749j19166j28387q0985
3500B704751j72724p5136j68926j91648O4850k9570n0443L6405O5143j8901r2630
3489B071171O974K6344K1376r1148J26688m0643k57816Q479J70924J33991K06837
$$ plain form
3478 2383177 2452976 2457202 2468035 2496097 2585674 2610024 2602370 2683360 2641699 2539839 2530771 2631793
3466 2631793 2766502 2759605 2981520 3158027 3165184 3045501 3206439 3412962 3518669 3664379
3456 3664379 3844527 4026130 4155052 4207254 4393289 4280604 4096091 3934484 3712987 3666025
3446 3666025 3422044 3324628 3012226 2845847 2793624 2681154 2579274 2482390 2440316 2304232
3436 2304232 2218610 2150654 2034402 1930284 1656966 1702744 1533312 1585897 1501965 1446598 1365493
3425 1365493 1231097 1082315 1074223 1129554 1173860 1195386 1136153 1089624 1036439 1062794 1032486
3414 1032486 1017747 997727 1123061 1140128 1203340 1096308 1122339 1176282 1016428 852848 828031
3403 828031 767781 838127 845096 801030 769082 632187 572453 573605 622596 782711 603377
$$ packed form
3478B383177O9799M226J0833K8062Q9577K4350p654Q0990m1661j01860r068J01022
3466B631793J34709o897K21915J76507P157j19683J60938K06523J05707J45710
3456C664379J80148J81603J28922N2202J86035j12685j84513j61607k21497m6962
3446C666025k43981r7416l12402j66379n2223j12470j01880r6884m2074j36084
3436B304232q5622o7956j16252j04118k73318M5778j69432N2585q3932n5367q1105
3425A365493j34396j48782q092N5331M4306K1526n9233m6529n3185K6355l0308
3414A032486j4739k0020J25334J7067O3212j07032K6031N3943j59854j63580k4817
3403H28031o0250P0346O969m4066l1948j36895n9734J152M8991J60115j79334
$$ plain form
3392 603377 531203 573737 516082 548614 639286 576930 622477 685287 709205 665225 604464 484477
3380 484477 514719 575689 438106 455131 488923 591243 625999 681124 581858 538525 513118
3369 513118 542122 615315 520728 609638 672485 642668 568735 481487 493006 525988 674636
3358 674636 574816 453707 427055 407814 566955 492082 454514 525052 639482 633340 449415
3347 449415 518547 597718 579840 426123 211250 328278 435158 472030 418548 476714 664962
3336 664962 538261 448675 504571 515633 505399 512147 535191 596797 768843 625898 413687
3325 413687 391011 367488 440750 377384 310005 321114 373073 234361 225515 334992 357434
3314 357434 259903 221545 175040 295380 428130 281841 268692 281490 300998 319608 447103
$$ packed form
3392F03377p2174M2534n7655L2532R0672o2356M5547O2810K3918m3980o0761j19987
3380D84477L0242O0970j37583J7025L3792J02320L4756N5125r9266m3333k5407
3369E13118K9004P3193r4587Q8910O2847k9817p3933q7248J1519L2982J48648
3358F74636r9820j21109k6652j9241J59141p4873l7568P0538J14430o142j83925
3347D49415O9132P9171j7878j53717k14873J17028J06880L6872n3482N8166J88248
3336F64962j26701q9586N5896J1062j0234O748K3044O1606J72046j42945k12211
3325D13687k2676k3523P3262o3366o7379J1109N1959j38712q846J09477K2442
3314C57434r7531l8358m6505J20340J32750j46289j3149J2798J9508J8610J27495
$$ plain form
3303 447103 397084 280874 305442 283231 171949 285523 347625 266397 227951 123774 209893
3292 209893 190296 87675 -5980 187634 257141 128555 51316 62692 53314 23368 186106
3281 186106 159130 150000 56191 44755 111482 151623 166320 164895 55008 188060 161297 108039
3269 108039 94917 76508 123193 234890 42677 -73121 -73635 -165492 -118669 45975 169769
3258 169769 90023 6616 188944 229964 194007 194499 236447 255135 245535 386852 267491 294909
3246 294909 247205 206596 161335 146559 111532 77636 145555 199560 107638 247485 163464
3235 163464 210809 283643 219173 160752 129005 334618 289744 219786 166436 248085 296925
3224 296925 507114 543139 480117 642457 689827 724468 810189 862758 770613 837110 732292
$$ packed form
3303D47103n0019j16210K4568k2211j11282J13574O2102q1228l8446j04177Q6119
3292B09893j9597j02621r3655J93614O9507j28586p7239J1376r378k9946J62738
3281A86106k6976r130r3809j1436O6727M0141J4697j425j09887J33052k6763n3258
3269A08039j3122j8409M6685J11697j92213j15798n14r1857M6823J64644J23794
3258A69769p9746q3407J82328M1020l5957M92M1948J8688r600J41317j19361K7418
3246B94909m7704m0609m5261j4776l5027l3896O7919N4005r1922J39847q4021
3235A63464M7345P2834o4470n8421l1747K05613m4874o9958n3350Q1649M8840
3224B96925K10189L6025o3022J62340M7370L4641Q5721N2569r2145O6497j04818
$$ plain form
3213 732292 769716 827121 915861 942374 1025020 990719 1009055 999812 973910 922650 759351 663436
3201 663436 569473 599727 609995 593687 625586 591296 508997 563856 766316 660214 756794
3190 756794 897084 1010214 1124899 1076297 1142520 1234444 1358073 1415707 1565580 1685632
3180 1685632 1835928 1862429 1988412 2030019 2028736 1936192 1690345 1776356 1712444 1677616 1548977
3169 1548977 1335865 1182785 1192258 1033549 900149 822926 906344 893186 821264 796913 753114
3158 753114 893421 894471 872392 815866 871320 852721 997813 982857 1086285 1027570 1124530
3147 1124530 1166268 1297763 1434276 1541031 1588724 1554831 1587130 1587132 1627525 1544599 1353258
3136 1353258 1371868 1247344 1227025 1160743 979516 890939 954387 947496 867583 835034 877458
$$ packed form
3213G32292L7424N7405Q8740K6513Q2646l4301J8336r243k5902n1260j63299r5915
3201F63436r3963L0254J0268j6308L1899l4290q2299N4859K02460j06102R6580
3190G56794J40290J13130J14685m8602O6223R1924J23629N7634J49873J20052
3180A685632J50296K6501J25983M1607j283r2544k45847Q6011o3912l4828j28639
3169A548977k13112j53080R473j58709j33400p7223Q3418j3158p1922k4351m3799
3158G53114J40307J050k2079n6526N5454j8599J45092j4956J03428n8715R6960
3147A124530M1738J31495J36513J06755M7693l3893L2299KM0393q2926j91341
3136A353258J8610j24524k0319o6282j81227q8577O3448o891p9913l2549M2424
$$ plain form
3125 877458 825111 808576 859133 813707 789676 781197 704212 717391 597780 586797 630816 499330
3113 499330 514563 418158 365823 507951 512368 524692 667407 574143 517810 532323 503694
3102 503694 391902 411297 503310 449342 487513 603507 651309 685186 736235 682693 596927
3091 596927 648705 579692 491316 534043 478927 509660 473194 543145 485592 378111 387034 484983
3079 484983 383337 305179 362504 375976 322328 349521 435368 289657 324929 329756 309609
3068 309609 215291 246098 73641 133125 160461 214934 150984 42653 -41187 -45879 -18121
3057 -18121 -41741 -137889 -134563 -89679 -103929 -1008 -1006 -124707 -216260 -182140 -60496 -89415
3045 -89415 -89122 -77358 -102775 -141525 -190588 -184268 -65438 -157774 -171021 -173604 -129201 -243476
$$ packed form
3125H77458n2347j6535N0557m5426k4031q479p6985J3179j19611j0983M4019j31486
3113D99330J5233r6405n2335J42128M417J2324J42715r3264n6333J4513k8629
3102E03694j11792J9395R2013n3968L8171J15994M7802L3877N1049n3542q5766
3091E96927N1778o9013q8376M2727n5116L0733l6466O9951n7553j07481Q923R7949
3079D84983j01646p8158N7325J3472n3648K7193Q5847j45711L5272M827k0147
3068C09609r4318L0807j72457N9484K7336N4473o3950j08331q3840m692K7758
3057a8121k3620r6148L326M4884j4250J02921Kj23701r1553L4120J21644k8919
3045h9415K93J1764k5417l8750m9063O320J18830r2336j3247k583M4403j14275
$$ plain form
3033 -243476 -320914 -365755 -247659 -115087 -148520 -119383 -166929 -365559 -269874 -202470 -253156
3022 -253156 -260266 -289243 -308562 -248875 -119984 -143769 -203849 -134362 -173411 -188981 -252933 -329987
3010 -329987 -249689 -326250 -191167 -262260 -299160 -198859 -273315 -383927 -327719 -123814 -189888
2999 -189888 -254926 -179543 -261277 -302673 -235674 -195162 -279011 -223118 -329004 -333979 -378024 -281950
2987 -281950 -178740 -99014 -270773 -444480 -586405 -477525 -383058 -309605 -157058 -162997 -233940
2976 -233940 -317361 -273355 -308529 -281107 -309453 -357497 -245113 -240932 -183000 -282028 -254315 -396996
2964 -396996 -429925 -407289 -464826 -279637 -294998 -184097 -291510 -367053 -210536 -309065 -315303
2953 -315303 -321360 -369630 -379843 -364854 -359447 -344908 -445388 -296059 -242960 -293746 -177490
$$ packed form
3033b43476p7438m4841J18096J32572l3433K9137m7546j98630R5685O7404n0686
3022b53156p110k8977j9319N9687J28891k3785o0080O9487l9049j5570o3952p7054
3010c29987Q0298p6561J35083p1093l6900J00301p4456j10612N6208K03905o6074
2999a89888o5038P5383q1734m1396O6999M0512q3849N5893j05886m975m4045R6074
2987b81950J03210P9726j71759j73707j41925J08880R4467P3453J52547n939p0943
2976b33940q3421M4006l5174K7422k8346m8044J12384M181N7932r9028K7713j42681
2964c96996l2929K2636n7537J85189j5361J10901j07413p5543J56517r8529o238
2953c15303o057m8270j0213J4989N407J4539j00480J49329N3099n0786J16256
$$ plain form
2942 -177490 -253249 -365050 -263291 -201418 -273097 -335886 -440717 -453757 -418613 -204556 -134440
2931 -134440 -141776 -334887 -395673 -261321 -224800 -295856 -438618 -353768 -290457 -120656 -118430
2920 -118430 -406900 -397460 -338339 -281358 -318348 -374422 -400728 -517766 -288626 -269804 -243116
2909 -243116 -285664 -239062 -243659 -407459 -382849 -334946 -279355 -233902 -255962 -254607 -215118 -287489
2897 -287489 -330037 -366324 -433722 -335286 -109488 -230417 -303335 -332121 -264436 -321999 -265399
2886 -265399 -190402 -207231 -190176 -285062 -220593 -55746 -55618 -214362 -348653 -276262 -336198
2875 -336198 -225295 -253347 -152458 -308035 -421970 -380859 -192579 -5415 -152025 -77271
2865 -77271 -12965 -120538 -65171 -103795 -116489 -16710 26952 -62778 -30089 17423 -21784 28387
$$ packed form
2942a77490p5759j11801J01759O1873p1679o2789j04831j3040L5144K14057P0116
2931a34440p336j93111o0786J34352L6521p1056j42762Q4850O3311J69801K226
2920a18430k88470R440N9121N6981l6990n6074k6306j17038K29140J8822K6688
2909b43116m2548M6602m597j63800K4610M7903N5591M5453k2060J355L9489p2371
2897b87489m2548l6287o7398R8436K25798j20929p2918k8786O7685n7563N6600
2886b65399P4997j6829J7055r4886O4469J64847J28j58744j34291P2391n9936
2875c36198J10903k8052J00889j55577j13935M1111J88280J87164j46610P4754
2865g7271O4306j07573N5367l8624j2694R9779M3662q9730L2689M7512l9207N0171
$$ plain form
2853 28387 50726 34271 5212 44872 -45707 -63773 -2289 -79713 33272 88471 60241 47137
2841 47137 66018 71644 71219 51910 7127 106811 107288 71172 113777 219220 220585 186623 138936
2828 138936 211544 226738 406695 348255 387023 502716 437063 401238 324222 326788 293504
2817 293504 237339 117447 209439 248944 218818 200317 195193 257277 281320 314423 340226 335075
2805 335075 269266 202719 276083 257829 345755 422837 261252 483201 418435 315430 428895
2794 428895 598145 477423 292996 394336 434354 480842 559412 549064 338036 357177 440438
2783 440438 314466 399422 455681 423040 401515 361125 322324 285511 342005 518562 378261
2772 378261 388926 318997 130394 115986 81255 174016 282966 151585 361721 290564 218384
$$ packed form
2853B8387K2339j6455k9059L9660r0579j8066O1484p7424J12985N5199k8230j3104
2841D7137J8881N626m25j9309m4783R9684M77l6116M2605J05443J365l3962m7687
2828A38936P2608J5194J79957n8440L8768J15693o5653l5825p7016K566l3284
2817B93504n6165j19892R1992L9505l0126j8501n124O2084K4043L3103K5803n151
2805C35075o5809o6547P3364j8254Q7926P7082j61585K21949o4766j03005J13465
2794D28895J69250j20722j84427J01340M0018M6488P8570j0348k11028J9141Q3261
2783D40438j25972Q4956N6259l2641k1525m0390l8801l6813N6494J76557j40301
2772C78261J0665o9929j88603j4408l4731R2761J08950j31381K10136p1157p2180
$$ plain form
2761 218384 328770 304208 339307 278992 170686 275797 263467 31015 71629 150295 85248
2750 85248 196117 259874 227402 167857 47412 68034 49845 130729 149405 138099 54553
2739 54553 46418 134530 28538 -130292 -137809 -119865 -102441 -46990 -75304 -105215 -118331 -102786
2727 -102786 -98229 -212701 -137847 -119833 -6292 -18031 -82585 23465 16609 -36869 44165
2716 44165 88511 -23490 -196482 -297238 -251045 -175158 -252137 -275583 -93486 -43171 -156481
2705 -156481 -90173 -212172 -89957 -283772 -199230 -239080 -450490 -345747 -391950 -288888
2695 -288888 -255713 -332631 -261495 -255375 -301779 -232116 -361352 -521303 -379525 -329860 -445987
2684 -445987 -432945 -493880 -402336 -403376 -299523 -362859 -316917 -259658 -245306 -252409 -187134 -242264
$$ packed form
2761B18384J10386k4562L5099o0315j08306J05111j2330k32452M0614P8666o5047
2750H5248J10869O3757l2472n9545j20445K0622j8189Q0884J8676j1306q3546
2739E4553q135Q8112j05992j58830p517J7944J7424N5451k8314k9911j3116J5545
2727a02786M557j14472P4854J8014J13541j1739o4554J06050o856n3478Q1034
2716D4165M4346j12001j72992j00756M6193P5887p6979k3446J82097N0315j13310
2705a56481O6308j21999J22215j93815Q4542l9850k11410J04743m6203J03062
2695b88888L3175p6918P1136O120m6404O9663j29236j59951J41778M9665j16127
2684d45987J3042o0935R1544j040J03853o3336M5942N7259J4352p103O5275n5130
$$ plain form
2672 -242264 -443707 -421899 -180343 -153525 -311096 -180569 -207897 -222934 -277194 -181729 -149490
2661 -149490 -242574 -323440 -294627 -258842 -213571 -311489 -320565 -241061 -307928 -313688 -232366 -344887
2649 -344887 -364055 -314034 -153234 -139870 -208294 -111101 -163206 -352487 -347600 -293608 -288186 -134646
2637 -134646 -160032 -145826 -240618 -179277 -187540 -141819 -189621 -269716 -211517 -189814 -171182 -176869
2625 -176869 -171410 -282948 -309313 -230149 -281079 -334042 -358227 -256353 -280064 -253597 -160857
2614 -160857 -78408 -219267 -159031 -162278 -190580 -146489 -199152 -41694 -9610 49126 -32642
2603 -32642 -177154 -111673 10956 57407 139995 125357 235803 222819 169483 377281 499254
2592 499254 505801 426185 312177 218489 176572 192834 84965 -9794 2352 -45121 97706
$$ packed form
2672b42264k01443K1808K41556K6818j57571J30527k7328j5037n4260R5465L2239
2661a49490r3084q0866K8813L5785M5271r7918r076P9504o6867n760Q1322j12521
2649c44887j9168N0021J60800J3364o8424R7193n2105j89281M887N3992N422J53540
2637a34646k5386J4206r4792O1341q263M5721m7802q0095N8199K1703J8632n687
2625a76869N459j11538k6365P9164n0930n2963k4185J01874k3711K6467R2740
2614a60857Q2449j40859O0236l247k8302M4091n2663J57458L2084N8736q1768
2603c2642j44512O5481J22629M6451Q2588j4638J10446j2984n3336K07798J21973
2592D99254O547p9616j14008r3688m1917J6262j07869r4759J2146m7473J42827
$$ plain form
2581 97706 55197 117196 115472 13202 -64053 4946 -17251 -35653 -18263 -130821 -125035 -165223
2569 -165223 -235795 -168680 39096 -117794 -193148 -147155 -147339 -172109 -167630 -100349 -95875 -171157
2557 -171157 -154835 -163358 -191166 -203151 -288350 -257806 -210153 -214733 -202475 -297552 -219250 -194126
2545 -194126 -146045 -217313 -297195 -266063 -228369 -149989 -69526 -24784 -110983 -171057 -5043
2534 -5043 -188338 -175682 -150933 -196128 -25078 -96262 -116971 -173950 -155247 -149059 -227093 -242965
2522 -242965 -200592 -269334 -296051 -194621 -160385 -212542 -232761 -125065 -97762 -158238 -141175
2511 -141175 -161496 -113085 -133555 -75975 -81843 -4114 77171 81743 14964 83072 126495 -5070
2499 -5070 -99768 -121916 -126878 -116139 -129826 -38832 119611 9756 -15310 50189 -7501 -15094
$$ packed form
2581I7706m2509O1999j724j02270p7255O8999k2197j8402J7390j12558N786m0188
2569a65223p0572O7115K07776j56890p5354M5993j84k4770M479O7281M474p5282
2557a71157J6322q523k7808j1985q5199L0544M7653m580J2258r5077P8302K5124
2545a94126M8081p1268p9882L1132L7694P8380Q0463M4742q6199o0074J66014
2534e043j83295J2656K4749m5195J71050p1184k0709n6979J8703O188p8034j5872
2522b42965M2373o8742k6717J01430L4236n2157k0219J07696K7303o0476J7063
2511a41175k0321M8411k0470N7580n868P7729Q1285M572o6779O8108M3423j31565
2499e070r4698k2148m962J0739j3687R0994J58443j09855k5066O5499n7690p593
$$ plain form
2487 -15094 -41596 -73218 -26811 -21051 -179343 -196232 -133413 103329 123588 51828 189825
2476 189825 -46056 -106916 25335 93773 23880 4021 108427 101913 149670 86690 188477
2465 188477 207828 202328 214183 394599 390204 320669 317578 147963 85567 109059 202703 267314
2453 267314 359106 419694 351630 242431 307765 324833 298826 343956 419986 287136 365566
2442 365566 268624 317287 277914 325111 468326 571603 649211 546600 463569 419715 490580
2431 490580 598979 465903 429495 377702 426513 633701 671347 787760 884436 795519 862501
2420 862501 866411 825735 782015 759645 847159 877368 1004631 1146350 1108875 1112529 1099755 1112439
2408 1112439 1133218 1175577 1051152 1029738 1265388 1265641 1324350 1269231 1271359 1248253 1279651 1146924
$$ packed form
2487a5094k6502l1622M6407N760j58292j6889O2819K36742K0259p1760J37997
2476A89825k35881o0860J32251O8438o9893j9859J04406o514M7757o2980J01787
2465A88477J9351n500J1855J80416m395o9535l091j69615o2396K3492R3644O4611
2453B67314R1792O0588o8064j09199O5334J7068k6007M5130P6030j32850P8430
2442C65566r6942M8663l9373M7197J43215J03277P7608j02611q3031m3854P0865
2431D90580J08399j33076l6408n1793M8811K07188L7646J16413R6676q8917O6982
2420H62501L910m0676m3720k2370Q7514L0209J27263J41719l7475L654j2774J2684
2408A112439K0779M2359j24425k1414K35650K53N8709n5119K128k3106L1398j32727
$$ plain form
2396 1146924 1156076 1238795 1316253 1368313 1422212 1575176 1684919 1837266 1972801 1986194 1944853
2385 1944853 2050209 1999999 2107918 2133085 2181246 2266120 2318093 2272940 2369626 2678669 2720385
2374 2720385 2673368 2844738 3020029 3110804 3144436 3224912 3455032 3451794 3507078 3537574 3883561
2363 3883561 4100366 4200043 4352389 4482638 4575129 4561866 4701059 4874917 5130205 5382109
2353 5382109 5684641 6107511 6402714 6735476 7055455 7459694 7889208 8451610 9202328 10174742
2343 10174742 11312434 12661091 13848129 14862314 15959581 17478095 19105558 21064019
2335 21064019 23644972 26817684 30423882 34902527 40661615 49064952 61498504 79676749
2327 79676749 99483898 110965945 108878438 100014117 91924202 84249491 75414638 65100530
$$ packed form
2396A146924R152Q2719P7458N2060N3899J52964J09743J52347J35535J3393m1341
2385A944853J05356n0210J07919K5167M8161Q4874N1973m5153R6686L09043M1716
2374B720385m7017J71370J75291R0775L3632Q0476K30120l238N5284L0496L45987
2363C883561K16805R9677J52346J30249R2491j3263J39193J73858K55288K51904
2353E382109L02532M22870K95203L32762L19979M04239M29514N62402P50718R72414
2343A0174742J137692J348657J187038J014185J097267J518514J627463J958461
2335B1064019K580953L172712L606198M478645N759088Q403337J2433552J8178245
2327G9676749J9807149J1482047k087507q864321q089915p674711q834853j0314108
$$ plain form
2319 65100530 55289824 46608240 39479633 33331124 28586874 25232265 22791633 20848434
2311 20848434 19177569 17470058 15948193 14502983 13221452 11990588 10781053 9816615
2303 9816615 8997282 8258115 7678106 7213052 6779667 6391000 6216330 5930579 5549024 5318593
2293 5318593 4868019 4488468 4157701 3852423 3645151 3610964 3502266 3219932 3067912 2926400
2283 2926400 2671157 2625536 2535942 2360307 2328790 2251934 2282908 2071969 1859580 1812504 1777651
2272 1777651 1746236 1849511 1790606 1677377 1553348 1609651 1550183 1404400 1406227 1316763 1310195
2261 1310195 1247271 1292635 1196613 1333735 1239999 1211338 1205750 1203481 1257771 1255264 1193939 1025059
2249 1025059 1040588 963221 807718 779060 782181 759099 749946 724201 875165 880950 809825 827264
$$ packed form
2319F5100530r810706q681584p128607o148509m744250l354609k440632j943199
2311B0848434j670865j707511j521865j445210j281531j230864j209535r64438
2303I816615q19333p39167n80009m65054m33385l88667j74670k85751l81555k30431
2293E318593m50574l79551l30767l05278k07272l4187j08698k82334j52020j41512
2283B926400k55243m5621q9594j75635l1517p6856L0974k10939k12389m7076l4853
2272A777651l1415J03275n8905j13229j24029N6303n9468j45783J827q9464o568
2261A310195o2924M5364r6022J37122r3736k8661n588k269N4290k507o1325j68880
2249A025059J5529p7367j55503k8658L121k3082r153k5745J50964N785p1125J7439
$$ plain form
2237 827264 848722 863708 734821 711283 593935 535979 660154 624196 537260 553188 690436
2226 690436 684042 639619 409454 408032 542479 684695 539263 508697 520520 471285 593551
2215 593551 573513 548427 509433 360417 424096 376745 330307 330289 432114 341928 347748 544511
2203 544511 440975 392949 312042 327584 241110 282526 317804 349289 260862 298051 116985
2192 116985 187562 259447 359376 408382 259254 306471 310294 317376 389963 425802 371503 304031
2180 304031 200510 115859 120426 133307 228317 247554 252549 225878 191900 287606 275326 61067
2168 61067 -3680 5073 48766 -22720 128118 179499 153527 153999 145438 154400 6531 -9682
2156 -9682 -123815 12117 23624 33956 49110 54062 67958 93522 163811 244954 136006 210531
$$ packed form
2237H27264K1458J4986j28887k3538j17348n7956J24175l5958q6936J5928J37248
2226F90436o394m4423k30165j422J34447J42216j45432l0566J1823m9235J22266
2215E93551k0038k5086l8994j49016O3679m7351m6438j8J01825r0186N820J96763
2203E44511j03536m8026q0907J5542q6474M1416L5278L1485q8427L7189j81066
2192A16985P0577P1885R9929M9006j49128M7217L823P082P2587L5839n4299o7472
2180C04031j03521q4651M567J2881R5010J9237M995k6671l3978R5706j2280k14259
2168F1067o4747Q753M3693p1486J50838N1381k5972M72q561Q962j47869j6213
2156i682j14133J35932J1507J0332J5154M952J3896K5564P0289Q1143j08948P4525
$$ plain form
2144 210531 153200 73676 55301 191437 234425 249548 152348 115033 192445 100432 113033
2133 113033 18011 45233 25190 -23647 -5204 207162 90558 14040 28865 15337 -64159
2122 -64159 84223 126383 116787 171509 135244 40040 -129661 -97844 39310 5619 93206
2111 93206 162392 144272 143513 156764 72720 -46263 14675 -29414 91621 247046 301846 252294
$$ packed form
2144B10531n7331p9524j8375J36136M2988J5123r7200l7315P7412r2013J2601
2133A13033r5022K7222k0043m8837J8443K12366j16604p6518J4825j3528p9496
2122f4159J48382M2160r596N4722l6265r5204j69701L1817J37154l3691Q7587
2111I3206O9186j8120p59J3251q4044j18983O0938m4089J21035J55425N4800m9552
$$ [...]
##END NTUPLES=NMR SPECTRUM
##END=
