##TITLE=1H_DE-80H_X3
 200.13MHz, d2o
 8 sc
 
 19ns.26.2.2025
##JCAMPDX= 6.0         $$ Bruker NMR JCAMP-DX V2.0
##DATA TYPE= NMR SPECTRUM
##DATA CLASS= NTUPLES
##ORIGIN= UXNMR, Bruker Analytische Messtechnik GmbH
##OWNER= pz
$$ XWIN-NMR		Version 3.5
$$ Mon Jun 22 10:46:03 2026 Russian Standard Time (UT+4h)  Yarkov@DPX200
##.OBSERVE FREQUENCY= 200.1313
##.OBSERVE NUCLEUS= ^1H
##.ACQUISITION MODE= SIMULTANEOUS
##.ACQUISITION SCHEME= undefined
##.AVERAGES= 8
##.DIGITISER RES= 18
##SPECTROMETER/DATA SYSTEM= spect
##.PULSE SEQUENCE= zg30
##.SOLVENT NAME= DMSO
##.SHIFT REFERENCE= (INTERNAL, DMSO, 0, 15.4957)
##AUDIT TRAIL= $$ (NUMBER, WHEN, WHO, WHERE, WHAT)
$$ ##TITLE= Audit trail, XWIN-NMR		Version 3.5
$$ ##JCAMPDX= 5.01
$$ ##ORIGIN= Bruker BioSpin GmbH
$$ ##OWNER= Yarkov
$$ C:/Bruker/XWIN-NMR/data/yarkov2/nmr/H-C/1/pdata/1/auditp.txt
$$ ##AUDIT TRAIL=  $$ (NUMBER, WHEN, WHO, WHERE, WHAT)
(   1,<2026-06-22 10:45:16.04 +0400>,<Yarkov>,<DPX200>,
      <created by zg, POWCHK disabled, PULCHK disabled
       configuration hash MD5:
       00 E9 B6 7A A2 85 ED C7 34 08 36 98 17 FE 4E 26
       data hash MD5: 16K
       53 F9 BE 7A F3 FC D5 9F 4B EF CD DD 35 7B 68 44>)
(   2,<2026-06-22 10:45:20.35 +0400>,<Yarkov>,<DPX200>,
      <Start of raw data processing
       efp BC_mod = 2 LB = 0.25 FT_mod = 6 PKNL = 1 PHC0 = -6900.419 PHC1 = 13.42196 SI = 16K 
       data hash MD5: 16K
       56 7F AB A4 E7 CD D1 A6 DE 71 FC D4 2C B8 ED B6>)
$$ ##END=
$$ 
$$ hash MD5
$$ C6 80 79 8F 9B 2C 7B 8D 03 40 B8 C1 1F 1C 43 73
##$RELAX= 
##$RELAX= 
##$RELAX= 
##$RELAX= 
##$RELAX= 
##$RELAX= 
$$ Bruker specific parameters
$$ --------------------------
##$DU= <C:/Bruker/XWIN-NMR>
##$EXPNO= 1
##$NAME= <H-C>
##$PROCNO= 1
##$TYPE= <nmr>
##$USER= <yarkov2>
##$AMP= (0..31)
100 100 100 100 100 100 100 100 100 100 100 100 100 100 100 100 100 100 
100 100 100 100 100 100 100 100 100 100 100 100 100 100 
##$AQSEQ= 0
##$AQ_mod= 1
##$AUNM= <au_zg>
##$AUTOPOS= <>
##$BF1= 200.13
##$BF2= 200.13
##$BF3= 200.13
##$BF4= 200.13
##$BF5= 200.13
##$BF6= 200.13
##$BF7= 200.13
##$BF8= 200.13
##$BYTORDA= 1
##$CFDGTYP= 0
##$CFRGTYP= 5
##$CHEMSTR= <none>
##$CNST= (0..31)
1 1 145 1 1 1 1 1 1 1 1 1 1 1 1 1 1 1 1 1 1 1 1 1 1 1 1 1 1 1 1 1 
##$CPDPRG= <>
##$CPDPRG1= <>
##$CPDPRG2= <>
##$CPDPRG3= <>
##$CPDPRG4= <mlev>
##$CPDPRG5= <mlev>
##$CPDPRG6= <mlev>
##$CPDPRG7= <mlev>
##$CPDPRG8= <mlev>
##$CPDPRGB= <>
##$CPDPRGT= <>
##$D= (0..31)
0 0.7 0 0 0 0 0 0 0 0 0 0.03 0 0 0 0 0 0 0 0 0 0 0 0 0 0 0 0 0 0 0 0 
##$DATE= 1782110715
##$DBL= (0..7)
120 120 120 120 120 120 120 120 
##$DBP= (0..7)
150 150 150 150 150 150 150 150 
##$DBP07= 0
##$DBPNAM0= <>
##$DBPNAM1= <>
##$DBPNAM2= <>
##$DBPNAM3= <>
##$DBPNAM4= <>
##$DBPNAM5= <>
##$DBPNAM6= <>
##$DBPNAM7= <>
##$DBPOAL= (0..7)
0.5 0.5 0.5 0.5 0.5 0.5 0.5 0.5 
##$DBPOFFS= (0..7)
0 0 0 0 0 0 0 0 
##$DE= 6
##$DECBNUC= <off>
##$DECIM= 32
##$DECNUC= <off>
##$DECSTAT= 4
##$DIGMOD= 1
##$DIGTYP= 9
##$DL= (0..7)
0 120 120 120 120 120 120 120 
##$DP= (0..7)
$$ [...]
##$SUBNAM2= <"">
##$SUBNAM3= <"">
##$SUBNAM4= <"">
##$SUBNAM5= <"">
##$SUBNAM6= <"">
##$SUBNAM7= <"">
##$SUBNAM8= <"">
##$SUBNAM9= <"">
##$SW= 18.0517328524113
##$SWIBOX= (0..15)
0 0 2 0 0 0 0 0 0 0 0 0 0 0 0 0 
##$SW_h= 3612.71676300578
##$TD= 16384
##$TD0= 1
##$TE= 0
##$TE2= 300
##$TE3= 300
##$TEG= 300
##$TL= (0..7)
0 120 120 120 120 120 120 120 
##$TP= (0..7)
150 150 150 150 150 150 150 150 
##$TP07= 0
##$TPNAME0= <>
##$TPNAME1= <>
##$TPNAME2= <>
##$TPNAME3= <>
##$TPNAME4= <>
##$TPNAME5= <>
##$TPNAME6= <>
##$TPNAME7= <>
##$TPOAL= (0..7)
0.5 0.5 0.5 0.5 0.5 0.5 0.5 0.5 
##$TPOFFS= (0..7)
0 0 0 0 0 0 0 0 
##$TUNHIN= 0
##$TUNHOUT= 0
##$TUNXOUT= 0
##$USERA1= <user>
##$USERA2= <user>
##$USERA3= <user>
##$USERA4= <user>
##$USERA5= <user>
##$V9= 5
##$VALIST= <valist>
##$VCLIST= <CCCCCCCCCCCCCCC>
##$VD= 0
##$VDLIST= <DDDDDDDDDDDDDDD>
##$VPLIST= <PPPPPPPPPPPPPPP>
##$VTLIST= <TTTTTTTTTTTTTTT>
##$WBST= 1024
##$WBSW= 4
##$XGAIN= (0..3)
0 0 0 0 
##$XL= 0
##$YL= 0
##$YMAX_a= 54073
##$YMIN_a= -105650
##$ZGOPTNS= <>
##$ZL1= 120
##$ZL2= 120
##$ZL3= 120
##$ZL4= 120
##$ABSF1= 0
##$ABSF2= 0
##$ABSG= 0
##$ABSL= 0
##$ALPHA= 0
##$AQORDER= 0
##$ASSFAC= 0
##$ASSFACI= 0
##$ASSFACX= 0
##$ASSWID= 0
##$AUNMP= <proc_1d>
##$AZFE= 0.1
##$AZFW= 0.1
##$BCFW= 0
##$BC_mod= 2
##$BYTORDP= 0
##$COROFFS= 0
##$CY= -3
##$DATMOD= 1
##$DC= 0
##$DFILT= <>
##$DTYPP= 0
##$F1P= 0
##$F2P= 0
##$FCOR= 1
##$FTSIZE= 16384
##$FT_mod= 6
##$GAMMA= 0
##$GB= 0
##$INTBC= 1
##$INTSCL= 3.241238e-09
##$ISEN= 128
##$LB= 0.25
##$LEV0= 0
##$LPBIN= 0
##$MAXI= 10000
##$MC2= 0
##$MEAN= 0
##$ME_mod= 0
##$MI= 1.114404
##$NCOEF= 0
##$NC_proc= -10
##$NLEV= 6
##$NOISF1= 3.799351
##$NOISF2= 2.8
##$NSP= 0
##$NTH_PI= 0
##$NZP= 0
##$OFFSET= 15.49568
##$PC= 1
##$PHC0= -6900.419
##$PHC1= 13.42196
##$PH_mod= 1
##$PKNL= yes
##$PPARMOD= 0
##$PSCAL= 0
##$PSIGN= 0
##$REVERSE= no
##$SF= 200.130005207613
##$SI= 16384
##$SIGF1= 3
##$SIGF2= 2
##$SINO= 0.751879
##$SIOLD= 32768
##$SREGLST= <19F.Aceton>
##$SSB= 0
##$STSI= 16384
##$STSR= 0
##$SW_p= 3612.71676300578
##$SYMM= 0
##$S_DEV= 0
##$TDeff= 16384
##$TDoff= 0
##$TI= <>
##$TILT= no
##$TM1= 0
##$TM2= 0
##$TOPLEV= 0
##$USERP1= <user>
##$USERP2= <user>
##$USERP3= <user>
##$USERP4= <user>
##$USERP5= <user>
##$WDW= 1
##$XDIM= 16384
##$YMAX_p= 425577475
##$YMIN_p= -4005117
$$ End of Bruker specific parameters
$$ ---------------------------------
##NTUPLES= NMR SPECTRUM
##VAR_NAME=  FREQUENCY,     SPECTRUM/REAL,   SPECTRUM/IMAG
##SYMBOL=    X,             R,               I
##VAR_TYPE=  INDEPENDENT,   DEPENDENT,       DEPENDENT
##VAR_FORM=  AFFN,          ASDF,            ASDF
##VAR_DIM=   16384,         16384,           16384
##UNITS=     HZ,            ARBITRARY UNITS, ARBITRARY UNITS
##FACTOR=    0.220516191357247, 1,           1
##FIRST=     3101.15049014603, 0,            0
##LAST=      -511.566272859745, 0,           0
##MIN=       -511.566272859745, -4005117,    0
##MAX=       3101.15049014603, 425577475,    0
$$ Real data points
##PAGE= N=1
##DATA TABLE= (X++(R..R)), XYDATA
$$ [...]
8212 6699297 8772822 11178256 10127946 8368970 8485731 10537667 11645177 10274986
8204 10274986 9545769 7582698 8500366 9846358 10014390 10602539 9782888 10760918 12027157
8195 12027157 13197530 13547359 13443363 16285697 18499402 17537283 16057044 16535635 17638613
8186 17638613 17415775 15864886 15362364 15426075 15435352 16620530 16494753 16470360 15342639 15403530
8176 15403530 14581204 13881659 12612051 12040135 12862152 12053992 11318704 11015488 10920416
8167 10920416 11078061 11122224 10814647 10640646 10045896 10508633 10699048 9419242 9048812
8158 9048812 8315600 8501857 9034963 8588805 8947940 9710853 10606128 9293640 9631969
8149 9631969 9425827 10048200 10651149 9746736 9829687 8410896 9185407 10068803 9920233 8865750
8139 8865750 8235347 9409958 10198117 10128433 8867261 8589117 7565732 8356604 8113560
8130 8113560 7226492 6946618 6500035 8444352 8662791 7624802 6729224 7332191 8772989
8121 8772989 9440229 8412873 6328051 6442480 7184345 8106854 7776409 5553136 5868580
8112 5868580 6739232 6794825 6956106 6297993 6053046 7077656 6590256 6626930 5741488 5615731
8102 5615731 7061937 6480566 5948853 5639048 5867662 6510592 6564719 6501066 5554289 5280508
8092 5280508 5948498 6186104 6090272 5258600 5642144 6558732 7416887 6929097 5723825 5627816
8082 5627816 6422968 6597684 5586579 4750716 4862884 5234064 5149555 5336610 4650035 4949084
8072 4949084 6008676 6459227 7049016 7345276 8345571 8292632 8140810 8452171 7310651
8063 7310651 8245013 8024026 7334122 7726120 7303074 8173747 8757318 8074438 7511953 7913151
8053 7913151 7977986 8285555 7299980 6404014 6276453 6189781 6515989 5569975 4324718 4021297
8043 4021297 4816633 6126174 6536659 5667529 4865249 6059146 6641544 6521605 4874867
8034 4874867 4301495 5799377 5360692 5177885 4096040 3008255 4044519 4734462 5754180
8025 5754180 5495845 4462530 4581776 4819228 4969484 5134945 4162818 4064952 4192002 3694626
8015 3694626 3866086 3519753 3888631 3909923 4503012 4847331 5069559 5321066 5561810 5438007
8005 5438007 4674341 5053203 5592801 5104091 4714736 3763056 3956060 4526760 4278197 4719595
7995 4719595 4254721 3847404 4681772 4845355 5546573 4798519 4892072 6306195 6012667 5617450
7985 5617450 5416271 5132184 6325103 7697816 7356422 7572005 7534090 8149123 8978151
7976 8978151 9576666 9921557 10592008 11674966 12272412 12846760 14082644 16713200 18215732
7967 18215732 19044261 19721644 19382034 20579017 20788172 19983989 19045055 17678832 17460033
7958 17460033 17464101 16817341 15673654 13615925 12323189 13080147 12429709 11397740 9713417
7949 9713417 9006004 9839370 9254926 8536325 6582244 6090802 6675478 6863981 6883760 5740297
7939 5740297 5820265 6618888 7472302 6778479 5522641 5588461 5588811 6487267 5718784 4598279
7929 4598279 4046465 4113293 4917445 5224860 4762627 4490966 5442424 5520278 5734343 4487357
7919 4487357 4667089 4802186 4974644 4981562 3488350 3577572 4005825 4959634 4744084 4430910
7909 4430910 4613176 5172470 5919842 6093453 5158054 4625812 4609997 4025896 4096875 5124487
7899 5124487 4853951 5412922 5072668 4654301 5160813 5236399 5091475 4676769 4667535 4480882
7889 4480882 5178455 4748833 4684942 4441037 4124075 5998286 5628615 5696647 5527923 5382810
7879 5382810 6155489 5408485 4758575 4240902 4586325 4907305 4939264 4276619 4133088 3478532
7869 3478532 4254154 5693502 5428178 5179209 5134775 5477652 5677096 5396746 4501357 4750466
7859 4750466 5351470 5074784 4781172 3704266 4499076 5527767 5765815 5382115 4180685
7850 4180685 4722089 5278393 5672542 5977454 5921552 5799368 6783462 7632944 7793928 7635525
7840 7635525 7527974 8690318 8682793 9050734 8737218 8512433 9578211 9749279 10336009 9702324
7830 9702324 9955688 11134004 10804567 10150714 8225533 7952542 7900425 7660716 7037781
7821 7037781 5721402 4773131 3611219 4354116 5302331 5354919 5577768 5099939 5053113 5425392
7811 5425392 5563701 4541066 3038571 545194 2111957 3769311 2895749 3185776 3133224
7802 3133224 3520849 3913068 4651283 5302807 4760617 4987714 5789641 6101995 5853579 4746652
7792 4746652 3738857 3325181 3366701 3588432 4091200 3225770 3378478 4305137 5100487 6143711
7782 6143711 5233413 4760469 4841427 5127378 5259717 4750006 4347541 4604248 4812243 4781718
7772 4781718 5659975 4609383 5550907 5212821 4746897 4599994 3757311 4103357 3718680
7763 3718680 3898950 3425803 2540611 3381758 4897512 5490308 4845871 5217673 4523273
7754 4523273 5056170 4637800 4329831 4772612 4013163 4516164 4025351 4373928 4707531 5878472
7744 5878472 6675757 7751261 7467003 7035057 8008178 7171513 7584268 5760679 4033509
7735 4033509 3041892 3139738 3927831 3849739 3458769 2424578 4428065 5363776 6375331
7726 6375331 5753657 5345857 6342450 6115676 6308076 4652387 4000224 4609151 5178325
7717 5178325 5100802 5649307 6344627 7062538 9002973 8525641 7824013 7036432 6825066 7338768
7707 7338768 6701994 5957673 4654096 5198273 5202227 5946712 5861851 5177612 6356559 6548259
7697 6548259 6689463 5431506 5766500 6276011 6574233 6848437 5670346 6205990 6684726
7688 6684726 7898809 8831829 9602842 9562865 9677989 10533569 9746113 9926305 9357394 9315063
7678 9315063 9122303 9038685 8736043 8994422 10009722 10290841 10534257 10472623 11023187 11020833
7668 11020833 10276801 9214516 8057650 7600077 7235266 7251927 6413713 5863358 6366863
7659 6366863 7082832 7310270 7051410 7375102 7828236 8701528 8108702 7124353 6159883 5751254
7649 5751254 5528996 5298035 4605712 4106555 4829889 6088079 6351675 6379084 6105134 6835093
7639 6835093 8096137 7815327 6874902 6100799 6938384 6452651 5463984 4671248 5048132
7630 5048132 5217616 5345332 5511683 5019589 5746788 6283270 6988248 6372660 5494427 6564942
7620 6564942 6063855 6706230 6160192 5729860 6425801 7644293 7760052 7852493 7986083 8074805
7610 8074805 9360712 8814306 8210778 7356607 7088043 8854755 9384618 8326343 7728396
7601 7728396 7464659 7948063 9350393 8591910 7495740 6557839 6166334 6908222 5898494
7592 5898494 4785009 4216402 4229945 4612251 5041581 5159669 4991144 5637706 4757470 4782096
7582 4782096 4793584 5450452 6373515 5018465 4323364 3548365 4413235 4215271 3928734 2834359
7572 2834359 3455216 4078216 4255477 4476292 2805195 3504921 4279554 5075090 4449431
7563 4449431 3037586 3434593 3782863 4022656 3711273 3208542 2164239 3499282 4148499
7554 4148499 3895691 3221802 3204473 4173995 4254324 3900127 3574320 3424243 4069948 3617671
7544 3617671 3277002 2563062 2909267 3002294 3121592 2944295 2167808 2736338 3384348 3662227
7534 3662227 2712403 2308319 2779074 3282938 3624913 3291976 3123502 3373505 3547838 2935842
7524 2935842 2471884 2372252 2242723 2805846 3100283 1923177 1306937 2457303 3451586
7515 3451586 4077417 3018799 2340663 2241290 5290706 6063294 5235645 3700472 3009449
7506 3009449 4007166 4042527 3734960 2480253 2451099 2845572 4145755 4138777 3796140 4392324
7496 4392324 5112694 5414956 4546051 3536296 3008162 3828283 4928995 4495985 3731331
7487 3731331 3064908 4002587 5479394 5203450 4607500 4597310 4790269 5856226 6069121
7478 6069121 4870658 5252015 4697675 5233922 5487888 4455309 4245260 4270634 4222747 4480312
7468 4480312 3994605 3920442 4857863 5666581 5932268 5510538 4021890 5102357 6114960
7459 6114960 6189762 5209494 4050694 4241842 4230810 4386545 3841661 3283445 3316289 4685036
7449 4685036 4136946 2871203 2896346 2935767 4925462 5311253 4468888 3509682 3311368 4499509
7439 4499509 4403551 3065068 1627439 1877083 2796309 4305249 3475685 2439729 2615832
7430 2615832 2453649 3773261 3287980 2703925 3283916 3640085 4679147 3847172 3494230
7421 3494230 3168509 4442424 4963261 4353912 3374293 2669469 3765080 3922535 4480925
7412 4480925 3455460 3903524 4520637 4966518 4605548 4740020 5007591 4384081 5402339
7403 5402339 4351812 4469441 4648429 4893932 5361048 4252951 3934202 3914019 5500376
7394 5500376 6416473 6134748 5031237 5153823 6994639 6942674 7370075 5550961 6458208
7385 6458208 6786334 6868153 6197742 5323902 5462441 6080726 7570560 6141853 6018745
7376 6018745 5619570 6754288 8350816 7116096 6279606 5635247 6486883 7062178 6950769
7367 6950769 6554246 5746837 6189025 6654580 7386309 6483671 6303369 6073044 6940190 6883473
7357 6883473 6477994 6829780 6700934 8227007 7846298 8179296 7425553 7312607 8436495
7348 8436495 8113221 9471234 8360571 9107470 10201918 11371872 12403925 13136623 13581919
7339 13581919 12543792 12477687 12267482 12259402 10893125 10113725 8446816 7757516 8685684
7330 8685684 9098023 8804681 7180169 7060856 7398516 8663940 9497206 9368882 10791407
7321 10791407 9998836 11509392 11476886 11088279 12885445 13411592 15218046 16562340 17737376
7312 17737376 19931155 23728629 28218220 34587061 41736892 51796784 65892602 79359623
7304 79359623 89320356 90503768 85376493 78209352 69255129 59752841 50378058 42587143
7296 42587143 36251868 31062861 26663624 23676680 21484050 19535927 17675003 14329206
7288 14329206 13514893 13394970 13240973 13915083 13152422 12993088 13321924 14086231 14662333
7279 14662333 14901745 14164004 13993225 14772704 14106533 13107124 11989172 12287105 11845976
7270 11845976 11922919 12028728 11398582 12368828 12906626 14302136 14250930 14013928 14301922 14999009
7260 14999009 16447381 17691649 18873342 18793075 18290370 17877945 16461688 16275487 15025005
7251 15025005 14103795 12980731 11620624 10426558 10213791 9702473 9205924 8033031 6075403
7242 6075403 7353830 6641712 6363063 5551863 5451546 7287140 7153259 7056786 5336713
7233 5336713 6543288 6553949 6492969 5663259 3596959 3687688 4518178 5722905 4194495
7224 4194495 3544862 3031092 4449231 5854526 5614417 4463082 3767529 5076127 5194657
7215 5194657 5442963 4071357 3458900 4818009 4651089 5089792 3522404 4662508 4727664
7206 4727664 5960154 5554625 4289452 4710429 4856666 6438875 5700179 4564603 3412089
7197 3412089 4310459 4883291 5269889 5475746 4875524 5858527 5536592 5832822 5836768 5596639
7187 5596639 6167042 6074986 6059364 5720194 6955663 6018044 6698163 6816171 7329959 8063855
7177 8063855 7585270 8435521 7503171 8579610 9875228 9812737 9179715 8316316 9449205
7168 9449205 10408021 10882692 9655809 9195201 9213090 10659369 10731806 9162736 8004578
7159 8004578 6919666 8260535 8012553 7513356 6402833 5911803 6178560 5985569 6183777
7150 6183777 5102706 5884000 6706311 6683270 6054943 4799366 5895799 6775949 6931867
7141 6931867 5239386 4956809 5152086 6300523 5999860 5200264 5066637 5039440 6747618
7132 6747618 5925606 5657270 4971142 5366758 6451649 5866959 5976322 5104050 5762141
7123 5762141 6369198 6830986 6324711 5418818 5587682 6471648 7705365 8123323 8011904
7114 8011904 7410310 8925902 10312765 11020542 11255103 11795179 12556804 12823318 14885622
7105 14885622 15701994 16227174 15842773 15404615 16103493 15317918 15110470 13549523 12028440
7096 12028440 11715714 11874842 12007160 11665953 10775118 10029964 10564363 10887741 10908992 9394035
7086 9394035 8847419 9460897 10959542 12374376 10943460 10147354 10257653 11392821 11334562
7077 11334562 10309222 8461218 7218845 7866476 7524324 7387085 6122063 5708171 6426672
7068 6426672 7227936 8050871 7485833 6445348 6524584 7753385 7968759 7740445 6907489
7059 6907489 7009028 8293946 9112687 10284469 9399185 9823781 10700058 11025939 10626024
7050 10626024 8590793 7598475 7178986 7750374 6929563 6196451 5205712 5649171 5481713
7041 5481713 5271020 4691917 3923499 4769580 5718529 6233498 4990490 4366438 4317907 6306428
7031 6306428 6606337 4473027 4167440 3663972 5514714 5640247 5107118 4808566 4544394
7022 4544394 5854893 6357999 6318204 5704611 5463341 5384762 6225567 5765229 5116278 4736067
7012 4736067 4852118 6139191 5883288 5437196 4770146 4901298 6003767 6270443 5670974
7003 5670974 5017754 5409441 5834984 7071340 6113445 5721607 6088533 6697237 7166872
6994 7166872 7082093 7188741 7411540 7944719 8106030 9182685 9238355 9831202 10113489 10196864
6984 10196864 11022916 10328452 11208783 11781051 12622443 13128571 12944077 12714038 13438274
6975 13438274 16156548 18513283 21362217 23094245 26238732 29319974 32571917 36302766
6967 36302766 37831930 39652001 40496847 40050589 37333722 32904296 29100561 26909762
6959 26909762 24500870 21043881 18743656 15150031 15129937 15699732 16207489 15202940 13410004
6950 13410004 13381648 13976309 15328225 14257320 13107858 11731207 12478619 13038027 13850666
6941 13850666 14197618 13450594 15349503 15969440 16920598 15956915 14216854 13872450 13218461
6932 13218461 12135408 10243887 9581990 8277450 8823250 8693685 7819853 7846701 7329478
6923 7329478 8966315 8746379 7083050 6005687 5519196 5502932 5993463 5431042 4907750
6914 4907750 5782227 5427023 6226848 5376785 5740571 6876387 7003942 6222887 5217199
6905 5217199 4788857 5027466 5151280 4718156 3730561 3653278 3590778 4456719 5382435 5606590
6895 5606590 5608909 6499421 6544556 5902890 4644387 4197063 4848105 4189543 3947870 1896050
6885 1896050 2129477 3708683 5420773 5441762 4365695 4871559 5748932 6754467 5819499
6876 5819499 4698018 4594959 4691045 4862558 3297156 3151578 4082286 4746582 4834812 4616229
6866 4616229 4646357 6057761 7184347 6644057 5489765 3574553 3794413 4224744 4177589
6857 4177589 3709878 3319053 4135522 4717488 5111619 4691765 4846330 5250612 6060868 4853305
6847 4853305 3042861 3272002 3700407 4254098 3905950 2635693 3004990 4644948 5651451
6838 5651451 5735980 4503763 4344313 6186116 5674057 5162813 3283245 1819839 3356242
6829 3356242 3485670 3219145 2511162 2245334 3583577 4866366 4219632 3173852 3401479
6820 3401479 4248270 5212639 4367959 2680472 1660809 2208771 3189381 3430941 3090311
6811 3090311 2892967 3891223 4198225 4898108 3522383 3571117 4954112 4308049 3346760
6802 3346760 2071676 2992071 3272810 3353343 2988799 2008392 2348743 3787699 4361613
6793 4361613 3322432 3289590 3264613 4231730 4063933 2165137 2365514 2646988 3779525
6784 3779525 3857638 3128301 2443514 3453325 4413307 4689032 4185447 3018878 3480299
6775 3480299 3360181 3376813 3287163 3127554 3104737 2791681 2426390 2569023 3266249 4303264
6765 4303264 4657452 3688707 2839366 2759637 3404942 4299733 2582871 1927507 1497088 2251876
6755 2251876 3461749 2720852 2326802 2258760 3178542 4156103 4432939 3603623 3827785 4082815
6745 4082815 4189797 3700104 2942646 3579936 3559763 4448064 4592492 4012515 3444034 4340002
6735 4340002 5418432 5253437 5114993 4627491 4556006 5278688 6077605 5653133 5837076 5762878
6725 5762878 5186904 6256441 6381147 6753105 6614507 5894056 5313384 5126567 5140050 4925142
6715 4925142 4939914 5269062 6076498 5524962 5686182 5932511 5336484 5641937 5144550 4489385
6705 4489385 3978052 4310757 4590769 4771689 4029487 4262642 5243775 6277943 7245013
6696 7245013 6730167 6606693 6746687 6343521 5605729 5191907 4334785 4358670 4674026 4368760
6686 4368760 4866385 3748711 4737658 5878544 5756211 6032772 3976395 4381127 4787466
6677 4787466 4617537 4162886 3896884 3202953 3688838 3774762 3419558 4153383 4256777 4991579
6667 4991579 4661073 4084461 4459558 4751370 4398477 3717698 2661724 2805238 4015436
6658 4015436 3180956 3328329 3312302 3214855 4751009 4836259 4961843 4307131 4098266 4440077
6648 4440077 4148575 3187686 2513968 2861939 3582641 4825480 3680396 3683317 3875837 3700716
6638 3700716 3858899 3117532 3649770 3577507 2896119 2766197 2567164 3214733 3941905 4154355
6628 4154355 3473601 3413240 4331497 6091635 6402680 4864813 4258646 4012415 4948639
6619 4948639 5457977 3772869 2288456 2893722 3931003 4461236 4184515 3321902 4255663
6610 4255663 5623889 6242553 5367899 3887949 3742808 3957368 4540705 3401089 2492835
6601 2492835 2833162 4031497 4842870 4072664 4083612 4034706 4670203 4324195 3760637 3444816
6591 3444816 3538278 3896248 3315888 2877440 2809522 3603962 4385132 3679348 3658555 3735528
6581 3735528 4405319 5383559 4154443 3033664 3381507 3671789 4140816 3565311 2270162
6572 2270162 3567306 4353512 4613958 4241573 3032948 3112303 3792883 3864662 3236893 2564970
6562 2564970 1941404 3310744 3489091 3815046 3821199 3008744 4057209 4055872 4040713 3557114
6552 3557114 3349337 3324113 3356425 1959481 2481103 3575636 4328918 4607053 3461698
6543 3461698 3053877 3819469 5158769 5095830 3273539 2935154 3787476 4251573 3815503
6534 3815503 2779699 1499569 2644668 3736097 4036698 4245162 3786981 4546629 5541641
6525 5541641 4543299 4175913 3092961 2840871 3521130 3114697 2608735 2542178 2269154 3585191
6515 3585191 4772014 4413940 5711721 5567999 5809146 5471066 3804913 3866995 4080690
6506 4080690 3153952 2503198 1937718 1924876 3271706 4116985 4471950 5361570 5588255 6864502
6496 6864502 6366417 5950276 5328190 4199033 3723883 3284888 2124627 2232298 2935049
6487 2935049 3141924 3595488 4164034 5096078 5648919 6445465 7009450 5812668 5551898
6478 5551898 4993115 4377290 3419287 2783383 2594568 2840649 3452548 3410805 3696546 4860347
6468 4860347 6417856 6683475 5747927 5066511 4875202 5116687 4806965 3885979 2463311
6459 2463311 2249416 3034351 3808082 4162041 4503070 5286043 4780546 4794328 4769373 5446924
6449 5446924 5314921 4162063 3561925 3312800 4137972 4277446 4157539 3893972 3688492
6440 3688492 4949442 4813140 4089527 3666095 4195038 4513290 5127161 4261132 2883619
6431 2883619 3609408 4998868 6018093 5485997 4552970 4489610 5442844 6204991 5741228
6422 5741228 4567337 3883697 4857237 5605133 5308566 4216617 3932771 5028696 5445679
6413 5445679 5722428 5860577 5611790 6930068 6812158 5743222 5502012 4540413 5113225
6404 5113225 5799521 4974661 4654334 4844328 5591641 6521960 5670028 4512755 5108423
6395 5108423 5811251 6453403 6071639 5425548 5413209 6204547 6125796 5820531 4872835 4771215
6385 4771215 5599120 6343136 6677705 5473150 4917106 5328515 5911910 5981117 5863104 4425313
6375 4425313 5010798 6103267 6574892 6842280 5824987 5606495 5875749 5393999 6047583
6366 6047583 6499679 5654779 5554168 5245298 5381543 6197096 6857307 7042807 6669165 7033725
6356 7033725 7140206 6906748 5852007 6156764 6426776 6405842 6269846 5349977 5322774 6074875
6346 6074875 6542873 6962765 7058926 7091700 7912016 8202033 8158980 7783341 7489611 7662315
6336 7662315 6688148 6977561 6980476 6846807 7857059 8487320 8714254 8468098 8937749 9651858
6326 9651858 10430280 10272618 9303028 8769151 8640819 9715450 10284186 9859535 9623929
6317 9623929 9998583 10842467 11854975 11959988 11087598 10645687 10711778 11991237 12309738
6308 12309738 11232479 11017531 11538388 12275558 13018092 12801641 12441279 13130100 14500995
6299 14500995 14942425 14748137 13627534 14164674 15383460 16197116 15480839 14543825 14294595
6290 14294595 15668021 17873063 17776044 17566777 16918658 18213239 18738925 19070923 18969907
6281 18969907 18384220 19697768 20556729 21198063 20988720 21342385 22006171 24024804 25311642
6272 25311642 25213273 24375275 24262884 25754407 25936463 25235202 24609373 24998487 26279243
6263 26279243 27109370 27201659 27101151 28433997 29810408 31096168 30780716 31693348 33313021
6254 33313021 32924513 34579255 35479537 37188677 39832089 43733908 48844184 54102192
6246 54102192 58863469 63132316 66761087 67344352 67548362 65584585 62919419 59876800
6238 59876800 56383442 54419947 52188411 50570428 49231259 48037310 48263959 49457345
6230 49457345 49518129 49554985 49833173 49647906 52158507 52953812 54941278 56352103 58135678
6221 58135678 62507149 67292710 72631572 78234055 88253853 100820845 116233669 130482179
6213 130482179 142908922 152960910 158295708 158847813 153524944 145147906 135947722 126749420
6205 126749420 119122843 111788560 105045985 99457325 95991090 92499719 89561936 85606827
6197 85606827 82675421 81304914 79963042 79516367 78766498 79274976 80984863 84362129 88729360
6188 88729360 93001837 98768858 107518711 118090017 131109888 146398345 164266289 183920514
6180 183920514 202021681 214925753 222266674 224782757 220947561 212494311 202557356 191687598
6172 191687598 182160428 175167153 169043178 162912747 155997178 148056371 139724518 131876363
6164 131876363 125387718 119349912 113742409 109004732 105106353 103862658 103568986 104720868
6156 104720868 105265960 106823290 110877156 116375105 123260322 131943737 142536757 154899078
6148 154899078 169629603 183658801 196229340 203677389 206782573 205615825 201350736 196679753
6140 196679753 191454103 189519967 188725071 187202522 182728407 174858647 166378307 157901228
6132 157901228 148897279 139109864 129618775 121306679 116015115 112537743 108726389 106267355
6124 106267355 103066484 103156794 104666581 106289715 108061417 110350312 114962383 122003616
6116 122003616 129924004 135172301 141802223 145177428 147362827 147091270 143870036 141669869
6108 141669869 140006038 141231597 142912005 142711779 140700774 137439885 133377524 127970290
6100 127970290 121487324 113742239 107611900 101900576 98047702 95328111 91292041 89096575
6092 89096575 87367800 87633299 87737932 87497907 86983147 88915195 91614807 94500491 98542018
6083 98542018 100225308 102873328 102169805 101124323 99163412 96259813 93335255 90855337
6075 90855337 89542251 89067689 87959292 85550833 82656706 79445628 77124306 75351410
6067 75351410 72076620 69054186 66337230 65455116 64566562 64052889 62981988 61383541 61946204
6058 61946204 61155964 61364925 59591658 58892281 58969875 59491670 59936914 58296088 58274838
6049 58274838 58021534 58304319 56770888 54280300 52452454 51761988 51778088 50478281 48605742
6040 48605742 46511952 45322393 44542693 44511586 42827855 40408500 39855885 40095205 39972129
6031 39972129 37963412 36714602 36422426 36471231 36913664 36082163 34466140 33241275 34494659
6022 34494659 35632217 35817674 34137601 32922323 32869827 34111496 34757012 33380204 32043602
6013 32043602 32244012 33670020 34607972 34000536 32866027 31830604 33060030 33978471 33288599
6004 33288599 31206649 30213271 30905403 31278844 31563716 29419018 28271459 29284056 29739700
5995 29739700 30389445 29635133 28713416 29030985 30565207 31712785 31598711 30526542 30295116
5986 30295116 31019123 32617101 33172515 32758197 33237095 34221368 35795474 35944737 36417822
5977 36417822 36101162 35332624 36014717 35702782 34753644 33697534 33338692 34461734 34177201
5968 34177201 34262318 33942375 33299566 34134580 35100675 36047053 36429859 35649408 36362615 38019228
5958 38019228 40420208 43429479 45126936 46475384 50076501 54044995 57687387 59218140
5950 59218140 59748561 60230867 60624260 61931584 61668700 61018945 60560919 62029441 63849139
5941 63849139 64375284 64142124 62937026 62603560 61736309 60076362 57107632 55155701 55292914
5932 55292914 55288252 55745401 56012828 57372123 60404049 64857528 68930905 71431903 73729202
5923 73729202 76329139 79982592 82149389 85620641 90344366 96533042 104911990 114737658
5915 114737658 125585709 135456328 146104265 152633971 155021940 153684252 149229118 145757406
5907 145757406 141119316 138214277 136231300 136298835 137938187 139393833 140816217 138796109
5899 138796109 133005867 124833711 116260494 107369894 99116219 89471159 81111785 74372817
5891 74372817 68495018 63884590 58989163 55083486 51157961 48791199 47135630 45930357
5883 45930357 44364230 42479925 43143831 43411876 43962514 43146935 41768991 42127152 42615545
5874 42615545 44008567 44162153 43826614 43884210 44917007 45629550 46325726 45790393 44478152
5865 44478152 44755102 44421831 45405820 44181279 44134391 43463354 42692471 42909430 41045861
5856 41045861 39356323 37465125 37086164 36569000 34146953 31562076 30236937 29751566 29537621
5847 29537621 29029788 27093964 25738531 25582820 25324847 25053195 24014652 23268516 23254776
5838 23254776 23363442 22303932 22550377 22598042 22823453 23007248 22041818 21962612 20841775
5829 20841775 20982258 21466328 20735797 20226110 20034206 19545220 19574639 19885415 19643964 19348486
5819 19348486 18617773 18740813 19152567 19288439 18768614 19133936 19428973 19228716 19098007
5810 19098007 18404251 18690356 18923707 18908470 18627870 17474659 18567346 19130763 18748458
5801 18748458 18238645 17583040 17405862 17786787 17666600 17868827 16852621 15875254 16100810
5792 16100810 16037649 16660288 15820403 15965975 15544530 16008426 16260249 16486061 16885578 17084911
5782 17084911 17764686 16939157 16981068 16069832 16092447 16914012 17157164 17243445 16905554 17113822
5772 17113822 17121528 19058340 19252831 19808392 19366421 20188145 22371743 23256534 24283435
5763 24283435 24176477 25768582 27588085 30239414 34279322 37157584 40903650 47542378
5755 47542378 58120328 70756712 87252656 105795347 124907553 136952289 136807110
5748 136807110 128955990 115984532 103389771 89437993 76778746 64655231 54463347
5741 54463347 46962324 41235685 38767600 35072236 31291869 26927740 25457734 26118592
5733 26118592 24280963 22857798 20535866 20048035 20350369 20560137 19915383 18887699 17843836
5724 17843836 18075414 18579368 17578190 16716802 15797523 16723124 16132986 15080883 13601319
5715 13601319 13139470 14865489 15196498 15496823 14582079 14746689 15310678 16438385 17226640
5706 17226640 16929645 16020056 15849603 16838060 16230341 15996584 16020187 15534342 15711281 15322289
5696 15322289 15037419 14681892 15127933 14695425 14599441 14383689 14624022 15046735 14527801 15296189
5686 15296189 14630523 14632887 14665697 14143261 14958808 14908391 15261378 15419879 15391720 16922874
5676 16922874 18323431 18311918 18120844 18225610 17681240 17750722 17152031 16041770 14572328
5667 14572328 13956549 13645716 13718932 12528563 11738779 11429100 12149146 13000833 11813209
5658 11813209 10225217 10551850 11020506 11963819 11138272 9995398 10004351 10398039 11358817
5649 11358817 11077737 9836938 9420502 9907332 10024091 10299972 9742566 9822029 10266242
5640 10266242 11198773 11379369 11176108 11647336 12056722 12714545 13478107 13709659 14015866
5631 14015866 14883956 15538453 16157397 15561920 15149327 15135121 15769036 15039474 14391425 13016146
5621 13016146 12259598 12952757 12146022 11919651 11665186 11519172 11344414 10648247 10862018
5612 10862018 11985706 11328816 10446967 9709638 9548577 9801931 9512876 9684021 8381639
5603 8381639 8519861 10163447 10149142 10396044 9052910 9199802 9901034 10322311 9675103
5594 9675103 8195256 8060486 8847438 9691705 9592475 9236944 9657827 9887941 10936422
5585 10936422 11709680 11577063 11317242 11951548 12408438 13050305 11932093 11796085 12308369
5576 12308369 12737389 13812881 13596700 14321607 14677000 15901014 16703835 15854979 15079002
5567 15079002 14773915 13845010 13009552 11881266 10414347 10452328 9895199 9783121 9299539
5558 9299539 8591600 10050004 10892715 11611340 11524295 10450794 10071151 10458040 11016030
5549 11016030 11079196 11081765 9214806 9469015 9667225 9385765 9408037 8255284 9584947 10193043
5539 10193043 10543040 10946343 10886389 10511918 11028638 10147939 9923812 8632476 7372967
5530 7372967 8816454 8390170 8930471 8705376 8151432 8727537 9006845 9449433 8924061
5521 8924061 9377054 8983009 9506291 9154432 8494114 8819936 8119729 8347466 7935951 8127415
5511 8127415 8534559 8355618 8580137 9451707 9012170 8751444 9328804 8877712 9328696 8436436
5501 8436436 7994417 8234166 8127276 8832058 7742576 7117067 7105326 7703502 9045202
5492 9045202 9418888 9307119 8532262 8793152 8979591 9046335 7985479 7338820 6956805 7391852
5482 7391852 7906414 8143555 7998656 7647874 8480661 9352940 9961479 9569257 9131283 9262164
5472 9262164 9116736 10134885 8843512 7485570 6854221 7714585 9270641 9392130 9026169
5463 9026169 8102440 8336942 9164234 10450429 10557610 9788099 8323784 9280362 9165492
5454 9165492 8761543 8607460 7202203 7141374 7846566 8698781 9947597 9426669 9864949
5445 9864949 10269089 10777974 11309721 11104836 9979324 9195585 9463844 8916993 8906986 7549977
5435 7549977 7226443 7811025 9009276 10719670 10645147 10699536 10787126 11281227 11402126 11827044
5425 11827044 9827948 8852582 8769619 8787807 9926948 9204414 9332778 9611961 10508676
5416 10508676 12048627 12910322 13052331 12812766 12411899 13180676 14287806 14632459 15716681
5407 15716681 15949244 16104657 16970998 18325111 19215781 18703084 17642356 16233624 17140652
5398 17140652 16488597 16349529 14458854 11930432 12491087 12225031 12719094 10467574 9387970
5389 9387970 10873105 12594026 13312319 13067869 11600083 10996389 12375034 12237558 11712935
5380 11712935 9929147 8748069 9919045 10461761 11842489 11239953 10991258 11741674 12194248
5371 12194248 13050208 12156995 12050917 11558053 12142007 11374228 11745516 11194645 10899955
5362 10899955 11577592 11542366 12163779 12236329 13988606 13935883 13342358 13346405 14281800 14398977
5352 14398977 14682480 14929739 14425726 15784578 16122695 17094580 17257235 16330522 16647132
5343 16647132 16332712 16633555 14937280 13711003 13703162 14409776 14323180 13759171 13410576 12201636
5333 12201636 12747024 12834130 13132527 12897388 12231558 11860318 12217986 13027839 13156867 13648266
5323 13648266 12440677 12090582 11981084 12853512 13317274 12549112 12682195 11803500 13455983
5314 13455983 12778322 12144192 12025385 11809116 12313463 12022480 11691411 11952363 12478810
5305 12478810 12918603 13575237 12686855 11938276 12982203 12527800 12954119 11872590 10876948
5296 10876948 11248849 11792753 11908362 12257789 12739670 13107030 13649737 13077329 12945059
5287 12945059 12668212 12786649 13600409 12051186 11618563 11269663 11235071 12256244 11998834
5278 11998834 11795127 11891667 11866007 12911938 14179937 13345515 13734392 13114434 13334041
5269 13334041 13710376 13242287 13071381 12107138 11808948 12766845 14235163 14831456 14708626
5260 14708626 14315711 14534190 15565357 15705866 16173596 14423150 13456049 13915003 14430251
5251 14430251 15254660 14467841 13151639 14158077 15503735 16432660 16612989 15671418 15293605
5242 15293605 16274483 16259379 16945890 15708904 14246993 15444363 16312819 17026722 16180918
5233 16180918 15471179 16055263 17196225 18061602 17523190 16889391 16689910 17189204 17487589
5224 17487589 17585235 17413019 17277032 17578172 17450843 18228311 18590490 18824708 18511750 18222662
5214 18222662 18379874 17664771 18102401 17713356 17695859 17075585 17998979 19341516 19621922
5205 19621922 19593455 18636336 20336076 20601650 20304851 19441995 18610064 20330440 19934157
5196 19934157 20293486 20110778 19446934 19497007 19960671 20450837 20557602 20593697 20527322 21910101
5186 21910101 21091982 20646283 20555644 21400972 22411465 22233201 21784739 22061523 23906445
5177 23906445 24657178 25040347 23869326 22987377 24537879 24608352 24729770 23348804 23234633
5168 23234633 24671765 25456527 25724336 25453287 25266243 26575930 27211252 27055213 27242086
5159 27242086 26316677 27933207 28664519 27839406 28082033 27393687 28125093 28737447 29418521
5150 29418521 29880912 30116790 30777699 31978680 32710690 31735780 32099004 31630243 31660040
5141 31660040 31569838 31941059 33736210 33737645 33822732 33969361 34537920 35452510 36590791 36365062
5131 36365062 36792989 37240780 36343761 37180939 37151508 37339767 37862054 38416469 39668495
5122 39668495 39639714 39915289 40592490 41591898 42110986 42686608 42594492 42269770 43320395 43942010
5112 43942010 43896109 43407957 43839801 45273440 46158776 46396792 47174565 48347568 49547566
5103 49547566 49831463 49484671 50025637 50221669 50947258 51358027 50529373 51424785 52017082
5094 52017082 52803508 53202933 52964256 53611310 54721673 56048352 56495118 56078500 55588438
5085 55588438 55953560 56998444 57016446 56499128 56431808 57179560 58087652 58497766 57933470 58053492
5075 58053492 58990683 59648685 59503371 58417881 58415892 58693412 58920454 58573886 58400657 58017839
5065 58017839 57861451 58799233 58149131 57166717 56648529 56724546 57497295 56710267 55801494 55407653
5055 55407653 56141345 56843340 55909178 54941452 54424935 54270886 54492478 53695290 52093884
5046 52093884 51540368 50633685 50624905 50853604 49860204 49769559 49726049 49862991 50020263 49195081
5036 49195081 49299642 48796117 47964747 47565772 47064780 46277309 45560831 44561657 44490766 45052268
5026 45052268 45203887 45494999 45059425 45197530 45441290 45297474 44885293 43757925 42226227
5017 42226227 42715898 43375280 41550518 41493738 40738133 41224841 43410309 42805600 41812031
5008 41812031 41184032 41602521 42371771 41927447 40470608 39923812 40830163 41815765 42059121
4999 42059121 40746940 39837733 40996109 42969719 43669682 42665260 41560945 41865100 43063756
4990 43063756 42736133 40963466 38822072 38066640 38249365 39128964 38941658 37145134 37279557
4981 37279557 38493136 40040195 39632237 38491976 38062140 37361070 36844303 36077730 35685252
4972 35685252 34827050 33927530 34050902 34848155 35772488 35946235 36868876 37003551 37613018
4963 37613018 37848120 38195064 38631387 37337343 36280173 35912906 36306400 35731509 35508023
4954 35508023 34981070 35149493 36566192 37696623 37828296 37037943 37927377 38997486 38702485
4945 38702485 37306598 35813672 35150933 35224730 35464362 35414980 34853671 34461348 35624609
4936 35624609 35725925 36720955 37212006 38208873 38977188 38657953 37745982 36874825 36792490 36468862
4926 36468862 36514855 35392386 35539227 36203141 36913364 37166225 35922669 36337192 37289011
4917 37289011 38108650 38582003 38731863 37774303 37551937 37524103 36871946 36774466 36815732 37608907
4907 37608907 37654437 38027515 38731984 38849711 38719616 39195359 39643170 39784040 39769104 38974816
4897 38974816 39311023 38583140 38322091 38870728 38631331 39475134 39621245 40917497 41317215
4888 41317215 41373346 41387112 40797091 41582104 41797336 41766324 40866570 40314046 40257423 41566607
4878 41566607 42650272 42778935 43443644 43871189 45183815 45553830 46126418 45892728 46218770
4869 46218770 46728108 46928306 47766312 46634035 47833804 48026467 49042349 50041113 50611053
4860 50611053 52839574 54500693 57202096 58313988 59575561 59925451 60982053 62465492
4852 62465492 62674365 62418785 62013158 63168767 63423927 65055443 66461029 68276991 70174367
4843 70174367 72383259 74933484 76535679 79728604 81209894 83451953 85210202 87395052
4835 87395052 89274362 90529616 93347422 96703844 101439277 105444684 110780160 118162582
4827 118162582 128906537 143096436 158009257 173164977 185731768 192321876 190135111
4820 190135111 185696417 178018462 169322903 162128735 156145331 152286293 148108612 146381870
4812 146381870 145914122 146692057 147596426 148230042 149281986 150863690 153195807 153882588 155244089
4803 155244089 155666084 157367483 160111359 162662551 165239697 166883655 169994120 174096639
4795 174096639 179499752 184554893 190284023 194928556 199567887 204970065 208997971 213811802
4787 213811802 216940224 221922278 226647050 232275761 240594012 248576863 257181691 263639475
4779 263639475 267421617 268087406 268370519 266870347 264185490 261245245 259478392 259258932
4771 259258932 258181484 257569254 255371066 253161669 250209216 246964363 243877182 241186153
4763 241186153 239093951 236601000 235342138 233105108 232429551 231108524 230081652 229945937
4755 229945937 229519720 230139159 231374033 233026219 234834023 236141505 237725001 239075301
4747 239075301 238897428 237924612 237407784 237824164 239966610 240949676 242110956 245033930 248668213
4738 248668213 252570633 254104509 254811061 253972913 254392242 254809145 255855270 257047110 257404827
4729 257404827 258644013 260678512 262757680 264309967 265821650 265973602 266474311 266770804
4721 266770804 266422486 266321522 266195746 266931985 267578338 267539323 266722018 266203704 266263089 265411117
4711 265411117 265944596 265372241 265666434 265399597 266220041 266800565 266797489 266581938 265986587 266034177
4701 266034177 265408176 264478120 264158339 264050513 263017834 261666352 260111900 259073560 258430357
4692 258430357 258540624 258822133 258998189 258542755 255634856 252502275 249058419 244195854 239817206
4683 239817206 235217119 232486777 229402604 226921714 224478254 220890767 218529368 215783015
4675 215783015 210588304 204709600 198224840 192280513 187211716 180730493 175409412 170816915
4667 170816915 165732324 162032948 158251116 154815135 150966345 147130502 144346024 141739274
4659 141739274 138413592 135147455 132246758 129490386 128207290 126116013 124414268 122670690
4651 122670690 120385295 118550976 116257789 115238385 114566901 113563914 112208825 111398758
4643 111398758 109907831 109696448 110727378 110266270 110850776 110938796 111265255 112000615 112118842
4634 112118842 111988528 112307956 113767974 116029706 118077924 121337623 126679897 132859197
4626 132859197 140005462 144999931 147300246 147125350 145496452 143842520 140514628 137229052
4618 137229052 134006472 131507815 130161109 128647690 127899638 126856719 127496906 127460062 128269029
4609 128269029 129040682 130935146 132726763 133984222 134815101 135333365 137410493 140126456
4601 140126456 143304681 146095132 148905721 151565677 153954614 156392851 157760727 158627212
4593 158627212 160084095 162330076 164135678 164066467 163643315 161700928 161307972 159626497 158922205
4584 158922205 157479119 155423435 153276675 149425674 145699023 140892180 136793091 132210720
4576 132210720 129597592 126947549 124172601 121849661 118699468 116575606 113493711 111272952
4568 111272952 108575481 107004783 105156799 104605258 103959899 102782063 103140540 101520736
4560 101520736 101863329 101384554 101483203 101939394 100651733 100505997 100305300 100001881 100207537
4551 100207537 100346725 99290028 98771552 98697150 97932344 97211462 95702676 95810397 94836426
4542 94836426 94532805 93843602 92589572 91821923 91357499 91114561 89346477 89066544 87463468
4533 87463468 86923087 86167864 85323405 84199155 81573887 80684055 78660776 76973378 75635626
4524 75635626 73889791 72693039 71347786 70756841 69745530 70536984 69453294 69571345 69586447
4515 69586447 69289272 69802768 69179985 68602427 67182656 66565434 65531328 64012292 62680039
4506 62680039 61605321 60699018 59260945 58860509 57307932 55990355 55322452 54921603 54592808
4497 54592808 52099597 51442984 50671011 50292985 50429146 50024651 49007063 48600312 48951874
4488 48951874 48745885 48266386 48174492 47812610 47370050 46856313 46819881 46122126 45964516 46012033
4478 46012033 46213739 45861888 45602252 46462348 46914377 46639270 46017622 46743063 45670202
4469 45670202 45300516 45550657 44725003 44920023 44817918 45062350 45302332 46105932 46973567
4460 46973567 47554382 48772238 49608718 50543912 51023030 52097606 53128179 54565392 56228376
4451 56228376 58487292 61903639 66576323 73233690 79417544 88244435 96438942 102377053
4443 102377053 106429919 107109218 106504700 103732000 98896591 92128939 84892034 78391252
4435 78391252 72940342 68014856 63259199 59754147 56732849 55522242 54046420 51411579
4427 51411579 49891772 48876713 48872259 48708690 47639754 46917980 47512804 47044035 47670925
4418 47670925 47447856 45747730 45930415 45656047 45394085 44716697 43774573 43789576 43917675
4409 43917675 44088888 44137939 43520840 43560821 44578691 44571563 44925367 45530484 45988608 46093983
4399 46093983 45218060 45002057 44567859 44133184 44757528 44234493 43293043 44278156 44708306
4390 44708306 44709511 45238343 44957145 45828692 46480033 45393653 46280066 45217354 44883266
4381 44883266 45244347 44075952 44154456 43683816 43060711 43772475 45168413 45430393 45431703 44864849
4371 44864849 45564564 46162479 45723166 46191775 45765806 46023561 45646316 44937676 44758673
4362 44758673 45369073 45982735 45489305 45613988 45143154 45728560 46393593 46513607 47148682
4353 47148682 46896325 46667202 47029944 47236868 47133352 46645285 46836997 46909601 46353415 46311340
4343 46311340 46755633 46566583 47612517 48150763 48081522 48834148 48604075 49295003 49419364
4334 49419364 49020818 48184023 47875761 47651334 47089303 47982394 47958799 48581880 47593681 46678038
4324 46678038 46694449 46796432 46851637 46219842 45916113 45473708 46571879 47172296 47858978 47148993
4314 47148993 46277000 46679095 46643990 47098840 46074595 46339856 45849670 45705181 44986736
4305 44986736 43670975 44431554 44640253 46527261 45837583 45832421 45358393 45207559 47072218
4296 47072218 47326776 47210759 46512692 46692148 47001998 47996595 47753682 47638907 48158471
4287 48158471 48361780 50736725 51329553 53168011 55739267 58855855 62927313 67840042
4279 67840042 73062720 78841749 85837623 88869276 92144217 92998191 94583727 96896167
4271 96896167 96955256 97415908 95320228 92497154 89762913 85566296 80723318 76819100 72611428
4262 72611428 69470928 67420491 63943218 62959068 62753805 63295372 63507468 63062129 63801491
4253 63801491 64482860 65164050 64351314 63752817 62172316 62180338 60673981 59711321 60144252
4244 60144252 59574165 61442823 62164432 63368682 65174269 67381177 70435675 74245381
4236 74245381 77427802 82205469 89041486 97453289 110647755 127093100 149653190 180888748
4228 180888748 217296417 252843525 273388296 271659384 255953780 234335823 209639296
4221 209639296 183359292 158469858 138353283 121980817 108297823 98674324 90775147
4214 90775147 84408774 79766253 75229395 72243323 70555815 68838612 67345340 65933760
4206 65933760 64265010 64211296 63414546 63127355 62353721 61287769 60568058 59561916 58608628
4197 58608628 56548831 55411174 55233961 55148478 54818875 54190435 53481635 52922192 52536701
4188 52536701 52656843 52263660 51974671 51389801 51116787 50890736 50870441 50701659 51541976 51698029
4178 51698029 51135384 51209356 51986932 53875475 54236401 55000538 56333543 57548959 59435803
4169 59435803 61213043 62842609 62752976 63108752 63160608 63536142 63460449 62172015 61270961
4160 61270961 60246792 60335541 59664861 57756101 56935783 56947022 56957795 57420542 56594197 55827114
4150 55827114 58166275 59321765 60620860 60837573 60932568 62189779 62844693 63403102 62854497
4141 62854497 61656239 59868359 58644795 58000938 56677767 55842658 54813885 55014814 54762480
4132 54762480 54866994 56149972 57279127 59320976 60576214 62836157 65938803 68208118
4124 68208118 69168288 70002001 70284481 71538801 71732528 70845399 71292658 69370273 68297861
4115 68297861 66803100 63451200 61699525 59774803 58512787 57247772 56300234 55170578
4107 55170578 55584066 54879889 54352481 53850603 53548508 55010862 54353873 53884122 53909468
4098 53909468 54358752 54811855 54893385 54406177 53474405 54487300 54309533 55471192 54791742
4089 54791742 53830875 55110922 56039063 57791466 57301559 56519284 57184511 57879253 58309877
4080 58309877 58719917 58883853 58894674 60337410 61123545 61746693 62296483 62977222 63855569
4071 63855569 64679275 65728896 64932687 65490761 65580335 66173839 66458804 65662202 66702105
4062 66702105 67901752 68884586 69339902 70211524 71556122 73835713 75366235 75502306 76555953
4053 76555953 77352392 79722649 79920762 78752500 78255647 78676899 79987467 80451839 80244686
4044 80244686 80186282 81580294 83470154 85436113 84865778 85678797 86776296 87941189 90161068
4035 90161068 89656198 90955353 91693738 92947186 95259624 96175599 97736662 98309313 101295802
4026 101295802 103358373 104492345 105547531 107227215 109683000 110806346 112439947 114140008
4018 114140008 116601345 118909755 120783599 122217447 123505973 125814549 129081332 131634316
4010 131634316 132271110 134965738 136911869 139865589 142426218 142943741 145291303 146692474
4002 146692474 149592744 151845440 152848372 154210701 156293607 157821839 160398569 162964964
3994 162964964 165228167 168059332 170035008 173334140 176292187 178941834 181262878 182726861
3986 182726861 185886289 188132252 190563350 191036844 192389414 194013083 196428021 200326034
3978 200326034 202741978 205524102 206781388 210981224 215585035 218740379 221528056 224035688
3970 224035688 227552536 232102659 236989607 240804705 245478919 249264563 256107587 262559414
3962 262559414 268132281 274262848 278395624 284213554 290039262 294703909 298410494 303062270
3954 303062270 307857166 314427726 320573264 326082695 332744427 338324152 343936891 348776855
3946 348776855 352655688 357599261 361132759 364422927 367917189 370738537 373159417 375618182
3938 375618182 377505121 379311613 381971351 385104256 389377130 390707196 393036873 395823680
3930 395823680 397956652 399857951 401246738 401840244 401938927 402720174 402098662 402760868 402510934
3921 402510934 403128462 404344996 404926038 405439141 405031141 403476144 400362289 395272400 389192077
3912 389192077 384137275 377979274 372196495 366527094 361276459 357501483 354602212 352452453
3904 352452453 349963150 347777367 347096332 346891612 345578057 343197092 340412001 337538976
3896 337538976 335284817 332807776 328243120 322617988 317704795 314029891 311551003 306981258
3888 306981258 300672933 295494679 291180603 288234021 283585525 278797704 272865829 268502363
3880 268502363 265435068 261446991 256828203 252574229 249436173 246036770 243277441 239519871
3872 239519871 235763484 232589896 229339171 226137388 221453170 216163852 212215924 208623099
3864 208623099 204692860 200461888 196616934 192222815 189307044 185274932 182154935 180225924
3856 180225924 177208224 174072274 170415128 167574804 165185923 163006633 160412121 157769024
3848 157769024 154498408 152267897 150059793 147252566 144861893 141994765 139906564 137838977
3840 137838977 135496970 133890025 132189090 129770875 127340836 125229533 122989954 121344348
3832 121344348 118722464 117049627 115698776 113040165 111849213 111017473 110390104 109691725
3824 109691725 107768782 106214757 105077738 103427814 102375668 101414418 99472796 97630139
3816 97630139 95425771 93867365 92057444 90438723 90467068 89923285 87863889 86078041 85378067
3807 85378067 84650211 84501622 82816158 80886423 79792799 78388713 77337351 75868723
3799 75868723 74355799 73851978 72095480 70975610 70250307 69732883 70109753 69265891 68571058
3790 68571058 68234147 66894966 66834412 66126623 65140142 64628754 62061678 60814148 60952365
3781 60952365 60422093 59370940 58128120 57626464 57868340 57807337 57205549 57173938 57098213 55874988
3771 55874988 55174637 53418260 52745363 53324242 53832239 53025238 51061564 48937309 48281447
3762 48281447 49138562 49220020 48541131 47122609 46874342 46459288 46470864 45532088 44724271 44201507
3752 44201507 44035710 43723692 42309821 41405169 40953328 41371103 40709815 39135449 38265539
3743 38265539 37844281 37593331 37577064 37148000 36746928 36150890 35711245 35559340 35711556 35068561
3733 35068561 34852978 33902087 34394976 34827835 33788779 33659073 33252588 32797482 31823192
3724 31823192 32051793 31742882 31658660 31218423 31494352 31762476 31670183 31816123 31209144 31155355
3714 31155355 30308417 28981478 28183572 28136093 28973304 29286767 29014918 27884655 27700346
3705 27700346 27673749 28622449 28937053 28304013 28611794 27666364 27639629 27108311 27161784 27252225
3695 27252225 27108269 26904750 25887890 26396148 26365509 27034730 27866847 27255529 27409667
3686 27409667 26739439 26360881 27147339 26887137 26526939 26708902 25868008 25921103 25937760 26186203
3676 26186203 26398056 25761807 25609395 25642951 26121859 26698695 26703444 26195666 25567101 26139395
3666 26139395 26858214 27149461 27412114 27012242 27015142 26772696 27427531 27859307 26826508 27175004
3656 27175004 27780106 26957533 26305374 26981122 28070331 28749603 29100410 29316041 29166859
3647 29166859 29323774 30262372 30831819 31368571 29899289 28490504 28381844 28987303 30370276
3638 30370276 30571537 30584868 30751631 31354929 32215086 33213036 34576207 35048410 35173667
3629 35173667 35447497 35823588 35845046 35845350 36193640 36580242 37120434 38197942 39836240 39847301
3619 39847301 41010338 42262485 43607502 45104532 45435902 46703926 48252423 49890298
3611 49890298 50367753 50136260 50206323 52028411 54612123 56214612 57866873 59516152 61840639
3602 61840639 65464184 69444790 71595682 73390361 76480888 79432361 82251526 83759309
3594 83759309 85454215 87733016 92086551 96559145 100920042 108491847 118511438 132612793
3586 132612793 147654082 160673635 170273086 175614311 177746747 177426954 175048089 171985083
3578 171985083 171249669 173784906 180232571 187723811 195518351 205308550 214974427 224071835
3570 224071835 229757137 231581647 229224343 225163705 219628924 212936940 205725866 198561355
3562 198561355 194489754 191286720 190896551 194033128 199580971 210718835 226804863 248733299
3554 248733299 275463546 303979937 327161722 339878712 343937766 343015681 340574730 337360861
3546 337360861 335325289 337303785 345462834 357277616 371973016 388030436 405018783
3539 405018783 419789976 425577475 419756036 403546073 382506879 358022803 331943010
3532 331943010 308344358 287486929 270178303 256571028 247050023 240214978 236899263
3525 236899263 237220539 240740834 247912520 258089612 270580784 282462653 291620174 297448563
3517 297448563 303050346 309098276 314258865 316729016 317354284 319193108 322187554 328355823
3509 328355823 334107881 341598268 348409469 349535340 342817362 328295265 310739411 291497159
3501 291497159 271428684 252688180 236034731 222300622 211523759 202228088 193469298
3494 193469298 185688779 178678129 173831359 170132812 166821082 163282618 159473603 158480797
3486 158480797 158333680 160847526 162575978 163170156 163914615 164154033 162808043 159521598 157895448
3477 157895448 156317339 156060474 155280434 153016654 149354633 144354542 140689015 135947431
3469 135947431 130225501 124596405 121085711 118903882 116406721 113284645 109870802 108015758
3461 108015758 105859854 104246150 101215470 98567261 96675424 95567518 95113342 92281366
3453 92281366 90961369 89671878 90891036 90677207 88966181 87229014 85721952 84496298
3445 84496298 82376373 79926668 75691423 73918313 72345456 70801872 67931262 65005689
3437 65005689 63680307 62392546 61585539 59715803 58749324 57041541 56119858 55838630 54278505
3428 54278505 53534285 52292575 52534884 51073934 50136111 48861640 47766157 48269634 47186839
3419 47186839 47429847 47018914 47297632 47462870 47123821 47253799 46820926 45540532 44310200
3410 44310200 44093314 42824918 42720061 41487752 40489899 39585038 38592785 39172747 38653342
3401 38653342 39219481 38038118 38435329 38883612 39036876 38685365 37304739 37709057 37783718
3392 37783718 38118954 37662952 36592130 35890937 36146707 37389880 36800277 37078953 37161123
3383 37161123 38337719 39405343 39658733 39427003 39232593 40457475 40988413 42090802 41772744
3374 41772744 43808130 46184142 48918298 52426374 53819575 54821875 54817924 55131789 52440970
3365 52440970 48891219 45890380 43900005 43343132 41331892 38740375 36555330 36234511
3357 36234511 35639409 35283222 33723471 31976204 31863083 32187002 33550881 32083801 30785755
3348 30785755 30178727 30724562 32701956 31859816 32108624 30894335 31014087 32414433 32736355
3339 32736355 32963638 32602589 33261884 34398739 35465762 35013003 34226815 33087377 32840203
3330 32840203 33178508 33076324 31790568 29653127 29863539 29977510 30492888 30705057 30149566
3321 30149566 30695897 30639334 31419913 30625720 29919866 29267392 28374204 28513908 27549158 26922886
3311 26922886 26409407 26752895 27565047 28852032 29658634 30552824 31171980 31872919 33108048
3302 33108048 33153592 32866958 31810614 30423634 29338232 28427859 28443436 28175336 28136050
3293 28136050 27970814 28801423 30344251 31941467 33246447 32774402 32511297 32081863 31911684
3284 31911684 30531059 27967055 26581423 25447187 25630292 24816516 24565422 24650403 25361246
3275 25361246 26423466 27430977 27674435 27538233 27847647 28185294 28326660 27030703 25933380
3266 25933380 25183446 24710144 24548555 24191323 23973560 24043245 24471684 24704495 24076130 25193563
3256 25193563 25317251 25336193 24445919 22808159 22865961 22706669 23493805 22839654 21984175 21834801
3246 21834801 22381843 23315709 23423345 22836939 22187124 22814907 24100748 25982903 24912528
3237 24912528 23886314 23668788 23868429 24276591 21946827 21068494 19988574 20657891 20884928
3228 20884928 19699913 19089258 17030560 17856128 18038283 18333270 17479814 16316975 17050211
3219 17050211 18251797 19515649 19793165 20047037 19891305 20929953 21920653 22672720 22478696
3210 22478696 22103319 23736232 23798704 24524857 25008071 25871496 26919519 26272755 25571493
3201 25571493 24516477 24298636 23903161 22444141 22107275 21105901 19696285 19041142 18219838
3192 18219838 17932437 17996454 17459485 17458641 17045523 17134948 18042359 18911658 18951735 18579141
3182 18579141 19422820 20313960 20638077 21101457 22432333 24587759 25390986 27159043 28731253
3173 28731253 31036900 33245053 34622857 35664457 34860429 34685048 34871685 34786746 33292072
3164 33292072 30031944 27162366 27459344 27845329 26266963 23502662 21265804 20191395
3156 20191395 20324394 19681481 18810052 17519844 17101607 17366049 18342577 18174213 17733627
3147 17733627 17014672 18106476 19872278 19412266 19113346 18810026 20508042 22135630 22106393
3138 22106393 22126287 22482121 24238867 26576202 27212196 27119767 26490124 25463660 24804645
3129 24804645 24200002 23019857 21654040 20244015 18997005 17700998 17230327 16988230 16183268
3120 16183268 15688162 14678915 14156378 14078489 13916933 13558400 12836622 11945645 10662861
3111 10662861 10054089 9825149 9031234 9169555 8983804 9534007 9798656 9218331 10026028
3102 10026028 10975209 10136416 10194189 9233839 9369960 8997742 8201484 8491547 8323546 8395730
3092 8395730 8151748 8201307 8140111 8390012 9682534 9830917 9484932 8392807 8463609 9781033
3082 9781033 9304485 8171119 6057313 5433596 6055571 7099520 6141743 5559183 5115821
3073 5115821 6166520 7530845 7738244 7885921 7232792 7247113 7378749 7644747 6990455
3064 6990455 6359777 6496316 5926797 6019858 6123190 6483578 5899345 6088009 6552284 6373790
3054 6373790 5588331 5865477 5581640 5652328 6327774 5212675 5128319 4829530 4246360 4563795
3044 4563795 4650627 4776047 4418423 4542873 3484435 3785136 4807207 4759466 4613660 3455241
3034 3455241 3826852 4142575 4738634 5081037 4995306 5038567 4134882 3647975 3951051 3680689
3024 3680689 3465283 3732252 2708399 2928130 3140061 3686034 4415721 3342779 3572191
3015 3572191 3350856 3992938 4292883 4412790 3941454 3195721 3508400 2840760 3052304 2250970
3005 2250970 2113184 3176064 2906349 2837306 2428481 2646031 3540037 4004107 2712395
2996 2712395 2712403 1894528 2287933 3360445 2888195 2884065 1380396 1871284 2763673 2877103
2986 2877103 3250793 2627652 2106228 1881395 2442683 2108303 2408710 2329157 2079777 1384360
2976 1384360 1808984 2393393 1864639 1714756 1981778 2013910 823703 1448214 593685 161713
2966 161713 393232 -235620 766073 993668 743725 841211 1314266 1927343 1833263 1075711
2956 1075711 1045233 1248837 1501186 2016380 1074634 1051362 -91481 -263572 522294 781104
2946 781104 1203612 939859 1799381 1569955 3139525 3493089 2976316 2499919 950627
2937 950627 987756 1104575 1455049 176424 479285 666549 1929789 2327398 2307954 3062430
2927 3062430 2398218 2889915 2315030 2863776 2853844 2386860 2436297 2245205 2436685 1361257
2917 1361257 1534627 543463 1838133 2456760 2106976 2175171 906773 2308864 3633277
2908 3633277 4148414 3350151 2950630 2335103 3072044 3875364 3340792 3064739 1093884
2899 1093884 1904251 1906131 3048064 3127739 1269384 1925663 1979123 3402128 3223484 3963420
2889 3963420 2751586 2816917 3463294 2334615 3132520 1832593 2057799 2533946 3086691
2880 3086691 2438388 2114030 1895196 2237716 2923280 2808564 3756126 2714281 3028945
2871 3028945 2845073 2785555 2974029 1853942 2629192 1959230 2176544 1899720 2148934 2675053
2861 2675053 1879373 2372781 2131346 3458471 3101561 3640547 3276823 3072971 2903402
2852 2903402 3226997 4262394 4482727 4762675 3744105 3748926 3391262 4058148 4423126 3726918
2842 3726918 3919047 3635821 4592298 4690552 4392865 4201463 4706481 5818430 5032523 5518710
2832 5518710 5306995 5572499 5248464 5543667 5529066 4697091 5347927 5763060 6608705 6505788
2822 6505788 7247560 7467113 8780597 10220263 9999288 10204717 9734808 10258818 10481457
2813 10481457 9553368 8837999 8369593 8599022 8507474 8704018 8651173 9307638 9368805 9302003
2803 9302003 9961811 9537465 9600489 10660204 10744678 10172901 8995809 9511268 9500903 9610540
2793 9610540 9858076 9895058 9886726 11058229 11385042 11175963 12233470 12424865 13298298 12952013
2783 12952013 12979430 13803735 13651507 12980357 12586580 12242897 12000683 12127238 12045126 11092408
2773 11092408 10636073 9258248 9618040 8859605 8445657 8156007 7904085 8572099 9996988
2764 9996988 9719096 9907335 9678009 8916999 9691022 8699486 7928278 7325242 7150387 8447644
2754 8447644 7770618 7332613 7079253 7396321 8751015 9726169 10016609 10745818 10997132
2745 10997132 9637638 9506567 8837837 8471524 7734121 6201898 5604338 5159202 5128013
2736 5128013 5419022 5677548 5553814 6381706 6739605 6770026 6607122 5346574 6455524
2727 6455524 5968327 5367658 5425603 3935120 3892594 4385413 4471787 4921580 4489753 4089328
2717 4089328 4478156 4775165 5006739 5011364 3944257 4039737 3942699 3940342 4086355 3737827
2707 3737827 3965185 4210618 4147507 3580754 3639993 3252246 4060453 3043506 2505811 2798268
2697 2798268 2473902 3434531 2862030 2991794 2394020 2460836 2754628 2842997 3083550 2743578
2687 2743578 3150471 2457535 2085383 1700230 1322372 1263445 1487549 1984323 1409263 1130889
2677 1130889 1064395 2333775 2477369 2328762 2342267 1102526 1466706 1425427 1334964 487457
2667 487457 -215243 161618 342341 877955 552942 889902 453760 1323337 1185340 1170610
2657 1170610 1109481 1079686 469217 189094 951041 680357 1078674 190297 379543 1155275
2647 1155275 667800 1358837 544961 558861 1044447 1244924 1525830 807816 259363 970726
2637 970726 1746249 1822772 1954568 610368 679518 813502 1679543 2615091 1392555 807374
2627 807374 314285 1136323 1765882 1731812 1071772 765500 1794941 2246926 3367747 2502214
2617 2502214 2432187 2427183 2409484 2343185 1247499 193057 1274190 2052858 1782139 1850707
2607 1850707 653638 1934655 2495446 1925566 2641067 1642376 1973064 2185487 1664711
2598 1664711 1655506 1795517 2096389 2176035 2087717 2262571 3487461 3476688 4080927 4474508
2588 4474508 3348241 3624955 3923575 3670858 3433099 2344195 1528779 2078178 2220618
2579 2220618 3102300 2461168 1929815 2529091 2014969 2107885 1743876 831037 979546 648298
2569 648298 673718 972892 369912 535930 1910707 1990203 1953934 1048506 1330752 1884817
2559 1884817 1413628 1206681 884002 39652 -660020 214249 221614 688431 707669 46319
2549 46319 745831 1342518 1935175 1753268 1040205 914148 -47106 901150 1079793 129459
2539 129459 -138370 228440 672687 1624670 1652068 1263663 2043336 2533537 2892102 2290847
2529 2290847 1780720 1046446 1744346 1481678 694671 659757 462593 1368127 1424369 1519803
2519 1519803 1526057 1520766 1863128 1525826 1122774 1168011 1209909 1195149 1445666 1408086 1255263
2508 1255263 2020471 2678933 2744152 2528146 2338494 2090725 3039849 2542494 1398578 1036847
2498 1036847 1172783 1693090 1698810 1474369 1354574 1605855 2478017 2724772 2309321 2107219
2488 2107219 2477750 2504296 1732746 554577 199277 737948 972730 1124356 326481 117564
2478 117564 1405592 2185048 2205096 1386158 1163022 1960282 2610651 2164625 1613345 825935
2468 825935 956140 2253817 1050048 181985 484141 1227234 2509853 1866776 763194
2459 763194 1303739 2342956 3133198 3116550 2447092 2541285 2674265 2786564 2706769 1596269
2449 1596269 1502464 1602214 2521321 2730820 1502213 1658868 2685043 2785956 2431531 2420531
2439 2420531 1660018 2228966 3671887 3500671 2752795 2236300 2845750 3723007 2730262
2430 2730262 2562618 2001144 2322763 3392931 2696770 1881720 2140696 2965448 3947672
2421 3947672 3985818 2898701 3244794 4165038 4816691 4528589 3685958 3055613 3002923 3860633
2411 3860633 3937882 3940291 3073206 3894118 4747111 4387355 3857835 3003620 4260675 5125902
2401 5125902 5217484 4985051 4080161 4904206 5739133 5542816 4570417 4150586 5266042 6909150
2391 6909150 6186199 5369375 5990778 5384932 6942478 7490381 7075380 5631249 5849315
2382 5849315 6894848 7236520 7197969 6857304 7966762 9005727 8803946 7981357 7447432
2373 7447432 8751947 9661321 10308526 9583448 8773494 8977064 11455818 12285043 11443071
2364 11443071 11319299 11589098 13397438 13649277 13253482 12293473 12705548 13030670 13395855
2355 13395855 13888561 12505286 13640443 14311877 15614788 16780913 16549348 17629687 18394697
2346 18394697 19809371 20739949 21979398 23035220 24667470 27195727 30685790 34316925
2338 34316925 37850770 43378593 46636116 51044793 55902438 60940656 67876926 77527792
2330 77527792 89364963 104896107 126751417 155369675 196190891 250720274 317483862
2323 317483862 382510748 422923668 423668819 398161686 361999339 318345371 270431629
2316 270431629 225458956 187363646 156158394 132081164 113232167 97943618 87277186
2309 87277186 78780437 72600270 66472098 60502381 56493632 51908908 48639955 44696668
2301 44696668 41052555 38207735 35684925 33905747 32137154 29693309 27912632 27332610
2293 27332610 24819659 23169729 21763494 20310133 19599002 18601886 17323256 16714519 16092000
2284 16092000 15908625 15945582 15463803 15195031 14813796 14394445 14197284 12784924 12574750
2275 12574750 12495696 11812949 10890297 9974127 10595450 10977322 10638112 10322467 9650801 9008473
2265 9008473 9556665 9582265 9454992 9529149 9330232 9256804 8374897 8068228 7308742 6765068
2255 6765068 7176301 7635754 7299316 6728839 6235429 6543568 7101516 6701592 6068808 5368961
2245 5368961 5183651 5407109 5466586 5345296 5845493 5619792 5684668 5624298 5745840 6108912
2235 6108912 5301172 4372018 4552160 3954950 3452054 3055326 2800267 2770626 2938777 3351054
2225 3351054 3562554 3518168 3974699 4449785 4925923 5238284 4082460 4009017 3933358 3476154
2215 3476154 3352286 3420141 1959886 1689287 2752878 2509841 3053826 3047524 3579094 4780845
2205 4780845 4957411 4673188 4072693 3481267 3287252 3027620 3242669 2839230 2037667 2435932
2195 2435932 3136447 3128486 3553009 2828709 3320359 3490298 2707019 3074012 2902833 2945367
2185 2945367 2903119 2504631 2538256 2343106 2101740 1849833 2746715 2229866 3183011 3078572
2175 3078572 2280434 2232813 1722032 1656080 1875784 2140755 2152833 2154986 1391524 2238168
2165 2238168 2476307 2851571 2434970 1794459 2140225 1887366 2461175 1627530 744630 452310
2155 452310 920443 1256341 1109635 1222590 1189742 1664314 1961860 2051988 1551095 796004
2145 796004 685183 971965 1094853 554562 -361146 -1018606 -452926 832308 949354 571242
2135 571242 263580 1037234 1349567 1803398 1342660 723423 288358 720652 1427229 782636
2125 782636 96577 42893 138629 1165120 1121173 67710 -193628 633936 685300 1052355
2115 1052355 369161 -151529 173529 -144507 310259 23041 282711 839672 1153361 1309668
2105 1309668 1811334 1651647 1485647 756146 606295 1343493 845309 390027 605947 159455
2095 159455 246139 990353 930197 1937937 1206914 802095 2168795 2162781 2257550 1782381
2085 1782381 977173 1103613 1195741 743707 24171 -442400 610201 2161119 1487050
2076 1487050 1278015 2060671 2653030 2962375 2537445 1930874 1844965 1630084 1928092 1833413
2066 1833413 1224231 1872061 1946031 2098487 2497235 1467942 1710903 1915281 2410204 2910272
2056 2910272 2086130 2612299 3056372 3394812 4097037 4189712 3854825 3496957 3343815 2650553
2046 2650553 2227649 1907716 2229154 2085815 1740462 1249843 1304870 1643242 1976206 1683349
2036 1683349 989305 1605281 1741866 2286842 2058902 1368053 709617 513057 1361741 1032085
2026 1032085 161042 149290 708838 1180316 1889554 1619467 423807 1023074 2038549
2017 2038549 2727193 1910532 1314792 649039 640386 865876 402506 561647 220753 402482
2007 402482 752938 1084378 977993 1128063 1830957 1716751 1920456 1369872 1651592 1411482
1997 1411482 1135061 1409697 1453869 1626370 946059 776804 810474 1080291 1669454 2537549
1987 2537549 1999601 1166717 1521533 936368 1219419 573388 735372 765979 500039 797966
1977 797966 446473 285501 1074775 1564178 1787107 2009081 550073 580603 793187 405359
1967 405359 609318 -468689 66324 1211893 1565520 1249713 716901 1052319 1433905
1958 1433905 1250451 956105 1075513 89146 434458 725051 100343 -129661 -642154 -540287
1948 -540287 365645 269771 410767 956114 1178082 2214828 1915620 950925 979407 -12340
1938 -12340 -40659 -31405 -363195 -224345 -471181 177006 674639 400889 292771 952873
1928 952873 1500796 2165791 1731192 1302344 639513 -60024 -553238 -432053 -870439 -656491
1918 -656491 -199356 -459763 26157 -37412 514631 778898 881034 1139998 511585 340913
1908 340913 548695 -165640 -486621 43989 195726 -5068 -264103 -644660 -108907 186885
1898 186885 959010 439303 734924 605894 527570 183626 210502 390299 -187538 35621
1888 35621 -357089 -361252 -106107 32607 -155131 -160751 -17765 368712 655556 435962 168672
1877 168672 -231248 535925 799391 749937 -71109 -785067 -617142 188735 783844 -149245
1867 -149245 -852623 -801909 -222984 695736 1017642 -299507 -1105378 206364 1354076
1858 1354076 1672271 -403674 -1100914 -655061 786018 1426829 235496 -485219 -400301
1849 -400301 732668 1690580 1332589 -48708 127100 879254 1310575 1478468 217460
1840 217460 -618688 456937 1746083 2071653 1483712 545403 953489 2065096 1746811
1831 1746811 1634940 -70797 -369840 -174100 -233455 -203033 -917672 -260509 291621 869856
1821 869856 1270860 1900368 2182466 1740375 1555101 566294 1137985 340754 164359 -381296
1811 -381296 -1160597 -968046 41137 492574 872450 733968 828830 2388042 2806562 2568812
1801 2568812 1415537 393722 791658 516586 1340185 906572 512231 294459 839889
1792 839889 1853012 1105131 1056405 1011778 2124686 2506977 3225305 2267705 352075 369138
1782 369138 1068396 1914232 1579499 911159 158732 878414 2099900 2069807 1688251 568979
1772 568979 322900 1393107 3104645 2321392 397958 -275721 -93663 1295092 1853486
1763 1853486 905351 -159688 507549 1339058 2862728 2221978 -132119 384273 953388
1754 953388 1876919 1042097 109586 -392353 319944 1814360 2362792 1835178 580811
1745 580811 891702 1629398 2103998 1484803 1001323 1216317 1021445 1831500 1109583 1008555
1735 1008555 851654 1273122 1416282 370522 945288 1022710 1417439 1010953 914400 537529
1725 537529 1207000 1133714 13471 255215 -387232 1189698 1106089 725936 562570 -23552
1715 -23552 -5417 708224 877326 -195954 -144066 89262 1045547 983557 381598 383432 -121190
1704 -121190 972568 1182798 943293 459136 -9043 659722 -125850 -431304 -395307 -120161
1694 -120161 -444433 454622 757590 263766 592846 864719 602030 -88359 440883 1217796
1684 1217796 958380 309215 -452578 -533818 -478596 305066 -437460 -425440 5289 346915
1674 346915 1442148 595746 97984 428164 957544 640520 -52171 -875024 -304899 82801
1664 82801 -575663 -624338 -1047389 137053 371586 580886 421874 36980 1238398 1171985
1654 1171985 928855 -87149 112081 909722 1790659 1856540 -119996 -199139 267843 1149929
1644 1149929 716913 -743677 -1271279 65884 2217396 2228456 1234021 -8963 506819
1635 506819 1350597 1334796 914575 -296342 -492127 -166084 1258749 962373 -22442 90240
1625 90240 291677 1290287 1223685 1138802 476829 866735 693743 1504718 806761 -366186
1615 -366186 415769 528377 1084538 777818 239817 303037 407848 1233178 1565824 1973122
1605 1973122 1443678 555817 405381 1065026 1206620 638959 884500 78456 434253 831479
1595 831479 1574033 1658983 824035 442021 -210089 621883 774151 839057 167595 -118788
1585 -118788 -61754 596897 1615350 947679 889842 870784 1313795 1410517 1297831 938632
1575 938632 -233180 360711 908826 1241833 604008 309240 219301 1268633 2328167
1566 2328167 1238748 509749 -631489 776001 1667569 1168883 353604 -792664 -427014
1557 -427014 995937 1466301 642215 -419793 -1061026 451382 1911837 1515587 1024773
1548 1024773 358303 773701 1473996 1849291 660452 131388 -219879 613848 1613519
1539 1613519 1268764 622042 181299 668931 1600760 1288968 464248 -297713 11915 1400925
1529 1400925 1408455 929190 616526 127090 595172 744613 246964 1100530 101828 439829
1519 439829 725806 996595 1101827 422851 801665 998444 1479043 715585 227255 -274037
1509 -274037 -416750 141286 280446 278151 624469 1058675 622163 800449 650430 338835
1499 338835 -17786 304596 558404 -12632 515991 355884 100982 662060 1470613 1124832
1489 1124832 239789 82987 319172 1231305 1070972 1268349 882161 518739 1020608 1014236
1479 1014236 1086513 1027503 1114373 1179101 1333604 1352077 1376515 1134637 1392508 811307 240646
1468 240646 -40196 -112831 -298676 369786 188511 664028 1424993 1363703 1396047 1207879
1458 1207879 1580348 1715897 2118107 1848153 1185768 763484 825583 1176886 343544 -20004
1448 -20004 377263 1098832 2311624 1731427 999261 1058362 2032400 2487428 2282035 1058893
1438 1058893 719247 1182985 1348804 987565 439776 119603 738392 1841568 2042520
1429 2042520 868596 1096609 1242479 2323283 1672220 595361 154544 -70685 315535
1420 315535 157345 484522 -511630 -303397 822972 1066513 1343812 1319858 565564 683463
1410 683463 1136463 1054155 1361105 564447 128989 -375111 -737589 -249337 -261760 -316416
1400 -316416 -468320 -93604 77679 354413 552784 18383 114852 514543 898658 926773
1390 926773 -100276 -593326 -395021 46124 -85659 -536586 -945514 -721445 -163330 641992
1380 641992 72137 -423321 -784421 -992435 -157483 -83963 -691223 -591788 22479 162407
1370 162407 -378377 -767198 -1058346 -744813 -361435 -788482 -1147539 -742318 -331420 412101
1360 412101 617664 126092 -146480 121142 -193960 -1147848 -1199965 -567269 -670112 -661686
1350 -661686 -922247 -1431169 -1148240 -539575 -315341 -470642 -959493 -846935 -56417 456867
1340 456867 442853 -616350 -737270 -537131 -783206 -90193 108499 -192605 86783 545603
1330 545603 526165 883667 410667 185673 128361 365556 644986 128773 334491 831793
1320 831793 1050045 807824 850128 593504 1576033 1269569 1009996 567597 574772 418304
1310 418304 -9692 755353 467064 1036126 587173 326911 1062280 1209610 1715633 1158936
1300 1158936 236947 412372 637518 1194397 1773959 1492876 312179 298188 746237 1512816
1290 1512816 1161750 978196 756397 947731 1180538 224056 283443 64097 771432 1189662
1280 1189662 934885 753964 892605 1817777 2191496 1901900 649895 728057 1113018 770459
1270 770459 769622 -360388 -512823 102374 1235929 907427 1035344 1166283 838497 1886010
1260 1886010 1533530 1524549 1207139 1172120 1115874 -106068 -687102 -1164236 -174564 68317
1250 68317 1319030 1013913 813052 1182007 1349754 2599083 1506969 1166687 952471
1241 952471 244072 572343 366476 285408 -286793 101134 4672 1122334 2113396 2198776
1231 2198776 2498367 2292173 3028061 1991751 1545387 685824 750384 1148496 378952 -117886
1221 -117886 -864450 693091 1201860 1414577 1423673 1657971 1995188 1224428 2712278 1519788
1211 1519788 822385 31544 610102 1330370 191043 -108247 -250055 1067886 1204217
1202 1204217 1792854 1190466 696614 1650847 2168150 1909720 -409169 -74167 -200505
1193 -200505 1452289 1604123 -5637 -101320 168370 1945000 1028726 409895 225709
1184 225709 1062975 1767239 806238 259336 -1328148 -509005 -253366 36574 -1063931
1175 -1063931 -313083 990953 857901 1708226 182851 548066 24901 799609 472439
1166 472439 -628876 -1268909 -1130580 78329 -1008661 -481425 -538767 332451 1092063
1157 1092063 40618 779998 120300 1811788 1540512 1110245 -366809 -1167707 -239168
1148 -239168 -494122 -617044 -2112720 -798927 -497637 1004447 1115873 612554 1182843
1139 1182843 1518083 2334180 700713 545694 215806 550493 430803 -225417 -779456
1130 -779456 -841920 539359 620347 1253682 117580 467227 1339562 1832516 1651706 511716
1120 511716 810231 243677 1485051 991712 427631 385581 531987 1740448 1041335 665212
1110 665212 -666355 544870 1172176 995555 363961 -449267 1036142 549729 548469 -215631
1100 -215631 -831175 -829458 309696 1134052 452577 186015 -191480 609219 695404 475152
1090 475152 -38426 162379 742432 71206 -403901 -719192 -306110 590270 1185395 844521
1080 844521 406287 795458 1099029 1312023 743838 64008 -729844 -350430 -3377 -291980
1070 -291980 -227934 -527444 329003 -127874 475188 567362 455413 892370 61215 2817
1060 2817 -404239 -424671 -369851 -629815 -640532 -435925 -719967 -860392 40138 218378 864200
1049 864200 1254943 898694 555749 707012 1341320 947893 557284 -884653 -901142 -689833
1039 -689833 451043 240361 -763990 -317521 685451 1261319 1706947 1167636 280157
1030 280157 777179 1312568 1360564 483549 -871512 -327407 -118292 386215 -3776 -170428
1020 -170428 541563 1099205 1393809 748466 621715 136464 1535930 1664700 1167392 -99646
1010 -99646 -99586 617342 376058 59942 -257649 894349 1609489 1104835 1065416 776581 953611
999 953611 1115883 1336706 1030424 1090970 1022370 1531060 939552 43684 -50630 142979
989 142979 1044355 725898 561280 352212 391294 985548 980809 1012102 624048 835617 386655
978 386655 219931 -14544 -121687 898652 1314489 1026748 678810 750091 1196467 1441253
968 1441253 852291 99882 179778 672160 613257 -543022 -703842 143656 1126363 1439676
958 1439676 116707 -149852 529620 2197493 1609545 89913 -420082 300410 1346199
949 1346199 2015889 1038927 -256146 -26631 625514 891177 439059 -795691 -781470 638480
939 638480 1759174 1364982 289847 -291072 338598 1169085 1068142 301141 -742336
930 -742336 -646837 678981 907215 388642 -659713 150721 728731 1114334 1606619 680717
920 680717 -40506 -19257 712981 668316 499879 -375135 -696806 499811 549671 62154
910 62154 -803662 -937032 -213006 371972 908447 303816 160187 -246676 823603 928806
900 928806 510128 -414897 -604098 496463 472963 456029 -167999 -256522 -82086 371411
890 371411 183217 -557310 690852 1109390 1398036 932717 662932 566835 1000193 929733
880 929733 66563 -358100 -762877 792139 672929 -307691 -1207969 -1223571 551792 671065
870 671065 1522014 -172556 -593174 -142844 1011908 1145824 -727611 -629571 -730910 451146
860 451146 289527 -559531 -1659727 -904901 283882 1215777 1882199 384091 293223 11379
850 11379 1250027 1357267 -286754 -753442 -1720102 210570 156815 98521 -820780 -1022581
840 -1022581 720395 1013445 1590860 353373 68769 -181321 1189615 685003 -682719
831 -682719 -854874 -1107414 748342 548472 945763 61240 503378 1241620 1850779 1377572
821 1377572 4697 -117653 -62470 860232 74893 -119459 -225073 -692148 68523 40734
811 40734 897569 1098052 1251899 900561 -39333 323968 267558 -236632 -1047251 -232897
801 -232897 -491507 -180564 -98394 -191594 295425 198044 1370200 1387421 1645494 1328674
791 1328674 1621368 1716885 847024 745658 19682 527121 -59843 -273358 -668463 -280517
781 -280517 1556556 1722246 1149603 302284 842716 1754476 2715772 1609131 304603
772 304603 -141382 759680 1481171 698910 -71471 -171888 1336854 3156148 2137854
763 2137854 761319 74991 1272477 2584639 2745910 1259940 73664 838682 1975336
754 1975336 2802350 870753 51497 226561 1532633 2970532 2185560 290113 525432
745 525432 2166151 2724263 2004660 351142 299418 1470985 1519035 1622767 350877 361443
735 361443 880375 1677403 1419801 574687 934437 1181186 1570535 1202618 924757 173919
725 173919 80229 601858 388800 -45309 21119 1315641 1344309 938578 519525 604548
715 604548 1539223 1337788 1602534 740653 -598622 -747514 -73915 755891 314605 -278815
705 -278815 -932596 -294064 817373 1495582 963923 1101602 1281276 1042959 736589 -129361
695 -129361 -1198637 -1946029 -1376347 -533899 -468401 -515654 -724145 92037 691645 1319322
685 1319322 1150721 191168 427980 1176553 1480768 893407 -905698 -1449197 -1006547 -585506
675 -585506 128195 -31632 -982044 94273 1397450 1807080 1846267 771587 373508 327734
665 327734 1030919 1649354 761733 -450467 -1095051 -831069 -236532 -413477 -177797 152910
655 152910 944969 1490166 1369831 768033 664514 1073204 1165435 935147 684898 506895
645 506895 729877 1247796 1252137 900742 -74517 -194107 184386 624779 1019048 -69901
635 -69901 -199929 -138089 233309 653322 747744 1031129 694768 -327051 307154 1039331
625 1039331 994239 579962 -307664 -993071 -456149 -627807 401188 -232622 -42520 473957
615 473957 834732 855914 558180 1337928 937850 922173 463741 92349 468685 -448691
605 -448691 -32484 -251829 344136 228991 234165 783838 457047 565129 951819 916994
595 916994 -791415 -521572 -90886 1296331 1432211 -116453 -744157 -624762 1069104
586 1069104 1413838 899579 -932941 -820686 71516 357953 417955 -607036 -121322 496255
576 496255 1962176 1089641 595923 370767 597487 1287444 384494 -237578 -1082488 -854321
566 -854321 -79138 -194142 -517574 -1052331 445339 883913 879905 230185 522060 914022
556 914022 1291176 984391 89534 373178 -258680 73848 46111 -577097 330314 419189
546 419189 593431 719475 -51831 -596800 573065 445716 388157 -259473 -663748 695884
536 695884 359863 289571 -57891 -648220 129428 763802 -173293 -336794 -167052 308257
526 308257 652304 -597281 -1463120 -964741 42789 989017 282137 -1036276 -300771
517 -300771 746160 1227554 756566 -1006597 -646261 337665 46939 -271099 -1402170
508 -1402170 -1194811 387213 526461 -127613 -798964 -574357 1432711 1276103 -78303
499 -78303 -700923 -696761 -98115 -174347 -488592 -903258 -497812 126181 524988 -172918 -1089722
488 -1089722 540554 479070 744959 449308 -81115 594847 1297236 1511477 642480 21545
478 21545 -247577 532804 115076 -3545 305660 348638 1462010 828353 497614 367956
468 367956 1062425 1565736 1175959 190327 -244390 910543 717580 987865 -779429 -526921
458 -526921 881615 1383907 1451517 -211313 -150643 1236341 1828113 907521 214407 353022
448 353022 1297308 2102419 699771 -27420 -623569 944420 1400171 841577 -319600
439 -319600 -121148 933803 1045399 1354991 817958 1202336 1561571 1526378 1676997 -65943
429 -65943 -178324 885029 1422724 952071 480578 516590 1581199 1907477 583733 270083
419 270083 -78148 1131063 1251030 492720 -183488 -247903 1013722 1320504 912444 257404
409 257404 350881 1414903 2438279 2539710 811508 113760 182825 1254118 751570 -353365
399 -353365 -695311 712640 1300394 2049624 1486586 309010 1025091 95644 1437594
390 1437594 1014872 569243 606347 533241 414502 284216 531168 311637 696845 634739
380 634739 1339121 2075919 1445861 1092646 635371 974808 1405876 1233858 448136 -410672
370 -410672 -445500 814382 831703 -246007 -594763 -661230 2052617 2916329 1487407 -21356
360 -21356 -319774 803302 1427434 850623 -364742 -399505 345438 1666965 1471333 459008
350 459008 1161907 985653 1192449 988832 -31778 -359325 582645 212897 -572284 -588617
340 -588617 -738294 535124 664549 1011903 914956 179502 1424478 1285842 339334 -335948
330 -335948 -566839 -237371 -174641 -1268590 -1301618 -484170 77473 972073 598374 -37791
320 -37791 -8625 866243 870840 426498 -305081 -754428 -74154 -689116 -824918 -1295785 -1078851
309 -1078851 -442448 -928041 -772904 -48596 954244 818608 621203 510724 985112 952320
299 952320 945382 310612 -763714 -817085 -715898 -484743 -333041 -883428 -938880 88700
289 88700 978286 954400 1082976 383457 837902 1347852 812828 405821 -423887 377338
279 377338 367627 6439 -753975 -798449 -469913 673658 519250 437465 -1187 -71314 1464860
268 1464860 1175331 1358834 815731 672149 588922 145905 104550 -650376 14323 268132
258 268132 709454 32287 -49320 1527497 1353286 782898 -515714 -706893 -106681 452016
248 452016 -451517 -465547 -735239 -615187 973028 491009 639149 -39436 276851 462368
238 462368 1306973 1200229 -267952 -35092 -65292 513625 157157 -298306 -430156 16352
228 16352 1466436 1284314 911420 1288639 886786 853196 1338397 317920 -340718 -1120259
218 -1120259 -1128245 321431 132939 696340 -121487 -295061 854936 1552569 1436560 688440
208 688440 930497 636650 982957 569696 -55922 -611015 -804162 -313882 -439556 -413369
198 -413369 -390652 755225 1331133 1724254 1417319 1101413 998292 641341 1268176 531381
188 531381 20911 -1000009 -1378464 -652275 -266598 97805 -114295 478237 307057 917462
178 917462 1263945 912650 469694 93736 478336 325958 -78591 -421197 -467231 41505
168 41505 684349 -107308 -710461 440187 42660 951470 441289 -268878 -105196 298861
158 298861 728932 386097 -847489 -826502 -37042 207757 1004158 439237 789826 890949
148 890949 -114162 229264 -300624 162318 470137 510105 -775991 -980598 169866 645029
138 645029 1177811 -238170 -255328 -25925 96176 330717 -701223 -1615622 -1597561 -1384277
128 -1384277 -1142707 -1342214 -1236017 -544894 -230153 -20989 157906 52028 608365 410360
118 410360 794393 -829804 -1604104 -1554415 -1195098 -1083139 -1616901 -1729383 -1766072 -879680
108 -879680 -261280 6830 908710 464319 218447 64695 -500615 -301812 -158432 -1047661
98 -1047661 -1878069 -2468150 -1616038 -296321 -523323 -921262 -1461238 -674740 444725 1139250
88 1139250 699152 -543329 -519032 -111203 -39317 -1014839 -2156913 -2057970 -1440337 -571547
78 -571547 -597721 -1270313 -389337 190665 531995 893518 -577640 -1106034 -1128635 -483553
68 -483553 154118 -847864 -1150149 -1524690 -946488 -154160 -439624 -148861 -139699 -656442
58 -656442 -146110 542730 553872 -24369 -732280 -922063 -817248 -381375 -489445 -541719
48 -541719 -415787 -594153 346611 -125526 -238074 -551623 -593816 170821 -84053 -506663
38 -506663 -1674017 -1647600 -697529 384849 -316681 -852397 -837592 -63629 513634 -112487
28 -112487 -249424 -1117969 -951081 -853113 -232899 -1099881 -1624363 -1316077 -1656456 -616505
18 -616505 -1057365 -628042 -571115 -800678 -483032 -916723 -688907 -716038 -1293960 -2025373
8 -2025373 -1715094 -1237517 -969999 -810435 -1365838 -1034186 -1428573 -811359
0 -811359
$$ Imaginary data points
##PAGE= N=2
##DATA TABLE= (X++(I..I)), XYDATA
16383 -5296078 -5114526 -5817947 -5459224 -5988719 -5628755 -5867024 -5171883 -4478486 -5094963
16374 -5094963 -3977704 -4565809 -3970916 -3408296 -3750755 -3762179 -4697968 -4988352 -4593707
16365 -4593707 -3826916 -3848027 -3726431 -4507784 -4140928 -3183632 -3403395 -2568454 -2898759 -2842699
16355 -2842699 -3227631 -2740911 -2531193 -2585045 -2701964 -3541323 -2992617 -3596416 -2389163
16346 -2389163 -2331339 -2385506 -1963200 -1970659 -1437528 -1524151 -836251 -1217228 -1613069 -1822789
16336 -1822789 -1274175 -1332182 -1695832 -1736940 -2422283 -1435632 -1272455 -601290 -1075610 -1290390
16326 -1290390 -525930 59484 647966 -432422 -451732 -412547 661781 1347128 -515421
16317 -515421 -627612 -1488178 -385834 530501 556095 401711 465139 1364852 1976536 2145384
16307 2145384 1247306 1809357 1455680 2183757 1849154 1542521 2216590 1788539 2544964
16298 2544964 1582886 2253731 2740976 3338532 4170711 3065714 3374414 2681308 3562148
16289 3562148 3161913 3202240 3240411 2964930 3806286 4097095 4100043 3224343 3995323 3479009
16279 3479009 4391950 4301050 3744123 3918153 3470132 4630730 3537102 3394137 3291867
16270 3291867 4086671 4596393 4209274 5705849 4560995 5197213 4650827 5351942 5650029
16261 5650029 4267057 4492103 3057610 3604260 3996300 4264437 4377430 4361615 3997575
16252 3997575 5221303 6126245 5097241 5203987 4150350 4917125 5245712 4677828 4355737
16243 4355737 3465437 4415383 4650352 5640252 4508848 4567679 4279905 5298451 7243844
16234 7243844 5291396 5063501 4246612 5206779 6083423 5377071 5120213 5210543 5150088 5244085
16224 5244085 6231630 5387672 5711327 5611948 5736488 6027959 4753749 5575495 5372755
16215 5372755 5947302 5795927 5672579 5839291 6380049 7096867 6448639 6506900 6108808 7212856
16205 7212856 6284347 5176035 5454459 4976879 5678237 6793799 6816442 6488393 7232444
16196 7232444 7465663 8834884 8505967 7436212 7126934 6661660 7714427 7367245 6957237
16187 6957237 6362593 6288852 7020528 7201286 8114936 7728298 8707238 8894551 9264084 9489085
16177 9489085 8880067 8229018 7258536 7004598 7120603 7402058 6696521 7155704 7079125 7909301
16167 7909301 9042287 9307856 9157390 8651951 8707123 9113829 8781866 8346407 7752687
16158 7752687 8045209 7896622 8507410 8592693 8680410 8259997 8595060 9366066 9443354 9567711
16148 9567711 8704600 7914362 7848144 7813765 7804705 8255666 7398542 7688140 8321472 8614451
16138 8614451 8910905 8309533 8745426 9674316 9374110 9084442 9039854 8061945 7660755 6858718
16128 6858718 7044508 7613068 7688984 7162202 8061853 8958278 9881085 10982950 9636223
16119 9636223 8343840 7930415 7961064 8956561 7783128 6078992 6238015 6544497 8163399
16110 8163399 9542598 9277427 9185745 9220556 10508243 11998206 10209845 9070588 7513753
16101 7513753 6475599 7481556 7821584 7042816 7059732 7592376 8214000 9633252 9637298
16092 9637298 9579139 10589676 10329847 10806538 9494354 8769236 8855467 7830317 8808756
16083 8808756 9112935 7861562 8461933 7951928 8519660 10516913 10682632 10573124 10847669
16074 10847669 10701094 11392316 10886359 9546409 8523174 7654021 7461876 8189829 8119096
16065 8119096 8517695 9208640 8998049 9801172 9861268 9680750 10193144 9632616 10357177 9807023
16055 9807023 8074049 8473521 9457627 9426939 8948922 7702422 7591190 8750405 9087496
16046 9087496 10130697 8591108 8029228 9187451 10370078 9869067 8851742 8548873 8862569
16037 8862569 10156588 8982816 7698535 7370378 7995094 9783742 9666308 7641134 6802418
16028 6802418 7767672 8834934 10165258 8658582 7650111 7740944 8774161 10303313 8974376
16019 8974376 8519119 8126765 8370648 9316001 8869672 8997042 8102729 8401999 8336151 8658057
16009 8658057 8838604 8430927 8941211 8497591 9024055 9197945 9118984 9314763 9459792 9018701
15999 9018701 9597431 8863393 8535920 8903328 8844833 9921801 9124567 7887930 7665475
15990 7665475 8012133 9906478 9695378 9086343 7706879 7442016 9729009 10652191 10083048
15981 10083048 8792242 9259553 9619907 10195047 9492591 7992073 8167895 9531754 9922876
15972 9922876 9676615 8524529 8314315 10137396 10789379 11865358 10523036 9131182 10714792
15963 10714792 10904840 11162609 8856809 7046419 7701625 9246630 9947880 9176498 8420015
15954 8420015 8896138 10902205 11167221 10710050 10026666 9692542 10271819 10510233 10167792
15945 10167792 8835087 7726322 7878384 9374841 9165392 8605682 8829325 9606721 11740769
15936 11740769 11756620 10846195 9280479 8389245 9185602 9539890 8853869 7927093 7407348
15927 7407348 8267595 9685533 9368968 8314293 8704910 9577893 10112908 9973174 9103921
15918 9103921 8833184 9480310 9255220 9311584 7614952 6797897 8448265 8503312 9262295
15909 9262295 8093255 7770452 8460039 8502786 9030016 8945078 8071430 7825185 8219951 8376385
15899 8376385 8509610 8459646 9001313 9130616 8800828 9047914 9582940 9872301 9716012 9237280
15889 9237280 8547418 8734530 8345750 7861532 9104102 8681308 9224580 8987734 8093784
15880 8093784 9373747 9943079 10412048 10906067 9685826 9196959 9930782 10177410 10387738
15871 10387738 8952096 8355798 9245337 10360441 10992251 10007983 8535813 9255255 10823303
15862 10823303 10715029 10233477 8777168 8773007 10454650 10487098 9106681 8659877 8093819
15853 8093819 9645266 11076980 10232313 8984024 8279876 10173798 11799334 10887110 9285004
15844 9285004 7781938 8511470 10618898 10898744 9933764 9596189 10021347 10755458 10641776
15835 10641776 10350742 9943446 9692313 9911647 8946142 9135819 9589800 9392343 8880423
15826 8880423 8957484 9199805 9051432 9682151 9798289 9779593 10184274 10196822 10135986 9149654
15816 9149654 8598548 9048436 9902078 9673968 9097036 8611921 8129675 8660048 9157534
15807 9157534 9281932 8457433 8201821 8569076 9131611 9399373 8837386 8599966 8794456
15798 8794456 9662848 8663175 8969414 9321895 8811594 8802818 7667198 7864367 8279633 9525944
15788 9525944 9879283 8927149 8328992 9447326 10488862 10118946 9270255 8587706 9060072
15779 9060072 9690421 9882549 8777132 8261964 8321848 8732479 10330893 9157864 8967874
15770 8967874 9586687 10877584 11377449 9835618 8953228 8514297 8922995 9348577 9085719
15761 9085719 8029559 8051159 8211236 8737147 9371963 8751056 9766137 9442221 9237941
15752 9237941 9512013 8781107 9204920 8862373 8662686 8258707 8210271 8022331 8714592 8055444
15742 8055444 7665508 8359862 7806036 9013435 9306758 8953570 9317092 9214635 9515577
15733 9515577 9244000 7890669 8030401 9094485 9078713 8853369 7599284 8141220 8479610
15724 8479610 9009975 9809542 8788696 8367797 7943051 8842233 9249818 9305215 9006826
15715 9006826 9214142 9617594 8555833 9474039 9091861 8622671 8847533 8079289 8359275
15706 8359275 8472143 8388530 8635677 8674967 8476247 8526962 8490182 8411891 9497085 8585160
15696 8585160 8785270 8415079 8395509 8801272 8268109 8577252 8445014 8203324 8139802 9116565
15686 9116565 8981347 9540831 9768616 9590590 9729635 9256250 9003528 9059226 9518032 8844942
15676 8844942 8573738 8754966 8664619 8827778 8937846 9645782 9229727 9473318 8876066 9403649
15666 9403649 10126822 10265986 10122533 8706658 9050388 9408214 9545414 8955079 8483135
15657 8483135 8808188 9949407 10436474 9655060 9364645 8600807 9288670 9945406 9439609
15648 9439609 9239119 7976323 9095950 9444661 10467837 10043163 8986414 9533360 9639140
15639 9639140 10356906 10343384 9483526 8386082 9076228 9700788 9304315 9022364 8858228
15630 8858228 9630250 9996532 10320323 9854260 9398415 9578575 9362372 9746160 9486401
15621 9486401 9976912 8874980 8908706 8749024 9316163 10131240 10195899 10683708 10143608 10125114
15611 10125114 10763888 10546536 10265698 9431201 9251597 8687907 9498428 9013411 8609622
15602 8609622 8706753 9124606 10384777 9987254 10425441 10229078 10712755 11523509 10772722
15593 10772722 9187438 9231707 9650078 9921948 10009046 8722348 9046903 9631051 10034071
15584 10034071 10713080 9470750 9806178 10530863 10318856 9847161 8787533 8170645 8933981
15575 8933981 9890240 9766931 10041375 9671989 10740737 11178976 10023823 9898732 9242920
15566 9242920 9999985 10106631 9742502 8994478 9084516 9283259 10145888 9763794 9163136 10178007
15556 10178007 10478320 11449069 10750180 10225611 10030759 8991978 8901136 8814403 8620266
15547 8620266 8217501 8199417 8324522 8940750 9161150 9504784 10148858 10333619 10775327 9845479
15537 9845479 9987107 9434916 8464360 8376600 7861960 8184366 8439333 8744637 8342953 8561735
15527 8561735 9647554 9841299 10145029 9513921 9358245 9797079 10381034 10130044 9062351
15518 9062351 8410773 8259866 8923358 9035982 8828395 8309910 8491014 9508638 9362928
15509 9362928 9013296 8554700 9038486 9081070 9286865 8922877 8891575 10172693 9544670 9774485
15499 9774485 8825643 8727184 9366304 10157912 9863840 9085745 8560424 8886605 9927560
15490 9927560 8947550 9194788 9012295 9838727 11204096 10596553 9917452 9814352 10151357
15481 10151357 10798503 9980028 8019889 7521679 8074785 8646847 9259617 8705800 8641990
15472 8641990 9752879 10864030 11972967 11172742 10252820 10321314 9885636 9951552 9670562
15463 9670562 8800359 8752592 8629845 8489839 8693340 9063753 9916112 10306922 9984855 10595118
15453 10595118 10872489 10850695 10526353 9682062 9253720 8774143 7927113 7214515 7705096
15444 7705096 8559417 9651230 10182975 9959346 10309527 9961318 10304144 10382869 10381707 9136767
15434 9136767 8442103 8708895 9167242 9432268 8742192 8322981 8484403 9592601 10085492
15425 10085492 10132533 9699835 9106064 9153154 9049837 8678020 8280000 8216620 8334935 8446847
15415 8446847 9012317 9012130 9314702 9187994 9608962 10160772 9709378 9928091 9250783 9323395
15405 9323395 9419364 9238851 8876943 8035903 7710238 8378642 9729272 9864131 9778965 8942718
15395 8942718 9372211 10045173 11159945 10991827 9027748 9445209 8628951 8815072 8867291
15386 8867291 8797536 9258086 9011199 9998586 9961201 10539153 10113623 10080129 9964390 9885981
15376 9885981 9746980 9160796 8919236 8189545 8512718 8865018 9109953 8813683 8799661 9232883
15366 9232883 8865537 9858578 9370744 8872551 8507516 9184187 10573741 10262214 9579432
15357 9579432 7835050 8885601 10430993 10902189 10525678 9659310 9572315 9892633 10763473
15348 10763473 9419394 9260970 9211423 9612313 9630262 8744651 8495019 8553383 10225011
15339 10225011 10183583 9396406 8903031 9168000 10537068 10843421 9552973 7821558 8769167
15330 8769167 9087809 10795263 10173701 8809977 9783502 10507135 11588374 10204741 9483155
15321 9483155 10364852 11254161 10637126 9398261 8522980 9559724 11336021 10958760 10014103
15312 10014103 8994698 9836635 11038950 11180369 10266556 9222890 9739281 9862265 10836760
15303 10836760 10281622 10028629 10065567 10019875 10651907 10159826 9979495 9492262 10141527 11117139
15293 11117139 10875141 9905915 9717660 10356033 9994003 10770580 10027714 10351496 10116861
15284 10116861 10329989 10843084 10411103 10387173 9861783 9943650 10108216 10707902 11328888 10702010
15274 10702010 10176071 9825570 10683472 10488852 10299032 9369550 9127473 10028780 10204439
15265 10204439 9865740 9126752 9604987 9636522 10887874 10249072 9440934 9631702 9713319
15256 9713319 10816252 10502497 9840536 10024899 10670401 10510219 10332597 9876226 8826142
15247 8826142 9524992 9801734 9924954 9719268 9574132 10435610 10248218 9608704 9060380
15238 9060380 9170429 9369438 9618227 8700032 8398127 8878003 9708476 10185861 9748257
15229 9748257 10040503 9785141 10298711 10215447 9710479 8816430 9329900 9290750 8683784 8490214
15219 8490214 7872671 8866096 9523420 9420073 9366849 9726107 10335873 10680231 10293282 9717971
15209 9717971 10114118 9966670 10367077 9751919 9258021 9576096 8882272 8988540 9100217
15200 9100217 9689057 10048353 10038096 10602020 10666245 9927974 9146928 10057003 10620815 10764644
15190 10764644 9514821 9120541 9474482 10145227 10698686 10425072 10623155 10106297 10349793
15181 10349793 10076340 10979611 10149836 9060438 9737242 9561078 10407583 10437593 9935232
15172 9935232 10676040 10566615 11126138 10891629 10046376 9897616 10266299 9624229 9586821 8708084
15162 8708084 8395779 9024738 9518818 10977511 10293138 10645095 11007965 11535889 11477547
15153 11477547 10205608 9480582 8746899 8608918 7762829 8012452 7724248 7532603 8995047
15144 8995047 9235768 9743983 9512591 10413654 11287230 11045633 10332512 9846234 8949532
15135 8949532 8246108 8325617 7686435 7630030 7446565 8119298 8916894 8405638 9278618 9505832
15125 9505832 10377661 9876613 8494133 8278274 9102715 9068639 8365880 7791074 7010296
15116 7010296 8221101 9111833 8724392 8331185 8246824 8908180 9248658 8756556 8754667 8629440
15106 8629440 8284506 8356742 8432770 8027070 8979448 9545027 9762818 9577048 9148897 9343625
15096 9343625 9045812 9017884 8033036 7414184 7955328 8543486 8500051 8233639 9368974 10180595
15086 10180595 10758382 10724549 10446869 10649050 10367341 10752852 10251478 9218003 8568469
15077 8568469 8955966 9063746 8900401 9073905 9196979 10058909 11070942 12027024 11938948
15068 11938948 12076641 11853899 11319479 11436014 10208744 10041753 9152359 8832488 8952160
15059 8952160 8484209 9806321 10270951 11319145 11458401 11622646 11864121 11972290 11230220
15050 11230220 10337303 10484208 10457532 10320131 9553404 9366348 10161601 11180619 11083969
15041 11083969 10554996 10845095 10885388 11184121 11156733 10876747 9792834 10091676 11635805
15032 11635805 11476863 10975072 10014568 10303345 11490821 11047628 10707086 9730811 10267442
$$ [...]
##END NTUPLES=NMR SPECTRUM
##END=
