##TITLE=1H_DE-80H_X3
 200.13MHz, d2o
 8 sc
 
 19ns.26.2.2025
##JCAMPDX= 6.0         $$ Bruker NMR JCAMP-DX V2.0
##DATA TYPE= NMR SPECTRUM
##DATA CLASS= NTUPLES
##ORIGIN= UXNMR, Bruker Analytische Messtechnik GmbH
##OWNER= pz
$$ XWIN-NMR		Version 3.5
$$ Mon Jun 22 10:55:44 2026 Russian Standard Time (UT+4h)  Yarkov@DPX200
##.OBSERVE FREQUENCY= 200.1313
##.OBSERVE NUCLEUS= ^1H
##.ACQUISITION MODE= SIMULTANEOUS
##.ACQUISITION SCHEME= undefined
##.AVERAGES= 8
##.DIGITISER RES= 18
##SPECTROMETER/DATA SYSTEM= spect
##.PULSE SEQUENCE= zg30
##.SOLVENT NAME= DMSO
##.SHIFT REFERENCE= (INTERNAL, DMSO, 0, 15.4957)
##AUDIT TRAIL= $$ (NUMBER, WHEN, WHO, WHERE, WHAT)
$$ ##TITLE= Audit trail, XWIN-NMR		Version 3.5
$$ ##JCAMPDX= 5.01
$$ ##ORIGIN= Bruker BioSpin GmbH
$$ ##OWNER= Yarkov
$$ C:/Bruker/XWIN-NMR/data/yarkov2/nmr/H-C/1/pdata/1/auditp.txt
$$ ##AUDIT TRAIL=  $$ (NUMBER, WHEN, WHO, WHERE, WHAT)
(   1,<2026-06-22 10:54:56.28 +0400>,<Yarkov>,<DPX200>,
      <created by zg, POWCHK disabled, PULCHK disabled
       configuration hash MD5:
       00 E9 B6 7A A2 85 ED C7 34 08 36 98 17 FE 4E 26
       data hash MD5: 16K
       84 F3 A9 1D F0 DB D8 10 BE 0C 7B 33 83 75 0B 54>)
(   2,<2026-06-22 10:55:02.18 +0400>,<Yarkov>,<DPX200>,
      <Start of raw data processing
       efp BC_mod = 2 LB = 0.25 FT_mod = 6 PKNL = 1 PHC0 = -6900.419 PHC1 = 13.42196 SI = 16K 
       data hash MD5: 16K
       0E F5 B0 95 32 AB 5A DE B6 0A AB E1 BB 89 9E 67>)
(   3,<2026-06-22 10:55:09.53 +0400>,<Yarkov>,<DPX200>,
      <abs ABSG = 5 
       data hash MD5: 16K
       B9 9A F7 F5 F8 68 F4 40 2C C6 DF 0A 9C 51 96 F4>)
$$ ##END=
$$ 
$$ hash MD5
$$ 04 63 3E 32 5F 11 6B 9A CF A2 74 9E 45 D3 26 AC
##$RELAX= 
##$RELAX= 
##$RELAX= 
##$RELAX= 
##$RELAX= 
##$RELAX= 
$$ Bruker specific parameters
$$ --------------------------
##$DU= <C:/Bruker/XWIN-NMR>
##$EXPNO= 1
##$NAME= <H-C>
##$PROCNO= 1
##$TYPE= <nmr>
##$USER= <yarkov2>
##$AMP= (0..31)
100 100 100 100 100 100 100 100 100 100 100 100 100 100 100 100 100 100 
100 100 100 100 100 100 100 100 100 100 100 100 100 100 
##$AQSEQ= 0
##$AQ_mod= 1
##$AUNM= <au_zg>
##$AUTOPOS= <>
##$BF1= 200.13
##$BF2= 200.13
##$BF3= 200.13
##$BF4= 200.13
##$BF5= 200.13
##$BF6= 200.13
##$BF7= 200.13
##$BF8= 200.13
##$BYTORDA= 1
##$CFDGTYP= 0
##$CFRGTYP= 5
##$CHEMSTR= <none>
##$CNST= (0..31)
1 1 145 1 1 1 1 1 1 1 1 1 1 1 1 1 1 1 1 1 1 1 1 1 1 1 1 1 1 1 1 1 
##$CPDPRG= <>
##$CPDPRG1= <>
##$CPDPRG2= <>
##$CPDPRG3= <>
##$CPDPRG4= <mlev>
##$CPDPRG5= <mlev>
##$CPDPRG6= <mlev>
##$CPDPRG7= <mlev>
##$CPDPRG8= <mlev>
##$CPDPRGB= <>
##$CPDPRGT= <>
##$D= (0..31)
0 0.7 0 0 0 0 0 0 0 0 0 0.03 0 0 0 0 0 0 0 0 0 0 0 0 0 0 0 0 0 0 0 0 
##$DATE= 1782111295
##$DBL= (0..7)
120 120 120 120 120 120 120 120 
##$DBP= (0..7)
150 150 150 150 150 150 150 150 
##$DBP07= 0
##$DBPNAM0= <>
##$DBPNAM1= <>
##$DBPNAM2= <>
##$DBPNAM3= <>
##$DBPNAM4= <>
##$DBPNAM5= <>
##$DBPNAM6= <>
##$DBPNAM7= <>
##$DBPOAL= (0..7)
0.5 0.5 0.5 0.5 0.5 0.5 0.5 0.5 
##$DBPOFFS= (0..7)
0 0 0 0 0 0 0 0 
##$DE= 6
$$ [...]
##$SUBNAM3= <"">
##$SUBNAM4= <"">
##$SUBNAM5= <"">
##$SUBNAM6= <"">
##$SUBNAM7= <"">
##$SUBNAM8= <"">
##$SUBNAM9= <"">
##$SW= 18.0517328524113
##$SWIBOX= (0..15)
0 0 2 0 0 0 0 0 0 0 0 0 0 0 0 0 
##$SW_h= 3612.71676300578
##$TD= 16384
##$TD0= 1
##$TE= 0
##$TE2= 300
##$TE3= 300
##$TEG= 300
##$TL= (0..7)
0 120 120 120 120 120 120 120 
##$TP= (0..7)
150 150 150 150 150 150 150 150 
##$TP07= 0
##$TPNAME0= <>
##$TPNAME1= <>
##$TPNAME2= <>
##$TPNAME3= <>
##$TPNAME4= <>
##$TPNAME5= <>
##$TPNAME6= <>
##$TPNAME7= <>
##$TPOAL= (0..7)
0.5 0.5 0.5 0.5 0.5 0.5 0.5 0.5 
##$TPOFFS= (0..7)
0 0 0 0 0 0 0 0 
##$TUNHIN= 0
##$TUNHOUT= 0
##$TUNXOUT= 0
##$USERA1= <user>
##$USERA2= <user>
##$USERA3= <user>
##$USERA4= <user>
##$USERA5= <user>
##$V9= 5
##$VALIST= <valist>
##$VCLIST= <CCCCCCCCCCCCCCC>
##$VD= 0
##$VDLIST= <DDDDDDDDDDDDDDD>
##$VPLIST= <PPPPPPPPPPPPPPP>
##$VTLIST= <TTTTTTTTTTTTTTT>
##$WBST= 1024
##$WBSW= 4
##$XGAIN= (0..3)
0 0 0 0 
##$XL= 0
##$YL= 0
##$YMAX_a= 168407
##$YMIN_a= -312463
##$ZGOPTNS= <>
##$ZL1= 120
##$ZL2= 120
##$ZL3= 120
##$ZL4= 120
##$ABSF1= 15.49568
##$ABSF2= -2.55617
##$ABSG= 5
##$ABSL= 3
##$ALPHA= 0
##$AQORDER= 0
##$ASSFAC= 0
##$ASSFACI= 0
##$ASSFACX= 0
##$ASSWID= 0
##$AUNMP= <proc_1d>
##$AZFE= 0.1
##$AZFW= 0.1
##$BCFW= 0
##$BC_mod= 2
##$BYTORDP= 0
##$COROFFS= 0
##$CY= -3
##$DATMOD= 1
##$DC= 0
##$DFILT= <>
##$DTYPP= 0
##$F1P= 0
##$F2P= 0
##$FCOR= 1
##$FTSIZE= 16384
##$FT_mod= 6
##$GAMMA= 0
##$GB= 0
##$INTBC= 1
##$INTSCL= 3.241238e-09
##$ISEN= 128
##$LB= 0.25
##$LEV0= 0
##$LPBIN= 0
##$MAXI= 10000
##$MC2= 0
##$MEAN= 0
##$ME_mod= 0
##$MI= 1.114404
##$NCOEF= 0
##$NC_proc= -8
##$NLEV= 6
##$NOISF1= 3.799351
##$NOISF2= 2.8
##$NSP= 0
##$NTH_PI= 0
##$NZP= 0
##$OFFSET= 15.49568
##$PC= 1
##$PHC0= -6900.419
##$PHC1= 13.42196
##$PH_mod= 1
##$PKNL= yes
##$PPARMOD= 0
##$PSCAL= 0
##$PSIGN= 0
##$REVERSE= no
##$SF= 200.130005207681
##$SI= 16384
##$SIGF1= 3
##$SIGF2= 2
##$SINO= 0.751879
##$SIOLD= 32768
##$SREGLST= <19F.Aceton>
##$SSB= 0
##$STSI= 16384
##$STSR= 0
##$SW_p= 3612.71676300578
##$SYMM= 0
##$S_DEV= 0
##$TDeff= 16384
##$TDoff= 0
##$TI= <>
##$TILT= no
##$TM1= 0
##$TM2= 0
##$TOPLEV= 0
##$USERP1= <user>
##$USERP2= <user>
##$USERP3= <user>
##$USERP4= <user>
##$USERP5= <user>
##$WDW= 1
##$XDIM= 16384
##$YMAX_p= 516083896
##$YMIN_p= -522685
$$ End of Bruker specific parameters
$$ ---------------------------------
##NTUPLES= NMR SPECTRUM
##VAR_NAME=  FREQUENCY,     SPECTRUM/REAL,   SPECTRUM/IMAG
##SYMBOL=    X,             R,               I
##VAR_TYPE=  INDEPENDENT,   DEPENDENT,       DEPENDENT
##VAR_FORM=  AFFN,          ASDF,            ASDF
##VAR_DIM=   16384,         16384,           16384
##UNITS=     HZ,            ARBITRARY UNITS, ARBITRARY UNITS
##FACTOR=    0.220516191357247, 1,           1
##FIRST=     3101.15049014709, 0,            0
##LAST=      -511.566272858692, 0,           0
##MIN=       -511.566272858692, -522685,     0
##MAX=       3101.15049014709, 516083896,    0
$$ Real data points
##PAGE= N=1
##DATA TABLE= (X++(R..R)), XYDATA
$$ [...]
6172F7522793O628083Q214187J0072305J1695086J2936850J3875618J5143589
6165A46088511J7507501J9506344J9731304J5790719Q527483n89993r494528j6577485
6157B00489856k0135658k0255690j9102594j6703577j3806717j0944720q274218
6150I1266682o031318m086724k366970q71795N02225J946072L760087N507860
6142H9626119O827677P561230P287783O965833O791118O852670P812955R512411
6134A49237796J2227349J5729254J9658055K2532944K1381934J5399438O033727
6127B62200497m414549j4122629k0422028k3156842k3022362k0761106j7669853
6120A38631128j4191508j1023780q048806n956609l615661j642722M16082L098264
$$ y = [67522793, 74150876, 82365063, 92437368, 104132454, 117069304, 130944922, 146088511, 163596012, 183102356, 202833660, 218624379, 227151862, 226561869, 217067341, 200489856, 180354198, 160098508, 140995914, 124292337, 110485620, 99540900, 91266682, 85235364, 81148640, 78781670, 77909875, 78412100, 80358172, 84118259, 89626119, 96453796, 104015026, 111302809, 118268642, 125059760, 131912430, 139725385, 149237796, 161465145, 177194399, 196852454, 219385398, 240767332, 256166770, 262200497, 257785948, 243663319, 223241291, 200084449, 177062087, 156300981, 138631128, 124439620, 113415840, 105367034, 99410425, 95794764, 94152042, 94568124, 97666388]
6112I7666388O145054R193954J1592986J1874052R416252N035019M20531l310124
6104A48034112n899590o104515m675779k215785Q17150L837650N804522N873082
6096A45470847L880093J82410m009913p657113r945468j0754538j0351655r256304
6088I7558359p617691o277583m726193l218771j665430J6630J344547L399997
6080G8813865N759710Q345873J0628024J0794451Q519901M271242j120553n669943
6072A20342570q723049j0265118j0208659r253867p706369n851731m582602l050310
6064F0700865k017825j746950j840793k115834k314109k325279k308548j883381
6056D4148146j673251j453929j089345q02025n04103j89145K02364Q42894J660762
$$ y = [97666388, 103811442, 113005396, 124598382, 136472434, 145888686, 150923705, 151344236, 148034112, 142134522, 136030007, 131354228, 129138443, 129955593, 133793243, 139597765, 145470847, 149350940, 149533350, 145523437, 137866324, 127920856, 117166318, 106814663, 97558359, 89940668, 83663085, 78936892, 75718121, 74052691, 74069321, 75413868, 78813865, 84573575, 92919448, 103547472, 114341923, 122861824, 127133066, 126012513, 120342570, 111619521, 101354403, 91145744, 81891877, 74185508, 68333777, 63751175, 60700865, 58683040, 56936090, 55095297, 52979463, 50665354, 48340075, 46031527, 44148146, 42474895, 41020966, 39931621, 39129596, 38625493, 38436348, 38638712, 39481606, 41142368]
6047D1142368K585796L053245L142873K551415J035067m02266j773239l014166
6039D8321093l614143l535523l583373l169446k421694k089623j836406j422261
6031B6648624j120797j058190q06347o36055n13021m58298m07577m61410m47509
6022B0739420k17511l95977j29246j26127j33384k74168k31268m8878j57977l2448
6012A8992436M1059k23929o1388j40506J23810r3746j53949K49799N0085Q6650
6002A8870321K05299q5832K7621K35569M6591Q8295n8136k29061j62330k1321
5992A8917016j35737n0871N9564K7164o6466J23980K59086K67605M78653M89523
5982B0369517K27227K78331L81210K58135L19913M53103M49787L89020L20624
$$ y = [41142368, 43728164, 46781409, 49924282, 52475697, 53510764, 53108498, 51335259, 48321093, 44706950, 41171427, 37588054, 34418608, 31996914, 29907291, 28070885, 26648624, 25527827, 24469637, 23663290, 23027235, 22514214, 22055916, 21648339, 21186929, 20739420, 20521909, 20125932, 19996686, 19870559, 19737175, 19463007, 19231739, 19182861, 19024884, 18992436, 19033495, 18809566, 18748178, 18607672, 18731482, 18637736, 18483787, 18733586, 18783671, 18870321, 19075620, 18989788, 19017409, 19252978, 19299569, 19387864, 19329728, 19100667, 18938337, 18917016, 18781279, 18730408, 18789972, 18817136, 18750670, 18874650, 19133736, 19401341, 19879994, 20369517, 20596744, 20875075, 21256285, 21514420, 21834333, 22287436, 22737223, 23126243, 23446867]
5973B3446867L86410K75747J95972J56176M9953Q3514O7012l9468J48474J67157
5963B4937814J71298K67970L07615K23805L79646M56796M95673O98312Q71287
5954B8810216J063047J022732J243659J484864J752508K266285K664696L283824
5946D3591831L951776M239696M374148L674795K986428J699741Q54503K68307
5938F5641225R3696Q73218J632746K628037L571125M157114L933031L402119K609680
5929H8541991K239134K005750J978526K489925L688120M871779O290345Q146654
5921A20252224J0048995J2079779J4414300J6973555K0192393K4285319K9107318
5914B47353883L4903205M0338207M3558041M1955660L4898968K3426463J0690915
$$ y = [23446867, 23833277, 24109024, 24304996, 24461172, 24511125, 24594639, 24661651, 24622183, 24770657, 24937814, 25109112, 25377082, 25684697, 25908502, 26288148, 26744944, 27240617, 27938929, 28810216, 29873263, 30895995, 32139654, 33624518, 35377026, 37643311, 40308007, 43591831, 47543607, 51783303, 56157451, 59832246, 62818674, 64518415, 65372918, 65641225, 65734921, 66608139, 68240885, 70868922, 74440047, 78597161, 82530192, 85932311, 88541991, 90781125, 92786875, 94765401, 97255326, 100943446, 105815225, 112105570, 120252224, 130301219, 142380998, 156795298, 173768853, 193961246, 218246565, 247353883, 282257088, 322595295, 366153336, 408108996, 443007964, 466434427, 477125342]
5907D77125342l64642q028699j0540940p970251j781930N875924J2146883J3778708
5899D80240395R338449l20276j2692138k4954669l4150406l9064511m0123240
5892C38273604l8085933l4272752k9826743k5236617k1062930j7562309j5061765
5885A57164555j2900840j1481955j0271887r187339q173011p354588o797874o176660
5877H4820401n477737m940341m428927m115175l600351l078310l085947k781242
5869E3312371k488481k266443k164640j999187j905134j607090j519623j399189
5861C7962584j001861j061040j227852j266059r44133q79210r63171p56188r48009
5852B8915061q27528q59432j153834r55932q08436n95768p26000q24662p45086
$$ y = [477125342, 476760700, 468732001, 458191061, 450220810, 448438880, 454314804, 466461687, 480240395, 489578844, 489258568, 476566430, 451611761, 417461355, 378396844, 338273604, 300187671, 265914919, 236088176, 210851559, 189788629, 172226320, 157164555, 144263715, 132781760, 122509873, 113322534, 105149523, 97794935, 90997061, 84820401, 79342664, 74402323, 69973396, 65858221, 62257870, 59179560, 56093613, 53312371, 50823890, 48557447, 46392807, 44393620, 42488486, 40881396, 39361773, 37962584, 36960723, 35899683, 34671831, 33405772, 32461639, 31582429, 30619258, 29863070, 28915061, 28087533, 27228101, 26074267, 25118335, 24309899, 23714131, 22988131, 22163469, 21418383]
5843B1418383q06435n03724m31281m43193o43808o06975o31477p04556n08121
5834A6138813m49481l66001k48115m15822k66090m00826k34963k05007j75323
5825A3377185j89004m41457k06632k03521j68093j87735q0891r9430l40685k41910
5815A1217827l34123j19438l6418n3845j6251j45424k64508k0608l5282o7677
5805A0124253k38385m9104p1590j18043o8913j26628l4271j43663k3830m9452
5795I200374o9353N7040m5322k55108n5741l50717l98849l14480k42634l19561
5785G205649j40451k01947k13013j32051k77437k89955j10510p0816j86865j0101
5775E572503J24573N2305n7292j15802j6881J5518o6569n0905q1442J6182K7227
$$ y = [21418383, 20611948, 20108224, 19676943, 19233750, 18589942, 17982967, 17351490, 16646934, 16138813, 15689332, 15323331, 15075216, 14659394, 14393304, 13992478, 13757515, 13552508, 13377185, 13188181, 12746724, 12540092, 12336571, 12168478, 11980743, 11899852, 11800422, 11459737, 11217827, 10883704, 10764266, 10727848, 10674003, 10657752, 10512328, 10247820, 10227212, 10191930, 10124253, 9885868, 9836764, 9765174, 9647131, 9578218, 9451590, 9417319, 9273656, 9249826, 9200374, 9131021, 9188061, 9142739, 8887631, 8831890, 8481173, 8082324, 7767844, 7525210, 7205649, 7065198, 6863251, 6650238, 6518187, 6240750, 5950795, 5840285, 5769469, 5582604, 5572503, 5697076, 5749381, 5692089, 5576287, 5559406, 5574924, 5508355, 5457450, 5376008, 5392190, 5419417]
5764E419417R2480K56191J05643O7931K2315M2705M6582L3982l4219R4912l0067
5753F117872r2965M6592Q8405k9823M8607K00016L43000L60536K83410L52979
5743G718629L79502N61230N12491P03006J002579J188345K197267L283607M644147
5734B2190803N178782M261811K205304n6879j792062l457246l999115l670868
5726B0860530l173619k773316k264021j687535j273330r09884o75179o39219m98581
5717F965846l38204m70333l54639m2741j48831j55020l00668o6493r0438j95391
5707D803088j28256j54275j06706k2815q6337k16927k47214j28053o0652o5614
5697C586239m57k01145j67353k578p1379j20035R603M5407l6765j12568j67701
$$ y = [5419417, 5511897, 5768088, 5873731, 5941662, 5963977, 6006682, 6053264, 6087246, 6053027, 6147939, 6117872, 6024907, 6071499, 6159904, 6130081, 6178688, 6378704, 6721704, 7082240, 7365650, 7718629, 8098131, 8659361, 9171852, 9874858, 10877437, 12065782, 14263049, 17546656, 22190803, 27369585, 31631396, 33836700, 33779821, 31987759, 28530513, 24531398, 20860530, 17686911, 14913595, 12649574, 10962039, 9688709, 8778825, 8103646, 7464427, 6965846, 6627642, 6157309, 5802670, 5759929, 5611098, 5456078, 5155410, 5088917, 4998479, 4803088, 4674832, 4520557, 4413851, 4391036, 4304699, 4087772, 3840558, 3712505, 3651853, 3586239, 3585782, 3384637, 3217284, 3214706, 3143327, 3023292, 3032895, 3078302, 3041537, 2928969, 2761268]
5686B761268P7169J39871O524N4878N4867j19726N3283L3322J24908J53036K48324
5675C587724J89830J38555J92534K51104L32637L39209L97977K73468K6721k9587
5665E700172J28648j53465k62366l71836l59639m28158k46552k69909k84770k51635
5655C200490q1210j0440r8134j28095r6761j82895j9126l5569Q4819l4367k39589
5644B359123O5298O2875l9951M4095j4654l478j32545j38917J27016r5677J06168
5633B339353k2383j47230P2991k0851L2066J18935Q9675J70958J02040r0469p4793
5622B570292J68727J06828J61185J71216K98463K56177K84632K84833N39446N11599
5612E353398M86831M81504K95233J44851J37514O9158K350l6474j22593l24479
$$ y = [2761268, 2838437, 2978308, 2984832, 3039710, 3094577, 2974851, 3028134, 3061456, 3186364, 3339400, 3587724, 3777554, 3916109, 4108643, 4359747, 4692384, 5031593, 5429570, 5703038, 5729759, 5700172, 5828820, 5675355, 5412989, 5041153, 4681514, 4253356, 4006804, 3736895, 3452125, 3200490, 3119280, 3108840, 3010706, 2882611, 2785850, 2602955, 2583829, 2548260, 2633079, 2598712, 2359123, 2424421, 2487296, 2447345, 2491440, 2476786, 2473308, 2340763, 2201846, 2328862, 2233185, 2339353, 2316970, 2169740, 2242731, 2221880, 2253946, 2372881, 2462556, 2633514, 2735554, 2645085, 2570292, 2739019, 2845847, 3007032, 3178248, 3476711, 3732888, 4017520, 4302353, 4841799, 5353398, 5840229, 6321733, 6616966, 6761817, 6899331, 6968489, 6970839, 6934365, 6811772, 6487293]
5602F487293l58203n09190m50575k37263k36737l53430k42821l757j27017j02126
5592C866174o5289J11197J1026J02458J08488o6305l5129K11460J75276J57242
5582D576598j59377n5704n3169q1689o6057J8934J12060N9865J01569J04213k8331
5571D528912r0117j05169j17081o0401j06228j49181k71316J05562K6436J7541
5561C778958O9237P0491P2813K8102M6438J16511J65449j7168M3708j14057r1080
5550D169402k06257K2727K1647J75663N3060j09972J14621j1400J82501J65612
5540D577604R8025j68345n9783j47397p0846L2247k8602j42169j5587P8626j61939
5529C991834r7510p941J02824r521k1060j83309p9105P0709J22893p4925j03405
$$ y = [6487293, 6129090, 5619900, 5169325, 4932062, 4695325, 4341895, 4099074, 4095317, 3968300, 3866174, 3800885, 3912082, 3923108, 4025566, 4134054, 4067749, 4032620, 4244080, 4419356, 4576598, 4417221, 4361517, 4308348, 4226659, 4160602, 4179536, 4291596, 4351461, 4453030, 4557243, 4528912, 4438795, 4333626, 4216545, 4156144, 4049916, 3900735, 3629419, 3734981, 3761417, 3778958, 3848195, 3918686, 3991499, 4019601, 4066039, 4182550, 4347999, 4330831, 4374539, 4260482, 4169402, 3963145, 3985872, 4007519, 4183182, 4236242, 4126270, 4240891, 4229491, 4411992, 4577604, 4675629, 4507284, 4447501, 4300104, 4229258, 4261505, 4232903, 4090734, 4075147, 4153773, 3991834, 3894324, 3886383, 3989207, 3979686, 3958626, 3775317, 3696212, 3766921, 3889814, 3814889, 3711484]
5518C711484N1552o7280j7867L7324q9504K0841N6745k12L3651j09001q6492P087
5506C548328J37610L9898j8512o8384P056p8531n8082j0132M6582J33483j3817
5495C665499L5043r1644j030l3831J5197O0655p2060j9070j53142J49028L5886
5484C590531m619J3912R4361M298J3679N9496j30592O256m8108P9450J21925m0762
5472C759827n6303j08709O9381J33265L6990j38986j45686Q1320J02341P6489
5462C809929j64142Q6672K0909m6009L5810P392P3459K24967O1375M3531R4200
5451D248093r6548j45754J65032J23352J78556m102r3263K9660k8326L3984J86957
5440D597641J20742l7934M544r8702K8205J70880J2590P318Q9958J04638Q4132
$$ y = [3711484, 3763036, 3695756, 3677889, 3715213, 3625709, 3646550, 3703295, 3703083, 3736734, 3627733, 3541241, 3548328, 3685938, 3725836, 3707324, 3638940, 3645996, 3567465, 3509383, 3499251, 3545833, 3679316, 3665499, 3700542, 3608898, 3607868, 3574037, 3589234, 3649889, 3577829, 3558759, 3405617, 3554645, 3590531, 3585912, 3599824, 3694185, 3698483, 3712162, 3771658, 3641066, 3647322, 3599214, 3678664, 3800589, 3759827, 3703524, 3594815, 3664196, 3797461, 3834451, 3695465, 3549779, 3631099, 3733440, 3809929, 3645787, 3732459, 3753368, 3707359, 3743169, 3750561, 3824020, 4048987, 4110362, 4153893, 4248093, 4151545, 4005791, 4170823, 4294175, 4472731, 4468629, 4375366, 4405026, 4376700, 4410684, 4597641, 4718383, 4680449, 4684993, 4586291, 4614496, 4785376, 4797966, 4805284, 4895242, 4999880, 5084012]
5429E084012K6806J35662J29237J46446J22807J28287J55900K3328J00484J29322
5419F182291k5266J91534L7504K6806k7878n6774K53911Q1375Q2756K30069J9113
5408F995441M8975Q4594K49333J01109K11910J98156O2206Q5770J79280K08319
5398H425093K92079L30351K77302K24315L16538L82986N46999P52682Q80429Q70052
5388A3298826N88323L45870K11183N7874j95545m22504m57354l67035l73942l17716
5378A2367980k09272k5554j2965L318K1096J33996m6863p2363k0113J81186J62310
5367A2482756L9415J70238J33822L10531K80037K99765K00509L2902K20064J69094
5357A4339133J66407J19379L35961J92831N8937R5699J92766K77185J81760M13320
$$ y = [5084012, 5110818, 5246480, 5375717, 5522163, 5644970, 5773257, 5929157, 5952485, 6052969, 6182291, 6157025, 6348559, 6386063, 6412869, 6384991, 6328217, 6582128, 6663503, 6746259, 6976328, 6995441, 7044416, 7129010, 7378343, 7479452, 7691362, 7889518, 7951724, 8037494, 8216774, 8425093, 8717172, 9047523, 9324825, 9549140, 9865678, 10248664, 10795663, 11548345, 12428774, 13298826, 13887149, 14233019, 14444202, 14502076, 14306531, 13884027, 13426673, 13059638, 12685696, 12367980, 12158708, 12133154, 12120189, 12123507, 12144603, 12278599, 12231736, 12159373, 12139260, 12320446, 12482756, 12522171, 12692409, 12826231, 13136762, 13416799, 13716564, 13917073, 13949975, 14170039, 14339133, 14505540, 14624919, 14960880, 15153711, 15212648, 15308347, 15501113, 15778298, 15960058, 16373378]
5347A6373378K70878K59656L04697K79943L05142M27882L12918N90296M79833
5338A9604623L77405M94543L95055M18265P78895R28231Q53423R10837Q39156
5329B5600433P78355Q65691N89728N52617L84520M09754L62844L22251M58951
5320C0325144M52604P33582P41883R09663R91052J139349J113825J296292J322488
5311C9025882J383939J220368J461425J429350J543874J880737J984446J930857
5303E1860878K054216K315180K414638K575425L019285L318631L351889L792663
5295G4702805M177475M286572M712533N306996N818776O386628O865252P276250
5287A19533287Q064037Q614985R384932J0039099J0806607J1263266J1715592
$$ y = [16373378, 16644256, 16903912, 17208609, 17488552, 17793694, 18221576, 18534494, 19124790, 19604623, 19982028, 20476571, 20871626, 21289891, 22068786, 22997017, 23850440, 24761277, 25600433, 26378788, 27244479, 27834207, 28386824, 28771344, 29181098, 29543942, 29866193, 30325144, 30777748, 31511330, 32253213, 33162876, 34153928, 35293277, 36407102, 37703394, 39025882, 40409821, 41630189, 43091614, 44520964, 46064838, 47945575, 49930021, 51860878, 53915094, 56230274, 58644912, 61220337, 64239622, 67558253, 70910142, 74702805, 78880280, 83166852, 87879385, 93186381, 99005157, 105391785, 112257037, 119533287, 127597324, 136212309, 145597241, 155636340, 166442947, 177706213, 189421805]
5280A89421805J2067088J2355386J2117542J1791248J1004705R552416Q222640
5273B66532830N854581L552114J066023j436811l916460o172318q060531r696784
5265B47722644j0796681j1474771j1899641j2131893j1832288j1359339j0978583
5258A67249448j0344085r628191q872932q153499p641180p088501o505475o161503
5250A02854082n736540n067761m717331m347099l928839l885162l555133l355855
5242F8260362l058764k807571k599870k532951k358653k186312k063830j892362
5234D8760049j675091j583758j589243j660188j348830j380713j407435j302447
5226C6812344j040944j089951j143101r67723r95537j024853q50749p48187q27686
$$ y = [189421805, 201488893, 213844279, 225961821, 237753069, 248757774, 258310190, 266532830, 272387411, 275939525, 277005548, 275568737, 271652277, 265479959, 257419428, 247722644, 236925963, 225451192, 213551551, 201419658, 189587370, 178228031, 167249448, 156905363, 147277172, 138404240, 130250741, 122609561, 115521060, 109015585, 102854082, 97117542, 92049781, 87332450, 82985351, 79056512, 75171350, 71616217, 68260362, 65201598, 62394027, 59794157, 57261206, 54902553, 52716241, 50652411, 48760049, 47084958, 45501200, 43911957, 42251769, 40902939, 39522226, 38114791, 36812344, 35771400, 34681449, 33538348, 32570625, 31575088, 30550235, 29699486, 28951299, 28123613]
5217B8123613p61727p77983q25058p32746o94977n53438n96447o41113o31892
5208B1908232o14321m87195n84982o03449n11894m72815m77203m57648m42561
5199A7256164m26835l83147k30300k74064l72186l69540k29982j21430j82214
5190A4666466k08560l12851k03223k55031m23465k68127k05854k3184j44369j87766
5180A2434036j06513k26031k44086j17107p4508N612q5696k34191j55266j60633
5170A1035617j09935j04655j72941j18604k00689k42637k07962o3644j8761k09036
5160I586753j20030j02441j97309k45100j00599j49828j04980q142m28058l1872
5150H098394k5881k40605K8576l9196j82853j12177L2748r1765k08996K9713q235
$$ y = [28123613, 27361886, 26583903, 25758845, 25026099, 24331122, 23777684, 23181237, 22540124, 21908232, 21293911, 20806716, 20221734, 19618285, 19106391, 18633576, 18156373, 17698725, 17256164, 16829329, 16446182, 16215882, 15941818, 15569632, 15200092, 14970110, 14848680, 14666466, 14457906, 14145055, 13941832, 13686801, 13263336, 12995209, 12789355, 12766171, 12621802, 12434036, 12327523, 12101492, 11857406, 11740299, 11665791, 11671403, 11585707, 11351516, 11196250, 11035617, 10925682, 10821027, 10648086, 10529482, 10328793, 10086156, 9878194, 9814550, 9795789, 9586753, 9466723, 9364282, 9166973, 8921873, 8821274, 8671446, 8566466, 8558324, 8130266, 8098394, 8072513, 7831908, 7860484, 7821288, 7638435, 7526258, 7559006, 7467241, 7258245, 7287958, 7279723]
5139G279723J9181j83885j57353j31205K7215M6924j1626K239k95851k59267p6409
5128F259686j30721K9616K1242l4102L935k19543l0499j31943J5680l2919K14486
5117E964918J96255j82953l55159J2695R6977O8600J32993J1957o0518j27005
5107E758760j16824k1083K19342K7658j04618p3833M313j42614j21022j3858P3845
5096E490066p9288R5855R8917j38460K5741O1961J9815Q079j02164P5987m7251
5085E509258j77019P0320K6567p2370O4397K6523m7305j14197P1771J79437J66759
5074E704141m9009k00828j04003q7167P2648K2745J99957p9358K8062N7779m877
5063E560090J30464J62574K41022J03121J4545j87276L4587L79154L11467L01290
$$ y = [7279723, 7298904, 7115019, 6957666, 6826461, 6853676, 6900600, 6888974, 6891213, 6595362, 6336095, 6259686, 6128965, 6158581, 6179823, 6145721, 6149656, 5930113, 5899614, 5767671, 5783351, 5750432, 5964918, 6161173, 5978220, 5623061, 5635756, 5732733, 5801333, 5934326, 5946283, 5885765, 5758760, 5641936, 5620853, 5840195, 5867853, 5763235, 5689402, 5693715, 5551101, 5430079, 5416221, 5490066, 5410778, 5506633, 5605550, 5467090, 5492831, 5554792, 5574607, 5582686, 5480522, 5556509, 5509258, 5332239, 5402559, 5429126, 5356756, 5421153, 5447676, 5400371, 5286174, 5357945, 5537382, 5704141, 5655132, 5454304, 5350301, 5263134, 5335782, 5358527, 5558484, 5479126, 5507188, 5564967, 5560090, 5690554, 5853128, 6094150, 6197271, 6211816, 6024540, 6059127, 6438281, 6749748, 7051038]
5053G051038K15315k21694j64232j2803o2497N2557J5097N4221L4845O2367K47305
5042G271519J43089k9972J10956j92101k89294k81417j49391j26832l2200J2473
5032F436830j57449P925l25295o9786J06725K24754K1461j38349O5184L413j6585
5021F158828p3424j41319K06404Q6899R3950R4410l3973r4458M8148K07001L3366
5010F585832J18451q8789M3735K7609Q0800P1826K05057L6987j04141j2790Q0045
4999G044622J754J14108J67422m7827m5543Q1818r5094m2384L00385J53432j3294
4988G619399K7007J53122P0183J65092J41273J01455K84082L05215J70028K19067
4978I255923N32511O23137M92562K90200J72837j68134j39078J9311P6699j99942
$$ y = [7051038, 7266353, 7044659, 6880427, 6867624, 6805127, 6857684, 6872781, 6927002, 6961847, 7024214, 7271519, 7414608, 7384636, 7495592, 7303491, 7014197, 6732780, 6583389, 6456557, 6424357, 6436830, 6279381, 6287306, 5962011, 5892225, 5998950, 6223704, 6245165, 6106816, 6172000, 6175413, 6158828, 6085404, 5944085, 6150489, 6237388, 6331338, 6425748, 6391775, 6297317, 6345465, 6552466, 6585832, 6704283, 6615494, 6659229, 6686838, 6767638, 6839464, 7044521, 7081508, 6977367, 6964577, 7044622, 7046376, 7160484, 7327906, 7280079, 7234536, 7316354, 7221260, 7178876, 7479261, 7632693, 7619399, 7646406, 7799528, 7869711, 8034803, 8176076, 8277531, 8561613, 8866828, 9036856, 9255923, 9788434, 10411571, 10904133, 11194333, 11367170, 11199036, 11059958, 11079269, 11155968, 10956026]
4968A0956026j68601N9803K05214J72765q8346j98909r9666l1564k66055l98410
4958A0142257m63733k06860j59117q5216j20957j07873j54158j54397j5737R5867
4948H770076R9372K42325J07130J18221P2925N2216P6228J58715L52435P8608
4938A0128251K05320J93354J87013L60546M48064M04188M23680L58669J81997
4929A2891082L37432L31880J92501L47527M33485K72795L49001K94521L03469
4920A5753693K13898M24639J00965o8449J69606R8411J50649J19559K37493K4471
4910A7224935O4212m1783k23676j23506j02893j20086p0878p9376l9352m5150
4900A6442447j44815J76955K57100J94974K62218L3535J61865L23911J36550L26975
$$ y = [10956026, 10787425, 10847228, 11052442, 11225207, 11136861, 10937952, 10838286, 10806722, 10540667, 10142257, 9678524, 9471664, 9312547, 9227331, 9106374, 8998501, 8844343, 8689946, 8674209, 8770076, 8869448, 9111773, 9218903, 9337124, 9410049, 9462265, 9538493, 9697208, 10049643, 10128251, 10333571, 10526925, 10713938, 11074484, 11522548, 11926736, 12350416, 12709085, 12891082, 13228514, 13560394, 13752895, 14100422, 14533907, 14806702, 15155703, 15450224, 15753693, 15967591, 16392230, 16493195, 16424746, 16594352, 16692763, 16843412, 16962971, 17200464, 17224935, 17289147, 17247364, 17023688, 16900182, 16797289, 16677203, 16606325, 16526949, 16487597, 16442447, 16297632, 16474587, 16731687, 16926661, 17188879, 17222414, 17384279, 17708190, 17844740, 18171715]
4890A8171715L08458K70918K4034l8065p842l3819J47745J49830l9191j70653
4880A8783130j03195k72415k39460q9315j28066r0364j16980j27953l56J0359
4870A7625385J39795q201J88450J25985j01682O3012J71539P1748K06765K31965
4860A8714761M6779L5682k425k941J64987J82077J33336J04745K5880m8801m9856
4849A9304224K10048J71533L00068J79205p3329R7801K9084K94879M44115K67368
4839B1224996K32540P8381K41059J50781K61032N64697K63490L69278K33520L15005
4829B3934779N91174M06585P58701P94041Q75503Q84622Q37488P57503N85435
4820C0425831O75283O62441N46749N34769O21443N67078Q38364J063177J217763
$$ y = [18171715, 18480173, 18751091, 18775125, 18737060, 18729218, 18695399, 18843144, 18992974, 18953783, 18783130, 18679935, 18407520, 18168060, 18078745, 17950679, 17860315, 17743335, 17615382, 17615026, 17625385, 17765180, 17756979, 17945429, 18071414, 17969732, 18032744, 18204283, 18276031, 18482796, 18714761, 18761540, 18797222, 18794797, 18791856, 18956843, 19138920, 19272256, 19377001, 19402881, 19354080, 19304224, 19514272, 19685805, 19985873, 20165078, 20091749, 20189550, 20218634, 20513513, 20957628, 21224996, 21457536, 21535917, 21776976, 21927757, 22188789, 22753486, 23016976, 23386254, 23619774, 23934779, 24525953, 24932538, 25691239, 26485280, 27360783, 28245405, 29082893, 29840396, 30425831, 31101114, 31763555, 32310304, 32845073, 33466516, 34033594, 34871958, 35935135, 37152898]
4811C7152898J415843J483968J481181K017284K743447L553784M095167L563382
4803E7506954K370117P03748n13061j610098j959804j734323j408834r31948q18756
4794E1603995m41239Q5120M82019M95281N02066N39307O10147Q31483J079408
4785E5787587J203386J281523J505520J737782J700225J640105J955074K100949
4777F8912151K486372K559396K668808K893689L078482L366356L724633M111022
4769I3800909M360296M573242M814042N697469O687123Q191210J0537239J2994157
4761A51655687J5141883J6288101J5703699J3683708J1034492P881990N653344
4754B37042904M944162O344081J0251320J6295221K2138354K5183858K3452872
$$ y = [37152898, 38568741, 40052709, 41533890, 43551174, 46294621, 49848405, 53943572, 57506954, 59877071, 60580819, 60067758, 58457660, 56497856, 54763533, 53354699, 52422751, 51603995, 51162756, 51247876, 51729895, 52225176, 52727242, 53266549, 53876696, 54708179, 55787587, 56990973, 58272496, 59778016, 61515798, 63216023, 64856128, 66811202, 68912151, 71398523, 73957919, 76626727, 79520416, 82598898, 85965254, 89689887, 93800909, 98161205, 102734447, 107548489, 113245958, 119933081, 128124291, 138661530, 151655687, 166797570, 183085671, 198789370, 212473078, 223507570, 231389560, 237042904, 241987066, 248331147, 258582467, 274877688, 297016042, 322199900, 345652772]
4747C45652772J6837356P970018o04622q076461j2815854j3315542j1212918p779757
4739C16654992m161698j277099j51237o80856k252614m028327n739239o604959
4731B91758963o547469n522854l998370k363791n15245J323844K780601M268982
4723B81184661N686800O880005P438884P375278O805801N660192M263624K949395
4715C28244640K031042J485357J273668J296624J852765K090715J632946O80801
4707C40588558n47104j599053k176365k314858j965715o39997M91334J714783
4699C33551583K592569K845747K598387J868098J327850L90329n89438j462213
4691C43122912k891697l952933m965429o017636o664782p398740p636603p741676
$$ y = [345652772, 362490128, 370460146, 369855524, 361779063, 348963209, 335647667, 324434749, 316654992, 312493294, 311216195, 311064958, 310384102, 308131488, 304103161, 298363922, 291758963, 285211494, 279688640, 275690270, 273326479, 272811234, 274135078, 276915679, 281184661, 286871461, 293751466, 301190350, 308565628, 315371429, 321031621, 325295245, 328244640, 330275682, 331761039, 333034707, 334331331, 336184096, 338274811, 339907757, 340588558, 340041454, 338442401, 336266036, 333951178, 331985463, 331345466, 331836800, 333551583, 336144152, 338989899, 341588286, 343456384, 344784234, 345174563, 344585125, 343122912, 340231215, 336278282, 331312853, 325295217, 318630435, 311231695, 303595092, 295853416]
4683B95853416q035245p991844p729155p020726o220154n304841m590665m374439
4675B44586347m580349m998866n293333n292651m954790m431004l907197l361209
4667B07766948k902402k629139k677811l352898m384444n679527o787238p488437
4659A71865052p805140p836956p310221p005695o272711n915462n534357n111148
4651A19073362m631902m269755l748129l579399l433108l271213l134088k901764
4643I0104004k670489k242971j914108j441930j149813p11424p28245p72016p69710
4634G7703298p61972j016161j114363p68079o47928k66354R5344L96248O55637
4625G4275670N61590L12922l51693q40787r67422j258505j065818r12426o35926
$$ y = [295853416, 287818171, 279826327, 272097172, 265076446, 258856292, 253551451, 248960786, 244586347, 240005998, 235007132, 229713799, 224421148, 219466358, 215035354, 211128157, 207766948, 204864546, 202235407, 199557596, 196204698, 191820254, 186140727, 179353489, 171865052, 164059912, 156222956, 148912735, 141907040, 135634329, 129718867, 124184510, 119073362, 114441460, 110171705, 106423576, 102844177, 99411069, 96139856, 93005768, 90104004, 87433515, 85190544, 83276436, 81834506, 80684693, 79973269, 79245024, 78473008, 77703298, 76941326, 75925165, 74810802, 74042723, 73394795, 73128441, 73223785, 73620033, 74275670, 74837260, 75150182, 74798489, 73957702, 72990280, 71731775, 70665957, 69753531, 69117605]
4616F9117605n03154k05137K92640N39041N86292O48648P85510R77296J079078
4607G3317819J231196J088141R42111P59979N00328K77154L94485M86382K65447
4598G9263042j35893l63426n44843q66083p77458n86941m12481m01458p73268
4589G4401191j116989j141525j041829q65472o71367m15385m46375k51097n75728
4580F7875424n72410p33091q58975n26265n05007p78126o29784o28302n93598
4571F2049866m48706l90957j88752K79695L49784N70356O17055N77362O64722
4562F4080425N93093M97499M55615N69587R59926J241478K125794K395798K334077
4553G5253292K077701J522529J183530O80078J15871K3029J23214L07519N57259
$$ y = [69117605, 68614451, 68409314, 68701954, 69240995, 69827287, 70475935, 71261445, 72238741, 73317819, 74549015, 75637156, 76579267, 77339246, 77839574, 78116728, 78511213, 78997595, 79263042, 79127149, 78763723, 78218880, 77352797, 76575339, 75988398, 75575917, 75174459, 74401191, 73284202, 72142677, 71100848, 70235376, 69564009, 69148624, 68702249, 68451152, 67875424, 67303014, 66569923, 65710948, 65184683, 64679676, 63901550, 63271766, 62643464, 62049866, 61601160, 61210203, 61021451, 61301146, 61650930, 62221286, 62838341, 63415703, 64080425, 64673518, 65171017, 65626632, 66196219, 67156145, 68397623, 70523417, 72919215, 75253292, 77330993, 78853522, 80037052, 80717130, 80833001, 80856030, 80979244, 81286763, 81844022]
4544H1844022R95653J622163K036262K536995K724661L145077L688211M350359
4536A02943403M767197M812469M440751L593920K191022M41365j535186k810575
4528A18844366m137812m717039m735174m609816m306715l859196l635110l408257
4520H5435247l118338l183929l177977l056293k843244k346034k011884j815507
4512F3882041j518917j470375j155643r42102p17484o97083q48559q46105q37093
4503E4848680j056320j270014j381825j394114j343024j356764j528165j675090
4495D3843364j617777j577126j437216j478965j645753j585842j518661j546664
4487C1435360j400779j356551j154486q96662p89153r63106p86222n84005o42638
$$ y = [81844022, 82839675, 84461838, 86498100, 89035095, 91759756, 94904833, 98593044, 102943403, 107710600, 112523069, 116963820, 120557740, 122748762, 123190127, 121654941, 118844366, 114706554, 109989515, 105254341, 100644525, 96337810, 92478614, 88843504, 85435247, 82316909, 79132980, 75955003, 72898710, 70055466, 67709432, 65697548, 63882041, 62363124, 60892749, 59737106, 58795004, 58077520, 57380437, 56531878, 55685773, 54848680, 53792360, 52522346, 51140521, 49746407, 48403383, 47046619, 45518454, 43843364, 42225587, 40648461, 39211245, 37732280, 36086527, 34500685, 32982024, 31435360, 30034581, 28678030, 27523544, 26626882, 25837729, 24874623, 24088401, 23504396, 22861758]
4478B2861758n54330l04154l49209m76446m66480l52453m16870m94757l14807
4469A9132252k75683k47817k73206k67170j43767q3326p1341p7833k59027j31207
4459A7301875L21j26220R6571R9507o4798j11103n0956J05545J82804K26517J87814
4448A7847877K76705L59239K15769K42674L60017O11054N88012P53041M63890
4439B1718278M71694O93846P21347J317616J583332K013921K631580L139765L420387
4430C7711766L283941K638599J769437O06104p51292j713392k401383k912327
4422C8231453k938704k796593k433155k135836j608285j428849j090960n47924
4414B3251147p17072m78496k41564l76192l63600k53192k50480j53885j06327
$$ y = [22861758, 22307428, 22003274, 21654065, 21177619, 20711139, 20358686, 19941816, 19447059, 19132252, 18856569, 18608752, 18335546, 18068376, 17924609, 17841283, 17769942, 17692109, 17433082, 17301875, 17302196, 17175976, 17272547, 17372054, 17307256, 17196153, 17145197, 17250742, 17433546, 17660063, 17847877, 18124582, 18483821, 18699590, 18942264, 19302281, 19913335, 20501347, 21254388, 21718278, 22189972, 22883818, 23605165, 24922781, 26506113, 28520034, 31151614, 34291379, 37711766, 40995707, 43634306, 45403743, 46009847, 45258555, 43545163, 41143780, 38231453, 35292749, 32496156, 30063001, 27927165, 26318880, 24890031, 23799071, 23251147, 22534075, 22055579, 21814015, 21437823, 21074223, 20821031, 20570551, 20416666, 20310339]
4405B0310339j69178l38857l51094k36833m78400k83369l83810l50770j80090
4396A7537938l92953l21811j98265k49009k31232l04408j55091l56008j78223
4387A5150938j52781j46907j30677j47864J9965j94602l03922l9474k00770k37196
4377A3616710m0643p4614j75499j28690k16608r7695K3949m6488k12221j90346
4367A2457855k46731k65817p3709j36174K5893J69239J04861r9351r8566K4875
4357A1862375K5778P4659m8745j42878j01950l0461K04935J51495L3512P439J22151
4346A2158310J4162J7065k2665L05222J72369M73833M94981L83536N1706J77629
4336A4226148L47955L44769J53687J31612J36747L9326J58055J95700K45987L89056
$$ y = [20310339, 20141161, 19802304, 19451210, 19214377, 18735977, 18452608, 18068798, 17718028, 17537938, 17144985, 16823174, 16624909, 16375900, 16144668, 15840260, 15685169, 15329161, 15150938, 14998157, 14851250, 14720573, 14572709, 14592674, 14398072, 14094150, 14054676, 13853906, 13616710, 13576067, 13501453, 13325954, 13197264, 12980656, 12882961, 12906910, 12860422, 12648201, 12457855, 12211124, 11945307, 11871598, 11735424, 11761317, 11930556, 12035417, 11936066, 11837500, 11862375, 11888153, 11962812, 11914067, 11771189, 11669239, 11638778, 11843713, 11995208, 12028720, 12036159, 12158310, 12172472, 12189537, 12166872, 12472094, 12644463, 13118296, 13613277, 13996813, 14048519, 14226148, 14574103, 14918872, 15072559, 15204171, 15340918, 15380244, 15538299, 15733999, 15979986, 16369042]
4326A6369042J68462J65430N8675j34605n1861K9307N1655n5430J71016j01914
4316A6669777j31419K48863K43919P4072j08054K3737K25728j765l4731k6129
4306A7183998K5794N6119n0920m2362k9247m2749J09575N7835r8830k41579j56696
4295A6770938k84705j16486l1238m2689j40252n8068j30396j87966O2368J28492
4285A5969998J7457Q3143J65465O375j2979P1106K45925L53028J76492M86125
4275A7562135M14187L74358N17107P38473J087668J338977J543802K148114K893930
4266B8618751L897531M770401N057696M437265L362106K091566J329837J050598
4258E4615751R42334O12704p00899k043223l412056m242015m568005m449157l961119
$$ y = [16369042, 16537504, 16702934, 16761609, 16627004, 16575143, 16604450, 16656105, 16600675, 16771691, 16669777, 16538358, 16787221, 17031140, 17105212, 16997158, 17020895, 17246623, 17244858, 17210127, 17183998, 17209792, 17265911, 17214991, 17172629, 17143382, 17100633, 17210208, 17268043, 17169213, 16927634, 16770938, 16486233, 16369747, 16338509, 16295820, 16155568, 16097500, 15967104, 15779138, 15841506, 15969998, 15987455, 16070598, 16236063, 16242438, 16229459, 16300565, 16546490, 16899518, 17076010, 17562135, 17976322, 18350680, 18867787, 19606260, 20693928, 22032905, 23576707, 25724821, 28618751, 32516282, 37286683, 42344379, 46781644, 50143750, 52235316, 53565153, 54615751, 55558085, 56170789, 55469890, 53426667, 50014611, 45772596, 41204591, 36755434, 32794315]
4249C2794315l235240k926354k269927j836683j367843j097507j009906p17235
4241A8333620n05320n62400m42036l06515m18259k42239k36029j87839n8765Q1709
4231A5455927P1549R8570M8959K37470K25302Q2748j52773j54899Q6161K39954
4221A6238968L82673K79454N59481N58865O16312O16392M45533K99203J21797
4212B0118678j79692l63506k44417j48430n5422j18113j47853k70855l98238k88906
4202A7903246l75342l30195j71088j3609j18031j6064k12608n7488K8994n6911
4192A6580904j09396j83348k8833j22482j65952j75347O183l700l9410k47001
4182A5511618k66009j37730J5781O0390n4275j98592n414j74367j61821k22604
$$ y = [32794315, 29559075, 26632721, 24362794, 22526111, 21158268, 20060761, 19050855, 18333620, 17828300, 17265900, 16823864, 16517349, 16099090, 15856851, 15620822, 15432983, 15374218, 15455927, 15527476, 15626046, 15675005, 15912475, 16137777, 16220525, 16067752, 15912853, 15999014, 16238968, 16621641, 16901095, 17460576, 18019441, 18635753, 19252145, 19697678, 19996881, 20118678, 19938986, 19575480, 19331063, 19182633, 19127211, 19009098, 18861245, 18590390, 18192152, 17903246, 17527904, 17197709, 17026621, 17013012, 16894981, 16878917, 16666309, 16608821, 16637815, 16580904, 16471508, 16288160, 16259327, 16136845, 15970893, 15795546, 15801729, 15798029, 15758619, 15511618, 15245609, 15107879, 15123660, 15184050, 15129775, 14931183, 14925769, 14751402, 14589581, 14366977]
4172A4366977j00704o8160l5756j50651j96599j32871j71605j40876j61576J5304
4162A3223483k80197l92889l88693k59598l6807J01168q3118l22928j63301p6066
4152A1321054j14058j28366J9716j14092n1844J9541m1096L8557p4737R6514P4052
4141A1045241l1812n3595l8716p341K21604K41478R3687J27417J14494j0664J8778
4130A1720571J56477o1698r4974J10109N2536j12600o1781O5755J3387J13461
4120A1901243Q6000n7817N4357K09874L73997M06982L18002K69530J62685J17362
4110A3842215K18246J14948l6170L57577J66060r1320l7534o7928o4927j01203
4100A4299964o4059M9987L0892l6535P3573J76550K17421K36658L76183M58430
$$ y = [14366977, 14266273, 14198113, 14162357, 14011706, 13815107, 13682236, 13510631, 13369755, 13208179, 13223483, 12943286, 12550397, 12161704, 11902106, 11865299, 11966467, 11883349, 11560421, 11397120, 11321054, 11206996, 11078630, 11098346, 10984254, 10932410, 10951951, 10910855, 10949412, 10874675, 10971189, 11045241, 11013429, 10959834, 10921118, 10913777, 11135381, 11376859, 11470546, 11597963, 11712457, 11701793, 11720571, 11877048, 11815350, 11720376, 11830485, 11883021, 11770421, 11708640, 11774395, 11787782, 11901243, 11987243, 11929426, 11983783, 12193657, 12567654, 12974636, 13292638, 13562168, 13724853, 13842215, 14060461, 14175409, 14139239, 14496816, 14662876, 14571556, 14534022, 14466094, 14401167, 14299964, 14235905, 14285892, 14316784, 14280249, 14353822, 14530372, 14747793, 14984451, 15360634, 15819064]
4090A5819064K22797L20418K62466L52810L08754L48197L54549K28945J80716
4081A8398716L22509M84151N61467M63332L74569K58922M75664N26414O22225
4072B2487969P40115Q81799P64014N11767O62109L66201L61053L65919K73322
4063B7414268N13399N29908L23464N00275M40187O99038P38737M81090M78980
4054C2119346L65103M26833K82154j98440j0398k65392k58864k93908j75133k18148
4044C1773153M8091L25269K82858M9234k51101k38664k09452l49979j72502k53931
4034C1002976j75853j78915k47545k23195j39524J24817J43019n8296J99910J92375
4024C0639769K10567K47075L70488L29683K93380J93596J01302L22777M44052
$$ y = [15819064, 16041861, 16362279, 16624745, 16977555, 17286309, 17634506, 17989055, 18218000, 18398716, 18721225, 19205376, 19766843, 20230175, 20604744, 20863666, 21339330, 21865744, 22487969, 23228084, 24109883, 24873897, 25385664, 26047773, 26413974, 26775027, 27140946, 27414268, 27927667, 28457575, 28781039, 29281314, 29721501, 30420539, 31159276, 31640366, 32119346, 32484449, 32911282, 33193436, 32994996, 32984598, 32719206, 32460342, 32166434, 31991301, 31773153, 31821244, 32146513, 32429371, 32478605, 32227504, 31988840, 31779388, 31429409, 31256907, 31002976, 30827123, 30648208, 30400663, 30177468, 30037944, 30162761, 30305780, 30247484, 30447394, 30639769, 30850336, 31097411, 31467899, 31797582, 32090962, 32284558, 32385860, 32708637, 33152689]
4015C3152689M83229M48054O85917O81657O30065Q35302P95666P93760R70912
4006C9477251Q96226J123292R42602P70488Q96307J227864J284916J183764J117081
3997D8919791J192288J111428J307552J178161J222328J291763J130938J332276
3989E8686525J282023J339970J490633J233312J534537J463548J471341J333970
3981F9835859J415288J589736J654812J705884J693575J802431J942651K198762
3973H3838998K499868K555942K424877K509455K574407K632570K643137K804571
3965A04483825L136339L124547L247645L530774L801244L958738L824681L939727
3957A33047520M031521L759175L646565L466420L539429L676410L565323L892594
$$ y = [33152689, 33635918, 34083972, 34769889, 35451546, 36081611, 36916913, 37712579, 38506339, 39477251, 40373477, 41496769, 42439371, 43209859, 44106166, 45334030, 46618946, 47802710, 48919791, 50112079, 51223507, 52531059, 53709220, 54931548, 56223311, 57354249, 58686525, 59968548, 61308518, 62799151, 64032463, 65567000, 67030548, 68501889, 69835859, 71251147, 72840883, 74495695, 76201579, 77895154, 79697585, 81640236, 83838998, 86338866, 88894808, 91319685, 93829140, 96403547, 99036117, 101679254, 104483825, 107620164, 110744711, 113992356, 117523130, 121324374, 125283112, 129107793, 133047520, 137079041, 140838216, 144484781, 147951201, 151490630, 155167040, 158732363, 162624957]
3949A62624957M292550M390129M618126N098057N509207N750023O074962O765965
3941B05123976P142612P361297P660382P936783Q223141Q187164P995068P930194
3933B67560617P575210P000815O373744N223733M435054L791417L119764K654428
3925C07734782K281935K227279J977627J852969K060063K092648K059868K205239
3917C24492410K625974K714191K740633K688946K533798K442735K266049J928466
3909C44433202J195965P35348O2574q29025j516926k484025k940679l184463l761363
3900C31710608l687828m109497m404336m389534m032182l404255k746292j976400
3892C02960284j267776p82002n57598k10613l26812o65548j031089j648366j911905
$$ y = [162624957, 166917507, 171307636, 175925762, 181023819, 186533026, 192283049, 198358011, 205123976, 212266588, 219627885, 227288267, 235225050, 243448191, 251635355, 259630423, 267560617, 275135827, 282136642, 288510386, 293734119, 298169173, 301960590, 305080354, 307734782, 310016717, 312243996, 314221623, 316074592, 318134655, 320227303, 322287171, 324492410, 327118384, 329832575, 332573208, 335262154, 337795952, 340238687, 342504736, 344433202, 345629167, 346364515, 346427089, 345598064, 344081138, 341597113, 338656434, 335471971, 331710608, 328022780, 323913283, 319508947, 315119413, 311087231, 307682976, 304936684, 302960284, 301692508, 300910506, 300352908, 300142295, 299815483, 299149935, 298118846, 296470480, 294558575]
3883B94558575k303124k732775k899820k967967k986217l185695l651838l845609
3875B69985530m337937m741435m859517m921798n104431n218185n258471n117906
3867B30425850m702444m387660m120708l540425l504610l669171l557169l995010
3859A98948653m532432m890767n232455n570586n712482n611755n418661n186529
3851A56792986m852281m596775m408953m100540l937083l771495l596676l235974
3843A24293209l149042k930926k938545k901414k796611k763906k417677k557117
3835A01837971k681633k750033k618398k605408k499080k459352k305825k069346
3827H1848896j947658j927561k028683j888507j697865j703331j645055j378276
$$ y = [294558575, 292255451, 289522676, 286622856, 283654889, 280668672, 277482977, 273831139, 269985530, 265647593, 260906158, 256046641, 251124843, 246020412, 240802227, 235543756, 230425850, 225723406, 221335746, 217215038, 213674613, 210170003, 206500832, 202943663, 198948653, 194416221, 189525454, 184292999, 178722413, 173009931, 167398176, 161979515, 156792986, 151940705, 147343930, 142934977, 138834437, 134897354, 131125859, 127529183, 124293209, 121144167, 118213241, 115274696, 112373282, 109576671, 106812765, 104395088, 101837971, 99156338, 96406305, 93787907, 91182499, 88683419, 86224067, 83918242, 81848896, 79901238, 77973677, 75944994, 74056487, 72358622, 70655291, 69010236, 67631960]
3819F7631960j469022j354716j043901r80352j123606j074539j078070j083169
3811E8424585p95854r18603j025616q24746q25685j099630r78502j159712j138310
3802D9657927j039045r12064j024944j115190j091535r73649r14997o73980p14227
3793D1198296q29932o04055n58165o57010m78519l88158l73562l93923l24759
3784C6590213l68244o40740n96063n20252n16597o16625o84844q54944p32193
3775C1059711m72492l09363n68253m70016l79525n55195m63032n23897n35082
3766B6782856m80948l31497k25255k18893m61436l57520l61433l08324j69388
3757B3868162j80544k60078l05644m24842k01796k71326l98982j45547l48786
$$ y = [67631960, 66162938, 64808222, 63764321, 62783969, 61660363, 60585824, 59507754, 58424585, 57628731, 56710128, 55684512, 54859766, 54034081, 52934451, 51955949, 50796237, 49657927, 48618882, 47706818, 46681874, 45566684, 44475149, 43501500, 42586503, 41912523, 41198296, 40368364, 39764309, 39206144, 38549134, 38070615, 37682457, 37308895, 36914972, 36590213, 36221969, 35581229, 34985166, 34464914, 33948317, 33331692, 32646848, 31791904, 31059711, 30587219, 30277856, 29709603, 29239587, 28860062, 28304867, 27841835, 27317938, 26782856, 26301908, 25970411, 25745156, 25526263, 25064827, 24707307, 24345874, 24037550, 23868162, 23687618, 23427540, 23121896, 22697054, 22495258, 22223932, 21824950, 21679403, 21330617]
3748B1330617m02761l22805l87719l79099l33447l39522l43693m20972m02865
3739A7997734m17263j39423k69996l14279k66524l31303m12093r5901j84569k23062
3729A5343321k26060m40043k90965j86334j45177k49161k15031J7364k03806j80892
3719A3223216r8440j41748N0917N200k48544k00952k11960l36032k23779k7857
3709A1790021q2178l01165j77188q2223j06644j17459l3219j89697n100P9120
3699A0774268r8587k20884j51647q9741J3027Q3155j47474j99541j55389O3456
3689I870643j78782j01224L2460L9573o900k77579l23182L1273K1399j03813P413
3678I011281j1368K2176p5628Q4570M2823J93252J39779J44554o6939Q745K4309
$$ y = [21330617, 20927856, 20605051, 20217332, 19838233, 19504786, 19165264, 18821571, 18400599, 17997734, 17580471, 17441048, 17171052, 16856773, 16590249, 16258946, 15846853, 15750952, 15566383, 15343321, 15117261, 14677218, 14386253, 14199919, 14054742, 13805581, 13590550, 13607914, 13404108, 13223216, 13124776, 12983028, 13033945, 13039145, 12790601, 12589649, 12377689, 12041657, 11817878, 11790021, 11707843, 11406678, 11229490, 11147267, 11040623, 10923164, 10889945, 10700248, 10695148, 10774268, 10675681, 10454797, 10303150, 10213409, 10226436, 10309591, 10162117, 9962576, 9807187, 9870643, 9691861, 9590637, 9623097, 9662670, 9655770, 9378191, 9055009, 9086282, 9107681, 9003868, 9011281, 8999913, 9022089, 8946461, 9031031, 9073854, 9267106, 9406885, 9551439, 9484500, 9493245, 9517554]
3667I517554J44K36553J99016L6331M6855L1729p825M4743K98536P0349j62598
3656A0311387k1185j27802k4730J28099J17418K4850J03934j7664o3917N6386
3646A0486776K31183j3387O0100P8564O4316J17105J70821J33610K81437J43536
3636A1754061K61680L34724R7917J61437K13917J19336R3816Q7475J10695O8947
3626A3304005Q8431K49076O7358J30061J17410J47609J48574M4548J77291L79612
3616A4853975L71311K36365K82314J10975K51237L74934L31345L58082L64897
3607A7535435M89183N21262N50855O39657N42629O99788N65393N56227N03038
3598B2603467K97212N93507O32857N65319P23552Q11050O14142N21427O44173
$$ y = [9517554, 9517698, 9754251, 9953267, 9989598, 10036453, 10068182, 10060357, 10105100, 10403636, 10473985, 10311387, 10290202, 10162400, 10137670, 10265769, 10383187, 10408037, 10511971, 10494307, 10430390, 10486776, 10717959, 10704572, 10764672, 10843236, 10907552, 11024657, 11195478, 11329088, 11610525, 11754061, 12015741, 12350465, 12448382, 12609819, 12823736, 12943072, 13036888, 13124363, 13235058, 13304005, 13392436, 13641512, 13708870, 13838931, 13956341, 14103950, 14252524, 14297072, 14474363, 14853975, 15225286, 15461651, 15743965, 15854940, 16106177, 16481111, 16812456, 17170538, 17535435, 18024618, 18545880, 19096735, 19736392, 20279021, 20978809, 21544202, 22100429, 22603467, 22900679, 23494186, 24127043, 24692362, 25415914, 26226964, 26841106, 27362533, 28006706]
3589B8006706R78701R85280J150846J255883J349432J486035J572167J630355
3581C8415405J675589J890269K090563K771962L529493M404875N716912O737254
3573F7232322P624182P614810P424885P145056P771751R546945J3009982J7566182
3565A44936115K1721704K2549075J8813319J1355608L106239m398840j0001495
3558B08081725j3088673j3773435j3570291j2679532j1051757r548578p770739
3551A26598720o173937m493772k801628j547774L14621K569004M986358P581849
3543A27033441J0060532J2544381J4968694J6519871J7074793J7712702J9006073
3536B34920487K2102209K8167865L7100784M6841965N2235721M7369980L3147092
$$ y = [28006706, 28985407, 29970687, 31121533, 32377416, 33726848, 35212883, 36785050, 38415405, 40090994, 41981263, 44071826, 46843788, 50373281, 54778156, 60495068, 67232322, 74856504, 82471314, 89896199, 97041255, 104813006, 114359951, 127369933, 144936115, 166657819, 189206894, 208020213, 219375821, 222482060, 218083220, 208081725, 194993052, 181219617, 167649326, 154969794, 143918037, 134369459, 126598720, 120424783, 115931011, 113129383, 111581609, 111896230, 114465234, 119451592, 127033441, 137093973, 149638354, 164607048, 181126919, 198201712, 215914414, 234920487, 257022696, 285190561, 322291345, 369133310, 421369031, 468739011, 501886103]
3529E01886103J4197793m839072k2599930l3518556l8694848m0867563m0443630
3522C35120297l7512276l3241646k8749627k3667227j8547175j4202743j0586128
3515A68613475p029903l622151q03434J405013L498160N592492P306736R173271
3507A84133659J1512655J4288292J7476610K0875052K2930969K4597236K6891361
3500C22705834K9350468K9742170K7110552J9423647O681971q456593k1935666
3493D04622383l1482527l7369104l8571040l6114619l2437582k8058328k2940557
3486A77648626j8437490j4402362j1127583q361326o296221m696324l537910k820028
3478A07969382k302558j704559p64404N19698J822233L503514M884860N231825
$$ y = [501886103, 516083896, 511244824, 488644894, 455126338, 416431490, 375563927, 335120297, 297608021, 264366375, 235616748, 211949521, 193402346, 179199603, 168613475, 161583572, 157961421, 157157987, 158563000, 162061160, 167653652, 174960388, 184133659, 195646314, 209934606, 227411216, 248286268, 271217237, 295814473, 322705834, 352056302, 381798472, 408909024, 428332671, 435014642, 426558049, 404622383, 373139856, 335770752, 297199712, 261085093, 228647511, 200589183, 177648626, 159211136, 144808774, 133681191, 125319865, 119023644, 114327320, 110789410, 107969382, 105666824, 103962265, 103197861, 103717559, 105539792, 109043306, 113928166, 119159991]
3470A19159991M450663L508533L158569L789891M793011N046166L419274j16034
3462A47210064m457743p875345j0548726j1640506j1224560j0090456q686237
3455H2686491p024749n562532m398713l247532k622984k176140j794548j594181
3447E4265112j284433r14540p61301q15352p56616q13508q86173j136223j248836
3438D5648130j831454j979828j998399k037087j819456j850590j715189j221027
3430C1195100j235686j090557p83955p77369p05169n70758m38958n04606l03006
3421B4785036m00535m35184l06386k34108j60492k12957q5594Q3996J95061O30864
3411B3859701R33397J020236R59812L95362k38325o78032j173379j197837j185475
$$ y = [119159991, 123610654, 127119187, 130277756, 134067647, 138860658, 143906824, 147326098, 147210064, 142752321, 134876976, 124328250, 112687744, 101463184, 91372728, 82686491, 75661742, 70099210, 65700497, 62452965, 59829981, 57653841, 55859293, 54265112, 52980679, 52066139, 51304838, 50489486, 49732870, 48919362, 48033189, 46896966, 45648130, 43816676, 41836848, 39838449, 37801362, 35981906, 34131316, 32416127, 31195100, 29959414, 28868857, 28084902, 27307533, 26602364, 26031606, 25592648, 25088042, 24785036, 24384501, 23949317, 23642931, 23408823, 23248331, 23035374, 22949780, 23033776, 23228837, 23859701, 24793098, 25813334, 26773146, 27168508, 26930183, 26252151, 25078772, 23880935, 22695460]
3402B2695460j232193j029479r24844p79304p45773o05534l81936m09384k74253
3393A6312760m26765n22783k77515l7280k51308j52788q7262j45321j21354l5407
3383A4254977n5720N4295K89671M59855M30184K69003K86598R4491k0044n14959
3373A5548351n24911n03629p63085n70421m22956l41026l08571j95546k86035
3364A1632171m20378m62553m64635j20461P4520k68110j67661l08121j26280j98535
3354I169957J2688l104j22629q9949p1372n7844j23328o1916q4427k21628k30160
3343H116288k62838k68305j81410r4123J46114J01938l85835k28772k8942m7797
3333F866318j3330k26626J5822j21735k08349j91746j67067q7226O7456K0695
$$ y = [22695460, 21463267, 20433788, 19508944, 18729640, 17983867, 17378333, 16996397, 16587013, 16312760, 15885995, 15363212, 15085697, 15048417, 14797109, 14644321, 14557059, 14411738, 14290384, 14254977, 14199257, 14253552, 14543223, 15003078, 15433262, 15702265, 15988863, 16083354, 16063310, 15548351, 15023440, 14519811, 13756726, 13186305, 12763349, 12422323, 12113752, 11918206, 11632171, 11211793, 10749240, 10284605, 10164144, 10238664, 9970554, 9802893, 9494772, 9368492, 9169957, 9182645, 9179541, 9056912, 8966963, 8895591, 8837747, 8714419, 8652503, 8568076, 8346448, 8116288, 7853450, 7585145, 7403735, 7309612, 7455726, 7557664, 7171829, 6943057, 6914115, 6866318, 6852988, 6626362, 6642184, 6520449, 6312100, 6120354, 5953287, 5866061, 5933517, 5954212]
3323E954212o2486p8988j5545j11657j38530K7231Q7550j73275j50404j30110
3313E207998j64264j02866k10569l17237o9252J16320O0580o9155P5438j89030
3303D337963r6277L0681k0466o8144j00330o8163J41949M2275m6790k11557j65071
3292C776070j13012j12715J78101K25918j15587k12107N3423m6629j78165J7732
3282C473029J41493r67j64490j39438J12992J86768R0491J30094J90172r7952
3272C922192J3531J0215j1833r3051L0379j11478l979j37156o8183j39925n2354
3261C358358l3409R3335J62678j46314j78608o809m233J32726O5709O6422J99568
3250C709423n3988j3767Q8771k9516J19467L76278K62343J12210K62232K81912
$$ y = [5954212, 5891726, 5812738, 5797193, 5685536, 5547006, 5574237, 5661787, 5488512, 5338108, 5207998, 5043734, 4940868, 4730299, 4413062, 4343810, 4460130, 4520710, 4451555, 4526993, 4337963, 4241686, 4272367, 4251901, 4183757, 4083427, 4015264, 4157213, 4199488, 4152698, 3941141, 3776070, 3663058, 3550343, 3728444, 3954362, 3838775, 3626668, 3680091, 3633462, 3455297, 3473029, 3614522, 3613555, 3449065, 3309627, 3422619, 3609387, 3699878, 3829972, 4020144, 3922192, 3935723, 3945938, 3934105, 3841054, 3871433, 3759955, 3755976, 3618820, 3550637, 3410712, 3358358, 3324949, 3418284, 3580962, 3434648, 3256040, 3249231, 3244998, 3377724, 3443433, 3509855, 3709423, 3655435, 3641668, 3730439, 3700923, 3820390, 4196668, 4459011, 4571221, 4833453, 5115365]
3240E115365N2340Q5768K9197m9907j88769j28553j72613j35439k9443o1706j27226
3229D389014p9834J8743J15707L5274O7887P1064M4056P3735J16452J04338K42982
3218E199418K27391K54274L48195M39061M07727M63743N80224O23580M01979M25551
3208I371143K84042Q3314k4822k3976j98618k91950k38810l84681l10675k41866
3198H023101k56640j94715r7038q5704l75479k90407q4717j16848o4057p4068
3188F383428J66687R6371K78859J21632J51689L62981N37040N90179M86180O42470
3178I817516P60308Q06392J069538J094064Q03996O57798M63002J96609p3801
3169A5595422k06327m36382n78449n34361n63200o67375o98399n99900m89173
$$ y = [5115365, 5167705, 5253473, 5282670, 5232763, 5043994, 4915441, 4742828, 4607389, 4577946, 4516240, 4389014, 4309180, 4327923, 4443630, 4478904, 4546791, 4617855, 4661911, 4735646, 4852098, 4956436, 5199418, 5426809, 5681083, 6029278, 6468339, 6876066, 7339809, 7920033, 8543613, 8945592, 9371143, 9655185, 9738499, 9713677, 9689701, 9491083, 9199133, 8960323, 8575642, 8264967, 8023101, 7766461, 7571746, 7474708, 7389004, 7013525, 6723118, 6638401, 6521553, 6457496, 6383428, 6550115, 6646486, 6925345, 7046977, 7198666, 7561647, 8098687, 8688866, 9175046, 9817516, 10577824, 11384216, 12453754, 13547818, 14351814, 15009612, 15472614, 15669223, 15595422, 15389095, 14952713, 14374264, 13839903, 13276703, 12609328, 11910929, 11311029, 10821856]
3160A0821856o73283p77914p69053o05083l61741l36708l51303j24528j51252
3151F670991j28046q9931L0433J17580J14499K48034Q5974K05655K86582L97419
3141G939190N08083O16699M81864K88757L78363K73309J00916j06909k34355j14297
3131A0131620l21475l86423m28747l93877k76640n53370l47712l21212l51107
3122F751057m03131k96449k27546k50170l4980o2440k14786j64518n0427j43860
3112D902750j38319k83555j23822j74037j53675j58406j79592j77393j09691o6670
3102C337590J20888j14004k31568k3285J23129N9322J821L4257o9603K22213L3159
3091C493919r4717J46494J11639J1492j19319j34213J12973j20653N1426m0581
$$ y = [10821856, 10148573, 9370659, 8601606, 7996523, 7634782, 7298074, 6946771, 6822243, 6670991, 6542945, 6453014, 6483447, 6601027, 6715526, 6963560, 7049534, 7255189, 7541771, 7939190, 8447273, 9063972, 9545836, 9834593, 10212956, 10486265, 10587181, 10480272, 10245917, 10131620, 9810145, 9423722, 8994975, 8601098, 8324458, 7771088, 7423376, 7102164, 6751057, 6347926, 6051477, 5823931, 5573761, 5538781, 5476341, 5261555, 5097037, 5046610, 4902750, 4764431, 4480876, 4357054, 4183017, 4029342, 3870936, 3691344, 3513951, 3404260, 3337590, 3458478, 3344474, 3112906, 3089621, 3212750, 3272072, 3273893, 3308150, 3238547, 3460760, 3493919, 3399202, 3545696, 3657335, 3668827, 3549508, 3415295, 3528268, 3407615, 3459041, 3418460]
3081C418460q0025o3574j51909n9892n2221l3599j38496k3737o8036k5687n2993
3070B668291p3615q2497j05575M4100J55153J0780K5718l2732l6852N3807m4389
3059B582189j75392k06006o1196J23920l7169q8038k5284q2947o8625P4046j4265
3048B021233k20238j6462m8779n2689J40454j38326j16869M0528p2843K972n7522
3037A481459k4897p2395j02431N3814L9458j06130m1039o7956M8302m1833o9615
3026A096737R3820m992J34290n9214l10095J6852J17339J08202K9370m4005J06795
3015A285099p3559K8712R658j19507o170N7248l1072m5864j58232o5819R9203
3004I79697n3837O831J9602j2055j94668p9327O2459J32513j9369o30j06551O5947
$$ y = [3418460, 3338435, 3274861, 3122952, 3063060, 3010839, 2977240, 2838744, 2815007, 2746971, 2721284, 2668291, 2594676, 2512179, 2406604, 2450704, 2605857, 2616637, 2642355, 2609623, 2572771, 2626578, 2582189, 2406797, 2200791, 2139595, 2263515, 2226346, 2138308, 2113024, 2030077, 1961452, 2035498, 2021233, 1800995, 1784533, 1735754, 1683065, 1823519, 1685193, 1568324, 1608852, 1536009, 1538981, 1481459, 1456562, 1384167, 1281736, 1335550, 1375008, 1268878, 1227839, 1159883, 1208185, 1166352, 1096737, 1190557, 1185565, 1319855, 1260641, 950546, 967398, 1084737, 1192939, 1222309, 1178304, 1285099, 1211540, 1240252, 1249910, 1130403, 1124233, 1181481, 1150409, 1104545, 946313, 880494, 979697, 925860, 932691, 952293, 940238, 745570, 666243, 728702, 861215, 841846, 841216, 734665, 800612]
2992H00612R9095o3683l7794O1247j13534M7876N9086r6075j00062j2870J31088
2981G74986J8399p5633j56611J43706J25339j26370k755O4849q0248k3995M5788
2970G07455k7530K8392K309o8383m7237p7056M8402j536k4992N6340J434L3742
2958F31340p1799o2900Q681N9024O9818j10864m7592J12227m0725j71412K2435
2947C98233P4723L4672p3427R471l7675L1280l7555J68030l9055k3866P250j19704
2935C92377M591L6669L8513l0536k2043L0886r593p5329J363q0785Q9634j30R6193
2922D71810J0901p2393n6842Q9077J43045P2971n7683k62306j3553Q5714R0215
2911E00956J73370N5452j33327r7965n4540j06580M2129Q7025n0772J4370M0911
$$ y = [800612, 899707, 836024, 798230, 859477, 745943, 793819, 852905, 756830, 656768, 643898, 774986, 793385, 717752, 561141, 704847, 830186, 703816, 701061, 765910, 685662, 661667, 707455, 679925, 708317, 710626, 642243, 595006, 517950, 566352, 564816, 539824, 596164, 597598, 631340, 559541, 496641, 505322, 564346, 634164, 523300, 475708, 587935, 547210, 375798, 398233, 472956, 507628, 434201, 443672, 405997, 437277, 399722, 567752, 528697, 504831, 512081, 392377, 396968, 433637, 472150, 441614, 419571, 450457, 440864, 365535, 366898, 286113, 375747, 375617, 471810, 482711, 410318, 353476, 442553, 585598, 658569, 600886, 338580, 325027, 410741, 500956, 674326, 729778, 596451, 498486, 443946, 337366, 379495, 466520, 415748, 430118, 471029]
2900D71029q6435Q0885J43943O4118Q8999j68004j23180J8004j53597R574J52041
2889D97377M3438J44721Q8906o1245j28680M2514J98298J12394n8319j02362P1457
2878H48499p0468k3960M208j8274j35278j3186J00729p2908J52689p1629K7668
2867G28090R3764O931j13714J69944k0979R0184J68248P2248k602J0142o5507
2856A136749K2782K07746P1207L8915M2867J70601Q1226J0954M9883R8095O7792
2845A998817j4379j19500j68694J47772O3137m2828P8038P6755R2069N0789K7522
2834B189498P3513O2889j50098J92067K42514K3711k5457K12965K62022P1209
2824C154833R0157J66653O1646J13860J32235Q9151N3995J72676N6930M3193J27713
$$ y = [471029, 384594, 465479, 609422, 673540, 762539, 594535, 471355, 489359, 335762, 345336, 497377, 540815, 685536, 774442, 713197, 584517, 627031, 825329, 937723, 879404, 777042, 848499, 778031, 754071, 758279, 740005, 604727, 591541, 692270, 619362, 772051, 700422, 728090, 821854, 828785, 715071, 885015, 864036, 954220, 1122468, 1194716, 1192114, 1202256, 1136749, 1159531, 1367277, 1438484, 1477399, 1520266, 1690867, 1772093, 1783047, 1832930, 1931025, 1998817, 1984438, 1864938, 1696244, 1844016, 1907153, 1864325, 1942363, 2019118, 2111187, 2161976, 2189498, 2263011, 2325900, 2175802, 2367869, 2610383, 2634094, 2608637, 2821602, 3083624, 3154833, 3244990, 3411643, 3473289, 3587149, 3719384, 3808535, 3862530, 4035206, 4092136, 4135329, 4263042]
2813D263042J16233j10391l6095o8517k18438q3667L5293O123K3970j23311J27126
2802C931368J56970J1554M97m813P2881Q0186O205J50753K00451R6421P7473J80629
2790D960575L32327J93816R9792L20120J2059l1863l515k8188j9240k71636j98187
2779E366060j34289j19182j60791k01591k05547k0223j09668l2323r57l2078J1594
2768D361005P2537P280j01462j33837j19477L2369N9045n4500n6377j20628n8261
2757C887694J66453L34741J54677r5894J85538L3067k6128N5889j34204j63337
2747D398496k74737n9824k49731k67505j58306j62113k06321j53835m5513k69408
2737B551203N054L7615p7134r3269m173R290l3045P587n4996j37892M2275k7448
$$ y = [4263042, 4379275, 4268884, 4232789, 4164272, 3945834, 3862167, 3897460, 3903583, 3927553, 3804242, 3931368, 4088338, 4099892, 4100389, 4095576, 4168457, 4248643, 4254848, 4405601, 4606052, 4702473, 4779946, 4960575, 5292902, 5486718, 5586510, 5906630, 5918689, 5886826, 5883311, 5855123, 5835883, 5564247, 5366060, 5231771, 5112589, 4951798, 4750207, 4544660, 4524437, 4414769, 4382446, 4381489, 4349411, 4361005, 4433542, 4440822, 4339360, 4205523, 4086046, 4118415, 4177460, 4122960, 4066583, 3945955, 3887694, 4054147, 4388888, 4543565, 4447671, 4633209, 4666276, 4640148, 4696037, 4561833, 4398496, 4123759, 4063935, 3814204, 3546699, 3388393, 3226280, 3019959, 2866124, 2820611, 2551203, 2556257, 2593872, 2516738, 2423469, 2419296, 2428586, 2395541, 2403128, 2348132, 2210240, 2252515, 2225067]
2725B225067r9762q9435k7737j74738j39299K33P7555M8680n3063j74007j01515
2714A491979J16910n3506Q6309k9971l2666j65404j44868j45208k42275M7997
2704I29297K5202j6059K8726j50937L813M968J54699O2467k7131j49496j12968
2693G52581m1106q5458K4860P013j55584n8678l436J07835L9752p9600J944q3719
2681D26404j48174p4216r7308K03029R0267M2497m5045j32874J41752P7930j74673
2670C09589p1750O2824Q6366R6580q2933j97022r2736J3098O1573P229o5444M178
2658A31552M6253M4186L1937j3576q9192P4733O7934j1086J3936P1894j11659
2647B56912o5394o9876L7415l20o3407J38180J3484n2761M6215j11423J07332
$$ y = [2225067, 2125305, 2035870, 2008133, 1833395, 1694096, 1694329, 1771884, 1820564, 1767501, 1593494, 1491979, 1608889, 1555383, 1641692, 1611721, 1579055, 1413651, 1268783, 1123575, 881300, 929297, 954499, 938440, 967166, 816229, 820042, 825010, 979709, 1042176, 1015045, 865549, 752581, 711475, 626017, 650877, 657890, 502306, 443628, 440192, 548027, 587779, 508179, 510123, 426404, 278230, 204014, 106706, 309735, 400002, 442499, 397454, 264580, 406332, 484262, 309589, 237839, 300663, 387029, 483609, 400676, 203654, 110918, 124016, 185589, 192818, 127374, 131552, 177805, 221991, 253928, 240352, 151160, 225893, 293827, 282741, 296677, 368571, 256912, 191518, 121642, 159057, 158737, 95330, 233510, 246994, 194233, 240448, 129025, 236357]
2636B36357R3561J7934r7955p8077l5137j56590K19135L7574n9131M09k2075M3411
2624A99416q044j37988j91923N1102J48181O6560k3750m601j26311j6390J31835
2613H8087O2667m9102K1350k7025m1729j5664J43900K0762J7400j3916J1179M3893
2601B61802N629q0916P731j9483K7116N1782J7622l4727j39853k7259J7710n3126
2589C4028N3897J13543m7306Q7967J99459M3442J03523J77734O3864r6016j78861
2578E55274k2966n322p9946q9096K639j67556l3118j87431j62977J13116K11426
2567A34043J72329k07269J4128K7206j2638J00450l424J28328n2986j14364p249
2556A78554K1041l2890p375K7867j2463q2p6767P9413P4911p6981o3239o4085
$$ y = [236357, 329918, 347852, 249897, 171820, 136683, -19907, 199228, 236802, 177671, 178080, 156005, 199416, 191372, 53384, -138539, -87437, 60744, 127304, 103554, 98953, -27358, -43748, 88087, 150754, 101652, 123002, 95977, 54248, 38584, 182484, 203246, 220646, 206730, 217909, 261802, 267431, 186515, 194246, 174763, 201879, 253661, 271283, 236556, 96703, 69444, 87154, 34028, 87925, 201468, 154162, 242129, 441588, 485030, 588553, 766287, 830151, 734135, 555274, 532308, 526986, 447040, 357944, 360583, 193027, 159909, -27522, -190499, -77383, 134043, 306372, 99103, 113231, 140437, 127799, 228249, 224825, 353153, 300167, 185803, 178554, 199595, 166705, 159330, 187197, 174734, 174652, 97885, 177298, 252209, 175228, 111989, 47904]
2544D7904J29612k7927N6201J1981N5312o746j10730n152N5837L3996J1920n1158
2532B01050p0700Q1413K6388n7793j09472J1636N9583j4701m8873o3247K6317
2521D1601P5058j02107L9951L0115j29770p9299J96975O5341q0833J659j8347
2510D0344l22l7731O896J3522q5637K4434R5213j6113j20266Q8486M5848J897
2498E6571P3738K1468M3368r2881J5237n9745J8943m7073n8064J22215o9347N9483
2486H3913O7753l9065K1063o0450q1590K5102O2254P7500L6065n1846K1356o6643
2474I5412l2569M929L3990l9950J45476N624j04958n9424l7392P5222n999O2906
2462A43267M8955m745k3799N5319Q4143N5472j2155M8694o3642P6301l5336m9868
$$ y = [47904, 177516, 149589, 205790, 217771, 273083, 266337, 155607, 150455, 206292, 240288, 252208, 201050, 130350, 211763, 238151, 180358, 70886, 82522, 142105, 127404, 78531, 15284, 41601, 116659, 14552, 54503, 84618, -45152, -124451, 72524, 137865, 57032, 58691, 40344, 40022, 2291, 9187, 22709, -62928, -38494, 56719, 40606, -79660, 8826, 54674, 56571, 130309, 151777, 195145, 102264, 117501, 57756, 76699, 29626, -28438, 93777, 24430, 83913, 151666, 112601, 133664, 73214, -8376, 16726, 78980, 156480, 192545, 140699, 162055, 95412, 62843, 67772, 101762, 61812, 207288, 212912, 107954, 48530, 11138, 86360, 80361, 143267, 192222, 187477, 163678, 218997, 303140, 358612, 346457, 395151, 331509, 407810, 372474, 322606]
2450C22606o2506l1133P9113J48923l0433j72393J62957P5882r3461r8707J4346
2439C15194o7154O9272R2578P7906j32820r7547K5610m6089N5698L4097p7790
2428B48955n1717k8259J1031K3056R400L1610N1855l4548J04655J61157k310q7461
2416D37424j14585n7582L8952P6027K8560l8877j02326r753J47495R9007O7349
2405E71691r6661M3549K9993K5868R3449L8511M1497j16220L5746Q1543N5870
2394H04836p0401K1720m3877J34834O2653l7167R0637K4895L3262M2811K5629
2383A089832J0930P6403l1805J6667O1388n7344M7210m2069j37444R4658K3961
2372A152387j3928K9347m163J1896k7147p5561j22833J09533K02670J44174p786
$$ y = [322606, 260100, 228967, 308080, 457003, 426570, 254177, 417134, 493016, 399555, 300848, 315194, 248040, 317312, 409890, 487796, 354976, 257429, 283039, 236950, 292648, 326745, 248955, 197238, 168979, 180010, 203066, 212466, 244076, 295931, 261383, 366038, 527195, 524885, 437424, 322839, 265257, 304209, 380236, 408796, 369919, 267593, 257840, 405335, 504342, 571691, 475030, 518579, 548572, 574440, 667889, 706400, 747897, 631677, 667423, 748966, 804836, 734435, 756155, 712278, 847112, 909765, 872598, 963235, 988130, 1021392, 1064203, 1089832, 1100762, 1177165, 1145360, 1162027, 1223415, 1166071, 1213281, 1171212, 1033768, 1128426, 1152387, 1138459, 1167806, 1163643, 1175539, 1148392, 1072831, 949998, 1059531, 1262201, 1406375, 1398589]
2361A398589J00691L1737P8292O0793J1316L8552O5452J12350K24190J59746R5589
2350B377297l7777J19306J71872J12567R148J24142J56999K06846K71465J28374
2340C640239K34418L45577J84037K91083N42827N11146O88110P62691J063704
2331H263832J300169J354351J201743J136369R94927J312421J440307J867870
2323A8871989K643093M045739O021217R615099J4087218J8072679J7232942J1731644
2315A02321620L912744l362167r467864j3266920j3171284j1990377j0309610
2308D4666142q572764o634478m996105l546834k491596j705388j386019j021623
2300A4311335r21556q76534r79205q47854q77557p14721o72155m61505m92316
$$ y = [1398589, 1499280, 1531017, 1609309, 1670102, 1681418, 1719970, 1785422, 1897772, 2121962, 2281708, 2377297, 2339520, 2458826, 2630698, 2743265, 2752413, 2876555, 3033554, 3240400, 3511865, 3640239, 3874657, 4220234, 4404271, 4695354, 5238181, 5749327, 6437437, 7200128, 8263832, 9564001, 10918352, 12120095, 13256464, 14251391, 15563812, 17004119, 18871989, 21515082, 25560821, 31582038, 41197137, 55284355, 73357034, 90589976, 102321620, 106234364, 102872197, 93404333, 80137413, 66966129, 54975752, 44666142, 36093378, 29458900, 24462795, 20915961, 18424365, 16718977, 15332958, 14311335, 13389779, 12513245, 11534040, 10686186, 9808629, 9093908, 8421753, 7960248, 7467932]
2291G467932m82158n95671l64048k68430k39531j93092l11272l49085k97557l34454
2281D032634o6113j99868k05544N7219j96789q8512J2370m5198j93341j5169q8299
2270C003390j80635j12761j21179m7161r8997q7091r5340K6231p3846j85345P4648
2259B101914J53247r0331j20948j31720j57416m3893j03312K14j25778m6009j31837
2248A304131J7688o9625j74995R621L4966n2945P3454j67354O5121J7236K0033
2237A077331Q4641l7757k65015J5105P1292p4840o0862j10294J48652q336j6142
2226H23775O3985j08257M2335l7333J19518Q1308q7704j3386L5185l5029O2417
2215I46814L0307j96982M0208K428r3218R1715n4054j12023n2370J04825j19866
$$ y = [7467932, 6985774, 6390103, 6026055, 5757625, 5518094, 5325002, 5013730, 4664645, 4367088, 4032634, 3966521, 3766653, 3561109, 3618328, 3421539, 3333027, 3345397, 3300199, 3106858, 3091689, 3003390, 2822755, 2709994, 2588815, 2541654, 2442657, 2355566, 2260226, 2286457, 2212611, 2027266, 2101914, 2255161, 2164830, 2043882, 1912162, 1754746, 1710853, 1607541, 1607755, 1481977, 1435968, 1304131, 1321819, 1252194, 1077199, 1086820, 1121786, 1068841, 1142295, 974941, 1040062, 1057298, 1077331, 1161972, 1124215, 859200, 874305, 945597, 870757, 809895, 699601, 848253, 839917, 823775, 887760, 779503, 821838, 784505, 904023, 985331, 897627, 884241, 919426, 884397, 946814, 977121, 780139, 820347, 822775, 729557, 821272, 767218, 655195, 602825, 707650, 587784]
2204E87784J5368K9317j51198J84891M8522j54831n4609m1098j28879J00116J1885
2193D47268M1963j21268J4999o440K3335K4223L9839L9624j60654j72461J4176
2182A84604N5684m1666r6259J4430M0210n9197m8451J98667l0230O7927J22373
2171D08092K8024j28577o7456j42886N7374J60490P1389k9838l3899O5238j38598
2160B49353k3709J13867o8581k10191l3949J68943J43978j00571Q7867n7176k226
2149B67605j69454j07816J22484J51235O5094P6293j45703j14492N1277o3476
2139A33047J17341k1489j00187l4265J22824n5476m3642Q5271p4742o4908M5167
2128A08941R300J1378n3812J18929J05412j18346L5557j5205j1956m9458k5419
$$ y = [587784, 603152, 632469, 481271, 666162, 714684, 559853, 505244, 464146, 335267, 435383, 447268, 489231, 367963, 382962, 376522, 399857, 424080, 463919, 503543, 342889, 170428, 184604, 240288, 198622, 102363, 116793, 157003, 97806, 49355, 248022, 217792, 285719, 408092, 436116, 307539, 240083, 97197, 154571, 315061, 386450, 356612, 322713, 387951, 249353, 225644, 339511, 270930, 60739, 26790, 195733, 339711, 239140, 327007, 269831, 267605, 98151, -9665, 112819, 264054, 329148, 405441, 259738, 145246, 196523, 133047, 250388, 228899, 128712, 94447, 217271, 161795, 118153, 203424, 128682, 63774, 108941, 118241, 129619, 75807, 194736, 300148, 181802, 217359, 202154, 190198, 140740, 115321]
2117A15321Q3216p0434n5101J71171P2463q2375j5757j20446R1679k2622j36247
2106C0868j44144M3561J70096P2448j11124l89K3616q723l1085k19438J96421
2095B2107J27651o5102j45988J2170J25240m0633j58777P254J94282K557j59458
2084g8697N7287k8657p8286O0465R0786J37419n9398k39976m27P5851R6238N6876
2072H9481k1888L7653q1448K9361n1812r6579L9541J8837j6271l9284O1822J7643
2060a2944J7677J33529R2178j40393n1484j9146j1122J37010L632K6036R2359
2049B67332P7570j6790n1416q2129K03054J65149q4260m98j51810j00987n7784
2038A67431J3820m7191n6841r1863j37086M936J38729J13511j1025n1699K6468
$$ y = [115321, 198537, 128103, 73002, 244173, 316636, 234261, 218504, 98058, 189737, 167115, 30868, -113276, -69715, 100381, 172829, 61705, 61316, 84932, 76209, 45124, -174314, 22107, 149758, 84656, -61332, -49162, 76078, 35445, -123332, -116078, 78204, 80761, -78697, -21410, -50067, -128353, -67888, 22898, 160317, 100919, -139057, -139484, -63633, 32605, 89481, 67593, 105246, 23798, 53159, 1347, -95232, -55691, -36854, -53125, -92409, -30587, -12944, 4733, 138262, 230440, 90047, 38563, 19417, 8295, 145305, 148937, 174973, 267332, 344902, 328112, 276696, 194567, 397621, 562770, 478510, 478012, 326202, 225215, 167431, 181251, 134060, 77219, -14644, -151730, -146794, -8065, 105446, 94421, 42722, 69190]
2027F9190p6152l4224R4295k0840P9888K4979o3212l4424k10255l9385R4217M3145
2015g2778K7273M0834l0250N350M9161m6787J4154P1832K1332j46842J9587r2247
2003a39381k3673L854N4073J16197r5497n4747N5247K280M1864o7422J1198R6314
1991C07j04975j76498p1284J05447j145J64440n5692J30788j10048j26349K37928
1980g081k6041M5812j18299P7630j519q8828n514Q5386Q6100L8049j08515j1764
1968c4584N0779m7888J51734j0466j99048K8008Q585j65305K2563N9111J9512
1957a16999O1811K70r429p6664r9280R8350N7106J14724q4537k23530K1328R4038
1945a62812R4414M666j2375R2879r7713p9055P624Q0931L4207n717j85856J18915
$$ y = [69190, -6962, -41186, 53109, 32269, 112157, 137136, 73924, 39500, -170755, -210140, -115923, -72778, -45505, -4671, -34921, -29571, 19590, -27197, -13043, 58789, 80121, -66721, -47134, -139381, -163054, -159200, -105127, 11070, -84427, -139174, -83927, -81647, -39783, -107205, -96007, 307, -104668, -281166, -352450, -247003, -248148, -83708, -139400, -8612, -118660, -245009, -7081, -33122, 12690, -105609, -27979, -29498, -118326, -123840, -38454, 47646, 85695, -22820, -34584, 16195, -31693, 120041, 109575, -89473, -61465, -52880, -218185, -195622, -136511, -116999, -55188, -54918, -64347, -141011, -240291, -141941, -84835, 29889, -54648, -278178, -256850, -162812, -68398, -63732, -76107, 16772, -80941, -159996, -152372, -71441, -37234, -42951, -228807, -109892]
1933a09892L4929k18016N7216R4948M9437n6015q7885L744Q8511K10698M6073
1922A13748p546m9518j06800j52334Q6504J00056K0129P0935j08074L1732m8303
1911d9471k4493k16417O2684R5608m1535J2664M288L6594M5743M6218J9327J98660
1899A89870j56711j83046M7849J15266M6895J00729J3909j48826k0162j12080
1889a06307P73m611J84460k7973p299j37899j40291K31149K9444q1350k9080j0267
1877i9251R8607l2035O2435q7939p171J95507R754k39186r4101j4969Q5658k9441
1865a52132M019J44364N6635k1337o2209l8731q783k1204p5070J06877p0385n6628
1853a94584K0569J48937N6579J440O3297q4321k05890r8800J27084J21191J59945
$$ y = [-109892, -74963, -292979, -235763, -140815, -91378, -147393, -235278, -231534, -143023, 67675, 113748, 106202, 56684, -50116, -202450, -115946, -15890, 4239, 75174, -32900, -1168, -49471, -73964, -290381, -227697, -132089, -173624, -160960, -156672, -120078, -74335, -28117, -8790, 189870, 33159, -149887, -102038, 13228, 60123, 160852, 174761, 25935, 5773, -106307, -105534, -110145, 74315, 46342, 39043, -98856, -239147, -7998, 21446, -59904, -88984, -99251, -644, -32679, 29756, -58183, -65354, 130153, 139907, -99279, -193380, -208349, -122691, -152132, -148113, -3749, 52886, 31549, -30660, -69391, -78174, -99378, -174448, -67571, -137956, -194584, -174015, -25078, 31501, 32941, 96238, 11917, -193973, -292773, -165689, -44498, 115447]
1842A15447o9278j75135j05571N6361Q1624L83038j16169k57796j51925K7625
1832b11779J15064r8948P5145R9648J31130j04433j24499k6589J94692J55006
1822B04437O6135q7661j66422Q0207O092j42579O6107K3116N894j21931j10804
1811a77409j05924J52243p72J47886l5387j07033L0n3802L720J51042J17141K2166
1799A13901j57342M3867r5583M747M8524R6058P498k8979Q264j7343N5783q0711
1787a316J35099p3534j46822l0385Q888j4879P7436J17170J02954k7818j03539
1776D3254j46913p8749M6038J06701M2253j00068j41265q2104J41977J31019J29505
1765I1648r3861M7102P7682k14282J24299K05685K9001j45026n6018j66767r2772
$$ y = [115447, 46169, -128966, -234537, -178176, -96552, 286486, 170317, -87479, -239404, -211779, -96715, -195663, -120518, -20870, 110260, 5827, -118672, -145261, 49431, 204437, 270572, 182911, 16489, 96696, 102788, -39791, 26316, 49432, 55326, -66605, -177409, -283333, -131090, -131862, 16024, -19363, -126396, -126366, -180168, -176448, -25406, 91735, 113901, -43441, 426, -95157, -90410, -41886, 54172, 61670, 32691, 40955, 23612, 79395, -1316, 133783, 60249, -86573, -116958, -108070, -122949, -45513, 71657, 174611, 146793, 43254, -103659, -182408, -136370, -29669, 12584, -87484, -228749, -310853, -168876, -37857, 91648, -2213, 44889, 122571, -91711, 32588, 238273, 267274, 122248, 66230, -100537, -193309]
1754a93309k3201N8670J68871P2882R8098k64386j02063N5570M6381J36395m9470
1743D438J5436K4861j29503o9749M5488N5345M0293q2606R3426r1808j14039J81625
1731b6793n041j14436J18546K9851l5572m8162m5501P8297J14669Q277M371r5914
1719a7408j46960k123O9149M7634K4565L6128p880j61183O4115j3690j7301Q9148
1707c5806R9580q1705P887j13800O1518O5467k2832J05102j24487j74375j44232
1696c57683P1882J73947J95933J4514L7798n8935r2168r7630J35401P5976j10028
1685a0993j43097P744J37261k6220O2539m5294K6322l51j4627M395m5845m6441
1673i4607K9286M0707O2727p1005m8723K0842j4582J49189J4228k9504k14425
$$ y = [-193309, -216510, -157840, 11031, 83913, 182011, -82375, -184438, -128868, -82487, 53908, 4438, 19874, 44735, -84768, -154517, -109029, -53684, -13391, -95997, -2571, -94379, -208418, -26793, -31834, -146270, -27724, 2127, -33445, -81607, -127108, -48811, 65858, 74135, 78506, -17408, -164368, -166491, -97342, -49708, -25143, 10985, 3105, -158078, -93963, -107653, -124954, -35806, 63774, -17931, -10044, -123844, -62326, 3141, -19691, 85411, -39076, -213451, -357683, -285801, -111854, 84079, 98593, 136391, 77456, -14712, -112342, 23059, 99035, -10993, -154090, -146346, -9085, -35305, 27234, -18060, 8262, 7911, -6716, -2321, -48166, -94607, -65321, -24614, 38113, -32892, -81615, -60773, -75355, 73834, 88062, 58558, -155867]
1662a55867M4013P9155n4237J17780P1728N0503k27004q5232n5226J7991J35006
1651f1390R3082J79755m5327j70076q8203M8068M091N3357J7080o7319j49010
1640a85892p4657m8607J41857K19388J36097l7529k09665j23152l2479Q2818K21472
1629H9651m3654o5632M819r4466Q3413L1222Q7281o9685n2591o8037o8827n5774
1617b22280J42940J08114n1301J00234j95108j16770O8289j3563R8491K5397m3421
1606i8978o6173k7453O7315O7057p9113J30075J34538k03324j01071n7571M7894
1595a86804J21225P3766q217l1050j39325l5108L8744P3258M1340K6053J5142
1584a0976j04804K7462p7097j5540K71744K0224N75j67726j55444l6650K32325
$$ y = [-155867, -111854, -32699, -86936, 30844, 102572, 153075, -73929, -159161, -214387, -196396, -61390, 31692, 211447, 166120, -3956, -92159, -44091, -40000, 13357, 30437, -36882, -185892, -260549, -309156, -167299, 52089, 188186, 150657, -59008, -182160, -214639, -131821, 89651, 45997, -19635, -14816, -109282, -25869, 5353, 92634, 22949, -29642, -97679, -166506, -222280, -79340, 28774, -22527, 77707, -117401, -234171, -165882, -179445, -80954, -55557, -98978, -165151, -192604, -125289, -58232, -137345, -7270, 127268, -76056, -177127, -234698, -186804, -65579, 8187, -30, -31080, -170405, -205513, -166769, -93511, -52171, -26118, -10976, -115780, -88318, -165415, -180955, 90789, 111013, 111588, -56138, -211582, -248232, -15907]
1573a5907N1101k0087j17758J50849q5350m0454R8974o17J77933j0017k43708
1562e5041j18817M1607j5845J71296P1475J17715n4975q6544k62047N9158J34480
1551B462J05741k2879j48473r2340O5450L3479J07986L5662J8580o3690p1441
1540b9463k696j31903J18423J95499J7204j53658j83408o5335j9323J13731K40030
1529I9101J14490r4450o3989l5422q3833K3723J09051J52753L7111k66088j37475
1518a45028M8821P0871R1302P5162l3298j23017r1735j17813L0375K06524J49904
1507A62068j8887j47356k13949j7700N7560J18371O3387J18979n7520p7662q0720
1496i3429n9973R5728R3627j6267j07131o5442q6641L8283J99924P1350Q0054
$$ y = [-15907, 35194, 15107, -102651, 48198, -37152, -77606, 21368, 20751, 198684, 188667, -55041, -173858, -132251, -148096, 23200, 94675, 212390, 157415, 70871, -191176, -132018, 2462, 108203, 85324, -63149, -155489, -90039, -56560, 51426, 87088, 105668, 41978, -29463, -32159, -164062, -45639, 149860, 167064, 13406, -170002, -235337, -254660, -140929, 99101, 213591, 119141, 55152, 19730, -64103, -40380, 68671, 221424, 258535, -7553, -145028, -96207, -25336, 65966, 141128, 107830, -15187, -106922, -224735, -194360, 12164, 162068, 143181, -4175, -218124, -235824, -178264, -59893, 3494, 122473, 64953, -12709, -93429, -153402, -57674, 35953, 19686, -87445, -152887, -239528, -201245, -1321, 70029, 150083]
1485A50083n0858k05573l0157O4314Q4161K0234q3779J01564k0815j70511j06074
1474b47411J02133K62783j08298r6837m782K167o8422K214J73543L1317K5646
1463G4053j98813j55496J07246Q7970L8855P2645R2368q7819r1048k7479L9053
1452d8465r7581K07586o6732p7469Q7814m6554M6723M9549N827L4549o876n577
1440H2794j13189l9062N3245J13501J04223j78815m1725k09091Q2194Q6559Q1360
1429B1994K1045j71249l5425o771J86842l3178N4167K8185j05542k55259l6019
1418c31210K04960J43793J14356M7917k187k49120j86867n3522Q0708J34980O3652
1407c2540K541j78497K445n4892J04640J9386J17728Q4835j18221J54284j15063
$$ y = [150083, 99225, -106348, -136505, -72191, 11970, 32204, -51575, 49989, 29174, -141337, -247411, -145278, 117505, 9207, -87630, -92412, -90245, -158667, -156453, 17090, 48407, 74053, -124760, -280256, -173010, -85040, -46185, 26460, 118828, 31009, -60039, -87518, -48465, -146046, 61540, -5192, -82661, 5153, -41401, 5322, 54871, 60698, 95247, 88371, 82794, -30395, -69457, -16212, 97289, 201512, 22697, -19028, -228119, -145925, -59366, 21994, 43039, -128210, -163635, -170406, 16436, -16742, 37425, 65610, -39932, -295191, -331210, -126250, 17543, 131899, 179816, 177629, -71491, -258358, -311880, -231172, -96192, -32540, -29999, -208496, -206051, -260943, -156303, -136917, -19189, 65646, -52575, 101709, -13354]
1396a3354j6680R7954j81m1498L460j27317o154M8042L2483m6391K7219l4701
1384g7118j12462r4720K01335R5094m4138P8504o3093q1179L4000L8443K6443
1373A109J72379j58677n6792m1202m1920k7307m7374J23172R5045K4056j17515
1362g5026j17408P0660J7354M7201J05442L9983k20136q3913M898q446K29451
1351A0060n3342j4256l4305M3970k6424J4796J68698K5963l8548q6180k29372
1340b18940M9074M449K9119L5737r743j06460k4620j28994P4968J28439J75097
1329H126K29406j48452j87244P1032J32598O9701m7075q3710p6035j34798j7460
1318a83911L8171J62160M7811Q5999q2192p6990j11036M9223J56546m4688l5185
$$ y = [-13354, -30034, 67920, 67739, 26241, 29701, -97616, -103770, -55728, -23245, -69636, -42417, -77118, -189580, -284300, -82965, 12129, -32009, 46495, -16598, -97777, -63777, -25334, 1109, 173488, 14811, -41981, -83183, -125103, -152410, -199784, -76612, 18433, 42489, -75026, -192434, -121774, -104420, -57219, 48223, 88206, -131930, -215843, -210945, -219391, 10060, -43282, -57538, -91843, -47873, -74297, -59501, 109197, 135160, 96612, 10432, -218940, -169866, -165417, -136298, -100561, -110304, -216764, -241384, -370378, -295410, -166971, 8126, 237532, 89080, -98164, -27132, 105466, 175167, 128092, 44382, -31653, -166451, -183911, -145740, 16420, 64231, 150230, 68038, -8952, -119988, -70765, 85781, 41093, 5908]
1307E908M8407j45376j48762K238J17518J09194m4378J7978O7294m8721o4061
1296h2761J46877J15688J10995J03187k90256k11809j63260J17990Q4677Q4956
1286A6284o4934k8743K0685K5519N4088k3565j30926J0392O4137l3612r1726K6339
1274a56062L5157J36445J4278K750j7050r4110J29288N4759J07710r2194k9050
1263I1921j19j14971j35051o8177M7279J08812N2527Q380j28813N9343Q7820N5805
1251F4756j19443l3230m9402O8615O7335l4847j1618M5126J14167l7526j79182
1240a05249L588J25057N3465M5465j25806Q4109L7846k21248K1090P6000N6355
1229E0672Q7641j90418o5721Q4259o7616Q0452J62313N6564j27780l2767r6159
$$ y = [5908, 54315, -91061, -239823, -237585, -120067, -10873, -55251, -37273, 30021, -18700, -82761, 64116, 179804, 290799, 393986, 103730, -108079, -271339, -153349, -68672, 16284, -48650, -77393, -56708, -31189, 22899, -666, -131592, -121200, -57063, -90675, -182401, -156062, -120905, 15540, 29818, 32568, 15518, -78592, 50696, 105455, 213165, 120971, 91921, 91802, -23169, -158220, -226397, -179118, -70306, -17779, -9399, -138212, -78869, 8951, 64756, -54687, -87917, -137319, -68704, -1369, -36216, -47834, -2708, 111459, 73933, -105249, -101661, 23396, 76861, 122326, -3480, 80629, 118475, -102773, -81683, -5683, 50672, 138313, -52105, -117826, -33567, -101183, -20731, 141582, 198146, 70366, 37599, -58560]
1218e8560J2635J94020l5035m780p8679m4333q2110J2331J02716P3865r7165J9872
1206A4777k324p9307K3244Q867N9063l6757J45811P4388q4254p0302N1146O1306
1194A65658l463m4496p9511q1237J5191J03365o8125r0658N1722R1771Q171j69968
1182a01580r2941J01537L0132q7391o8522l118o6575K7363P8436N9988n4887O1715
1170a15843J55951q2543J24444N5809J25718j3263j32648l7673N227j06748j18627
1159a40196j6722J41309R3328L1374q1517j06218O8606M6702J8824o9096M9049
1148C5443j62794Q6926L4079k4865p2842n7609K3572O7590o2940M0803m3575J10616
1136b5596J13861N2412k47475O8454P2080n3878J1806j35370l1206j46274O9582
$$ y = [-58560, -45925, 148095, 113060, 108280, 29601, -14732, -96842, -84511, 18205, 92070, -5095, 14777, 12453, -66854, -43610, -34743, 24320, -12437, 133374, 207762, 123508, 53206, 104352, 165658, 162195, 117699, 38188, -43049, -27858, 75507, 7382, -83276, -31554, 60217, 68388, -101580, -194521, -92984, -62852, -150243, -218765, -221883, -288458, -261095, -182659, -122671, -177558, -115843, 40108, -42435, 82009, 137818, 263536, 250273, 117625, 79952, 85179, -21569, -140196, -156918, -15609, 77719, 109093, 27576, -78642, -10036, 36666, 55490, -13606, 35443, -127351, -40425, -6346, -31211, -104053, -161662, -138090, -70500, -133440, -92637, -136212, -25596, 88265, 140677, -106798, -38344, 33736, -20142, -8336, -143706, -174912, -321186, -251604]
1125b51604J50727J33961o5844K20783M931k056o1155o826j27381p9583k4895
1114a08942l623J17050K8756l0099p4424R3612N9515j04995o2291J49850J50111
1103B14520j47322q8495N5260J8976J4776R392n7396M1212O9882O4789K7293l7895
1091A84992p3088j02871J45353O1112k19836j43397n3999o830R3092K7216k6193
1080a14449K4223N7998J57939L8521r0879j52163L0787J1389j71027K9595R9938
1069g8128j19309n9801J41378n6478J5936J33337O3380J0099o5877n0504J1886
1058e4081Q376K9583R2107k2800r2506J2682m6519L4001M0942p9744J53915J57283
1046B33239n3820j8704q8097m5052q9314n6419P0930L5285J39101N0207l8192
$$ y = [-251604, -100877, 33084, -32760, 188023, 192954, 190898, 129743, 122917, -4464, -84047, -108942, -112565, 4485, 33241, 3142, -71282, 22330, 81845, -23150, -85441, 64409, 214520, 67198, -21297, 33963, 52939, 67715, 77107, 19711, 60923, 130805, 195594, 222887, 184992, 111904, 9033, 154386, 215498, -4338, -147735, -201734, -208564, -115472, -88256, -114449, -90226, -32228, 125711, 164232, 73353, -78810, -48023, -36634, -207661, -178066, -78128, -197437, -257238, -115860, -172338, -156402, -23065, 40315, 50414, -15463, -65967, -54081, -45705, -16122, 75985, 53185, -39321, -26639, -73158, -39157, 1785, -77959, 75956, 233239, 179419, 160715, 72618, 27566, -61748, -118167, -47237, -11952, 127149, 177356, 139164]
1035A39164m6972o8611l1245q5430N5651k3705K7858K1800N9063j53860q3523
1024a89810r748r350j1027J29702J45926l7336m3958l1818l2357M8006K599m4963
1012h4134N3461j21324L5659N8380Q9918N6327j4989j25649j24400L3936J6887
1001a25928L5962M8012j52482n0954K2206J48552O834l9334J0902m7082j42907
990b86219J06876o6865J73805O1951q9351K0792P2620J9180l4515q3379L8378
979f6727J05118q3761M1911j36906m3621J5087O2525J1637n86K5071P711o1762
967a24303N3110M9939n174m0855J15493j89929k5882R3134Q3310P3251q7721p4151
955g9778L2204J03708j6333L9446j31596q1825N0831P6043m029q2365J63447q3521
$$ y = [139164, 92192, 23581, -7664, -93094, -37443, -61148, -33290, -11490, 47573, -106287, -189810, -199558, -208908, -219935, -90233, 55693, 18357, -25601, -57419, -89776, -41770, -39171, -84134, -30673, -151997, -116338, -57958, 31960, 88287, 73298, -52351, -176751, -142815, -125928, -89966, -41954, -194436, -245390, -223184, -74632, -67798, -107132, -96230, -143312, -286219, -179343, -246208, -72403, -10452, -99803, -79011, -6391, 12789, -21726, -105105, -66727, 38391, -45370, -3459, -140365, -183986, -168899, -106374, -94737, -95323, -70252, -62541, -124303, -71193, -21254, -26428, -67283, 48210, -141719, -167601, -74467, 8843, 82094, -5627, -79778, -47574, 56134, 39801, 79247, -52349, -134174, -83343, -7300, -11329, -93694, 69753, -13768]
943a3768k3267J62814M1605j19908j06966P9580Q2570J00147q9584j34956P2757
932E1024O9586n0670r8782J18159P7087O091j28252o2264N818L2259L9424M1368
920A00848J3538K9833p5324j03675j38130n8312R8088K9409Q8567j562k9376j43731
908a89827K1862P155K04326K5563l4942j1795p674j887j30964K3927l5428J25444
896d240L082j4321r933N7952K7593j6908J04783M9359r3979j96582M2400K4724
884b6070J3792m0669J32233J35437o5052m085Q648J1673j28131o2328J4036L9142
872B8626R7673O8272m904k4592J528j83282k4072O1910P8401m3324O6702J6654
860A39592P4066p7757j47236j1979R3165n0595R616P8687j10670j10696o4303
$$ y = [-13768, -37035, 125779, 167384, 47476, -59490, 20090, 102660, 202807, 113223, -21733, 51024, 120610, 69940, -28842, 89317, 166404, 172495, 44243, -18021, -12203, 20056, 59480, 100848, 114386, 144219, 68895, -34780, -172910, -231222, -133134, -103725, -15158, -16720, -46096, -189827, -167965, -160810, 43516, 69079, 34137, 22342, 14668, 12781, -118183, -94256, -129684, -4240, -1158, -15479, -25412, 32540, 60133, 43225, 148008, 197367, 103388, -93194, -50794, -26070, -12278, -52947, 79286, 214723, 149671, 145586, 154234, 165907, 37776, -24552, -10516, 28626, 126299, 194571, 189667, 165075, 166603, -16679, -40751, 21159, 99560, 56236, 122938, 139592, 213658, 135901, -11335, -23314, 69851, 19256, 28872, 107559, -3111, -113807, -178110]
849a78110K02182O1045N3102j11782j67273J4387J14924J22722J6507k50246K9200
838i3342P7918P8861R041j03543O275P1746P4101N3948k04600L8583J83172j68290
826B3870j04995m7229O6443j23545R7607J9626p7651N5532J06295Q2846n0251
815D8548j04266r2182L3222J67959L7990n3827r5801j15281J12643K9831j3836
804d5000O8829k937n8052J5655J714o0464R8211K8717M2767r8124N33K6712k2719
791d158Q268J42062j96983m4925P8593L3799J17968j17136j32974L8866K9631
780d6989l5581o601p0288K653k1999K18320J7662j23906O0631R3184M2862k1509
768A08439M5788l1696j14458Q7120j82428l2042K9702N9152P281J5000L4958J9374
$$ y = [-178110, 24072, 85117, 138219, 26437, -140836, -126449, -11525, 111197, 127704, -122542, -93342, -15424, 63437, 72478, -31065, -24790, 46956, 121057, 175005, -29595, 8988, 192160, 23870, -81125, -128354, -61911, -185456, -87849, -68223, -145874, -90342, 15953, 98799, 48548, -55718, -147900, -114678, 53281, 91271, 37444, -58357, -173638, -60995, -31164, -45000, 23829, 20892, -37160, -21505, -19791, -80255, 17956, 46673, 89440, -8684, -8151, 18561, -4158, 4110, 146172, -50811, -95736, -17143, 16656, 134624, 17488, -115486, -76620, -46989, -82570, -89171, -159459, -156806, -178805, 39515, 57177, -66729, -6098, 87086, 129948, 108439, 154227, 122531, 8073, 95193, -87235, -119277, -89575, -30423, -23142, -8142, 26816, 46190]
756D6190J27173o9789p9413q8416j76468Q1182Q5894J57116Q0751L8867j32708
745G0379Q347k9429J2376J2831j40365j6857n812P300p3042k912k1928O0211J55890
732C6989k0443j22112K15J33377J33885n5115p3244j05077k7415O2193L6931m3730
720d3546l6726O9322j4462P9760k5258n0406O1041L4150J38058k2981m7308j00473
708D1171l1541J5787l1483N8564n1192j78485J2111J30562L6124K2573m5134N977
696a4966j01953k9358q9070m8778J47626J5851M0144O0216o4706q0431J6562K19355
684G0492k4811p3254J38303j07894q6140o3880J63699K18967p5730o0031j45022
673d5301j10094J9733O9124P3279Q4536K9565q1849o5569J6566n412m9379R4483
$$ y = [46190, 173363, 103574, 24161, -64255, -240723, -159541, -73647, 83469, 164220, 203087, 70379, 78726, 49297, 61673, 74504, -65861, -82718, -88530, -81230, -154272, -157184, -179112, -118901, 36989, 16546, -105566, -105351, 28026, 161911, 106796, 33552, -71525, -98940, -36747, 184, -43546, -80272, -10950, -25412, 54348, 29090, -21316, 39725, 73875, 211933, 188952, 141644, 41171, 9630, 25417, -6066, 52498, 1306, -177179, -165068, -34506, 1618, 24191, -20943, -14966, -116919, -146277, -235347, -284125, -136499, -120648, -80504, -20288, -84994, -165425, -148863, 70492, 45681, -27573, 110730, 2836, -83304, -147184, 16515, 235482, 159752, 99721, -45301, -155395, -135662, -66538, 6741, 91277, 120842, 38993, -26576, -10010, -15422, -64801, 29682]
661B9682j24453P1097R816L3016R5184N0022O1124n2575r5769j25900l6952K11921
649A26213N0962P7033j16495k46760n2363R0736l6961n9284K01801k4450r3913
638h3481j1036N751N8931O5820l6301o4713k5745r9339J25400K17981p1521k8067
626E3680K6823k3759r0718l4351P2513P2419n3711R531O1353p4629J08188j8066
614A09273r6641J28502N9650j16113l2137n5397r6635J04571K415j73807P194
603a59125M0192P8879O2918J464K7551j0668N0483o2944p2936J663j6572J21536
591F2441M0427j46751L303j21880k6559J12081Q9846J09065M7936r0180j7601
580F2128K6785m5754J7654J09374J05622j47582j22796p3079O1838J93825O5798
$$ y = [29682, -94771, -23674, -13858, 19158, 114342, 164364, 225488, 172913, 77144, -48756, -85708, 126213, 177175, 254208, 137713, -109047, -161410, -70674, -107635, -166919, 34882, 10432, -83481, -94517, -88766, -29835, 35985, -316, -65029, -90774, -190113, -64713, 153268, 81747, 53680, 80503, 56744, -33974, -68325, 4188, 76607, 22896, 32427, 93780, 19151, 127339, 109273, 12632, 141134, 200784, 84671, 52534, -2863, -99498, 5073, 7488, -166319, -159125, -118933, -40054, 22864, 24328, 51879, 41211, 91694, 28750, -44186, -42523, -59095, 62441, 102868, -43883, -40580, -162460, -189019, -76938, 12908, 121973, 169909, 79729, 62128, 88913, 43159, 60813, 170187, 275809, 128227, 5431, -67648, -5810, 188015, 253813]
569B53813m302J07228l8154j45305k7603j6604l3979j78323r0819L4136J23015
558a6897L5444K973J9866M5597M686l812K6396k0329M1750n8611j28956q754m7223
545a07870j06192Q5916R9178m0496J40804L990l5819J5297L4922j1548O9904O3018
533B11104m3768m2209j34612P8689m7136N5090j03342m1466J82460q3242k4756
522F812J21737P6111K6103J6676j36715j07923L5319o9678j2628O2490P2580J46702
510B37586j45083k3270O9442L5786r9382j3617p4914J9176Q4566j39333o0920
499a09963J27739J59304j20396q8036L4950P6451J55890k3188K6081j66535r0331
488a8034l4790j8618P3241J24628o9426m4590J06604j82009r482p9243Q4499J51509
$$ y = [253813, 249511, 356739, 318585, 173280, 145677, 129073, 95094, -83229, -174048, -139912, -16897, 18547, 21520, 41386, 86983, 91669, 87857, 114253, 93924, 135674, 77063, -51893, -60647, -107870, -214062, -128146, -28968, -69464, 71340, 75330, 39511, 54808, 89730, 78182, 148086, 211104, 167336, 125127, -9485, 69204, 22068, 77158, -26184, -67650, 114810, 31568, 6812, 128549, 204660, 230763, 247439, 110724, 2801, 38120, -31558, -44186, 18304, 90884, 237586, 92503, 69233, 138675, 174461, 75079, 61462, -13452, 5724, 90290, -49043, -109963, 17776, 177080, 56684, -31352, 3598, 80049, 235939, 212751, 238832, 72297, -18034, -52824, -71442, 1799, 126427, 57001, 12411, 119015, -62994, -72476, -151719, -67220, 84289]
476H4289J5070l4866p9621N0482j34523J40485K14434j60993l7084p4641R1500
465G4532j4083J7557K524m3887M0751n8315j51742K685n5263N5180O4908J00011
453C4858R437j34777R9947K17045J745k68450M4363L2120N1798j1828j26413L6177
441a3978J00970j04394l7313N6432k3226j2332j4393q4233J28411Q7587o8084
430A5447l3852K0536M8482p0592j1717j3087l8896K2930j17320N8818P0199J4377
418c4675P981K219L4881j7186r375O2093O9449j39399j0412J3339J02687m89L0329
405A11442J23410r5144P736j01864j11751N0014O5150O6667k8430m222l9231m546
393C9231o480J28332M5921L0117p1000o6023j29661L7041R6389J6493m3426r092
$$ y = [84289, 99359, 64493, -15128, 35354, -99169, 41316, 255750, 94757, 57673, -16968, 74532, 60449, 78006, 80530, 36643, 77394, 19079, -132663, -129978, -185241, -130061, -65153, 34858, 44295, -90482, 9465, 226510, 228255, -40195, 4168, 36288, 88086, 76258, -50155, -13978, 86992, -17402, -54715, 1717, -21509, -33841, -48234, -132467, -4056, 83531, 15447, -18405, 2131, 50613, -19979, -31696, -44783, -83679, -60749, -178069, -119251, -49052, -34675, -26694, -24475, 10406, -6780, -16155, 45938, 115387, -24012, -34424, -21085, 81602, 81113, 111442, 234852, 139708, 147444, 45580, -66171, -16157, 48993, 115660, 87230, 83008, 43777, 39231, 32751, 161083, 207004, 237121, 166121, 100098, -29563, 7478, 103867, 120360, 76934, 67842]
381F7842j04238J44206K2746J8240Q8695L5861p8913o5681k5367Q6972r6611l8040
$$ y = [67842, -36396, 107810, 130556, 148796, 237491, 273352, 194439, 128758, 103391, 190363, 93752, 55712]
$$ [...]
##END NTUPLES=NMR SPECTRUM
##END=
