##TITLE=1H_DE-80H_X3
 200.13MHz, d2o
 8 sc
 
 19ns.26.2.2025
##JCAMPDX= 6.0         $$ Bruker NMR JCAMP-DX V2.0
##DATA TYPE= NMR SPECTRUM
##DATA CLASS= NTUPLES
##ORIGIN= UXNMR, Bruker Analytische Messtechnik GmbH
##OWNER= pz
$$ XWIN-NMR		Version 3.5
$$ Tue Jun 16 10:36:17 2026 Russian Standard Time (UT+4h)  Yarkov@DPX200
##.OBSERVE FREQUENCY= 200.1313
##.OBSERVE NUCLEUS= ^1H
##.ACQUISITION MODE= SIMULTANEOUS
##.ACQUISITION SCHEME= undefined
##.AVERAGES= 8
##.DIGITISER RES= 18
##SPECTROMETER/DATA SYSTEM= spect
##.PULSE SEQUENCE= zg30
##.SOLVENT NAME= DMSO
##.SHIFT REFERENCE= (INTERNAL, DMSO, 0, 15.4957)
##AUDIT TRAIL= $$ (NUMBER, WHEN, WHO, WHERE, WHAT)
$$ ##TITLE= Audit trail, XWIN-NMR		Version 3.5
$$ ##JCAMPDX= 5.01
$$ ##ORIGIN= Bruker BioSpin GmbH
$$ ##OWNER= Yarkov
$$ C:/Bruker/XWIN-NMR/data/yarkov2/nmr/H-C/1/pdata/1/auditp.txt
$$ ##AUDIT TRAIL=  $$ (NUMBER, WHEN, WHO, WHERE, WHAT)
(   1,<2026-06-16 10:35:18.35 +0400>,<Yarkov>,<DPX200>,
      <created by zg, POWCHK disabled, PULCHK disabled
       configuration hash MD5:
       00 E9 B6 7A A2 85 ED C7 34 08 36 98 17 FE 4E 26
       data hash MD5: 16K
       45 87 25 FF B2 9E 1F EF 58 93 8C D3 88 56 B9 D2>)
(   2,<2026-06-16 10:35:25.20 +0400>,<Yarkov>,<DPX200>,
      <Start of raw data processing
       efp BC_mod = 2 LB = 0.25 FT_mod = 6 PKNL = 1 PHC0 = -6896.419 PHC1 = 13.42196 SI = 16K 
       data hash MD5: 16K
       95 15 B4 A0 81 B6 32 F4 A6 F1 FB C8 79 D5 74 E0>)
(   3,<2026-06-16 10:35:30.64 +0400>,<Yarkov>,<DPX200>,
      <abs ABSG = 5 
       data hash MD5: 16K
       3D E9 91 F4 D0 70 FF BD 60 DB EB A1 D1 90 9D 54>)
(   4,<2026-06-16 10:35:42.92 +0400>,<Yarkov>,<DPX200>,
      <pk PHC0 = -2.2 PHC1 = 0 
       data hash MD5: 16K
       CA AA DC F8 16 17 99 F2 B3 D3 FC F4 90 0F 8F 55>)
$$ ##END=
$$ 
$$ hash MD5
$$ 86 3B D3 3B 08 33 DE DF 6D 9D F0 AB E5 EA 60 04
##$RELAX= 
##$RELAX= 
##$RELAX= 
##$RELAX= 
##$RELAX= 
##$RELAX= 
$$ Bruker specific parameters
$$ --------------------------
##$DU= <C:/Bruker/XWIN-NMR>
##$EXPNO= 1
##$NAME= <H-C>
##$PROCNO= 1
##$TYPE= <nmr>
##$USER= <yarkov2>
##$AMP= (0..31)
100 100 100 100 100 100 100 100 100 100 100 100 100 100 100 100 100 100 
100 100 100 100 100 100 100 100 100 100 100 100 100 100 
##$AQSEQ= 0
##$AQ_mod= 1
##$AUNM= <au_zg>
##$AUTOPOS= <>
##$BF1= 200.13
##$BF2= 200.13
##$BF3= 200.13
##$BF4= 200.13
##$BF5= 200.13
##$BF6= 200.13
##$BF7= 200.13
##$BF8= 200.13
##$BYTORDA= 1
##$CFDGTYP= 0
##$CFRGTYP= 5
##$CHEMSTR= <none>
##$CNST= (0..31)
1 1 145 1 1 1 1 1 1 1 1 1 1 1 1 1 1 1 1 1 1 1 1 1 1 1 1 1 1 1 1 1 
##$CPDPRG= <>
##$CPDPRG1= <>
##$CPDPRG2= <>
##$CPDPRG3= <>
##$CPDPRG4= <mlev>
##$CPDPRG5= <mlev>
##$CPDPRG6= <mlev>
##$CPDPRG7= <mlev>
##$CPDPRG8= <mlev>
##$CPDPRGB= <>
##$CPDPRGT= <>
##$D= (0..31)
0 0.7 0 0 0 0 0 0 0 0 0 0.03 0 0 0 0 0 0 0 0 0 0 0 0 0 0 0 0 0 0 0 0 
##$DATE= 1781591717
##$DBL= (0..7)
120 120 120 120 120 120 120 120 
##$DBP= (0..7)
150 150 150 150 150 150 150 150 
##$DBP07= 0
##$DBPNAM0= <>
##$DBPNAM1= <>
##$DBPNAM2= <>
$$ [...]
##$SUBNAM3= <"">
##$SUBNAM4= <"">
##$SUBNAM5= <"">
##$SUBNAM6= <"">
##$SUBNAM7= <"">
##$SUBNAM8= <"">
##$SUBNAM9= <"">
##$SW= 18.0517328524113
##$SWIBOX= (0..15)
0 0 2 0 0 0 0 0 0 0 0 0 0 0 0 0 
##$SW_h= 3612.71676300578
##$TD= 16384
##$TD0= 1
##$TE= 0
##$TE2= 300
##$TE3= 300
##$TEG= 300
##$TL= (0..7)
0 120 120 120 120 120 120 120 
##$TP= (0..7)
150 150 150 150 150 150 150 150 
##$TP07= 0
##$TPNAME0= <>
##$TPNAME1= <>
##$TPNAME2= <>
##$TPNAME3= <>
##$TPNAME4= <>
##$TPNAME5= <>
##$TPNAME6= <>
##$TPNAME7= <>
##$TPOAL= (0..7)
0.5 0.5 0.5 0.5 0.5 0.5 0.5 0.5 
##$TPOFFS= (0..7)
0 0 0 0 0 0 0 0 
##$TUNHIN= 0
##$TUNHOUT= 0
##$TUNXOUT= 0
##$USERA1= <user>
##$USERA2= <user>
##$USERA3= <user>
##$USERA4= <user>
##$USERA5= <user>
##$V9= 5
##$VALIST= <valist>
##$VCLIST= <CCCCCCCCCCCCCCC>
##$VD= 0
##$VDLIST= <DDDDDDDDDDDDDDD>
##$VPLIST= <PPPPPPPPPPPPPPP>
##$VTLIST= <TTTTTTTTTTTTTTT>
##$WBST= 1024
##$WBSW= 4
##$XGAIN= (0..3)
0 0 0 0 
##$XL= 0
##$YL= 0
##$YMAX_a= 106969
##$YMIN_a= -150924
##$ZGOPTNS= <>
##$ZL1= 120
##$ZL2= 120
##$ZL3= 120
##$ZL4= 120
##$ABSF1= 15.43287
##$ABSF2= -2.618979
##$ABSG= 5
##$ABSL= 3
##$ALPHA= 0
##$AQORDER= 0
##$ASSFAC= 0
##$ASSFACI= 0
##$ASSFACX= 0
##$ASSWID= 0
##$AUNMP= <proc_1d>
##$AZFE= 0.1
##$AZFW= 0.1
##$BCFW= 0
##$BC_mod= 2
##$BYTORDP= 0
##$COROFFS= 0
##$CY= -3
##$DATMOD= 1
##$DC= 0
##$DFILT= <>
##$DTYPP= 0
##$F1P= 0
##$F2P= 0
##$FCOR= 1
##$FTSIZE= 16384
##$FT_mod= 6
##$GAMMA= 0
##$GB= 0
##$INTBC= 1
##$INTSCL= 3.241238e-09
##$ISEN= 128
##$LB= 0.25
##$LEV0= 0
##$LPBIN= 0
##$MAXI= 10000
##$MC2= 0
##$MEAN= 0
##$ME_mod= 0
##$MI= 1.114404
##$NCOEF= 0
##$NC_proc= -7
##$NLEV= 6
##$NOISF1= 3.799351
##$NOISF2= 2.8
##$NSP= 0
##$NTH_PI= 0
##$NZP= 0
##$OFFSET= 15.49568
##$PC= 1
##$PHC0= -6898.619
##$PHC1= 13.42196
##$PH_mod= 1
##$PKNL= yes
##$PPARMOD= 0
##$PSCAL= 0
##$PSIGN= 0
##$REVERSE= no
##$SF= 200.130005207682
##$SI= 16384
##$SIGF1= 3
##$SIGF2= 2
##$SINO= 0.751879
##$SIOLD= 32768
##$SREGLST= <19F.Aceton>
##$SSB= 0
##$STSI= 16384
##$STSR= 0
##$SW_p= 3612.71676300578
##$SYMM= 0
##$S_DEV= 0
##$TDeff= 16384
##$TDoff= 0
##$TI= <>
##$TILT= no
##$TM1= 0
##$TM2= 0
##$TOPLEV= 0
##$USERP1= <user>
##$USERP2= <user>
##$USERP3= <user>
##$USERP4= <user>
##$USERP5= <user>
##$WDW= 1
##$XDIM= 16384
##$YMAX_p= 458658589
##$YMIN_p= -584248
$$ End of Bruker specific parameters
$$ ---------------------------------
##NTUPLES= NMR SPECTRUM
##VAR_NAME=  FREQUENCY,     SPECTRUM/REAL,   SPECTRUM/IMAG
##SYMBOL=    X,             R,               I
##VAR_TYPE=  INDEPENDENT,   DEPENDENT,       DEPENDENT
##VAR_FORM=  AFFN,          ASDF,            ASDF
##VAR_DIM=   16384,         16384,           16384
##UNITS=     HZ,            ARBITRARY UNITS, ARBITRARY UNITS
##FACTOR=    0.220516191357247, 1,           1
##FIRST=     3101.1504901471, 0,             0
##LAST=      -511.566272858676, 0,           0
##MIN=       -511.566272858676, -584248,     0
##MAX=       3101.1504901471, 458658589,     0
$$ Real data points
##PAGE= N=1
##DATA TABLE= (X++(R..R)), XYDATA
$$ [...]
8836C173078L6790j43937l7920K7318R0513J82646Q3211o7916P3998M0465O0393
8825C518639J34962J5739J09843N1556q0062l5517L15429n3690Q5269N9405K0460
8814D142033R6571J14234K100l9202O0060R628J77550J15387j57280R7000J33988
8803D752069J39599N2664J24390p565J49700J62109n2634K70896J14157Q4751
8793E790136O3218J40919j2463K29652L5369o4303K23499K53953J28332P6689
8783F865001J5943J4920M19823J22583P1789J75311m6777L41868K96875Q2104
8773H359440J87574K74464Q108J80408K79723R3320L30570J83251K5252L27029
8763A0249139K70482K35507K54805K54344J07598M39761L40039K97941K42650
$$ plain form
8836 3173078 3209868 3065931 3028011 3055329 3145842 3328488 3411699 3343783 3417781 3458246 3518639
8825 3518639 3653601 3669340 3779183 3830739 3750677 3715160 4030589 3976899 4062168 4121573 4142033
8814 4142033 4238604 4352838 4354938 4315736 4375796 4385424 4562974 4678361 4521081 4618081 4752069
8803 4752069 4891668 4944332 5068722 5061157 5210857 5372966 5320332 5591228 5705385 5790136
8793 5790136 5853354 5994273 5981810 6211462 6246831 6182528 6406027 6659980 6788312 6865001
8783 6865001 6880944 6895864 7315687 7438270 7510059 7685370 7638593 7980461 8277336 8359440
8773 8359440 8547014 8821478 8829586 9009994 9289717 9383037 9713607 9896858 9922110 10249139
8763 10249139 10519621 10755128 11009933 11264277 11371875 11811636 12151675 12449616 12692266
8754A2692266L65066N95068N21198L28505M07956O53421N55233N66437N63035
8745A7248185O52741P82594O90627Q09651Q64885R61316Q49253J066885R68542
8736B4894679J060485J234632J290779J465038J512940J641997J822292K018554
8728C6941396K134501K418833K553359K866991L045789L362343L767987L944820
8720F1036019M359941M680151N140748N366215N887816O243830O222684O506691
8712A05444095O582028O603723O114132N393307M590069L742169K618535J199218
8704A42287276k76236j821121k995707m120235m932415n590239o195133o375022
8696A09981168o416705o352575o219382n850317n668591n428376n038395m500717
$$ plain form
8754 12692266 13057332 13652400 14173598 14502103 14910059 15563480 16118713 16685150 17248185
8745 17248185 17900926 18683520 19374147 20183798 21048683 22009999 22859252 23926137 24894679
8736 24894679 25955164 27189796 28480575 29945613 31458553 33100550 34922842 36941396
8728 36941396 39075897 41494730 44048089 46915080 49960869 53323212 57091199 61036019
8720 61036019 65395960 70076111 75216859 80583074 86470890 92714720 98937404 105444095
8712 105444095 112026123 118629846 124743978 130137285 134727354 138469523 141088058 142287276
8704 142287276 142011040 140189919 137194212 133073977 128141562 122551323 116356190 109981168
8696 109981168 103564463 97211888 90992506 85142189 79473598 74045222 69006827 64506110
8688F4506110m230055m090971l687227l247886k980811k810533k701191k420994
8680C8336442k251036j961485j841104j565067j752277j546558j325862j064373
8672B5028680j048180j048062j054406r27182q90592p91635p18921o44519p10244
8663A7194939o39226n85484m91720o48133n08323m15192l48443n08737l22555
8654A2727126l56517m20754l40715k95168k38564l54860l16051k53691j90886
8645I959920l09925k76456r8713l98229k79313k49229j58303j72871k63550p9280
8635G674051j22440k40837l40845o2658k58969j44868j76035j2053k96805n4323
8625E964218j91735k54954j40936j05074o1326O935j75545j57424o9473r9995
$$ plain form
8688 64506110 60276055 56185084 52497857 49249971 46269160 43458627 40757436 38336442
8680 38336442 36085406 34123921 32282817 30717750 28965473 27418915 26093053 25028680
8672 25028680 23980500 22932438 21878032 20950850 20060258 19268623 18549702 17905183 17194939
8663 17194939 16555713 15970229 15478509 14830376 14322053 13906861 13558418 13049681 12727126
8654 12727126 12370609 11949855 11609140 11313972 11075408 10720548 10404497 10150806 9959920
8645 9959920 9649995 9373539 9274826 8876597 8597284 8348055 8189752 8016881 7753331 7674051
8635 7674051 7551611 7310774 6969929 6907271 6648302 6503434 6327399 6315346 6018541 5964218
8625 5964218 5772483 5517529 5376593 5271519 5210193 5217128 5041583 4884159 4814686 4714691
8615D714691j34499Q5189j78679j6064j85896k08207p799O9223k23305j65868
8605C748786k1790j61327j671O1433j88516m1090n1315N9808j31292p3632j77065
8594C022329P8329j28020j2667r703r3505r2132K4240M917j17780K7031q9152
8583B613887k8374j13688j68304J57788p537j18324o4629p5091J23974r4274j74391
8572B051037j01291K55714P716l6861k59533j2299l862J20603p0337O9667m4037
8561A976517n3178o6735r1046J32059J15250j48233r6213j01791R4165O4650J12822
8550A938267k89895L9704N5900Q2093J0438m2642j0186L8735J5057n6097l3349
8539A748025L0885K0155K7900j22517J486J26853J56563o2899J9777K0492K67723
$$ plain form
8615 4714691 4580192 4665381 4486702 4470638 4284742 4076535 4068736 4137959 3914654 3748786
8605 3748786 3726996 3565669 3563998 3625431 3436915 3395825 3344510 3404318 3273026 3199394 3022329
8594 3022329 3100658 2972638 2959971 2950268 2856763 2764631 2788871 2793788 2676008 2703039 2613887
8583 2613887 2585513 2471825 2303521 2461309 2453772 2335448 2270819 2195728 2319702 2225428 2051037
8572 2051037 1949746 2205460 2213176 2176315 1916782 1904483 1900621 2021224 1950887 2020554 1976517
8561 1976517 1923339 1856604 1765558 1897617 2012867 1864634 1768421 1666630 1760795 1825445 1938267
8550 1938267 1648372 1688076 1743976 1826069 1836507 1793865 1783679 1822414 1837471 1781374 1748025
8539 1748025 1778910 1799065 1826965 1704448 1705934 1832787 1989350 1926451 1946228 1966720 2234443
8528B234443K84142N7657J59042K61065N43010K93714M14592L75055K70886J95101
8518E088707j96686l90411l75774l61601k83215k95839k88296l79017j46458k62769
8508B108641L2619p7385J21294j47636k12030k79247J39032J43743r5963k6195
8498A706873k10611q3050J11755J1953j14398o7193j82010l2552k16j27551J48895
8487A161895J2258j88071q0415K4723k8514O6800j06053k70499J87288N4943l6732
8476G97623J00629j79476N5435J42446q2401p0313J20168n7079J39114K4753l83624
8465F07275J48272P9079J7178L2324n0036j14887Q0808k03630r1944K79398j6655
8454G67182j574j53473k12474J22208J91290r9097j46247K2908j00048J42834
$$ plain form
8528 2234443 2518585 2576242 2735284 2996349 3539359 3833073 4247665 4622720 4893606 5088707
8518 5088707 4892021 4501610 4125836 3764235 3481020 3185181 2896885 2517868 2371410 2108641
8508 2108641 2141260 2063875 2185169 2037533 1825503 1546256 1685288 1829031 1733068 1706873
8498 1706873 1496262 1413212 1524967 1536920 1422522 1355329 1173319 1140767 1140551 1013000 1161895
8487 1161895 1174153 986082 905667 930390 901876 968676 862623 592124 779412 834355 797623
8476 797623 898252 718776 774211 916657 834256 763943 884111 827032 966146 990899 607275
8465 607275 755547 834626 851804 884128 834092 719205 800013 596383 504439 783837 767182
8454 767182 765608 612135 399661 521869 713159 614062 467815 490723 390675 533509
8444E33509J5361m0180J05073k1862o3502q265j0229J45299J49148k17018j33175
8433D54159l3079P2314P5171j34798j22989P2507J27666l7097J3332k6909m2203
8422D18074R3847o1497k3362J26097J2831p8287P7100j17236o0817K7427l5834
8411C78343k8580k093L3072L6153o9748J035J49469Q5833k66671m8849l527N0406
8399C14843J65840M413r5001j06930m0099J58356J35674j68848j0724L7432q2337
8388C12619j6767N9897J9858q9764n0482l2722J71588J31149k23484M1408l722
8377C19578P008Q4861O9080j52404l6929Q9183J14893q33j24344j9460J42708
8366D93341j21163j64089N8323J00290j01510N3958m078Q1986j46163j9977M876
$$ plain form
8444 533509 548870 508690 613763 591901 528399 520134 509905 655204 804352 587334 454159
8433 454159 421080 493394 568565 433767 310778 383285 510951 473854 487186 460277 418074
8422 418074 511921 450424 427062 553159 565990 487703 564803 447567 386750 414177 378343
8411 378343 349763 347670 380742 416895 347147 348182 497651 583484 316813 267964 264437 314843
8399 314843 480683 485096 390095 283165 243066 401422 537096 368248 357524 394956 312619
8388 312619 295852 355749 375607 285843 235361 202639 374227 505376 281892 323300 319578
8377 319578 326586 411447 480527 328123 291194 380377 495270 494437 370093 350633 493341
8366 493341 372178 208089 266412 366702 265192 319150 315072 397058 250895 230918 235794
8355B35794L7939N1262m7861O474j0672k4454O841J31887l2255r0672j9934j9087
8343B25262J2254J12428Q9945j5118l5445k04319N6534J50045n9871Q4777q2984
8332C33508j54288p1837K41331k7611p0391p6845k1215Q4111j9325j05367K3251
8321A35322j144O6175N0487J55199j45238j039O9130J7110K3731M4648j22954
8310B91427o1259m3115r537J64640n5613k78072J19501J88286k1047O267j8973
8299B82505j11635J19666j15P1580M7415l32294m8500L35878O3177o9882J89673
8288E47468l39204r9189J09942k4463K64264p3250k47760J86771J24717j97349
8278B51947N5641J21089k36572R5014P084l8069K3448j29618L7070K37570k63509
$$ plain form
8355 235794 273733 324995 277134 283608 272936 248482 255323 387210 354955 264283 244349 225262
8343 225262 237516 349944 439889 424771 389326 185007 241541 391586 331715 416492 333508
8332 333508 179220 107383 348714 321103 250712 173867 152652 236763 217438 112071 135322
8321 135322 134178 200353 250840 406039 260801 259762 328892 346002 369733 414381 291427
8310 291427 230168 187053 177516 342156 286543 8471 127972 316258 295211 301478 282505
8299 282505 170870 290536 290421 362001 409416 77122 28622 364500 427677 357795 547468
8288 547468 208264 109075 219017 194554 458818 385568 137808 324579 449296 251947
8278 251947 307588 428677 192105 287119 294203 256134 279582 149964 187034 424604 161095
8267A61095k0136J59000o2272Q3460n6835n0822J02813j04082m3123R9790J80519
8256D49407j72686P8970n6278J7290J9457j18184J0407M2104j42126L9929J84487
8245C52777j18354L8340j13196p2586O1830j7111P0028K05824k06039k15703N1547
8234C7357K4110J48440J41985j55474l5299Q4786q719R3166P7006k40557q1864
8223H4937O1958j421K37447n6967j73211J34442o0380j01826M8848J00427j42024
8212A32230J9263K7695r190P1592j46635K7633K56140j13717k33582K16752r3835
8201A54346p7321K11868j31533l8194j26847n8435Q2765K50133m49887J174840
8191I91735L57950q13285R3004j32246n4342k16329n0355j11144J69541K8917
$$ plain form
8267 161095 140959 299959 237687 321147 264312 213490 316303 212221 169098 268888 449407
8256 449407 276721 355691 299413 316703 336160 217976 228383 270487 128361 168290 352777
8245 352777 234423 272763 159567 86981 148811 131700 201728 407552 201513 -14190 37357
8234 37357 61467 209907 351892 196418 161119 245905 237186 330352 407358 166801 84937
8223 84937 146895 145474 382921 325954 152743 287185 226805 124979 173827 274254 132230
8212 132230 151493 179188 169998 241590 94955 122588 378728 265011 31429 248181 154346
8201 154346 77025 288893 157360 119166 -7681 -66116 16649 266782 -183105 991735
8191 991735 1349685 536400 629404 497158 442816 226487 176132 64988 234529 263446
8181B63446n9696l2431Q0223n3396O1678N351O5888j32979j50902M7418M8086
8170A42686j01668J38014K0696K4477o9450J2634n834K4288O5763M930j8704o5802
8158A72030q4651m5217J12779N4057O819o2913p3018l1826J34687K8187M7920
8147B58854k5757k2394j30106J09964J3355j2780N3884l179j024l7704j0904J02549
8135B94758n6600j25350j53837J12221J25096j9182j12920J4784j662O4814j1661
8124A30461J19359n0242n2352j9093O5505J39920j94859J18120K1752l6260J2768
8113B55079N4795O3616o5999o5104O7831J11862k13343j03356J21570M1648o7999
8102B00600l6683j26708n6260Q0394p4353K05754m6996j94185M7669J03993P8200
$$ plain form
8181 263446 203750 171319 251542 198146 259824 265175 331063 198084 47182 94600 142686
8170 142686 41018 179032 199728 224205 154755 167389 161555 185843 251606 256536 237832 172030
8158 172030 87379 42162 154941 208998 215817 152904 79886 48060 182747 210934 258854
8147 258854 233097 210703 80597 190561 203916 191136 245020 241841 240817 203113 192209 294758
8135 294758 238158 112808 -41029 71192 196288 177106 64186 78970 77308 142122 130461
8124 130461 249820 199578 147226 128133 193638 333558 138699 256819 278571 242311 255079
8113 255079 309874 373490 307491 242387 310218 422080 208737 105381 226951 268599 200600
8102 200600 163917 37209 -19051 61343 -13010 192744 145748 -48437 -768 103225 181425
8091A81425P5862k6814k1109M2817o7073l0968K75371j00743j24117K6932K8171
8080B59754k9783M8132j54979J4807j6735n6001K07934n6187j71179J27556n6633
8069A16686m4335l9934M5535P8936P2681j95244K7350Q2696O86M0680j1971N390
8057A79156J11280n5200j31684J08505M0001q918N4567j34993j00215N4419P4280
8046A91198J7585j05024j37885o3323J56547p7680J09833k3249J20350j06249
8036H2103n9934P9747K00667j12621j53897N6432O2597J32827l6585p2012m0022
8025A39302N2606M9319m420J47008j85015K6341k4824k7547P9622l0183M9413
8014B71622r5336j39312O7156J20032J1569k06936K2958P5553l3339l5005J6278
$$ plain form
8091 181425 257287 230473 209364 252181 185108 154140 429511 328768 204651 231583 259754
8080 259754 229971 278103 123124 137931 121196 65195 273129 216942 45763 173319 116686
8069 116686 72351 32417 77952 156888 229569 34325 61675 144371 145057 185737 173766 179156
8057 179156 290436 235236 103552 212057 252058 243140 297707 162714 62499 116918 191198
8046 191198 208783 103759 -34126 -97449 59098 -18582 91251 68002 188352 82103
8036 82103 22169 101916 302583 189962 36065 92497 155094 287921 251336 179324 139302
8025 139302 191908 241227 236807 383815 198800 225141 200317 172770 252392 222209 271622
8014 271622 176286 36974 104130 224162 235731 28795 51753 127306 93967 58962 75240
8003G5240j2815K16059k7676j41440O9269p5743Q7955K6374J43211k16900p551
7992A35983j8669o3343J74842n6662K5107Q2223j23008k05951K89466P3338j66701
7981A46625L2848k05621N2781L4077N7196j24933J12849K3032q178J76089j79997
7970A16768R9917l1961L3128N2292K1515p3199R6186m3468j54701M3878L3673
7959A94028Q609n7057q3635l7327O874J7773j16949J94960K195k5202R9793j40796
7947F3266l6537J61446J56464j19272p5672O1100M9334o9146n4155j7520J27129
7936B46437k7202j03355K0204K8189Q6122P9536j97517j09871n4543J34847L50
7925A03197P4362p9564O1781K9738K3292p6556P373J14990K6753k9517p0765r598
$$ plain form
8003 75240 62425 278484 250808 109368 178637 102894 190849 217223 360434 143534 135983
7992 135983 117314 53971 228813 172151 197258 279481 156473 -49478 239988 313326 146625
7981 146625 179473 -26148 26633 60710 117906 -7027 105822 128854 120676 296765 116768
7970 116768 216685 184724 217852 270144 291659 218460 314646 271178 116477 160355 194028
7959 194028 202637 145580 61945 24618 31492 49265 -67684 127276 129471 104269 204062 63266
7947 63266 26729 188175 344639 225367 149695 210795 260129 190983 136828 119308 246437
7936 246437 219235 115880 136084 164273 250395 329931 132414 22543 -32000 102847 103197
7925 103197 177559 97995 159776 189514 212806 136250 143623 258613 285366 255849 185084 175486
7913A75486R2156o7440L4687L9245n555o2433K1230k38613J59062M9597j31525
7902F5897L7896K3250N1645K0006J8478k06406J03369J67438M1703m5764j11632
7891A65880p7610Q7678Q4878q3449N4798j00285m9287m1215j0311K25717k8548
7880B28246J8931j47606K5094N2150L8499m5387r524O1497l4812l6505j2628q7773
7868E0182J27613K5366p3399k1386J3292o6010K21170j24861O3241M0517j70837
7857H4888j3232M9320p4239J13794M4406r7485l9141j4877M211J72008p6229N7721
7845B11145J29245n433j69402J03717j72523O9277R6932k06946J94131R6861k05049
7834A41955m9929O4762o2008Q9367M6838j60632N907l3344m0214K77820p6038
$$ plain form
7913 175486 267642 200202 234889 274134 268579 206146 227376 -11237 147825 197422 65897
7902 65897 103793 127043 178688 198694 217172 10766 114135 281573 323276 277512 165880
7891 165880 88270 175948 260826 177377 232175 131890 82603 41388 31077 256794 228246
7880 228246 247177 99571 124665 176815 215314 169927 160403 221900 187088 150583 137955 50182
7868 50182 177795 203161 129762 108376 121668 55658 276828 151967 215208 255725 84888
7857 84888 71656 120976 46737 160531 204937 107452 68311 53434 57645 229653 153424 211145
7845 211145 340390 334957 165555 269272 96749 166026 262958 56012 250143 347004 141955
7834 141955 92026 156788 94780 184147 230985 70353 76260 42916 2702 280522 204484
7823B04484k13459K5435P4590q6729J94164l9712j5953l9414k4405j1610K6150
7812I3541k2865P1466K30295m086j46917L9914r4895O2376j1040R3413j3718p4980
7800B22504k26839J36602J16853J00410j17241j54877k502O7397J53354j9314
7790B76347j09171o3630n0868J06647k0548j08374j28454J65920L9362J32618
7780B39849K8181j9811j5673n8500m140P2523O2356j35921M7550k1367J91945
7769C86992k9054n1182o6301Q0458M9618n9056l3762j18452K2808J38434n635
7758C14868j8132k22792J745N9150P1113R3391m2645j02973K2700j02781J55896
7747B29540J85665j35994K1190l5914r6617J03600k5457n561J33830o7029n5115
$$ plain form
7823 204484 -8975 16460 91050 4321 198485 158773 142820 103406 79001 67391 93541
7812 93541 70676 142142 372437 368351 221434 261348 166453 228829 217789 311202 297484 222504
7800 222504 -4335 132267 249120 349530 232289 77412 74910 142307 295661 276347
7790 276347 167176 103546 52678 159325 138777 30403 -98051 67869 107231 239849
7780 239849 268030 248219 232546 174046 169906 242429 304785 168864 216414 195047 386992
7769 386992 357938 306756 240455 320913 370531 311475 277713 159261 182069 320503 314868
7758 314868 296736 73944 75689 134839 205952 299343 256698 153725 176425 73644 229540
7747 229540 415205 279211 300401 264487 167870 271470 246013 240452 374282 307253 252138
7736B52138J44092m1259N1299J10757O5045r1398o3990l4663Q914J06503j01863
7725D05575k4613J66931j88386l4515N1371J5188p8440P0644k4231o3616j6289
7714B79619p3101J10519L9260j23605r8924L1849L7295K24693P173n8386Q4632
7703D61024K5360Q7930M1618J2128m4795J4805q8085j28831J23299r6868j93735
7692B13850p934K521O9560n6456j04128k2646l8275J31857J15178m9766o9963
7681A83798m5002Q3390o1282L97R4606L3531l6986o2660K05768r0719q0355R4159
7669C18645O1493K2679o479j28001n9532P968q0167Q5322L9537k67951j36296
7658a42782J48726J58932P8772j20930j55206J61065O207j9399J77739k6053j61522
$$ plain form
7736 252138 396230 354971 406270 517027 582072 490674 426684 392021 400935 507438 405575
7725 405575 380962 547893 359507 324992 376363 391551 313111 383755 359524 295908 279619
7714 279619 206518 317037 356297 232692 133768 165617 202912 427605 434778 376392 461024
7703 461024 486384 574314 615932 628060 583265 598070 509985 381154 504453 407585 213850
7692 213850 205916 208437 277997 221541 117413 94767 56492 188349 303527 253761 183798
7681 183798 138796 222186 160904 161301 255907 289438 252452 189792 395560 304841 224486 318645
7669 318645 380138 402817 396338 268337 208805 216773 136606 221928 261465 -6486 -142782
7658 -142782 5944 164876 243648 122718 -32488 128577 134784 115385 293124 267071 105549
7647A05549O231K9803J48705N293o1244m0372n340q2272J10550J1814j00727q8781
7635C9209N0581J21217j4615j92448J15898J97580r0303p1185L6722n5059K4711
7624A62308r5859J26654O331q8394K6350J93196o3515m3078Q781p0458J1532O7744
7612B41592j0309l0619r1049k33484J63349M2941l4522J62831j87734j11697J87852
7601I9151n7491J41550R4262j22793o6222J38308p4202j8990J40402P1556j04844
7590B40687p671j04703N8921m4875n5980N7208m5278Q922J62288q0197p4825j5694
7578I8803J25301l9297n2250n0942O1760j12677n1596M4437Q9711j41496J0685
7567a7561P1010L98o408l9776J8723O8168n0250J72504L9400j84055k9111K0117
$$ plain form
7647 105549 111780 141583 290288 295581 234337 193965 188625 106353 216903 228717 127990 39209
7635 39209 89790 211007 196392 3944 119842 317422 227119 155934 192656 137597 162308
7624 162308 66449 193103 199434 111040 137390 330586 267071 223993 232774 162316 173848 241592
7612 241592 231283 200664 109615 -123869 39480 82421 47899 210730 22996 -88701 99151
7601 99151 41660 183210 277472 154679 88457 226765 152563 133573 273975 345531 240687
7590 240687 233016 128313 187234 142359 86379 143587 98309 107231 269519 189322 114497 98803
7578 98803 224104 184807 132557 81615 143375 30698 -20898 23539 113250 -28246 -17561
7567 -17561 53449 53847 47439 7663 26386 94554 44304 216808 256208 72153 43042 63159
7555F3159K04380N3424j77234j00570J24874P90p110N5120k2154r3785L319K3561
7543A27774O3479J02769j04212r5234K7317p7299J12877M293k1772p9879P948
7532F8061O1353j8719j2468m3983Q1611J23810j11118l6974P3175Q280j42358
7521E0670M6418K4730m5915o7725j08653M7309J59913j30031J4986M1988m9211
7510a5521P3163J45242R979n0391n5327l7463J49770M1644j76790R7585M7799
7499B29690j25842R0514q436k6921M7186j78120L1600J70162j03355r5568O469
7488C7379o755L5140J53110q8879o6717K6713j16659K8469N6434j08651Q7658
7477C7242J56933l1487q847N8816j92035J21307P5758N9508K954k15170j08616
$$ plain form
7555 63159 267539 320963 143729 43159 168033 168823 161713 216833 194679 100894 104213 127774
7543 127774 191253 294022 189810 94576 121893 44594 157471 161764 139992 60113 68061
7532 68061 129414 110695 98227 54244 135855 259665 148547 111573 184748 193028 50670
7521 50670 97088 121818 75903 8178 -100475 -53166 106747 -23284 -8298 33690 -15521
7510 -15521 57642 202884 212863 162472 107145 69682 219452 261096 84306 181891 229690
7499 229690 103848 194362 185926 159005 206191 28071 59671 229833 126478 30910 37379
7488 37379 30624 65764 218874 129995 63278 89991 -26668 1801 58235 -50416 37242
7477 37242 194175 162688 153841 212657 20622 141929 217687 277195 280149 64979 -43637
7466d3637J17107P1051j2877J29697j4540j71908J0726j8133J67988J28706j57448
7455B06732O479o3682j3467J05623p8679m9849K570k6419L4408r3938J27731o7923
7443H9586m1361p3939R4047J0215j08094J12644p339r1415J10695J426J69623
7432B66088q5569k20291N1208J68785j00822P5049P9903l9429n203n2178l4186
7421A03355J34796p5204r7913J05406j34038p3228R9535n1501L8343O9235j19147
7410c61m664J5709j00469K48551K60482k47594m9996J0660J35150J54855J227
7399D23550j82110l1351k29179o9294K40947L7516k29381q9988P1054J44937k1949
7388F4752m6427K0487r37l9367J19152J02876l903j85726R4604J90780r8153j35870
$$ plain form
7466 -43637 73470 144521 131644 261341 246801 74893 85619 67486 235474 364180 206732
7455 206732 213211 149529 136062 241685 163006 113157 115727 89308 123716 29778 157509 89586
7443 89586 48225 -25714 68333 78548 -29546 83098 75759 -15656 95039 96465 266088
7432 266088 180519 -39772 11436 180221 79399 154448 234351 194922 189719 137541 103355
7421 103355 238151 162947 65034 170440 36402 -36826 62709 11208 49551 118786 -361
7410 -361 -5025 10684 -89785 158766 419248 171654 121658 132318 267468 422323 423550
7399 423550 241440 210089 -19090 -88384 152563 190079 -39302 -129290 -58236 86701 64752
7388 64752 18325 38812 37875 -1492 117660 220536 216633 30907 125511 316291 218138 82268
7376H2268J31607O9415k0979p3056N2116K4928n2831p2960J56268j21708j13874
7365F1194l1347P7910K7648j817j59055p8881M471k1800J80951P4484r4339j56834
7353a17415R3293R0239J13163N6535k8369R1189j03442o8466K09373n5034p0028
7342B11038l3574k6151n3523K1768r7853O0652Q7255n7797j16886P9662L4410
7331A09001M6645m625j44891O2513M0449m4249Q8511j08780J6827k5505K4632
7320F0528O8245J8239l7121l585M9278J1607N7137Q0216R958j49325r3558J0473
7308H2092J02510n5787j1707J15513m8008q0084j19026O9868L7719N2337L0251
7297A75678q2651o8200O1152N3180J08266K183j53012N7621k7318p3885J54010
$$ plain form
7376 82268 213875 283290 262311 189255 241371 266299 213468 140508 296776 175068 61194
7365 61194 29847 107757 135405 133588 -25467 -104348 -99877 -121677 59274 133758 39419 -117415
7353 -117415 -24122 66117 179280 235815 207446 298635 195193 126727 336100 281066 211038
7342 211038 177464 151313 97790 119558 21705 82357 169612 111815 -5071 74591 109001
7331 109001 155646 151021 6130 68643 109092 64843 153354 44574 61401 35896 60528
7320 60528 128773 147012 109891 106306 155584 167191 224328 304544 314502 165177 71619 82092
7308 82092 184602 128815 117108 232621 184613 104529 -14497 55371 93090 145427 175678
7297 175678 93027 24827 85979 139159 247425 249608 96596 154217 126899 53014 207024
7286B07024N0659P7551j05476j27937K00288J13077j75871j70086N7026N0713
7276A76968O7125J8635q1669m8854k0829O9707J0832j82240r2312J21833l5466
7265C730K9845k008J0824M2906q1347Q1803N641J29670q2541j10115R7590N2045
7253A78043M0581p7410M1564P148Q4232J64349q3798j15945j05049J4206J11068
7242B58989k5598k04448l6933J2892k5230O1086j7020q8037p8925K334L2463J97127
7230H8700o6761j8419R3162K7166O2736k351P8885j7922M4028k7131L4025j5107
7218B81011o2640o5671j6540J25603p1694j93722Q3309r2462R3793j319M371l0428
7206E3611P7041j17531K868J27880j51539J12363J23133j78309J59435K9509j65720
$$ plain form
7286 207024 257683 335234 229758 101821 302109 415186 239315 69229 126255 176968
7276 176968 244093 262728 181059 132205 111376 181083 191915 9675 -82637 39196 3730
7265 3730 33575 31567 42391 85297 3950 85753 91394 221064 138523 28408 125998 178043
7253 178043 218624 141214 182778 189926 274158 438507 354709 238764 133715 147921 258989
7242 258989 233391 28943 -7990 4902 -20328 40758 23738 -64299 -143224 -140890 -108427 88700
7230 88700 21939 3520 96682 123848 186584 184233 263118 245196 289224 262093 296118 281011
7218 281011 218371 152700 136160 261763 190069 -3653 79656 -12806 80987 79668 84039 53611
7206 53611 130652 13121 15989 143869 -7670 104693 227826 49517 208952 238461 72741
7195G2741J79967q290j30152K45222j26741j45621J33775K5843q8631l4664j15018
7184H431L7482J83289k43205m5463J54034l2312P6916p7118j65372J72264P3526
7173A42472J7414P4523j5977q7639J41720j02749m4971J10987J6621j04943M3487
7162A90945q2123R5451p944j42264l7336J47261l5966l4622j11886J0290R8932
7151I0738O9030k9144j73162j72612J90009J54206J07117p5983j30896N4201J56829
7140B40333o0749M634J30006j19529k2322N1115L8228N0129j34355j13849J58806
7129B22447L6662j29537J0295j42206n6438J26796M7143m3468j70035J02979J12911
7118A17549l833k3748K3523N485N701k3654m0802J1664R6267j26616J76296O7557
$$ plain form
7195 72741 252708 244418 114266 359488 232747 87126 220901 246744 158113 123449 8431
7184 8431 45913 229202 -14003 -59466 94568 62256 139172 62054 -103318 68946 142472
7173 142472 159886 234409 218432 130793 272513 169764 124793 235780 252401 147458 190945
7162 190945 108822 204273 196329 54065 16729 163990 128024 93402 -18484 -8194 90738
7151 90738 159768 130624 -42538 -215150 -25141 129065 236182 160199 29303 83504 240333
7140 240333 179584 184218 314224 194695 172373 223488 261716 311845 177490 63641 222447
7129 222447 259109 129572 139867 -2339 -58777 68019 115162 71694 -98341 4638 117549
7118 117549 113716 89968 113491 118976 124677 101023 60221 71885 168152 41536 217832 285389
7106B85389n0061j44284k0886P7239K8822O2903M7053k62796l4959O4518J29037
7095A81975J6634o9455m3045n3955M6987p7828l0999J16798o5172N2740L9137
7084A13817m1999N5459N3428l2783L8689l8767l6951K7425J3209o1257l5139J15430
7072A70561k4790L3807l5265k2146N2305k5253p8216M4272o4307j28836Q9048
7061A1180R5872k8518l2741j64321k597J17981P0560j03077J62058p9944r5931
7050d9478K11732M7246O163J786j61241J60145J49546j25503l1539J17575j28214
7039A98218M3536R8788j75977q8962P2792j47508N2767Q9682k17202J62736k3274
7028F5596j63566J24877N6213j22992m8694R1953J15282J38216j21510j38716
$$ plain form
7106 285389 235328 91044 70158 147397 176219 239122 286175 23379 -11580 52938 181975
7095 181975 198609 129154 86109 32154 79141 1313 -29686 87112 21940 74680 113817
7084 113817 71818 127277 180705 147922 186611 147844 110893 138318 151527 90270 55131 170561
7072 170561 145771 179578 144313 122167 174472 149219 71003 115275 50968 -77868 11180
7061 11180 107052 78534 45793 -118528 -121125 -3144 67416 -35661 126397 46453 -49478
7050 -49478 162254 209500 215663 217449 56208 216353 365899 240396 208857 326432 198218
7039 198218 241754 340542 164565 75603 148395 887 53654 143336 -73866 88870 65596
7028 65596 -97970 26907 83120 -39872 -88566 3387 118669 256885 135375 -3341
7018c341K44357n2389P8290N8744r3276k4492K663m1405J04902p7100j55932n0868
7006i847j4478Q7884N1735p2493l5106r2623J7544O6950Q6490j18967P1630N738
6994D4457J65201P1979j33769R7330L1302n3852n2642O6183j00094J2125o2636
6983H5584j6801R2350K557j11356j97o3299k5515J34839l5164m3674P0125p5473
6971A3976K4591n970l3507J900J50281O9571N5656n2403N1484p9745j25672K7212
6959I7374J81796P4020j72867j15772J35070j06734k72j7517n0659r1820Q8688
6948B1307L7610K6503O6510n5030o5232J04422m3265M4955J50604k03030P467
6937I2821J49026L9993j8171j09438j46033J24826R0424q3915N7650M7062j91457
$$ plain form
7018 -3341 241016 188627 266917 325661 232385 207893 210556 169151 274053 196953 41021 -9847
7006 -9847 -24325 63559 115294 42801 7695 -84928 -67384 -434 86056 -32911 38719 44457
6994 44457 209658 281637 147868 245198 276500 222648 170006 236189 136095 148220 85584
6983 85584 68783 161133 163690 52334 52137 -11162 -36677 98162 62998 19324 89449 13976
6971 13976 38567 32597 -910 990 151271 220842 276498 224095 275579 195834 70162 97374
6959 97374 279170 353190 180323 64551 199621 92887 92615 75098 24439 -67381 21307
6948 21307 58917 85420 151930 96900 31668 136090 92825 137780 288384 85354 92821
6937 92821 241847 281840 263669 154231 8198 133024 223448 139533 197183 244245 52788
6926E2788O0910J02219l7859K9790m069o6339J06670j08103m9287L2853k2175
6915I7398j1063j6616M6508Q4888o6360K5812k1821O5743j31899M3299m7060O8253
6903A37082J7873l9082M3982l4252J4819J3640O2831J6918J4598o1744m7351R3148
6891B32462j10707J7657k927k3055n9659J19101N8307q1632o1196j98805O0067
6880e0387J08020p150K2486K9468j57007O0523O1417l2765J04148K8496k2740
6869A44509o857N4770m7719J01820P8920k20501J16772M4980l4557m7176j12377
6858G2584l1906K4538m9246j32966M3748k5569M1859P5622m7093j2622J25289
6847H4238j8084k5343J30649p0529R1482P3890r9212P0469R4652m5993n0577q757
$$ plain form
6926 52788 113698 215917 178058 207848 203779 137440 244110 136007 86720 119573 97398
6915 97398 86335 69719 116227 201115 134755 160567 138746 204489 72590 115889 68829 137082
6903 137082 154955 115873 159855 125603 140422 154062 216893 233811 248409 186665 139314 232462
6891 232462 121755 139412 136485 113430 53771 172872 231179 149547 88351 -110454 -50387
6880 -50387 57633 50483 72969 102437 -54570 5953 67370 34605 138753 167249 144509
6869 144509 137652 192422 144703 246523 325443 104942 221714 266694 232137 184961 72584
6858 72584 40678 65216 15970 -116996 -73248 -98817 -56958 18664 -28429 -41051 84238
6847 84238 66154 40811 171460 100931 192413 266303 167091 237560 332212 286219 235642 226885
6835B26885q7984J38083p907k56192k4454k2039P9541Q58l2984m6864L2150j8918
6823a9825N7068J32240k8041p3881j6774L4913P1399J30973L8828o1416m1504
6812B23980q1257K22773P1257j18417j58647J3779k9924M8369n1102n9813J13161
6801A94159r5068p8262J8005J34758j06020m0600O8322J7702J08188j43003l9419
6790C8762J30159n695R594J26271j9903j37031L3266N7546q0857p2382j10108
6779c0378R9176J09254j37335J9500J41117k22388L3625K247J38397L2931j95733
6768i587o6069J29174J79231p3502K7533j13341j61707J65297J63899m0990p8547
6757A21391n7238L2983M7313L9529M0156K4665n1697r9842o8091J22109o7080
$$ plain form
6835 226885 138901 276984 269077 12885 -11569 -33608 45933 46791 13807 -33057 -907 -19825
6823 -19825 37243 169483 141442 67561 50787 85700 157099 288072 326900 265484 223980
6812 223980 142723 365496 436753 318336 159689 173468 143544 191913 140811 80998 194159
6801 194159 99091 20829 38834 173592 67572 26972 95294 112996 221184 78181 38762
6790 38762 168921 163226 172820 299091 279188 142157 175423 232969 152112 79730 -30378
6779 -30378 68798 178052 40717 60217 201334 -21054 12571 14818 153215 186146 -9587
6768 -9587 -75656 53518 232749 159247 186780 73439 -88268 77029 240928 199938 121391
6757 121391 64153 97136 144449 183978 224134 248799 197102 97260 29169 151278 84198
6746H4198K5754l6584Q5630j995N460j2036q3001k516Q9742M0680J3234r5851
6734A12715N5175K4349p6424j28182J87012m6241J08839k9325j29661M9922O9517
6723A97696j90485L6990J18279r8506J39256j17220j53682J84222R2271M0702
6713B49523m7130j65814p4995J58995J11256m349n286j32371j20973M8889J07937
6702A25682q716P7514j21957o4101O3562O1090R5360j43207j28639M2808J13610
6691A13006J81022j42192j3076l3418k6205O4352L9518j82134J18384p857l715
6680A07685M3782N821j13990P7277k2371l2897R5684P9534r1142R4930p3005J8380
6668A89688M62o2985l2730R5794J15669J13775o4237k01019J9364J62632q3469
$$ plain form
6746 84198 109952 73368 158998 157003 162463 150427 67426 64910 154652 195332 208566 112715
6734 112715 167890 192239 115815 -12367 174645 128404 237243 207918 78257 128179 197696
6723 197696 7211 44201 162480 63974 203230 86010 -67672 116550 208821 249523
6713 249523 202393 36579 -38416 120579 231835 227486 222200 89829 -31144 17745 125682
6702 125682 116966 194480 72523 8422 71984 133074 228434 85227 -43412 -604 113006
6691 113006 294028 151836 138760 105342 79137 143489 183007 873 119257 111400 107685
6680 107685 151467 157288 43298 120575 98204 65307 160991 240525 149383 244313 171308 189688
6668 189688 190150 127165 94435 190229 305898 419673 355436 154417 173781 336413 252944
6657B52944m7702L5396k83272Q7041P7833j5499J28849r3289j60651p908q963
6646c5221J23513J27485j35662j12443J7163J7952J70314N735j45105J0212Q7806
6635A31749N5502Q3285l8716p7228j2061Q684o0904Q2786o8265j0923L0025l165
6623A20769l0449Q8357j88353M7061N3122J35089m4142J5755p6148L361J9660
6612A44082J8652l0311K7957J8888K085N836O069j24523m211M3030K1389J00002
6600B28945L8232j09648j97423K4344J22730J60541o0344o0175j45718J1187K8342
6589D1013R2822L0744o8764n0739M5835J4969J17518m6070m262J1796k0864q4053
6577G9945J39846p5856m7404K8924J378N261m4504r3744O4710Q9458R02N1368
$$ plain form
6657 252944 205242 240638 -42634 44407 122240 106741 235590 142301 -18350 -26258 -35221
6646 -35221 88292 215777 80115 -32328 -15165 2787 173101 178836 33731 43943 131749
6635 131749 187251 270536 231820 154592 142531 151215 90311 173097 104832 93909 123934 120769
6623 120769 90320 178677 -9676 37385 90507 225596 181454 197209 121061 124422 144082
6612 144082 162734 132423 160380 179268 181353 187189 193258 68735 64524 107554 128943 228945
6600 228945 267177 157529 -39894 -15550 107180 267721 207377 147202 1484 12671 41013
6589 41013 133835 164579 95815 45076 90911 105880 223398 177328 173066 184862 163998 79945
6577 79945 219791 143935 96531 125455 126833 132094 87590 -6154 58556 148014 148916 200284
6565B00284m2652j74031K7493J68830l8260k3017J553p1367M3289O9997Q64K8461
6553A91444k9163j51496J0135J16234j01754Q3104j17518k7960J52585J7689k3780
6542A19520n8401q7041m8003J36023J81370j30117j3210j32498r602K21489J28912
6531C08442n1103j6145j19407j8960J47827K9010j34538m9332j0020j16950J95503
6520A64327J2769m7060L4836j13799k0744N5757l1731j33490J06309N9336K3675
6509A10185J62908q1806j00862P9591N8797O4129M0044j34519m4137j02346K9441
6498H1425J56206l3124o4773m3773k6748Q8872J515l4026j32840R4705J5035l168
6486I9306r8251P2024q2889P2026M3867J31780k4061q0937k1017Q868K14504O3997
$$ plain form
6565 200284 157632 -16399 11094 179924 141664 118647 120200 48833 92122 162119 162983 191444
6553 191444 162281 10785 20920 137154 35400 118504 986 -26974 125611 143300 119520
6542 119520 61119 -25922 -73925 62098 243468 113351 100141 -32357 -41959 179530 308442
6531 308442 257339 241194 121787 102827 250654 279664 145126 95794 85774 -31176 164327
6520 164327 177096 130036 164872 51073 30329 86086 54355 -79135 27174 86510 110185
6509 110185 273093 191287 90425 170016 228813 292942 332986 198467 154330 51984 81425
6498 81425 237631 204507 139734 95961 69213 158085 159600 125574 -7266 87439 102474 99306
6486 99306 1055 73079 -9810 62216 106083 237863 213802 132865 111848 120716 335220 399217
6474C99217r2593n4357j89862J2401J31737J2200k0773m0663o6629j8448M9705
6463A21935m7419J37170N8482j02855j7485O2926j37797O046K6861R2006j5619
6452A84251q6096k3759q2386J2779J22970O0981l157r4297L9129n3826P9331K8110
6440A84030P118P7600k6619k01318N1944O9241j1073L6424j33833L4350J86190
6429B74054r8810j5553m5532M3383m5245J23162p1610M0102m9628m1618R5665
6418B08370k13k8059L2084m4243j40882P7753J15744N6086j01577j36299J4716
6407E3480J35361R5131l1252q176o0163k7995J590l5152M1544j05868J56286K4946
6395B39732p3757j11643n2952J9859J25493J15651j12837L5726j05529M922J69893
$$ plain form
6474 399217 306624 252267 62405 74806 206543 218743 197970 157307 90678 72230 121935
6463 121935 74516 211686 270168 167313 149828 212754 74957 81003 107864 199870 184251
6452 184251 98155 74396 -7990 4789 127759 188740 185583 91286 130415 76589 155920 184030
6440 184030 191148 268748 242129 40811 92755 161996 150923 187347 53514 87864 274054
6429 274054 175244 159691 114159 157542 112297 235459 163849 203951 154323 112705 208370
6418 208370 208157 180098 212182 167939 27057 104810 220554 276640 175063 38764 53480
6407 53480 188841 283972 252720 244544 184381 156386 157976 122824 164368 58500 214786 239732
6395 239732 165975 54332 1380 21239 146732 262383 149546 185272 79743 84665 254558
6384B54558N9635N4551j36691o4841k2112J63042p894J6848J5280j07912l0597
6373A93867N3527j11600J1396j7302q4437K43735l1405k16776K4798l7288o6699
6362c8184M8833J34196l7330J2723o2393m829L09181o4454k1782q5730m7543O6264
6350B08952R2943j5490P4887n4553j40838N6656m2782o1348L2217J14306J887
6339B66837o7106R5268l4193r4836r077J12605P0927P58j04630k4360P9069K1784
6327C13046Q0000l5404n6137j45531n6171L9108O5630P9731l3668j10581N549
6316A45572m1196Q6611K8840m8074j30227P0815o2513P2772L4775Q203l859K30928
6304C92647P806p3078m6930p1321J30419N7290P620k084j00303j56450J4529K26027
$$ plain form
6384 254558 314193 368744 232053 167212 145100 308142 300248 317096 332376 224464 193867
6373 193867 247394 135794 147190 129888 45451 289186 257781 41005 65803 28515 -38184
6362 -38184 10649 144845 107515 120238 57845 53016 362197 297743 275961 190231 142688 208952
6350 208952 301895 286405 361292 306739 165901 222557 179775 118427 150644 264950 266837
6339 266837 199731 294999 260806 165970 156893 269498 340425 341183 236553 212193 291262 313046
6327 313046 393046 357642 301505 155974 99803 138911 204541 284272 250604 140023 145572
6316 145572 104376 190987 219827 171753 41526 112341 49828 122600 157375 165578 161719 392647
6304 392647 400453 327375 280445 209124 339543 396833 404453 402369 302066 145616 160145 386172
6292C86172k2448k5466r4734o0157L3590M2803L8207q7836j47783M2071J68457
6281B72876m7626j50557l5135J28795J31439n9694L5039p1032o5552R595P7732
6270B25880J07563j14786j80041m3183J78454p4497J00560L606j44219k1196P5306
6259A13447J23966M6748j55071o4205J50848J64608j12737r3959K8043R7721p2036
6248B27373J11914q4883j7616j95779J15325J12753j13366N7642L1045j49504
6238I4904r0405L5175K09415n2973j71049n6473K39533m4862R4289K4825p5962
6227B06417l4572L6024K5272K0740Q2089j21893J8765O564l0605J04983o0066
6216B53718n7396N0469r9584J90290Q0806k25971n5238O5080p449J53678M331
$$ plain form
6292 386172 363724 338258 243524 183367 216957 259760 297967 210131 62348 104419 272876
6281 272876 225250 74693 39558 168353 299792 240098 275137 204105 138553 148148 225880
6270 225880 333443 218657 38616 -4567 173887 99390 199950 203556 59337 38141 113447
6259 113447 237413 284161 129090 64885 215733 380341 267604 173645 201688 299409 227373
6248 227373 339287 254404 236788 41009 156334 269087 155721 213363 244408 94904
6238 94904 4499 39674 249089 196116 25067 -31406 208127 163265 257554 282379 206417
6227 206417 171845 207869 233141 253881 335970 214077 232842 239406 208801 313784 253718
6216 253718 196322 246791 147207 337497 418303 192332 137094 202174 194725 348403 352734
6205C52734r9503n3812K70312n166l465q3875p8161N8521j10276n902J51797j50486
6193B42718j13714r9052R5877N3017L571j67876l9450K9008K0846P0617j48888
6182e3326j90281K4225L22273J00181o1175j52464O3122O8263P690P3766J02837
6171C05111o5781j75221P7732J42333Q2697n0209n6624L4477k2877L1622m6532
6160B56728L386j70239j4630J53536K5046j47154j40985Q5648Q0692M1616m0414
6149A33230N0999K9047O400L7387M7257L5368j26646K864R1429o4305m6279J21822
6137C18573Q9390j10325m8196J3317J28715j01542j92726J11348J46427j6250
6127C38731j14930j0028O779K5681O5056n1699J34711j28379j63042o3303J28226
$$ plain form
6205 352734 253231 199419 469731 464565 461100 377225 299064 357585 247309 241407 393204 242718
6193 242718 129004 29952 125829 178846 182417 14541 -24909 4099 24945 95562 -53326
6182 -53326 -243607 -219382 102891 203072 141897 -10567 52555 120818 128508 202274 305111
6171 305111 239330 64109 141841 284174 366871 316662 260038 294515 271638 303260 256728
6160 256728 260114 89875 75245 228781 253827 106673 -34312 51336 132028 173644 133230
6149 133230 184229 213276 219676 257063 304320 339688 213042 215906 307335 243030 196751 318573
6137 318573 407963 297638 249442 262759 391474 289932 97206 208554 354981 338731
6127 338731 223801 213773 220552 246233 311289 259590 394301 265922 102880 39577 167803
6116A67803R872N2725n3003n7021J535J14206L2327n3296l0335o272L6602O0147
6104B75290m9484J2890l1001m025p5916J9454j0390k919K0947j39961L7032L8453
6092I0370K3176j11276K5255Q5551R2287L0946q9613Q007j5944K04038J14179
6081D56976j00288j28798N561J09012n1600M2473o9783J01885n3573k2983l1344
6070B57538J30278j72877j02652J3450J8986J75314n0186j19396J20045p5488
6060A95012R6601J73101R1466l26313J04867J70742J12836m6184p3541R3771M4096
6049F36454q0218n5711K23467J02173j18229r0005k3988l8195l9011m8633j1877
6038D56227O2515m294l97M5357j05336n6827Q6852J96484k30070r0145L3626N5081
$$ plain form
6116 167803 177675 230400 177397 120376 121911 236117 268444 215148 184813 178541 215143 275290
6104 275290 225806 238696 207695 203670 127754 147208 136818 133899 154846 14885 51917 90370
6092 90370 113546 2270 27525 113076 205363 236309 146696 154703 138759 342797 456976
6081 456976 356688 227890 233451 342463 290863 333336 263553 365438 311865 288882 257538
6070 257538 387816 214939 112287 125737 144723 320037 269851 150455 270500 195012
6060 195012 291613 464714 556180 229867 334734 505476 618312 572128 498587 592358 636454
6049 636454 556236 500525 723992 826165 707936 617931 593943 555748 516737 468104 456227
6038 456227 518742 514448 514051 559408 454072 397245 484097 680581 450511 360366 393992 449073
6026D49073J51848l2506m7480K3681n3006j03852J56462J40436j31616k4761o7382
6015D60897J69289J05668O4330k1014J53247Q843L32488M33123q287J20420K76268
6004B095272K72579K62525K26874M4439o5408j11493k94753j20043j78125k55369
5994A876498k84170j07166j77749q4814j37234j37363j0232j86805O808K9643
5984G87416j19671j80390L4576J99720R641j29328q6281n6162M8457J18404m1780
5973E84602O394L8952r4063J83504P3033J38805q2035k3885j20589m6235Q4226
5962G42709P0425J50927k09137j50591J39625J30470M0963j02971j08414L2714
5952G36720O7453L402N7712o07p3031n8378M5902O4594l4400l7913j61797O616
$$ plain form
6026 449073 600921 568415 520935 544616 491610 387758 544220 684656 553040 528279 460897
6015 460897 630186 735854 800184 779170 932417 941260 1273748 1706871 1698584 1819004 2095272
6004 2095272 2367851 2630376 2857250 2901689 2836281 2724788 2430035 2309992 2131867 1876498
5994 1876498 1592328 1485162 1307413 1222599 1085365 948002 937770 750965 757773 787416
5984 787416 667745 487355 521931 721651 731292 601964 515683 459521 507978 626382 584602
5973 584602 590996 629948 535885 719389 792422 931227 849192 825307 704718 658483 742709
5962 742709 813134 964061 754924 604333 743958 874428 915391 812420 704006 736720
5952 736720 804173 807575 865287 864680 791649 733271 779173 843767 809367 771454 609657 616273
5940F16273L4885J13077R5133j13928J2510K877R6274j05401j18232n733J4600
5929F42335Q0383q8668r6628n8229J6644j2154R7898k066j03930M1085q323Q1823
5917E90170J35800l7321j12711J30522m4195K00988L01946j07295o9598j05792
5907H82514Q4534O0549J26417j59637l5058L1453n0472P0160m4554m5515j3204
5896I07187j7084q7913K99140p6179k55497J33578l7741N0628J01326p7526j09014
5885H30905O9026N08R5089l3514j94949N1474J47480O449j29317Q7212r0814P3781
5873I13330L9428o0949k4255j27409l5038N6609J41111K5621j28882l3459j05441
5862F60666j7761K07851K29626o039j52270p2109J20294R1756j609n2771k5316
$$ plain form
5940 616273 651158 764235 859368 745440 757950 760827 857101 751700 633468 627735 642335
5929 642335 722718 634050 537422 479193 495837 483683 581581 579515 475585 516670 508347 590170
5917 590170 725970 688649 575938 706460 662265 863253 1165199 1057904 988306 882514
5907 882514 967048 1027597 1154014 994377 959319 990772 940300 1010460 965906 920391 907187
5896 907187 890103 802190 1101330 1025151 769654 903232 865491 916119 1017445 939919 830905
5885 830905 899931 900439 995528 962014 767065 818539 966019 972468 843151 930363 839549 913330
5873 913330 952758 891809 867554 740145 705107 761716 902827 928448 799566 766107 660666
5862 660666 642905 850756 1080382 1074343 922073 849964 970258 1062014 1060405 1007634 982318
5851I82318L4642n8053J14748p5817R279R0777m2696L1823O5332m3143J68436
5840A277646J8435k9202J39082K07695k3548P0082P6873J55183P5118J16785j3648
5829B070501J37569N4869k2536J50203n5418M694J06486n3971o6486l374P909
5818B330446P4770P4934j09899L339R3839j44147J04210R9920J2207L9220J20968
5807B699807k31333R7648k7098O5287J69151L3370m2573Q6754j3762p74K07235
5796C043712J25753P850N9985N9939J51433J73738J02430q1365J55902L3269R5887
5785C928533k7502l6531R573P5205N2180j36669k3628j07408J00155K95842J46115
5774D275865Q5027Q1610N4191J65788L47810Q5018l4960O4112j95M2052J19513
$$ plain form
5851 982318 1016960 958907 1073655 997838 1007117 1097894 1055198 1087021 1152353 1109210 1277646
5840 1277646 1296081 1266879 1405961 1613656 1590108 1660190 1737063 1892246 1967364 2084149 2070501
5829 2070501 2208070 2262939 2240403 2390606 2335188 2339882 2446368 2392397 2325911 2322537 2330446
5818 2330446 2405216 2480150 2370251 2373590 2467429 2323282 2427492 2527412 2539619 2578839 2699807
5807 2699807 2468474 2566122 2539024 2604311 2773462 2806832 2764259 2851013 2837251 2836477 3043712
5796 3043712 3169465 3177315 3237300 3297239 3448672 3622410 3724840 3643475 3799377 3832646 3928533
5785 3928533 3901031 3864500 3874073 3949278 4001458 3864789 3841161 3733753 3833908 4129750 4275865
5774 4275865 4360892 4442502 4496693 4662481 5010291 5095309 5060349 5124461 5124266 5166318 5285831
5763E285831N4367j02965J79864N1212L49392L63452K09290K78839L66767L13716
5753G349765M43667M52242K11581L47809N32099L98569Q06378Q73406Q68579J505386
5743A3789481J738375J369086J755567J541411J046443M82953m00440j363275
5735A9959601j615304j612221j454058r55934r14432q51780m14285m87063l48549
5726A1305975j0076O6518r217J31108J22262N30462N38595L20528M46248M37758
5716A3880161M72296M15892N77397N02159M53812M39131M26320N20018M02037
5707A8089223O74902Q55103P88504P43992P66761J032248J044418J084186J232645
5698B6311982J390724J349299J896809K102785K753299L168448L444784L992686
$$ plain form
5763 5285831 5340198 5237233 5417097 5468309 5817701 6181153 6390443 6669282 7036049 7349765
5753 7349765 7793432 8245674 8457255 8805064 9337163 9735732 10542110 11415516 12284095 13789481
5743 13789481 15527856 16896942 18652509 20193920 21240363 21723316 21322876 19959601
5735 19959601 18344297 16732076 15278018 14322084 13407652 12555872 12141587 11654524 11305975
5726 11305975 11295899 11362417 11353200 11484308 11606570 12137032 12675627 12996155 13442403 13880161
5716 13880161 14352457 14768349 15345746 15847905 16301717 16740848 17167168 17687186 18089223
5707 18089223 18764125 19619228 20407732 21151724 21918485 22950733 23995151 25079337 26311982
5698 26311982 27702706 29052005 30948814 33051599 35804898 38973346 42418130 46410816
5690D6410816M881123N515292O418847P834555R069769J0650714J2732743J5222961
5682A18736820J8702635K2215075K7315723L4621518M2181891M4338079M4247516
5675C52359257M4230106L7870831K2371117J827278j9980342l7516552m5563286
5668C55598409m6925862m4632578l8532269l0626332k4377651k0644738j8170448
5661A31688531j6905276j4992536j2219010j0037174q299252o684780n645278
5654E6905225n036309m247233l801193l291823k862973k575054k544074k136331
5646C0410235j976600j551331j330003j351328j158803r32539r98608p99925j046303
5637A9264795j034199p43036o28159p13602n69356n62567l57504l78440k42110
$$ plain form
5690 46410816 51291939 56807231 63226078 71060633 80130402 90781116 103513859 118736820
5682 118736820 137439455 159654530 186970253 221591771 263773662 308111741 352359257
5675 352359257 396589363 434460194 456831311 458658589 438678247 401161695 355598409
5668 355598409 308672547 264039969 225507700 194881368 170503717 149858979 131688531
5661 131688531 114783255 99790719 87571709 77534535 69235283 62550503 56905225
5654 56905225 51868916 47621683 43820490 40528667 37665694 35090640 32546566 30410235
5646 30410235 28433635 26882304 25552301 24200973 23042170 22109631 21111023 20311098 19264795
5637 19264795 18230596 17487560 16859401 16145799 15576443 15013876 14656372 14277932 14035822
5628A4035822k17322l34352l83427k63640j61925j83599k31185l65844l90411
5619A1504117m3669k22553j52608l39333m21436l42007k34150l37015k64596l51494
5609H795256l94509j71800k47720j90181k10963j40626k41230m5923k33070j97703
5599F721531J17210k59523k28936k16272k72137j44272k00670k02662q5816p5420
5589E153033k09138k0193j18545r0253K7509j48346k73500k29601j85261L8267
5579C943972R1970l80481j10737j1003j45938J32161K2559j8152O9348n9923r5829
5568C437947K16217j38600n7047J9924q9140j06855j02694j91453j43775l2791
5558B811733r6239L767q4545k12787N0875n2651j1196k1617j45617q0006O7602
$$ plain form
5628 14035822 13818500 13484148 13100721 12837081 12675156 12491557 12260372 11894528 11504117
5619 11504117 11460448 11237895 11085287 10745954 10324518 9982511 9748361 9411346 9146750 8795256
5609 8795256 8400747 8228947 7981227 7791046 7580083 7439457 7198227 7152304 6919234 6721531
5599 6721531 6838741 6579218 6350282 6134010 5861873 5717601 5516931 5314269 5228453 5153033
5589 5153033 4943895 4923702 4805157 4714904 4742413 4594067 4320567 4090966 3905705 3943972
5579 3943972 4035942 3655461 3544724 3533721 3387783 3519944 3542503 3524351 3593699 3533776 3437947
5568 3437947 3654164 3515564 3458517 3478441 3389301 3282446 3179752 2988299 2844524 2811733
5558 2811733 2715494 2719261 2634716 2421929 2472804 2420153 2408957 2387340 2241723 2161717 2229319
5547B229319r7360q632N0364k04854K1985J90464l2493l8610L504r8454K5758
5536B040991M2567j51399J02834j52977r7418j7580l7126K6895l3051o8496p1627
5525A583613K9992q7835R192M9597j69481j0712o7088n110m5635R1327J50506
5514A528366J86748k23137n3912J23097R2143K11412j5013j10064j03631Q6118
5504A722127j08156N7949R4433j00231l123j05986n6823O6242M142n7341J05874
5493A619107K0133n9035J01454j39420J2055M0872J06205j58090M7936K7534L6949
5482A655700Q5031j5234m5338p4294n6765L4925m6845j15335o5442M3031j17021
5471A282413M3275k5002K4855j68146j13170M158R6824N0040j35852j38516K833
$$ plain form
5547 2229319 2131959 2123327 2173691 1968837 1990822 2181286 2148793 2110183 2113687 2015233 2040991
5536 2040991 2083558 1932159 2034993 1882016 1784598 1767018 1729892 1756787 1723736 1655240 1583613
5525 1583613 1613605 1525770 1534962 1584559 1415078 1404366 1337278 1332168 1286533 1377860 1528366
5514 1528366 1715114 1491977 1438065 1561162 1653305 1864717 1849704 1739640 1636009 1722127
5504 1722127 1613971 1671920 1766353 1666122 1662999 1557013 1500190 1566432 1570574 1513233 1619107
5493 1619107 1639240 1580205 1681659 1542239 1554294 1595166 1701371 1543281 1591217 1618751 1655700
5482 1655700 1740731 1725497 1680159 1605865 1549100 1584025 1537180 1421845 1356403 1399434 1282413
5471 1282413 1325688 1300686 1325541 1157395 1044225 1048383 1145207 1195247 1059395 920879 923712
5460I23712K5022L8437P688p320j71530q550l4244j03152L1968j2044K9140k5409
5448F93718j64672o2993J32013j3945J01230o051j03899j4287N9785Q9003J13427
5437H23329J36188k06694r059N5489L0969J15560j2489r1920m2700Q9589r4957
5426G93305K01017j24738j18883q4803K5346j598L1367k4448n3530K7026j32468
5415E37593K4818k9266r9593J00825q3466N2103k4613P9744O0104l9438j17519
5404D61292Q778L5357k4935R4984M9048r8550j36873P3416M337K6976M1556l0937
5392E04449K5524q7092R0586N4179Q6384J2621p8816J7057K6509n2484M6332J78421
5380H23670j07518j99980m2555l8435o2012Q1435l4373R3406p9573j26494J33852
$$ plain form
5460 923712 948734 987171 994859 987539 816009 807459 773215 670063 702031 689987 719127 693718
5448 693718 529046 466053 598066 584121 685351 679300 575401 561114 620899 709902 823329
5437 823329 959517 752823 743764 799253 830222 945782 933293 841373 798673 888262 793305
5426 793305 994322 869584 750701 665898 691244 689646 721013 696565 643035 670061 537593
5415 537593 562411 533145 433552 534377 450911 503014 478401 558145 618249 578811 461292
5404 461292 470070 505427 480492 575476 624524 525974 389101 462517 466854 493830 535386 504449
5392 504449 529973 442881 533467 587646 674030 686651 607835 624892 651401 598917 645249 823670
5380 823670 716152 516172 473617 435182 373170 454605 420232 513638 434065 307571 441423
5369D41423P3997o4616J90853j16339m0460O5715M9013J52501N8995j04057M1126
5358G48151K45573K7060l0327J46185j2669l1779L2357M3661O3418J59717L2229
5347A423576K57857J4371J44861L41405J87394J67995J17372J42705K3122j52628
5337B668030k44040q0700j18024k31318k75596m8498m5882j28095j02381j50055
5327A243441j50639l9982L907j02906p9016J436j29615J28324p0051J5147J1368
5316H31414p0962j59956J6065N0083N4839L171j11378j06085J27095n2409M511
5305E86388J52355j55686q5186J07529q5440N4892M7282r8259J43265p7794k24925
5294C64421Q6209J63914j37477k8839J3872j86458l8151O6114m2917R8849J9837
$$ plain form
5369 441423 515420 450804 641657 525318 484858 550573 599586 752087 811082 707025 748151
5358 748151 993724 1020784 990457 1136642 1123973 1092194 1124551 1168212 1231630 1391347 1423576
5347 1423576 1681433 1695804 1840665 2182070 2369464 2537459 2654831 2797536 2820658 2668030
5337 2668030 2423990 2343290 2225266 1993948 1718352 1669854 1623972 1495877 1393496 1243441
5327 1243441 1092802 1052820 1056727 953821 874805 876241 746626 874950 804899 820046 831414
5316 831414 760452 600496 616561 666644 721483 724654 613276 507191 634286 581877 586388
5305 586388 738743 583057 497871 605400 519960 574852 622134 523875 667140 589346 364421
5294 364421 450630 614544 477067 448228 462100 275642 237491 303605 260688 359537 379374
5283C79374o1924P9260O9203l4587J8104L5387O1135n7770M1577j51K4274Q0934
5271F34816L4823P7815K881k4182L4862k985R2932l6637Q3072k2022j06582J25
5259G68918l3400k157l2963q2612J17688p7506k41331L0456N1233J945q570P667
5247D99368r0760M6983j1288j18893J42687O2890j46194J49469p9117o2009J76098
5236E69234M5432k5369N1357p7321o9485J6625l619P7570J45451j7304j11150
5225F01421R524o6574J8835q009j17992J58309j9834r3438K3656l4402p705J58216
5213F22007M8669j50515j3516k1276K8707N2166K1985M950J7225j11003m8199
5202D51200J6254j65879O7948L4015r8036N5315m5388N9399k7693o568J01731
$$ plain form
5283 379374 317450 396710 465913 431326 449430 484817 545952 488182 529759 529608 553882 634816
5271 634816 669639 747454 750335 726153 761015 758030 850962 814325 897397 875375 768793 768918
5259 768918 735518 733361 700398 617786 735474 657968 416637 447093 498326 500271 491701 499368
5247 499368 408608 455591 444303 325410 468097 530987 384793 534262 455145 393136 569234
5236 569234 614666 589297 640654 563333 493848 510473 506854 584424 729875 712571 601421
5225 601421 610945 544371 563206 555197 437205 595514 575680 482242 505898 471496 463791 622007
5213 622007 670676 520161 506645 485369 514076 566242 588227 593177 610402 499399 451200
5202 451200 467454 301575 369523 403538 305502 360817 315429 374828 347135 340567 442298
5191D42298J46716p8498o0501M3781J17191N6891J2133k2628J38755k8620j43226
5180F24292K18561J04572j40472J19700p0590k0852o451J0998L5443K3127r0760
5169H07568j39681J72503j31808j19530Q3746L2342Q9549R2462k66226O9798J44205
5158H34928l9441J62756M3615j04294q6860J67368J1185l3344O8906j68512O3291
5147I19598j24585j12129K24608Q4396j23369J08057N2630n5409J2122J6740k9124
5136I73535J10329J5076k5672P9502m0712q0567K47300k2400l3068P4509M8457
5125A346289J31704l7882l2550Q5140J41627J3324l6809M9834N2997J08258R8729
5114A920661J9583N9132p5833r8682J50745P823J74611K88569m1085O1357K4726
$$ plain form
5191 442298 589014 510516 450015 493796 610987 667878 680011 657383 796138 767518 624292
5180 624292 842853 947425 806953 926653 856063 835211 828760 839758 875201 898328 807568
5169 807568 667887 840390 708582 589052 672798 705140 794689 887151 620925 690723 834928
5158 834928 795487 958243 1001858 897564 810704 978072 989257 955913 1024819 856307 919598
5147 919598 795013 682884 907492 991888 868519 976576 1029206 973797 985919 1002659 973535
5136 973535 1083864 1098940 1073268 1152770 1112058 1031491 1278791 1256391 1223323 1297832 1346289
5125 1346289 1477993 1440111 1407561 1492701 1634328 1647652 1610843 1660677 1713674 1821932 1920661
5114 1920661 1940244 1999376 1923543 1824861 1975606 1983429 2158040 2446609 2405524 2466881 2491607
5103B491607K46859K46491K8104J27540J90231K03993q2268K9805L81840K31977
5093D096179L40167R2436L5478L37637L32836K05638L63561J22436J39361J83303
5083F249032J54751K03704J46784R3913J64650J54469k18608P7990J39654k94675
5073F871664q2874q2048j84788O3990k90999l24278l9349j77883m02961n7446
5063E293028q7116j93824j24712k99334k09834r6909k69245J6053K9496n21570
5053C536033j51371m7147j52070P219j47040j95519j38314k16292j30973J29099
5043B493625j18319k39398j12139k4247o4517J9824n8776q7802j5145j45348J0871
5032A658629J8981l5132q8719L2162L9387j87334L897k513K2130K6388j39125
$$ plain form
5103 2491607 2738466 2984957 3013061 3140601 3330832 3534825 3452557 3482362 3864202 4096179
5093 4096179 4436346 4528782 4564260 4901897 5234733 5440371 5803932 5926368 6065729 6249032
5083 6249032 6403783 6607487 6754271 6848184 7012834 7167303 6948695 7026685 7166339 6871664
5073 6871664 6788790 6706742 6521954 6585944 6294945 5970667 5931318 5753435 5350474 5293028
5063 5293028 5205912 5012088 4887376 4588042 4378208 4281299 4012054 4028107 4057603 3536033
5053 3536033 3384662 3337515 3185445 3192664 3045624 2850105 2711791 2495499 2364526 2493625
5043 2493625 2375306 2135908 2023769 1999522 1935005 1954829 1896053 1808251 1793106 1647758 1658629
5032 1658629 1677610 1642478 1553759 1585921 1625308 1437974 1441871 1439358 1461488 1487876 1348751
5021A348751k04926O1364P9337J37988N0227j00059J434p3600J00826l6798R083
5010A373627k9549o3762R0719j04006p3421K35753r9897j34628J16967R554o0170
4999A261187J37901n0236j07096N5372l5085j69860J91347L5619M7639L9433j42579
4988A263642J26818J06239p8482Q7487j5144n7612P2036J59647n2973J0807M8990
4977A671455r0572N1563k4891r9584L3459o6400k42557L0511M4421p68N0816L8314
4965A395767j5350K3185j46293N597J61850M7064j06931O5474k31711j13654J10047
4954A195045J42628l3848k2444k68147K0989m822n2360m4537O0805j75514j18052
4943F99743J08197L9074J9920p8009j1124J43117M8106r6180P4352J66265P3337
$$ plain form
5021 1348751 1143825 1205189 1284526 1422514 1472741 1372682 1374116 1300516 1401342 1364544 1373627
5010 1373627 1344078 1280316 1371035 1267029 1193608 1429361 1329464 1194836 1311803 1321357 1261187
4999 1261187 1399088 1348852 1241756 1297128 1262043 1092183 1283530 1319149 1366788 1406221 1263642
4988 1263642 1390460 1496699 1418217 1505704 1490560 1432948 1504984 1664631 1611658 1622465 1671455
4977 1671455 1580883 1632446 1607555 1507971 1541430 1475030 1232473 1262984 1307405 1306637 1357453 1395767
4965 1395767 1380417 1403602 1257309 1262906 1424756 1471820 1364889 1430363 1198652 1084998 1195045
4954 1195045 1337673 1303825 1281381 1013234 1034223 1029401 977041 932504 993309 817795 699743
4943 699743 807940 847014 866934 788925 777801 920918 969024 872844 947196 1113461 1186798
4932A186798o4714J0284j56955p0702J39147J41993j5627n7548j95270K9483M0491
4921I87380m8210r5645n3138j05746M9971R8370J17618j72597k0161l8131K05646
4910I25357J44454o8441J29477m8446j82484O3450Q5095N3626j05405J26936k5230
4899A098389j7184O2191p968K9638q4807k86473J06448O4107m9896k5317l0898
4888H58230O3471l3955N3770M1742R9266K8232Q8986r183m5580m3094J42964K7155
4876A272004J9794l5747L7405K8383j5969k3515P4413K5014o887j87897R262R4746
4864A291006M6649M2984p7608j5914J1915J09069J54876L8224M4175O8240J50678
4853A864294J29324K1730P6564J75212r2172J9147J11280J47801L610r4743k5221
$$ plain form
4932 1186798 1122084 1132368 975413 904711 1043858 1185851 1170224 1112676 917406 946889 987380
4921 987380 939170 843525 790387 684641 734612 832982 950600 778003 757842 719711 925357
4910 925357 1069811 1001370 1130847 1082401 899917 963367 1048462 1102088 996683 1123619 1098389
4899 1098389 1081205 1143396 1135428 1165066 1080259 793786 900234 964341 914445 889128 858230
4888 858230 921701 887746 941516 983258 1082524 1110756 1199742 1190559 1144979 1101885 1244849 1272004
4876 1272004 1291798 1256051 1293456 1321839 1305870 1282355 1356768 1381782 1374895 1186998 1196260 1291006
4864 1291006 1337655 1380639 1303031 1287117 1299032 1408101 1562977 1601201 1645376 1713616 1864294
4853 1864294 1993618 2015348 2091912 2267124 2174952 2194099 2305379 2453180 2456790 2362047 2336826
4842B336826J35191J23768P2974j25827N3872q3198J66358J46305j18418J97092
4832B904943J65978Q0297J15734Q7960J78580L43191K43935K47857M28798L79409
4822E176682L28308P30657P86114J163543J099785P42100J068019Q96901M66440
4813A2458549Q6894n86455j221715j255321q77606r02907o71827n99495n64750
4804E865367k82336k65646m32947j06792k64327k34598m69j24600j6575K8885
4794D165962r6187q9670p4190P5621L2078L8124j78753J9457J12083P3239P1907
4783D149671m7113j6171J48614j2714m2791J1346r6416K22664J26852j73817N6274
4772D326399Q849P7201Q3024M7874J80090J14607m1185o9562K98142K11249K16463
$$ plain form
4842 2336826 2472017 2595785 2668759 2542932 2596804 2513606 2679964 2826269 2707851 2904943
4832 2904943 3070921 3151218 3266952 3354912 3533492 3876683 4120618 4368475 4797273 5176682
4822 5176682 5504990 6235647 7021761 8185304 9285089 10027189 11095208 11992109 12458549
4813 12458549 12545443 11958988 10737273 9481952 8604346 7701439 7029612 6430117 5865367
4804 5865367 5583031 5317385 4884438 4777646 4513319 4278721 4278252 4153652 4137077 4165962
4794 4165962 4069775 3980105 3905915 3981536 4013614 4051738 3872985 3892442 4004525 4077764 4149671
4783 4149671 4102558 4086387 4235001 4222287 4179496 4190842 4094426 4317090 4443942 4270125 4326399
4772 4326399 4335248 4412449 4495473 4543347 4723437 4838044 4796859 4727297 5025439 5236688 5453151
4761E453151P0652K6432N7349L26146K88342K55880Q3270m4798L38481J35270
4751F990175J69615K43148J18809K28272J01157N3994L25862M51123J46366J7891
4741H846412L52359L80755N67078M68950L07865M26415O52573P15076Q45646P39616
4731A4302745Q21565J108616J190031J191670J162816J518198J665858J898667
4723B4860166J816085J794825K112777J883655J820752K046706K024425J774127
4715D0133518J770418J774990J891566K063016J795926J600603J282039R91053
4707E3303129R43649J008481O29151M81647N70161Q12990J225925J405138J758917
4698F2139188K314056K484457K716007L098291L438896L312124L280419K997783
$$ plain form
4761 5453151 5523803 5550235 5607584 5933730 6222072 6477952 6561222 6516424 6854905 6990175
4751 6990175 7159790 7402938 7521747 7750019 7851176 7905170 8231032 8682155 8828521 8846412
4741 8846412 9198771 9579526 10146604 10615554 10923419 11349834 12002407 12717483 13563129 14302745
4731 14302745 15124310 16232926 17422957 18614627 19777443 21295641 22961499 24860166
4723 24860166 26676251 28471076 30583853 32467508 34288260 36334966 38359391 40133518
4715 40133518 41903936 43678926 45570492 47633508 49429434 51030037 52312076 53303129
4707 53303129 54246778 55255259 55884410 56366057 56936218 57749208 58975133 60380271 62139188
4698 62139188 64453244 66937701 69653708 72751999 76190895 79503019 82783438 85781221
4690H5781221L049847K816552K498168K291161K032489J565370J331939R23446
4682A02290193P5079n13841j015766j210352j416414j892650j973109j881990
4674I2461150j774390j900839k064391j890110j758536j665446j425790j041595
4666G8940053r46546j144403j124525j101347j339935j226095j446322j909834
4658F8701046k412328k628790k448022k533164k959403l092295l022599k819334
4650D6785111k824042k572623k485547k257889k157000k029874j817990j580103
4642B9060043j545477j421091j261164j118336r85576q85520p38834p98962o24429
4633A9680654l50864l61923k84698n25774j64778K2682n8834j86724m6818r3043
$$ plain form
4690 85781221 88831068 91647620 94145788 96436949 98469438 100034808 101366747 102290193
4682 102290193 102365272 101851431 100835665 99625313 98208899 96316249 94343140 92461150
4674 92461150 90686760 88785921 86721530 84831420 83072884 81407438 79981648 78940053
4666 78940053 77993507 76849104 75724579 74623232 73283297 72057202 70610880 68701046
4658 68701046 66288718 63659928 61211906 58678742 55719339 52627044 49604445 46785111
4650 46785111 43961069 41388446 38902899 36645010 34488010 32458136 30640146 29060043
4642 29060043 27514566 26093475 24832311 23713975 22728399 21842879 21104045 20305083 19680654
4633 19680654 19329790 18967867 18683169 18157395 17992617 18015299 17956465 17769741 17722923 17629880
4623A7629880j06982j88291l22635l63771m64772m37192l62426j83047r7855j13003
4613A4989906j12779j16104P2000J60180M19288K03277k2211J66723K81165M99227
4603A6540672M01676J50833J01602M88915M34896N73444L92193L00383K66844
4594A9651458K06432L50678N81610L47869L44395M44020K69017J49763M60128
4585B2805370J83834L39288N55865O41818O90917P91534N23642P76363J060057
4576B8368688J073828J119784J361701J415579J596747J846836J798195K144269
4568D0725627K149652K057483K488299K499113K400290K489863K341091K080983
4560E9232401K120846J922181J688146J641401J176022J195495J550446J390822
$$ plain form
4623 17629880 17522898 17334607 17011972 16648201 16183429 15746237 15383811 15200764 15102909 14989906
4613 14989906 14877127 14761023 14833023 14993203 15412491 15615768 15593557 15760280 16041445 16540672
4603 16540672 16942348 17093181 17194783 17683698 18118594 18692038 19084231 19384614 19651458
4594 19651458 19857890 20208568 20790178 21138047 21482442 21926462 22195479 22345242 22805370
4585 22805370 22989204 23328492 23884357 24526175 25217092 26008626 26532268 27308631 28368688
4576 28368688 29442516 30562300 31924001 33339580 34936327 36783163 38581358 40725627
4568 40725627 42875279 44932762 47421061 49920174 52320464 54810327 57151418 59232401
4560 59232401 61353247 63275428 64963574 66604975 67780997 68976492 70526938 71917760
4552G1917760J293126J444491J468324J852267K140737K229014K294836K329205
4544H6969760K085507K158559K206866K050932J869831J908199J398710J239642
4536A01888006Q14562J43697m07277j200803j633535j752649k177193k585008
4528I3089800k731040k838896k958768l040503l126732k994897k673060k265767
4520G0460137j877656j238165j269372j102016p28184p07711n08032n34171p66725
4511F1728105r18292j312149j512894j449829j723543j867696j935098k165164
4503D8843440j996527k036266k214428k252727k171001k425997k260115k030838
4495C1455541k334790j886147j915392j731563j400453j346465j323496r81822
$$ plain form
4552 71917760 73210886 74655377 76123701 77975968 80116705 82345719 84640555 86969760
4544 86969760 89055267 91213826 93420692 95471624 97341455 99249654 100648364 101888006
4536 101888006 102702568 102846265 102438988 101238185 99604650 97852001 95674808 93089800
4528 93089800 90358760 87519864 84561096 81520593 78393861 75398964 72725904 70460137
4520 70460137 68582481 67344316 66074944 64972928 64244744 63537033 63029001 62494830 61728105
4511 61728105 60809813 59497664 57984770 56534941 54811398 52943702 51008604 48843440
4503 48843440 46846913 44810647 42596219 40343492 38172491 35746494 33486379 31455541
4495 31455541 29120751 27234604 25319212 23587649 22187196 20840731 19517235 18535413
4487A8535413j068901j010976o27986p23861o08693p18348p42418n08724l49099
4478A2176407n82981m42856k34888n90961l36955l16151n09612k27923l29282
4469H604798k73315o4395l82062l77794j47863k21452j77569R057k59252k24717
4459F485436k06625k37055r723L6996q7565j46357j95784j28888L2859j75639
4449E367655m2802O2666k38148j36689O6382q7008j7004K5106r0399Q4924p9832
4438D914851k62380K0598j13847j44322j11886j57161j89796j08510k12837L7174
4428C671884Q8329j53877j07138l3192j72279j76393J49044j37706n7615K401
4418C073458j32704J6217q5239j73121N2151K2511j98460j9630J2659j20405q3205
$$ plain form
4487 18535413 17466512 16455536 15827550 15103689 14494996 13776648 13034230 12525506 12176407
4478 12176407 11593426 11150570 10915682 10324721 9987766 9671615 9162003 8934080 8604798
4469 8604798 8331483 8267088 7885026 7507232 7359369 7137917 6960348 6969405 6710153 6485436
4459 6485436 6278811 6041756 6032033 6069029 5981464 5835107 5639323 5510435 5543294 5367655
4449 5367655 5324853 5387519 5149371 5012682 5079064 4992056 4975052 5000158 4909759 4994683 4914851
4438 4914851 4652471 4673069 4559222 4414900 4303014 4145853 3956057 3847547 3634710 3671884
4428 3671884 3760213 3606336 3499198 3466006 3293727 3117334 3266378 3128672 3071057 3073458
4418 3073458 2940754 2956971 2871732 2698611 2750762 2773273 2574813 2555183 2567842 2447437 2364232
4407B364232p7905J01469R0768k2616k34296J12569o4417n0517R4587M6591J879
4396B362344r0911l4545j6282O882L9562R8481m0979j72197j09748N9221O5568
4385B167396q0138o6770j6408M9652j32914o2482J16583L4715J73k8205o8581
4374A913021K7393r7018P4533J33904j40973m5520p0394p0138K8603J08201N1600
4363A913212L0038j87646j09579O2485K6362q9739K0286j35571O4203J36345j40527
4352A589869p7032O0919j30747P7518J27041j50486n4759M623j33115J44629R2187
4341A550647j44688L5825n5823o7617O4303J8495J02145L3512k12765o9178R5049
4330A349905k2296N9610J16488L7681n7750p3735q7830J22907P9901m6773l6536
$$ plain form
4407 2364232 2286327 2387796 2478564 2455948 2221652 2334221 2269804 2219287 2313874 2360465 2362344
4396 2362344 2271433 2236888 2220606 2227488 2267050 2365531 2324552 2152355 2042607 2101828 2167396
4385 2167396 2087258 2020488 2004080 2053732 1920818 1858336 1974919 2009634 2009807 1981602 1913021
4374 1913021 1940414 1843396 1917929 2051833 1910860 1865340 1794946 1724808 1753411 1861612 1913212
4363 1913212 1943250 1755604 1646025 1708510 1734872 1645133 1665419 1529848 1594051 1730396 1589869
4352 1589869 1512837 1573756 1443009 1520527 1647568 1497082 1442323 1446946 1313831 1458460 1550647
4341 1550647 1405959 1441784 1385961 1318344 1382647 1401142 1503287 1536799 1324034 1254856 1349905
4330 1349905 1327609 1387219 1503707 1541388 1483638 1409903 1322073 1444980 1524881 1478108 1441572
4319A441572j91134r594M8487J2181J2457J0318k177J62091k6920k55671N6471
4308A258081K66441J16926M0104j9633j5940o3997r1473J64865J68489m8162k2275
4297A753426k6912j8555J30060K6333k3777N329j44560J30114P3173j53936j06439
4286A644256p689J04513P5013j45892r5162N8376N5563L3425J36247l456j97302
4275A657892Q8165J36617j7094q196p4130m2790Q5913q4701j0044l0544j19564
4264A581524q7263L7844J11150j14483j97921j0363J39363J24905q6694j24518
4254A373544M0053m0094P0419K05890n1554p7375J76694O9524j15648J212J2820
4243A665485N1628Q4976p2291o0387o6427j5677N5254l0907j33790n3360m7421
$$ plain form
4319 1441572 1250438 1240844 1289331 1301512 1313969 1324287 1322110 1484201 1457281 1201610 1258081
4308 1258081 1524522 1641448 1681552 1661919 1645979 1581982 1490509 1655374 1823863 1775701 1753426
4297 1753426 1726514 1707959 1838019 1864352 1840575 1845904 1701344 1831458 1904631 1750695 1644256
4286 1644256 1636567 1741080 1816093 1670201 1575039 1633415 1688978 1722403 1858650 1855194 1657892
4275 1657892 1746057 1882674 1865580 1857384 1783254 1740464 1826377 1741676 1731632 1701088 1581524
4264 1581524 1494261 1532105 1643255 1528772 1330851 1320488 1459851 1584756 1498062 1373544
4254 1373544 1413597 1373503 1443922 1649812 1598258 1520883 1697577 1767101 1651453 1652665 1665485
4243 1665485 1717113 1802089 1729798 1669411 1602984 1587307 1642561 1611654 1477864 1424504 1377083
4232A377083j47552Q1771o719j17898P0365k7764m2473r40P9917J349P6789P4238
4220A418166O6334K819j64771N0462J85905Q9198m1403j40773l4454M1758R8420
4209A571661l4771k1185m5259m7464P2348l4582j7277j03369j7561J08887N3607
4198A485035R5247j14615r8198m6645k7264J35801j9632n1884j4437k1290J42648
4187A464766J87100r2754o6147p1474J13497K4108M9255j68869m2061J55054P8700
4176A631175m5957j21919j88515J83687J09733l3939M2567j15900q9076J51334
4166A523190N6985o8248O4840m465j10804J15428p212Q0992n3707j21888O2078
4155A537189J39948p426j20094N8094j28826J74560Q9758j59280n8710O3575q3433
$$ plain form
4232 1377083 1229531 1311302 1304583 1186685 1257050 1229286 1186813 1185873 1265790 1267139 1343928 1418166
4220 1418166 1484500 1487319 1322548 1373010 1558915 1648113 1606710 1465937 1431483 1473241 1571661
4209 1571661 1536890 1515705 1470446 1422982 1495330 1460748 1443471 1340102 1322541 1431428 1485035
4198 1485035 1580282 1465667 1367469 1320824 1293560 1429361 1409729 1357845 1343408 1322118 1464766
4187 1464766 1651866 1559112 1492965 1421491 1534988 1559096 1608351 1439482 1397421 1552475 1631175
4176 1631175 1585218 1463299 1274784 1458471 1568204 1534265 1576832 1460932 1371856 1523190
4166 1523190 1580175 1511927 1576767 1572302 1461498 1576926 1569714 1650706 1596999 1475111 1537189
4155 1537189 1677137 1669711 1549617 1607711 1478885 1653445 1743203 1583923 1525213 1588788 1505355
4144A505355J7914o3478p4288J3001J03661k42636n0172J38815N2487L1396L5254
4133A467309j31978J56132K0781o9028J20757r01m8518J52642o8319p6653J40286
4122A662510N6729j44145J49019r2739l5556J48382j28366k27602L18597M4904
4112A751733k80744n7643m7053J47582J75113j54677p0441P8748j18466J40021
4102A564173J88770k03457j48299M5226Q3144J05841L011j01984N743Q2204q0187
4091A544185J38279J2191j10570j80149R4411J60972m2656k2758n9325O8397K03994
4080A806971k3089K1919j16162Q023L1144K17624j22251N7030l794N5511L9236
4069A972162K4752o8014J01025M5458j12243J19555J92345o6759J53536M5162
$$ plain form
4144 1505355 1523269 1459791 1385503 1398504 1502165 1259529 1209357 1348172 1400659 1432055 1467309
4133 1467309 1335331 1491463 1512244 1443216 1563973 1563072 1514554 1667196 1598877 1522224 1662510
4122 1662510 1719239 1575094 1724113 1631374 1595818 1744200 1615834 1388232 1706829 1751733
4112 1751733 1470989 1413346 1366293 1513875 1688988 1534311 1463870 1542618 1424152 1564173
4102 1564173 1752943 1549486 1401187 1446413 1529557 1635398 1638409 1536425 1542168 1624372 1544185
4091 1544185 1682464 1694655 1584085 1403936 1498347 1659319 1616663 1593905 1534580 1602977 1806971
4080 1806971 1783882 1805801 1689639 1697662 1728806 1946430 1824179 1881209 1877415 1932926 1972162
4069 1972162 1996914 1928900 2029925 2075383 1963140 2082695 2275040 2208281 2361817 2406979
4059B406979L5321K37272M5851J2895K23838m7398J68732K03009j93784j32360
4049B960355M0882q2205j00049J31616K9714Q6882J28581j05694q5597N9262O5806
4038C129553M3275Q0328j33924Q5383K85751n9061m7498k9761J77969M8386R4160
4027C674561j49928q049J62630Q6521K4195Q8198q5565J03134j9610k8534J49491
4016C997044K54929j93639N9647O0479J15009J70231J17842q8641J33200K34165
4006D860266m692R5339M6950K3320K10828J40019o8380J5743L4850O9787K86017
3995E710047J44235L8807J69485J88867K0253K23643K59018R4696K55270l911
3985G100410J35171L67821K80174Q6616K84076K40872M11439N52827J35240K56622
$$ plain form
4059 2406979 2442300 2679572 2725423 2738318 2962156 2914758 3083490 3286499 3092715 2960355
4049 2960355 3001237 2919032 2818983 2950599 2980313 3067195 3195776 3090082 3004485 3063747 3129553
4038 3129553 3172828 3253156 3119232 3204615 3490366 3431305 3383807 3354046 3532015 3580401 3674561
4027 3674561 3524633 3516584 3679214 3765735 3789930 3878128 3792563 3895697 3876087 3847553 3997044
4016 3997044 4251973 4058334 4117981 4178460 4293469 4463700 4581542 4492901 4626101 4860266
4006 4860266 4855574 4950913 4997863 5021183 5232011 5372030 5303650 5319393 5354243 5424030 5710047
3995 5710047 5854282 5893089 6062574 6251441 6271694 6495337 6754355 6849051 7104321 7100410
3985 7100410 7235581 7603402 7883576 7970192 8254268 8495140 8906579 9459406 9594646 9851268
3975I851268M87180O04455N74565N87536M68535N90394Q03349N94691P94091P11594
3965A6067658M94417N71382P12284O33656P75527P15124N46510O50196N77572
3956B1744326O39530P87355O59934Q46862Q80711Q44113Q23586Q84265N73373
3947B8684055P67121R42952O46578N52365P30954P72081Q41747Q84436P94422
3938C5616711R53708R16526J052198J261909J184209J357607J410520J566526
3930D5319914J524605J547442J858080K024392K154600K234552K343621K329003
3922F1336209K213453J829089J715953J849561J524959J498268J552708J704539
3914G5224739J649505J935659K057152K363715K503724K532254K974319K930697
$$ plain form
3975 9851268 10338448 10942903 11517468 12105004 12573539 13163933 13967282 14561973 15356064 16067658
3965 16067658 16562075 17133457 17845741 18479397 19254924 19970048 20516558 21166754 21744326
3956 21744326 22383856 23171211 23831145 24678007 25558718 26402831 27226417 28110682 28684055
3947 28684055 29451176 30394128 31040706 31593071 32324025 33096106 33937853 34822289 35616711
3938 35616711 36570419 37486945 38539143 39801052 40985261 42342868 43753388 45319914
3930 45319914 46844519 48391961 50250041 52274433 54429033 56663585 59007206 61336209
3922 61336209 63549662 65378751 67094704 68944265 70469224 71967492 73520200 75224739
3914 75224739 76874244 78809903 80867055 83230770 85734494 88266748 91241067 94171764
3906I4171764L374424L923683M447347M742430N073211N400049N632369N604171
3898A32369448N241925M814773L941677L050968K001437J267334P27135K77354
3890A53692051R1435K0317L46183K31289L97942N01749K64652K22389L05109K1558
3880A56094674l48517m33438l22677j90004k11389k80109k23246l50020l56510
3871A53378764r71523j499230k111719l015520l948668m532754n192714n641960
3863A26464676n475405n560493n144055m709758m437426l928550l813538l471706
3855H9923745k840085k414706k485549k197134k121335j896557j592200j678317
3847G2697862j629050j480493j637043j675506j714884k056850j896426j767816
$$ plain form
3906 94171764 97546188 101469871 105917218 110659648 115732859 121132908 126765277 132369448
3898 132369448 137611373 142426146 146367823 149418791 151420228 152687562 153414697 153692051
3890 153692051 153783486 153803803 154149986 154381275 154779217 155280966 155545618 155768007 156073116 156094674
3880 156094674 155746157 155312719 154990042 154800038 154588649 154308540 154085294 153735274 153378764
3871 153378764 152407241 150908011 148796292 145780772 141832104 137299350 132106636 126464676
3863 126464676 120989271 115428778 110284723 105574965 101137539 97208989 93395451 89923745
3855 89923745 87083660 84668954 82183405 79986271 77864936 75968379 74376179 72697862
3847 72697862 71068812 69588319 67951276 66275770 64560886 62504036 60607610 58839794
3839E8839794k119868k004866k007452j845458j717039j655913j667334j579773
3831D4242091j498885j809756j496241j496426j271881j108796j070300j007451
3823C3482355r92315q31102n53619o52562p18240m87195n44693n77611o30349
3814B7494669o21825n95504r31656p34048p35353o68921q19325p77231p60592
3805B0850214o42908o63550p07771p01512o97409p79532n53515m20222o50128
3796A5033667o06768m97670n24963n13411o96235l93896l89330n79666l68290
3787A0463438l62529m63259l86531l01720k96335j68374l03441k67351j52503
3778G761395k44336k56638k1962k32227k93358n9026k71021j53190j19377k85152
$$ plain form
3839 58839794 56719926 54715060 52707608 50862150 49145111 47489198 45821864 44242091
3831 44242091 42743206 40933450 39437209 37940783 36668902 35560106 34489806 33482355
3823 33482355 32490040 31658938 31105319 30452757 29734517 29247322 28702629 28125018 27494669
3814 27494669 26872844 26277340 25345684 24611636 23876283 23207362 22388037 21610806 20850214
3805 20850214 20207306 19543756 18835985 18134473 17437064 16657532 16104017 15683795 15033667
3796 15033667 14426899 13929229 13404266 12890855 12194620 11800724 11411394 10831728 10463438
3787 10463438 10100909 9637650 9251119 8949399 8653064 8484690 8181249 7913898 7761395
3778 7761395 7517059 7260421 7238459 7006232 6712874 6653848 6382827 6229637 6110260 5825108
3768E825108J0881j31154k29191Q797M7991k47602r2503K1103q3037p5141j75761
3757D879491l1080n3903o9231K3550j05378m7082j20457p2156j22046L4872m0364
3746D276216J42j00296q7196R544n4649J3400r2797K4154r1577N9917q3517j33522
3734C739819J53790m2109j47245l0045k2345j07326J34216j24201j08629P9670
3724C525595J2373n8990p5998j09475o1354M3162j70445k9816N9286k00652O6709
3713C000395J07861j64086J72121L3155k05132J04150J03685j45218J70424Q8775
3703C266130j53091J20225J60443j53785J36305J66868p6816L60028l6949r0813
3693C698545M41689J0467J56048K78511J16270M7447L71493P6416M0853K02944
$$ plain form
3768 5825108 5835989 5704835 5475644 5484441 5532432 5284830 5192327 5213430 5130393 5055252 4879491
3757 4879491 4848411 4794508 4725277 4748827 4643449 4596367 4475910 4403754 4281708 4316580 4276216
3746 4276216 4276358 4176062 4088866 4098410 4043761 4057161 3964364 3988518 3896941 3956858 3873341 3739819
3734 3739819 3893609 3851500 3704255 3674210 3651865 3544539 3678755 3554554 3445925 3525595
3724 3525595 3537968 3478978 3402980 3293505 3232151 3275313 3104868 3075052 3134338 2933686 3000395
3713 3000395 3108256 2944170 3116291 3149446 2944314 3048464 3152149 3006931 3177355 3266130
3703 3266130 3113039 3233264 3393707 3239922 3376227 3543095 3466279 3826307 3789358 3698545
3693 3698545 4140234 4150701 4306749 4585260 4701530 4748977 5120470 5196886 5237739 5440683
3683E440683k03247L0761L3088j49690M9477M6812k33482K644q7839o4976J25769
3672D990000q5290K6464P9109o1454j19343K7453R1394j68453k5898j09148o2888
3661D581946o9054K4697j86355o6903o7404j63371k71574k1619j51199k93702
3651C315462k3244k57682m4609K2730l76824j2687M0281q3935L940n5341k03313
3640B324778J66150J7875j21281K23236o386q1853J46858r5191k34285K53597
3630B593498p3683j92556R5755j77502j15989P6515k77464J24227K53993r5342
3620B211452o7738J22994j43012K02105J83727j43197J13554J17929j09853J21965
3610B609926J19808j34229J05964J45692j47182K8466L4040Q7477O021j66149
$$ plain form
3683 5440683 5237436 5268197 5301285 5151595 5201072 5247884 5014402 5017046 4929207 4864231 4990000
3672 4990000 4904710 4931174 5010283 4948829 4829486 4856939 4948333 4779880 4753982 4644834 4581946
3661 4581946 4512892 4537589 4351234 4284331 4216927 4053556 3781982 3760363 3609164 3315462
3651 3315462 3292218 3034536 2989927 3012657 2635833 2623146 2663427 2579492 2583432 2528091 2324778
3640 2324778 2490928 2508803 2387522 2610758 2604372 2522519 2669377 2574186 2339901 2593498
3630 2593498 2519815 2327259 2423014 2245512 2129523 2206038 1928574 2052801 2306794 2211452
3620 2211452 2143714 2266708 2123696 2325801 2509528 2366331 2479885 2597814 2487961 2609926
3610 2609926 2729734 2595505 2701469 2847161 2699979 2728445 2762485 2849962 2855983 2689834
3600B689834k22010J56289p7681o6533J8528j09399k7485m7103j03373j46601
3590B064466M1714K06159j92808o5008J55845P0720r1828j5710j12327J52412
3580B213635K7071j60685J2758p7201j5989j25452Q6687m9207O3823k7108p9166
3569A869166L613j63727J33273K69664p8463p7656J84810q6111k0057K19661J24212
3558B378385J74450k6047J6677O6642R7889J2821J29658K32774l7727k4109N3898
3547C075311K03132J22598j01267l3918J9446K3389j52347M7049l197J170k07271
3536B994095R8213M0288n4210o0481j02110j4412r7059o1755J58515j70067j04748
3525B626269o0252J15783K4660k0653j85109P3929J03902p0910K8582J17305J40628
$$ plain form
3600 2689834 2467824 2624113 2546432 2479899 2498427 2389028 2361543 2314440 2211067 2064466
3590 2064466 2106180 2312339 2119531 2054523 2210368 2281088 2189260 2173550 2061223 2213635
3580 2213635 2240706 2080021 2092779 2015578 1999589 1874137 1960824 1911617 1975440 1948332 1869166
3569 1869166 1872779 1709052 1842325 2111989 2033526 1955870 2140680 2054569 2034512 2254173 2378385
3558 2378385 2552835 2526788 2543465 2610107 2707996 2720817 2850475 3083249 3045522 3021413 3075311
3547 3075311 3278443 3401041 3299774 3265856 3285302 3308691 3156344 3203393 3200196 3201366 2994095
3536 2994095 3092308 3132596 3078386 3017905 2915795 2901383 2804324 2742569 2901084 2731017 2626269
3525 2626269 2566017 2681800 2706460 2685807 2500698 2574627 2678529 2607619 2636201 2753506 2894134
3514B894134j4642J46108M235M9182O441J53176Q6888o0233m0843l0550m8818
3503C145078o7699M2538N0067p6707j08075j92550Q8901J81932l2557k41508j23733
3492B665687l1498n0015l2298q0579r3694m8361j8859p8503m6067j00401K450
3481B087862j5523j27661Q4785r2854L2393n1209m1015l4421J76821N0553k53544
3470A816187O3554J91849Q1362j5034j31995J35946J70938L6858l1727J47196
3460B465134n1978K23666J01420k7734J29768P2929K4391Q3986K6223o3286Q4915
3449C069434M8150q6742m5315N460O9602Q926k42818k2159p036k96954j8790o2175
3437B419583k28151J7158j41238j16375j10843k0873n9507n953j61030j63368
$$ plain form
3514 2894134 2879492 3025600 3029835 3079017 3085458 3238634 3325522 3265289 3224446 3193896 3145078
3503 3145078 3077379 3119917 3169984 3093277 2985202 2792652 2881553 3063485 3030928 2789420 2665687
3492 2665687 2634189 2584174 2551876 2471297 2377603 2329242 2310383 2231880 2185813 2085412 2087862
3481 2087862 2072339 1944678 2029463 1936609 1969002 1917793 1876778 1842357 2019178 2069731 1816187
3470 1816187 1879741 2071590 2152952 2137918 2005923 2141869 2312807 2349665 2317938 2465134
3460 2465134 2413156 2636822 2738242 2710508 2840276 2913205 2937596 3021582 3047805 2984519 3069434
3449 3069434 3117584 3030842 2985527 2990987 3060589 3069515 2826697 2804538 2797502 2500548 2481758 2419583
3437 2419583 2191432 2208590 2067352 1950977 1840134 1819261 1759754 1753801 1592771 1429403
3427A429403M6040q1279L1401r5514k35569J24188J26123k44930o6930O9093k3958
3416A078068K11790j17463o5356p8991L4115N0486M2679J8214J801J7753L0209
3405A223305n0952N8058j26764L2669m6850j89239J31743J62925l02717j28111
3395G64067P9748K03478N5861j40798j1912R9857O0179k1344J97463J755m095
3384A284259R5839O4554j3791Q9921J32565R0965J4210n7134Q3519K93606L4972
3373B113485p2960Q7054L38425P9502M8869L7844J39853J33518N3489J40868j16101
3362B983846j9702J21352R7003j06275j33025J7354q6660J121j37406j12996n7878
3351B566734k05510l40424o2318R2o5694k38378k86089Q386Q38k2498l7905l02126
$$ plain form
3427 1429403 1475443 1394164 1425565 1330051 1094482 1218670 1344793 1099863 1032933 1102026 1078068
3416 1078068 1289858 1172395 1107039 1028048 1062163 1112649 1155328 1173542 1175343 1193096 1223305
3405 1223305 1172353 1230411 1103647 1136316 1089466 900227 1031970 1194895 892178 764067
3395 764067 843815 1047293 1103154 962356 950444 1050301 1110480 1089136 1286599 1288354 1284259
3384 1284259 1380098 1444652 1430861 1520782 1653347 1744312 1758522 1701388 1784907 2078513 2113485
3373 2113485 2040525 2127579 2466004 2545506 2594375 2632219 2772072 2905590 2959079 3099947 2983846
3362 2983846 2964144 3085496 3182499 3076224 2943199 2960553 2873893 2875014 2737608 2624612 2566734
3351 2566734 2361224 2020800 1958482 1958574 1892880 1654502 1368413 1376799 1377637 1355139 1317234 1015108
3339A015108j07541J40525J23375j57022j4545o9302O7642L3308r9840m2759N0593
3328I39542j16279j14163l6880m5970M4379j12276m8191K7402K0966P1790n0093
3317E80227p7394k4759J23442l463j43626k1840L9594J21915N2068j07748j47502
3306C90914Q3474j2091J97777r2563j16515m7606P9707L2744r4530R7570J43401
3295F62282k02696m632n2928N0884J00683n2023r5979L8893M2648N9867K8901
3284E75900m3660n5201L0762N6077j20533p0735K253P9491j32115k01981Q9780
3273B10038J42213o2258j75802l1319O7154J67672K7832j65503r326J53704J32614
3262D57019l0412k8443K7874L5584k5563j02867J4972j1680J81081J8394j94690
$$ plain form
3339 1015108 907567 1048092 1171467 1014445 999900 930598 998240 1031548 931708 888949 939542
3328 939542 823263 709100 672220 626250 670629 558353 510162 537564 558530 630320 580227
3317 580227 502833 478074 601516 598053 454427 432587 472181 594096 646164 538416 390914
3306 390914 474388 462297 660074 567511 450996 403390 483097 515841 421311 518881 662282
3295 662282 459586 454954 402026 452910 553593 501570 405591 444484 487132 546999 575900
3284 575900 532240 477039 507801 563878 443345 372610 374863 454354 322239 120258 210038
3273 210038 352251 289993 114191 82872 150026 317698 345530 180027 170701 324405 457019
3262 457019 426607 398164 426038 461622 436059 333192 348164 336484 517565 535959 341269
3251C41269l5223J7353j4853j13704M7553K6805J86355j32970k57456m915K80800
3240C41014J13006q1625k27426n412J15218R0401P6287k1100j12090k7098J20305
3229C81480p0996p357J39932q0619J993k14716p2718K66391m3898j04116J0254
3218B05630O6653J01394n0169k84795Q3504K53805j5465R893J9302o5287N2238
3207C76703Q7933j08228N6598R8122m199N8320k88724m0728K43551o3273K2380
3196D38455r555N87Q7288o6352j98188K34866J68001j2560o8885j47981r6425
3185C29251J61796J50947o4884m8067l14549K24606M5446q7887J80615J21602
3175F98876q0986M8906j33252j05358K75512Q4756r6332l4536N0581J23316J27983
$$ plain form
3251 341269 306046 323399 308546 194842 242395 269200 455555 322585 65129 60214 341014
3240 341014 454020 372395 144969 139557 254775 345176 421463 400363 288273 261175 381480
3229 381480 310484 303127 443059 362440 364433 149717 76999 343390 299492 195376 205630
3218 205630 272283 373677 323508 38713 122217 376022 360557 370450 389752 324465 376703
3207 376703 464636 356408 413006 511128 506929 565249 276525 235797 479348 416075 438455
3196 438455 428900 429487 516775 450423 252235 487101 655102 642542 573657 425676 329251
3185 329251 491047 641994 577110 529043 214494 439100 484546 396659 577274 698876
3175 698876 617890 666796 533544 428186 703698 788454 692122 657586 708167 831483 959466
3164I59466r9508O9835K54353k7451J5481l9651p3869L04393J85384j35377L8829
3153A451885J1881J14594N0386l7510O3100K02580O7130R8804o7768J12024L70491
3142B437597J21269o1249J71218L11543K33001J44994K19694L14730L92733K93192
3132D578722M00480L78462L71104O59439P13235O85941Q62263R59553Q07937O62110
3122A1079246K32765L39234M01165k18025q60514p09511q24044o77054o37203
3113H126059p78208o62861n81285o08846n37421m88366l60947j77217k09738m79552
3103C241618k45549k77127j94164r1456j58738j72874J01903l19033k84060q4030
3093A516490N8234J06313o3318k14823r6573O4254N8154M8748o0343j49387J17482
$$ plain form
3164 959466 859958 929793 1184146 1156695 1172176 1132525 1058656 1363049 1548433 1413056 1451885
3153 1451885 1463766 1578360 1628746 1591236 1654336 1856916 1924046 2022850 1955082 2067106 2437597
3142 2437597 2558866 2497617 2668835 2980378 3213379 3358373 3578067 3892797 4285530 4578722
3132 4578722 4979202 5357664 5728768 6388207 7101442 7787383 8649646 9609199 10417136 11079246
3122 11079246 11312011 11651245 12052410 11834385 10973871 10264360 9440316 8763262 8126059
3113 8126059 7347851 6684990 6103705 5494859 4957438 4469072 4108125 3930908 3721170 3241618
3103 3241618 2996069 2718942 2524778 2433322 2274584 2101710 2203613 1884580 1600520 1516490
3093 1516490 1574724 1681037 1617719 1402896 1306323 1370577 1428731 1477479 1417136 1267749 1385231
3082A385231m8350j05490j22371l9198J5653O7763j76237o0367J21178j60110
3072H77702M1698o8078J7538O9874j14587j52224R0322R7325r3770k8715k9282
3061G07803p0458J11563j39529j51855O0802k3081L7274O0480k79762R468L3451
3050C56156Q2480J68028n1667k82755M6969L1935q4887P5755R2210j18059J04083
3039D20248r9619n8738J63005O8241j75500J44067j00592q2758M1810j94982J13171
3028B38353J51781j92485K7351j27335j97135K23444K56313j66361j23913n3118
3018C6895M4001K05089r645k40197J66261R3943q2245J9280m1775j317L2055N042
3006B27387k9097j580k20641m8036M3028O470O4447J36685m7957j23100O0459
$$ plain form
3082 1385231 1336881 1231391 1109020 1069822 1085475 1153238 977001 916634 1037812 877702
3072 877702 919400 851322 868860 938734 824147 671923 762245 859570 765800 737085 707803
3061 707803 637345 748908 609379 457524 518326 495245 532519 592999 313237 322705 356156
3050 356156 438636 606664 554997 272242 319211 351146 266259 342014 434224 316165 420248
3039 420248 320629 261891 424896 493137 317637 461704 361112 278354 320164 125182 238353
3028 238353 390134 197649 225000 97665 -99470 123974 380287 213926 90013 36895
3018 36895 80896 285985 276340 36143 202404 296347 214102 233382 191607 190290 222345 227387
3006 227387 198290 196710 -23931 -71967 -28939 -22469 41978 178663 130706 7606 68065
2995F8065J05214K2158n6323j57075K00878N5102n0490l8446K0230q7181J35549
2984B17681K1096n8673j06394r4033J06137J05346K0482j79611l3528N3807p8082
2973b5772J21368m3870L7431L219m0673j9992M2111r0595M9112j855l5076J45783
2961A41191p1272m3220J20452l281R561l7510r5726l8350N8904j3616j8467m1367
2949c2701j12863K01553O9590j4413K1502o3309R324K05953j25744k9355M7176
2938A76713r4650q244K2323j42708L2520N2898r2903J32625P1095k02497J04559
2927E1731k8071j65421J09167L0552l1177Q5667p5186k6833J85119k41017j8810
2916a24279J58155K9250K9996J70k6685n80R7273m1446J66006j63635k23135J51545
$$ plain form
2995 68065 173279 195437 139114 -17961 182917 238019 187529 149083 169313 82132 217681
2984 217681 238777 180104 73710 -20323 85814 191160 211642 32031 -1497 52310 -25772
2973 -25772 95596 51726 89157 92376 51703 31711 73822 -16773 32339 30484 -4592 141191
2961 141191 69919 26699 147151 143870 153431 115921 20195 -18155 40749 27133 8666 -32701
2949 -32701 -145564 55989 125579 111166 132668 69359 78683 284636 158892 129537 176713
2938 176713 82063 73819 96142 -46566 -14046 38852 -54051 78574 149669 -52828 51731
2927 51731 23660 -141761 -32594 -2042 -33219 52448 -22738 -49571 135548 -105469 -124279
2916 -124279 33876 63126 93122 93292 66607 66027 163300 121854 287860 124225 -98910 52635
2904E2635L9046j29067L597J28625j68105L9780j39065Q5376J73113j10465m7576
2893g2106J19218k5796o1232P0318j0677Q6825J8189j44031Q6581p9380p2614
2882h4705J52372R5176l05614N8281m2918o3130N7463j10287J29389J28949q1640
2871f6664p0535J51007m6179J1483r749o9558P5981O5533m4956M9207n7471l3413
2859d5314J73729J13572k62716N5924K8263o8640M9966m94r0319P8338j21051
2848h8742j78594Q2656J8491O4557K06348r6609j59998J06444J08484l9635O5723
2837H9125j05325L5383k1791j27503P7813L4348M798L2638j16125k7880L6619
2826h7900l2020o722Q5892j12244O9378P2547k9680j18686J60295J50820j20242
$$ plain form
2904 52635 91681 -37386 -33789 94836 -73269 -33489 -172554 -87178 85935 -24530 -72106
2893 -72106 47112 21316 -39916 30402 19725 106550 124739 -19292 67289 -12091 -84705
2882 -84705 67667 162843 -142771 -84490 -127408 -190538 -133075 -243362 -113973 14976 -66664
2871 -66664 -137199 13808 -32371 -20888 -30637 -100195 -24214 41319 -3637 45570 -11901 -45314
2859 -45314 128415 241987 -20729 35195 63458 -5182 44784 44290 -46029 32309 -88742
2848 -88742 -267336 -184680 -166189 -101632 104716 8107 -151891 -45447 63037 23402 89125
2837 89125 -16200 19183 -2608 -130111 -52298 -17950 -13152 19486 -96639 -124519 -87900
2826 -87900 -119920 -126642 -40750 -152994 -83616 -11069 -40749 -159435 860 151680 31438
2815C1438o4201j24981R1755j5683O7568N217n6421l4003l3782n2607p4300M2875
2803b17125O4535J11374j01720k5280J8332J27447p2352n9760J28594O5494o2588
2792b3049j55468J11942J54621k9025m8139o5601o1294o747Q2696p0686l550J7869
2780i6431j02032Q5926j23570j11850J18517J16120p9586M1777J8400N7817j916
2769g6828j6469q5580K96917M7153j18677P964k2371q9898J76349q6916o3732
2758c2088l4422j6460l2731j0973p6913O7967J24116j88209r1855N8068k8868
2747b62368J00050L1090n4556J51743M3329k68321J68406M3515k4710J99400j17970
2736I608j64401J3K6751O0640O6686j61267K4712Q5443r7570L2528M8746N009
$$ plain form
2815 31438 -32763 -157744 -65989 -81672 -14104 -8887 -65308 -99311 -133093 -185700 -260000 -217125
2803 -217125 -152590 -41216 -142936 -168216 -149884 -22437 -94789 -154549 -25955 39539 -23049
2792 -23049 -178517 -66575 88046 59021 10882 -54719 -116013 -122760 -40064 -110750 -114300 -96431
2780 -96431 -198463 -112537 -236107 -347957 -229440 -113320 -192906 -151129 -132729 -74912 -76828
2769 -76828 -93297 -178877 118040 165193 46516 54480 32109 -57789 118560 31644 -32088
2758 -32088 -66510 -82970 -115701 -126674 -203587 -135620 -11504 -199713 -291568 -233500 -262368
2747 -262368 -162318 -131228 -185784 -34041 9288 -259033 -90627 -47112 -71822 127578 9608
2736 9608 -154793 -154780 -128029 -67389 -703 -161970 -137258 -51815 -149385 -116857 -68111 -63102
2724f3102q3264j1550j30428J70741j8893j57055K49820j3422r8786M5762J10318
2713A41k01284p45K9506J47823R1038k41781O7853J15974j42322o1026J36515
2702e8308q2934M0925J3530j67460P2057J18590R451K9858j3691j89051K05459
2691b1574m0383k0264J03806J6940m1412j4861j52769k9220J07229j1188p6002
2680a79698K12528l02435J27371J3652p6178J49785L0143j12360L9611q9451l9972
2669b27004J99573N4283j77241K1901k5243R883J4318o3955j54451K25724l7043
2658a59255k6315P8932k15019M1564P8019K7687M1600l4960j07381P5404k6764
2647b26488K6192K06040r3364m9860M7176J94510L5141j01169j3902L6617R3513
$$ plain form
2724 -63102 -146366 -157916 -288344 -117603 -136496 -293551 -43731 -57153 -155939 -110177 141
2713 141 -201143 -201888 -172382 -24559 66479 -175302 -107449 8525 -133797 -194823 -58308
2702 -58308 -141242 -100317 -86787 -254247 -182190 -63600 -54149 -24291 -37982 -227033 -21574
2691 -21574 -61957 -82221 21585 38525 -2887 -17748 -170517 -199737 -92508 -103696 -179698
2680 -179698 32830 -269605 -142234 -128582 -204760 -54975 -24832 -137192 -97581 -187032 -227004
2669 -227004 -27431 26852 -150389 -128488 -153731 -143848 -129530 -193485 -347936 -122212 -159255
2658 -159255 -185570 -106638 -321657 -280093 -202074 -174387 -132787 -167747 -275128 -199724 -226488
2647 -226488 -200296 5744 -87620 -137480 -90304 104206 139347 38178 24276 60893 154406
$$ [...]
##END NTUPLES=NMR SPECTRUM
##END=
