##TITLE=1H_DE-80H_X3
 200.13MHz, d2o
 8 sc
 
 19ns.26.2.2025
##JCAMPDX= 6.0         $$ Bruker NMR JCAMP-DX V2.0
##DATA TYPE= NMR SPECTRUM
##DATA CLASS= NTUPLES
##ORIGIN= UXNMR, Bruker Analytische Messtechnik GmbH
##OWNER= pz
$$ XWIN-NMR		Version 3.5
$$ Wed Jun  3 10:30:32 2026 Russian Standard Time (UT+4h)  Yarkov@DPX200
##.OBSERVE FREQUENCY= 200.1313
##.OBSERVE NUCLEUS= ^1H
##.ACQUISITION MODE= SIMULTANEOUS
##.ACQUISITION SCHEME= undefined
##.AVERAGES= 8
##.DIGITISER RES= 18
##SPECTROMETER/DATA SYSTEM= spect
##.PULSE SEQUENCE= zg30
##.SOLVENT NAME= DMSO
##.SHIFT REFERENCE= (INTERNAL, DMSO, 0, 15.5001)
##AUDIT TRAIL= $$ (NUMBER, WHEN, WHO, WHERE, WHAT)
$$ ##TITLE= Audit trail, XWIN-NMR		Version 3.5
$$ ##JCAMPDX= 5.01
$$ ##ORIGIN= Bruker BioSpin GmbH
$$ ##OWNER= Yarkov
$$ C:/Bruker/XWIN-NMR/data/yarkov2/nmr/H-C/1/pdata/1/auditp.txt
$$ ##AUDIT TRAIL=  $$ (NUMBER, WHEN, WHO, WHERE, WHAT)
(   1,<2026-06-03 10:28:54.90 +0400>,<Yarkov>,<DPX200>,
      <created by zg, POWCHK disabled, PULCHK disabled
       configuration hash MD5:
       00 E9 B6 7A A2 85 ED C7 34 08 36 98 17 FE 4E 26
       data hash MD5: 16K
       1D C7 57 23 1C 7F 6D 08 33 1E 5A 36 99 94 30 2D>)
(   2,<2026-06-03 10:29:26.15 +0400>,<Yarkov>,<DPX200>,
      <Start of raw data processing
       efp BC_mod = 2 LB = 0.25 FT_mod = 6 PKNL = 1 PHC0 = -6359.679 PHC1 = -11.17805 SI = 16K 
       data hash MD5: 16K
       08 8C FE 68 6B 53 DD 8D 2D C4 FB 7B 3D 38 37 56>)
(   3,<2026-06-03 10:29:49.23 +0400>,<Yarkov>,<DPX200>,
      <pk PHC0 = -43.44252 PHC1 = 54.80001 
       data hash MD5: 16K
       97 60 AF B5 2A FA AB 1C 51 4E 9D 6E D3 18 CD AC>)
(   4,<2026-06-03 10:29:52.56 +0400>,<Yarkov>,<DPX200>,
      <abs ABSG = 5 
       data hash MD5: 16K
       6A DC 8F 2E AE F2 C0 03 14 34 E1 FD 7F 70 8F 33>)
$$ ##END=
$$ 
$$ hash MD5
$$ 11 50 D6 46 91 FB 74 87 B1 A3 A7 F4 EE 72 AB AA
##$RELAX= 
##$RELAX= 
##$RELAX= 
##$RELAX= 
##$RELAX= 
##$RELAX= 
$$ Bruker specific parameters
$$ --------------------------
##$DU= <C:/Bruker/XWIN-NMR>
##$EXPNO= 1
##$NAME= <H-C>
##$PROCNO= 1
##$TYPE= <nmr>
##$USER= <yarkov2>
##$AMP= (0..31)
100 100 100 100 100 100 100 100 100 100 100 100 100 100 100 100 100 100 
100 100 100 100 100 100 100 100 100 100 100 100 100 100 
##$AQSEQ= 0
##$AQ_mod= 1
##$AUNM= <au_zg>
##$AUTOPOS= <>
##$BF1= 200.13
##$BF2= 200.13
##$BF3= 200.13
##$BF4= 200.13
##$BF5= 200.13
##$BF6= 200.13
##$BF7= 200.13
##$BF8= 200.13
##$BYTORDA= 1
##$CFDGTYP= 0
##$CFRGTYP= 5
##$CHEMSTR= <none>
##$CNST= (0..31)
1 1 145 1 1 1 1 1 1 1 1 1 1 1 1 1 1 1 1 1 1 1 1 1 1 1 1 1 1 1 1 1 
##$CPDPRG= <>
##$CPDPRG1= <>
##$CPDPRG2= <>
##$CPDPRG3= <>
##$CPDPRG4= <mlev>
##$CPDPRG5= <mlev>
##$CPDPRG6= <mlev>
##$CPDPRG7= <mlev>
##$CPDPRG8= <mlev>
##$CPDPRGB= <>
##$CPDPRGT= <>
##$D= (0..31)
0 0.7 0 0 0 0 0 0 0 0 0 0.03 0 0 0 0 0 0 0 0 0 0 0 0 0 0 0 0 0 0 0 0 
##$DATE= 1780468134
##$DBL= (0..7)
120 120 120 120 120 120 120 120 
##$DBP= (0..7)
150 150 150 150 150 150 150 150 
##$DBP07= 0
##$DBPNAM0= <>
##$DBPNAM1= <>
$$ [...]
##$SUBNAM3= <"">
##$SUBNAM4= <"">
##$SUBNAM5= <"">
##$SUBNAM6= <"">
##$SUBNAM7= <"">
##$SUBNAM8= <"">
##$SUBNAM9= <"">
##$SW= 18.0517328524113
##$SWIBOX= (0..15)
0 0 2 0 0 0 0 0 0 0 0 0 0 0 0 0 
##$SW_h= 3612.71676300578
##$TD= 16384
##$TD0= 1
##$TE= 0
##$TE2= 300
##$TE3= 300
##$TEG= 300
##$TL= (0..7)
0 120 120 120 120 120 120 120 
##$TP= (0..7)
150 150 150 150 150 150 150 150 
##$TP07= 0
##$TPNAME0= <>
##$TPNAME1= <>
##$TPNAME2= <>
##$TPNAME3= <>
##$TPNAME4= <>
##$TPNAME5= <>
##$TPNAME6= <>
##$TPNAME7= <>
##$TPOAL= (0..7)
0.5 0.5 0.5 0.5 0.5 0.5 0.5 0.5 
##$TPOFFS= (0..7)
0 0 0 0 0 0 0 0 
##$TUNHIN= 0
##$TUNHOUT= 0
##$TUNXOUT= 0
##$USERA1= <user>
##$USERA2= <user>
##$USERA3= <user>
##$USERA4= <user>
##$USERA5= <user>
##$V9= 5
##$VALIST= <valist>
##$VCLIST= <CCCCCCCCCCCCCCC>
##$VD= 0
##$VDLIST= <DDDDDDDDDDDDDDD>
##$VPLIST= <PPPPPPPPPPPPPPP>
##$VTLIST= <TTTTTTTTTTTTTTT>
##$WBST= 1024
##$WBSW= 4
##$XGAIN= (0..3)
0 0 0 0 
##$XL= 0
##$YL= 0
##$YMAX_a= 284464
##$YMIN_a= -153870
##$ZGOPTNS= <>
##$ZL1= 120
##$ZL2= 120
##$ZL3= 120
##$ZL4= 120
##$ABSF1= 15.50009
##$ABSF2= -2.55176
##$ABSG= 5
##$ABSL= 3
##$ALPHA= 0
##$AQORDER= 0
##$ASSFAC= 0
##$ASSFACI= 0
##$ASSFACX= 0
##$ASSWID= 0
##$AUNMP= <proc_1d>
##$AZFE= 0.1
##$AZFW= 0.1
##$BCFW= 0
##$BC_mod= 2
##$BYTORDP= 0
##$COROFFS= 0
##$CY= -3
##$DATMOD= 1
##$DC= 0
##$DFILT= <>
##$DTYPP= 0
##$F1P= 0
##$F2P= 0
##$FCOR= 1
##$FTSIZE= 16384
##$FT_mod= 6
##$GAMMA= 0
##$GB= 0
##$INTBC= 1
##$INTSCL= 3.241238e-09
##$ISEN= 128
##$LB= 0.25
##$LEV0= 0
##$LPBIN= 0
##$MAXI= 10000
##$MC2= 0
##$MEAN= 0
##$ME_mod= 0
##$MI= 1.114404
##$NCOEF= 0
##$NC_proc= -8
##$NLEV= 6
##$NOISF1= 3.799351
##$NOISF2= 2.8
##$NSP= 0
##$NTH_PI= 0
##$NZP= 0
##$OFFSET= 15.50011
##$PC= 1
##$PHC0= -6403.122
##$PHC1= 43.62196
##$PH_mod= 1
##$PKNL= yes
##$PPARMOD= 0
##$PSCAL= 0
##$PSIGN= 0
##$REVERSE= no
##$SF= 200.130004321264
##$SI= 16384
##$SIGF1= 3
##$SIGF2= 2
##$SINO= 0.751879
##$SIOLD= 32768
##$SREGLST= <19F.Aceton>
##$SSB= 0
##$STSI= 16384
##$STSR= 0
##$SW_p= 3612.71676300578
##$SYMM= 0
##$S_DEV= 0
##$TDeff= 16384
##$TDoff= 0
##$TI= <>
##$TILT= no
##$TM1= 0
##$TM2= 0
##$TOPLEV= 0
##$USERP1= <user>
##$USERP2= <user>
##$USERP3= <user>
##$USERP4= <user>
##$USERP5= <user>
##$WDW= 1
##$XDIM= 16384
##$YMAX_p= 483169182
##$YMIN_p= -1780779
$$ End of Bruker specific parameters
$$ ---------------------------------
##NTUPLES= NMR SPECTRUM
##VAR_NAME=  FREQUENCY,     SPECTRUM/REAL,   SPECTRUM/IMAG
##SYMBOL=    X,             R,               I
##VAR_TYPE=  INDEPENDENT,   DEPENDENT,       DEPENDENT
##VAR_FORM=  AFFN,          ASDF,            ASDF
##VAR_DIM=   16384,         16384,           16384
##UNITS=     HZ,            ARBITRARY UNITS, ARBITRARY UNITS
##FACTOR=    0.220516191357247, 1,           1
##FIRST=     3102.03701574677, 0,            0
##LAST=      -510.679747259006, 0,           0
##MIN=       -510.679747259006, -1780779,    0
##MAX=       3102.03701574677, 483169182,    0
$$ Real data points
##PAGE= N=1
##DATA TABLE= (X++(R..R)), XYDATA
$$ [...]
6535E100599k7912M0689l2189k47465J12277J66810j65222l58316M95534M89848
6525E574653L48101K84938m63859L33816K84965k02355k51477n66422o37654L06437
6515E011143L91827m56158m75720O96351j01370k96521J193011P16050o53367
6506F025246k33857L79540l82331J07866o7112n9521J22669J80644J77208j37804
6496F112548L80779L08362k50345L39561M38514m14152P5324J71789O2889l65369
6486F859900K01680o97037J81646J303115L07501L35790j21593N0587O65412m00226
6476H686775j81930n34356P0838o28707j47619N50732j20642r45712j44187j85170
6466F420022L78046k58444J80082r5824l81714M8963k5848M26699n09463p70009
$$ plain form
6535 5100599 5072687 5113376 5081187 4833722 4945999 5112809 4947587 4589271 5084805 5574653
6525 5574653 5922754 6207692 5743833 6077649 6362614 6160259 5908782 5342360 4704706 5011143
6515 5011143 5402970 4946812 4471092 5167443 5066073 4769552 5962563 6678613 6025246
6506 6025246 5791389 6170929 5788598 5896464 5829352 5769831 5892500 6073144 6250352 6112548
6496 6112548 6493327 6801689 6551344 6890905 7329419 6915267 6990591 7162380 7225269 6859900
6486 6859900 7061580 6364543 6546189 7849304 8156805 8492595 8371002 8421589 9087001 8686775
6476 8686775 8504845 7970489 8041327 7412620 7265001 7815733 7695091 6749379 6605192 6420022
6466 6420022 6798068 6539624 6719706 6623882 6242168 6291131 6265283 6691982 6182519 5412510
6456E412510k28240N7254K29168J06359m0132j184608K97233K72437k46264l06987
6446D368730O30484l7116o05527O46803K9817j36377L88392o31028k49195N92048
6436D997031l52011q5207L98384M52090j083264j1003M96130L47578N90458l93711
6426E356475p6073k0818L12913k41372k41671M68848j131836j050468Q03302O08178
6416D787478k82322m35220L93764N61806q5393K85962M17199J10330r54192Q45319
6406E644731K71883k18817m28161j15440l45931n46651L86198J70778J03799K65081
6396E187470n0632n25852r3434P77387N8341k87498k52569K48231K23637N83255
6386E868336m81550o12996o4037R9149n7226P09132L01064j57825J6035k499q1825
$$ plain form
6456 5412510 5184270 5241524 5470692 5577051 5536919 4352311 4649544 4921981 4675717 4368730
6446 4368730 4999214 4962098 4356571 5003374 5033191 4896814 5285206 4654178 4404983 4997031
6436 4997031 4645020 4559813 4958197 5410287 4327023 4316020 4812150 5159728 5750186 5356475
6426 5356475 5280402 5259584 5572497 5331125 5089454 5558302 4426466 3375998 4179300 4787478
6416 4787478 4505156 4069936 4463700 5025506 4940113 5226075 5643274 5753604 4799412 5644731
6406 5644731 5916614 5697797 5269636 5154196 4808265 4261614 4647812 4818590 4922389 5187470
6396 5187470 5136838 4610986 4517552 5294939 5353280 5065782 4813213 5061444 5285081 5868336
6386 5868336 5386786 4773790 4709753 4808902 4751676 5460808 5761872 5604047 5620082 5617583 5535758
6375E535758O36770m28202o85579K39675L93845n48882J92921N71636o10214m11930
6365D885798O23676O75351P4227o99502K64966J69752J86591m03191n14068K89731
6355E553331J11132m12925j48532M26738p14912j99915R0937O33149j44721J90194
6345E384476k08388L17448N4424l3713l15478K96714j35398J5416M23900k66985
6335E532416l58958K21N69056K88158L82548p25458j78738P02505k19416j59286
6325E833048K71348k09020j64495K85665L58287k13234k15769N0867j23070j6582
6315E857045J7110q7968J9454J62700q0658k61577J503j85485J125584P02346
6305G270054K41190q85354P5199P03203K80797n19293L4513K62323k23962N64966
$$ plain form
6375 5535758 6172528 5744326 5058747 5298422 5692267 5143385 5336306 5907942 5297728 4885798
6365 4885798 5509474 6184825 6259052 5559550 5824516 5994268 6180859 5777668 5263600 5553331
6355 5553331 5664463 5251538 5103006 5529744 4814832 4614917 4705854 5339003 5194282 5384476
6345 5384476 5176088 5493536 5547960 5514247 5198769 5495483 5360085 5375501 5799401 5532416
6335 5532416 5173458 5173679 5742735 6030893 6413441 5687983 5509245 6211750 5992334 5833048
6325 5833048 6104396 5895376 5730881 6016546 6374833 6161599 5945830 5996697 5873627 5857045
6315 5857045 5874155 5786187 5805641 5968341 5887683 5626106 5627609 5442124 6567708 7270054
6305 7270054 7511244 6625890 6701089 7404292 7685089 7165796 7200309 7462632 7238670 7803636
6295G803636M61091m094j27834J81631M9617M29577R55967L57382K25448L84406
6285A0716827J70092N92857N55289J72593n70325J60766N20311L46038N62172
6276A3226620Q86194N73036K61814N12266J675769M78481J707004J173612J930966
6267B2425762J581920K055536K402579K843902L994492M285071N546562P417251
6259E2553075Q946698J0200309R961396R322195Q186216N365941K277675k9278
6251A06784227l151959m636300m455729l600277k888869k213389J37487L041034
6243H9016225N507097N763756N970703M884774J323961j656889m157467o632280
6235A00019880q393356r122854r113831r014758p643883o222062n938233n088097
$$ plain form
6295 7803636 8264727 8260633 8132799 8314430 8364047 8793624 9749591 10106973 10332421 10716827
6285 10716827 10886919 11479776 12035065 12207658 11637333 11798099 12318410 12664448 13226620
6276 13226620 14112814 14685850 14947664 15459930 17135699 17614180 19321184 20494796 22425762
6267 22425762 24007682 26063218 28465797 31309699 35304191 39589262 45135824 52553075
6259 52553075 61499773 71700082 81661478 90983673 99169889 104535830 106813505 106784227
6251 106784227 103632268 98995968 94540239 90939962 88051093 85837704 85975191 89016225
6243 89016225 94523322 100287078 106257781 111142555 112466516 110809627 106652160 100019880
6235 100019880 91626524 82503670 73389839 64375081 56731198 50509136 44570903 39482806
6227C9482806l464616l264263l779555k007138j285842k121078k171623o67216
6219B0721475j004187q58483q04446k4441n46190r52185r83263j64650j11755
6210A5271875o11980o53175k38882j07877j007804L00673K53363j99970K28364
6201A3234587l04638N41738N33063N38561n4906l87406K19708j243096n88520
6192A2489091l10389j31555n80853j75639l06942K80466n15086K09761L9642P87500
6182A1785996r37903L55746J34704M9190l7974Q23111j04625o53304P97629K64826
6172A2477396l45904Q25381Q2625K70917o7725J552597K24243M69067K13034l35632
6162A5365999L13342N63571J47006m18425L07285m86372o5928J080856K27624
$$ plain form
6227 39482806 36018190 32753927 28974372 26967234 25681392 23560314 21388691 20721475
6219 20721475 19717288 18858805 18054359 18029918 17483728 16531543 15548280 15383630 15271875
6210 15271875 14659895 14006720 13767838 13659961 12652157 12952830 13206193 13006223 13234587
6201 13234587 12929949 13471687 14004750 14543311 14488405 14100999 14320707 13077611 12489091
6192 12489091 12178702 12047147 11466294 11290655 10983713 11264179 10749093 10958854 10998496 11785996
6182 11785996 10848093 11203839 11338543 11387733 11349759 12172870 12068245 11414941 12212570 12477396
6172 12477396 12131492 12956873 13039498 13310415 13242690 14795287 15019530 15488597 15701631 15365999
6162 15365999 15679341 16242912 16389918 15971493 16278778 15792406 15726478 16807334 17034958
6153A7034958k32114L34656K5705N30311N47822J288495j68863M40906M17530
6144B0219406O50888N99952Q60350j3120J94503Q41690J732085Q59695R43791
6135B6889240R34281J224900J462224J316720Q06984O51481O99862J108611L88944
6126C5483247P72053J050560J755998m12679n4075k01772J21036p86789r98642
6117C6728937p85395r70786j029056j813833j481328r31386j331093j736612r35292
6108B5714156o93030q39544p64303O7305j153417J76834M09843K83331j71640
6099B3029535J94816q0456K16466P00942L10548M09864l637R00288J265352N94630
6089B7538348J363446J350269J508931J538753K138012K173769K680111J959402
$$ plain form
6153 17034958 16802844 17137500 17163205 17693516 18241338 19529833 19360970 19801876 20219406
6144 20219406 20870294 21470246 22330596 22317476 22511979 23353669 25085754 25945449 26889240
6135 26889240 27823521 29048421 30510645 31827365 32634349 33285830 33985692 35094303 35483247
6126 35483247 36255300 37305860 39061858 38649179 38595104 38393332 38514368 37727579 36728937
6117 36728937 35943542 34972756 33943700 32129867 30648539 29717153 28386060 26649448 25714156
6108 25714156 25021126 24181582 23417279 23484584 22331167 22508001 22917844 23201175 23029535
6099 23029535 23224351 23143895 23360361 24061303 24371851 24781715 24778078 25678366 26943718 27538348
6089 27538348 28901794 30252063 31760994 33299747 35437759 37611528 40291639 42251041
6081D2251041K354415K658369K868687K596973K348648J888115J126394J659599
6073E9752241J158311M98177l19227k96073j342126j527003q76536j391742j532540
6064E4123482j415439j916302j720130j844465j749885j624743k284911j442929
6056D0124678j243785p60095j453187r81192n52889j338128q55743m24397k25830
6047C2289432j412058q42849L16097O38187j016967m45327M5438j80722l78853
6038B9012378k94614o32835q60093j154233j82274L3267n71523j282025j479466
6029B2588582p21161o91199k08374p94197o72572m02920J96890o90613j068571
6020A7535865Q1076o64975o73979P26748m1836j682508p88440l96420L21277K09587
$$ plain form
6081 42251041 44605456 47263825 50132512 52729485 55078133 56966248 58092642 59752241
6073 59752241 60910552 61408729 61089502 60793429 59451303 57924300 57047764 55656022 54123482
6064 54123482 52708043 50791741 49071611 47227146 45477261 43852518 41567607 40124678
6056 40124678 38880893 38120798 36667611 35686419 35133530 33795402 32939659 32515262 32289432
6047 32289432 30877374 30034525 30350622 30988809 29971842 29526515 29571953 29391231 29012378
6038 29012378 28717764 28084929 27224836 26070603 25888329 25921596 25350073 24068048 22588582
6029 22588582 21867421 21176222 20967848 20173651 19501079 19098159 19295049 18604436 17535865
6020 17535865 17616941 16951966 16277987 17004735 16962899 15280391 14491951 14095531 14416808 14626395
6010A4626395j93496l9764k78058l56419k23486M96669j90187o11019l15950k38154
6000A2676531k40726M01365J25406l74263j8619J87322J51640k74717M05936P34053
5990A3773928L95463Q0347J179799N45717K96657N7729J007320P69215N2631J026694
5980A9185500J233028J186913K67330J261335J493977J329645J285025J046906
5972B8289659Q34107R97604J986362J228156J476045J341516L51320P5137L08855
5963C6888761N85626l3390j021983j091551l83628j15832j05501j183344m44952
5954C3094206k39269k93741K72985O56506p42630L32945J850212Q72499J062975
5945C6866688J894436J379965R72495J698695K346606K359432K455486J983029
$$ plain form
6010 14626395 14432899 14393135 14115077 13758658 13535172 14031841 13841654 13230635 12914685 12676531
6000 12676531 12435805 12837170 12962576 12588313 12569694 12757016 12908656 12633939 13039875 13773928
5990 13773928 14169391 14249738 15429537 15975254 16271911 16329640 17336960 18106175 18158806 19185500
5980 19185500 20418528 21605441 21872771 23134106 24628083 25957728 27242753 28289659
5972 28289659 29123766 30121370 32107732 33335888 34811933 36153449 36504769 36579906 36888761
5963 36888761 37474387 37440997 36419014 35327463 34943835 34828003 34722502 33539158 33094206
5954 33094206 32854937 32561196 32834181 33490687 32748057 33081002 34931214 35803713 36866688
5945 36866688 38761124 40141089 41113584 42812279 45158885 47518317 49973803 51956832
5937E1956832K627567K639216L379195K319242K319482J227244Q20036M16436
5929F7705250K49854l85481j309227k079275k478139j894337k627666j853589
5921E5327390k563295k442204k081974j420907j368149j017349o46966j099052
5913D2687494q40474J96598K97489l78976j88072O15221N46555N53478J204947
5904D4694260P15129O81623J881125J998693J800636J620975J659499J713360
5896E6765300L266341K170222K258903L070546K848023K351706K393181L082350
5888G8206572J894473K739011K553645K248116J337171J772303J038517R32830
5880I2722638P89064R96799P4298J55164j85619m7276k59280o21837j053574j628562
$$ plain form
5937 51956832 54584399 57223615 60602810 62922052 65241534 66468778 67288814 67705250
5929 67705250 67955104 67569623 66260396 64181121 61702982 59808645 57180979 55327390
5921 55327390 52764095 50321891 48239917 46819010 45450861 44433512 43786546 42687494
5913 42687494 41847020 42043618 42341107 41962131 41774059 42389280 42935835 43489313 44694260
5904 44694260 45409389 46091012 47972137 49970830 51771466 53392441 55051940 56765300
5896 56765300 60031641 62201863 64460766 67531312 70379335 72731041 75124222 78206572
5888 78206572 80101045 82840056 85393701 87641817 88978988 90751291 91789808 92722638
5880 92722638 93511702 94508501 94582799 94737963 94552344 94505068 94245788 93623951 92570377 90941815
5870I0941815j557686j362718j580226k855147k351738j890799j975989k116373
5862G5251139k594758k378782k688413j952135k021946k346922k719251k390913
5854E6158019k124005j688383r47758k306783k376458j940948m25498r39366q59685
5845D2549135k600477j360385p08421r52589j046049k23535j800957j133968p52013
5836C1970741k47076j072291r01273j136930j63167R159j280188n88505j07265
5827B6483205m57230j001873r16230j23887q94512o52151p3708k39323j179865
5818B0944426j582792j59717l40008p28585k61165L22476p59047j027012k22902
5809A6185674n1164p50335p43148p54255O9209k62285p90898r89350m06562j046372
$$ plain form
5870 90941815 89384129 88021411 86441185 83586038 81234300 79343501 77367512 75251139
5862 75251139 72656381 70277599 67589186 65637051 63615105 61268183 58548932 56158019
5854 56158019 54034014 52345631 51397873 49091090 46714632 44773684 44348186 43408820 42549135
5845 42549135 39948658 38588273 37879852 36927263 35881214 35657679 33856722 32722754 31970741
5836 31970741 31723665 30651374 29750101 28613171 28450004 28459163 27178975 26590470 26483205
5827 26483205 26025975 25024102 24107872 23983985 23089473 22437322 22363614 22124291 20944426
5818 20944426 19361634 19201917 18861909 18133324 17872159 18194635 17435588 16408576 16185674
5809 16185674 16134510 15384175 14641027 13886772 13955981 13693696 12902798 11913448 11506886 10460514
5799A0460514l76326o8488k65598j02660r57039L8171j330R3682n79322j32210
5789H109394J52306K00528k48120l75534L95006j70726q50084k52444K02938m48114
5779F715150q78522L28311K44832q94802K57266J13396j24242n35745P84960l7262
5769E973342j19233Q0286M85410l70186k03317L9720K2901r20903k78848L23449
5759E032621J3532m26287l2810l89874M02493j26530K86601J32707j147141K39459
5749C984771N99332k21818n03739J42561J30929L47546J11880J66604k56036K0595
5739D522625K79302O61902r02929l02971K93218K22105p81165M29609J4986p67367
5729C669315N4745N03923l21542J48640K58868m89182K93723K41948k30563K80114
$$ plain form
5799 10460514 10084188 10015700 9750102 9647442 8690403 8728574 8727244 8820926 8241604 8109394
5789 8109394 8261700 8462228 8214108 7838574 8233580 8062854 7212770 6960326 7163264 6715150
5779 6715150 5836628 6164939 6409771 5514969 5772235 5885631 5761389 5225644 6010604 5973342
5769 5973342 5854109 5934395 6419805 6049619 5846302 5886022 5908923 4988020 4709172 5032621
5759 5032621 5046153 4619866 4587056 4197182 4599675 4473145 4759746 4892453 3745312 3984771
5749 3984771 4584103 4362285 3858546 4001107 4132036 4479582 4591462 4758066 4502030 4522625
5739 4522625 4801927 5463829 4560900 4257929 4551147 4773252 3992087 4421696 4436682 3669315
5729 3669315 3724060 4227983 3906441 4055081 4313949 3824767 4118490 4360438 4129875 4409989
5719D409989j00700j11J66110k16475l36657p58093P45011O0842K09955k40467
5709C939404K82362k82119m8914j07318M30633n84357O38614K63029m01099k70668
5699C859567P12351K9992P3480P61350n9966J37362K43202n1497P69602L23581
5689F799024l8868l17395M68883N00968N0362M50228L36337n581j30934M23234
5679H536258M81557L28941l0187K77167j49619j45205l00930N47231j28018M63326
5669I880521o54098j57411j80093N39307l93713j27259O35944k79611k86390K81576
5659I258773R1766m39867r35857m44748k98568J66957j83327p42835j124041j10255
5649E237998L89556j65811n00090j02754m04386K11818M49389N38091J86379p60074
$$ plain form
5719 4409989 4309289 4309178 4475288 4258813 3922156 3164063 3909074 3969916 4179871 3939404
5709 3939404 4221766 3939647 3890733 3783415 4214048 3629691 4268305 4531334 4130235 3859567
5699 3859567 4571918 4601910 4675390 5436740 5376774 5514136 5757338 5705841 6475443 6799024
5689 6799024 6760156 6442761 6911644 7412612 7462974 7913202 8249539 8243958 8113024 8536258
5679 8536258 9017815 9346756 9316569 9593736 9444117 9298912 8997982 9545213 9417195 9880521
5669 9880521 9226423 9069012 8888919 9428226 9034513 8907254 9543198 9263587 8977197 9258773
5659 9258773 9350539 8910672 7974815 7530067 7231499 7398456 7215129 6472294 5348253 5237998
5649 5237998 5627554 5461743 4961653 4858899 4454513 4666331 5115720 5653811 5840190 5080116
5639E080116o08363P82226O62289p7438L65641K25710k48599n22666k36970L39451
5629E761397k69257o53153L71054J006759J59746l53887L95754L90571O48993
5620G457977J9869j27788P57105r7435L64814q26169P7243l32180j02897J55386
5610G345925L21900k20893J80180J578393Q04049J344643Q38321J145676O67491
5601A4005685K229150J175003J162513O86039R95946L09535L20990n60270j08686
5592B0215905m67258J37310l41877M93622J47189P0524M92498J015681J304283
5583B3067877Q45461J22665J515452J422724M17118j88644J242261J710407R85430
5574C1140751J416633K228532L096575K725359M015299L303166L498760J735849
$$ plain form
5639 5080116 4471753 5253979 5916268 5838830 6204471 6430181 6181582 5658916 5421946 5761397
5629 5761397 5492140 4838987 5210041 6216800 6376546 6022659 6418413 6808984 7457977
5620 7457977 7477846 7350058 8107163 8009728 8374542 7548373 7625616 7293436 7190539 7345925
5610 7345925 7667825 7446932 7627112 9205505 10009554 11354197 12192518 13338194 14005685
5601 14005685 16234835 17409838 18572351 19258390 20254336 20563871 20884861 20324591 20215905
5592 20215905 19748647 19885957 19544080 20037702 20184891 20255415 20747913 21763594 23067877
5583 23067877 23913338 24036003 25551455 26974179 27391297 27202653 28444914 30155321 31140751
5574 31140751 32557384 34785916 37882491 40607850 44623149 47926315 51425075 53160924
5566E3160924M92773k22771q80727k298446k037811k051428p93239q01661J48224
5557D4715838J087057K237545K009680K441815K277503K721455K91865p11736
5549E7071022j719209j628945k949249k187627j810209j296674j269602K21070
5541D4430577Q73449Q71126J481943J000977J038818M97158l32441j742089r73073
5532D7146445k185837j412409j107714o85074r29617L57739M73886M31425J081812
5523D3170656J208435M05075Q15097n02768j776886k327610k560426l019408k137466
5514C3274699k590842j912368j629119j896150j594201l76943j664922q00511
5506B0809643j30250l89051n05631O15040k0662J31684K71890P29026O36769K07715
$$ plain form
5566 53160924 53653697 53430926 52550199 50251753 48213942 46162514 45369275 44567614 44715838
5557 44715838 45802895 48040440 50050120 52491935 54769438 57490893 57782758 57071022
5549 57071022 55351813 53722868 50773619 48585992 46775783 45479109 44209507 44430577
5541 44430577 45304026 46175152 47657095 48658072 49696890 50194048 49861607 48119518 47146445
5532 47146445 44960608 43548199 42440485 41755411 40825794 41183533 41657419 42088844 43170656
5523 43170656 44379091 44784166 45599263 45096495 43319609 40991999 38431573 35412165 33274699
5514 33274699 30683857 28771489 27142370 25246220 23652019 23275076 21610154 20809643
5506 20809643 20679393 20290342 19784711 20399751 20379089 20510773 20782663 21511689 22148458 22356173
5496B2356173J624828J782547K396800K779836L388946L817319M788089M997556
5488D7932094M904931J936436P02763q75812m156907m437656l851963m740137
5480C7413749l667115k419472j708889j104487j111367o40808n91166l76135l51257
5471B5443053K71137K57637O82024J602937J463454J571377K011380L060241L363266
5462C9726506N443585O434200Q356685J0408154J2190836J3425049J1354194O415199
5454A13754408L297866k437555q959920p933368o432045m505466l326267j6558
5446H3441095K203093M266101N298524O446857P250876P986641P315015N272398
5438A29480600L887296K898332J783576R80364J529459K419567K738088L328962
$$ plain form
5496 22356173 23981001 25763548 28160348 30940184 34329130 38146449 42934538 47932094
5488 47932094 52837025 54773461 55476224 54600412 50443505 46005849 42153886 37413749
5480 37413749 33746634 31327162 29618273 28513786 27402419 26761611 26170445 25794310 25443053
5471 25443053 25714190 25971827 26653851 28256788 29720242 31291619 33302999 36363240 39726506
5462 39726506 45170091 51604291 59960976 70369130 82559966 95985015 107339209 113754408
5454 113754408 117052274 114614719 105654799 97721431 91289386 86783920 83457653 83441095
5446 83441095 85644188 89910289 95208813 101655670 108906546 116893187 124208202 129480600
5438 129480600 133367896 136266228 138049804 139030168 140559627 142979194 145717282 149046244
5430A49046244N386987N909370O281426O429210P171325N526419J675569k024378
5422A85402172n030698j1448124j5646392j3775209j1588578r645636o937880
5415A11329655l767078j607775j21835P99651J063193J438253O14711R43953M5879
5406A10738607p79810j925449o65857J05962j34694l92174j00376p00613r09490
5397A05236106j139955k040223j644920k584786k974996k984140l036187m798560
5389H4032339p792588o723290n849973n231617m199437l576433l076103j465986
5381D6116912k166267k010021k415673k353156k771637k502007j633919k363119
5373B7901113k159387j284928j100844j030621j560415m63757o56442k15339J16356
$$ plain form
5430 149046244 154433231 160342601 166624027 173053237 180224562 185750981 187426550 185402172
5422 185402172 180371474 168923350 153276958 139501749 127913171 118267535 111329655
5415 111329655 107562577 105954802 105832967 106632618 107695811 109134064 109748775 110692728 110738607
5406 110738607 109958797 108033348 107367491 107473453 107338759 106946585 106846209 106145596 105236106
5397 105236106 104096151 102055928 100411008 97826222 94851226 91867086 88830899 84032339
5389 84032339 76239751 69516461 63666488 58434871 54235434 50659001 47582898 46116912
5381 46116912 43950645 41940624 39524951 37171795 34400158 31898151 30264232 27901113
5373 27901113 25741726 24456798 23355954 22325333 20764918 20301161 19644719 19429380 19545736
5364A9545736r78122q10728r71455J85819m81886p11157j97244L30826q0262m25026
5354A5406501L93359l07229k28245j90606L50662J48231o63369o72253j145407
5345A3091644o46471q61656l59053k44437q07882o91849m00599n52670L05444
5336H832471k68388q7436j098636M42395J78461L33543n02595l47354L34444m44426
5326G372479R3951k0497k36037m69436K04446n71454j14117M44946n92366k63229
5316E848686K31931K64637l86640n07802r7903K30448m79444m38764L71221K55709
5306E292079j213206j76691j06660J64227l51706m93882N6369K84286K36900M08895
5296D100611M08615K25668J35975k65330p98419p8211J53465k13629k70341j33147
$$ plain form
5364 19545736 18567614 17756886 16785431 16971250 16489364 15778207 15580963 15911789 15831527 15406501
5354 15406501 15799860 15492631 15264386 15073780 15424442 15572673 14909304 14237051 13091644
5345 13091644 12445173 11583517 11224464 10980027 10172145 9480296 9079697 8527027 8832471
5336 8832471 8564083 8476647 7378011 7820406 7998867 8332410 7829815 7482461 7816905 7372479
5326 7372479 7466430 7445933 7209896 6740460 6944906 6373452 6259335 6704281 6111915 5848686
5316 5848686 6080617 6345254 5958614 5450812 5352909 5583357 5103913 4665149 5036370 5292079
5306 5292079 4078873 3902182 3795522 3959749 3608043 3114161 3170530 3454816 3691716 4100611
5296 4100611 4509226 4734894 4870869 4605539 3807120 3728909 3882374 3668745 3398404 3265257
5286C265257l94700l00218k39959N35092J88078k13785l66141R8846O36290k45621
5276B963139j65567K72063Q2964k02006l78655L30737K37379l98869l05116p1953
5266B364116k10867o98837n1498j91150j05645k53084k80236L81317M33273k27871
5256A159518m18410O2269P56705l8405l74713n9086J35924m1716M54550l46974
5246A289662O9282k22922k56477M02381J07832k79961k46296j17108J8957L4956
5236H00306k10835j38203J35386J45813n4274J38797o8351k25352Q9439l53541
5226B59185O6399J85458J44221J25205O04243n63358m21339k24956o5721J51940
5216B61277r3607k29816q9165m2377J57774j54349K77725n4852k90967k7265L56958
$$ plain form
5286 3265257 2870557 2570339 2330380 2865472 3053550 2839765 2473624 2572470 3208760 2963139
5276 2963139 2797572 3069635 3152599 2950593 2571938 2902675 3140054 2741185 2436069 2364116
5266 2364116 2153249 1454412 1402914 1211764 1106119 853035 572799 954116 1387389 1159518
5256 1159518 741108 803377 1560082 1521677 1146964 1087878 1223802 1182086 1636636 1289662
5246 1289662 1358944 1136022 879545 1281926 1389758 1109797 863501 746393 765350 800306
5236 800306 589471 451268 586654 732467 678193 816990 748639 523287 612726 259185
5226 259185 325584 511042 655263 780468 1384711 821353 400014 175058 109337 261277
5216 261277 167670 -62146 -151311 -193688 -35914 -190263 87462 32610 -258357 -285622 71336
5205G1336n3674M1065o13770L02960L68202O2419M80061q7678p93868J54361R80474
5194I11888L65481q66021n18003j05046j38718l38744j67673L12119n31905k48730
5184a325352K60416M21496L43227J75100m38427P31038n5418K26054K16792J3637
5174E68563m82350k19866n12459r6433L80957l8971j013146K47460L04384l91999
5164a253860M44958N96625N1186l7638K80095K6475M84206k0461m02738k50547
5154h1699O7864m51326L25287l1255o2010l69293Q7003K66675K28903j54561j45195
5143c19607l8756L79083K21037l02342l58570J269506j04135o95843l02122Q53386
5133F01637l2726j104679N01988N83092j42583j219025N75342Q18302j26294j013501
$$ plain form
5205 71336 17662 58727 -555043 -252083 116119 178538 658599 570921 -222947 -68586 911888
5194 911888 1277369 411348 -106655 -211701 -350419 -689163 -856836 -544717 -1076622 -1325352
5184 -1325352 -1064936 -643440 -300213 -125113 -563540 167498 112080 338134 554926 568563
5174 568563 86213 -133653 -646112 -742545 -361588 -400559 -1413705 -1166245 -861861 -1253860
5164 -1253860 -808902 -212277 -161091 -198729 81366 107841 592047 571586 168848 -81699
5154 -81699 -13835 -465161 -139874 -171129 -233139 -602432 -515429 -248754 -19851 -174412 -319607
5143 -319607 -358363 20720 241757 -60585 -419155 850351 746216 50373 -251749 601637
5133 601637 568911 -535768 -33780 549312 406729 -812296 -236954 581348 455054 -558447
5123e58447M91470J017522J91243j069658P45200j18735L74063k01653j1594k75572
5113E83839p5785j26652J61886R8120N31321R0606o00934l09559P48509L9656
5103A141007q08363L34047P87170j41766p99813N66241J46129q4436J24412j60981
5093A103647k29021k499k71290L55835j03005o6687q87419L9165Q05203J73439
5083I17368P7701o24988N90031J37604k16789K80859L72268j41623j48990j95906
5073A047535L41789K17773j052315j39489N22087k22313o06773N31715K05091
5064H45100j63176K2573L69032Q5129o07800K11433Q7513L94056J44253L3323
5054A421436r6536P8866l97345j06084P79048J8274n37789k67289P6867j57596
$$ plain form
5123 -558447 -66977 950545 1141788 72130 817330 698595 1072658 871005 859411 583839
5113 583839 508054 381402 543288 641408 1172729 1263335 662401 352842 1101351 1141007
5103 1141007 332644 666691 1453861 1312095 512282 1078523 1224652 1140216 1264628 1103647
5093 1103647 874626 872127 600837 956672 853667 786980 -100439 -61274 743929 917368
5083 917368 995069 370081 960112 1097716 880927 1161786 1534054 1392431 1243441 1047535
5073 1047535 1389324 1607097 554782 415293 937380 715067 108294 640009 845100
5064 845100 681924 704497 1073529 1158658 550858 762291 849804 1243860 1388113 1421436
5054 1421436 1324900 1403766 1006421 900337 1679385 1697659 1159870 892581 969448 811852
5044H11852N75142r6766Q8381r428P36935j38049k91016K29838k23446m01495
5034A281948J82424L88419j70125O0912O16476k60636j08741J47519O61238K29510
5024C028944p2817r2982L09040N80847j29529m78857M33070Q8068j83291l34015
5014C148478L21308J2287L85930L77058K45847M92028K22589O14523M7010J21574
5004E988632Q32894k32427J63305J067112M62006m40448L74440J109783N83715
4995I909012N16208L5307J516746N33787P44857R58257J712833J521544L29053
4986A7777604J217535J348354P60597Q03121J184326R92107P75881J483505J456599
4977B7799629J092973L16108O31586J005994P51076R30591M17904j88473O04759
$$ plain form
5044 811852 1386994 1290228 1378609 1369181 2106116 1968067 1677051 1906889 1683443 1281948
5034 1281948 1464372 1852791 1682666 1743578 2360054 2099418 1990677 2138196 2799434 3028944
5024 3028944 2956127 2863145 3172185 3753032 3623503 3144646 3577716 3665784 3482493 3148478
5014 3148478 3469786 3482073 3868003 4245061 4490908 4982936 5205525 5820048 5867058 5988632
5004 5988632 6821526 6589099 6752404 7819516 8281522 7841074 8215514 9325297 9909012
4995 9909012 10425220 10460527 11977273 12511060 13255917 14214174 15927007 17448551 17777604
4986 17777604 18995139 20343493 21104090 21907211 23091537 24083644 24859525 26343030 27799629
4977 27799629 28892602 29208710 29840296 30846290 31597366 32527957 32945861 32757388 33362147
4968C3362147Q36912q17772m72394M53855l8557q66211o4588N10496p91966q23969
4958C1287953k14084o41879p72531m58444l22127l61640o29502l04150l67465
4949B7216131m79792K05444N73518M8399n5380L56322M26309K99936J356152J346481
4939C1293520J923584N14251J093016K157557J704725J993886J797311J933026
4931D4410876J697434K616780K259990J821578K504862K567114J032243J972173
4923F0883050J891187J642958M63782M36493Q17108Q34088M56629q6505L04390
4914F7643180O8504o02996n30928L5266l57068p98149j202833n81789j345635
4905F2327552k262523j526022j671372j554420k700839j995995k069185j773165
$$ plain form
4968 33362147 34199059 33381287 32908893 33362748 33324191 32457980 32393392 32903888 32111922 31287953
4958 31287953 31073869 30431990 29659459 29201015 28878888 28517248 27887746 27583596 27216131
4949 27216131 26736339 26941783 27515301 27563700 27508320 27864642 28290951 28590887 29947039 31293520
4939 31293520 33217104 33731355 34824371 36981928 38686653 40680539 42477850 44410876
4931 44410876 46108310 48725090 50985080 52806658 55311520 57878634 58910877 60883050
4923 60883050 62774237 64417195 64880977 65317470 66134578 66968666 67425295 67338790 67643180
4914 67643180 67711684 67108688 66577760 66613026 66255958 65457809 64254976 63673187 62327552
4905 62327552 60065029 58539007 56867635 55313215 52612376 50616381 48547196 46774031
4897D6774031j548864j845518j499886j516744j405450j218505m91944j039931
4889C6207189r37879j085136r36770k83336m00947j165013n51103l77282q229
4880C0461494r5274L93062l15639O09595n35849K55060P75402O70946j29516M44079
4870C2533360N20230N10513K11609K02677N89714J112197J331538P36399R45131
4861C8693368J318486J521552R90065J455606K098349J419841J062549P84179
4853D9343995J439923J059072J188778J736460J285824R99055J484022K083183
4845F0620312J573610K074356J761091K711456K689410K765682K464731L181597
4837G9842245L083377M046413L006163K500027K786324L508477L230550J499304
$$ plain form
4897 46774031 45225167 43379649 41879763 40363019 38957569 37739064 37247120 36207189
4889 36207189 35269310 34184174 33247404 32964068 32563121 31398108 30847005 30469723 30461494
4880 30461494 30366220 30759282 30443643 31053238 30517389 30772449 31547851 32218797 32089281 32533360
4870 32533360 33053590 33564103 33775712 33978389 34568103 35680300 37011838 37748237 38693368
4861 38693368 40011854 41533406 42523471 43979077 46077426 47497267 48559816 49343995
4853 49343995 50783918 51842990 53031768 54768228 56054052 57053107 58537129 60620312
4845 60620312 62193922 64268278 66029369 68740825 71430235 74195917 76660648 79842245
4837 79842245 82925622 86972035 89978198 92478225 95264549 98773026 102003576 103502880
4829A03502880J332167J084401J309515K4329j6581O2688l98807r40640m24493
4820A05535459j35717m12318r18523q40455j81362K37314K13365k72660O7045
4811A03292148K81352J233640L28375N85281P69223N29214L06321J171606J422019
4802A09919179J303575L40406J678594J288825Q31068L41053P52708P38234j88711
4793A17004931m34006m43103j216721r62129j117957j767421k328681k354148
4785A06380765k466751k343028j720102k073723k271893k388601k152965j542228
4777H9421474j800248j960257j485950j442440j337968j686410p21344j682367
4769G7304490j832531j457675n91689j551036j521365j371937j894048j396722
$$ plain form
4829 103502880 104835047 105919448 107228963 107253292 107236711 107299399 106900592 105959952 105535459
4820 105535459 105399742 104987424 104068901 103228446 103047084 103284398 103497763 103225103 103292148
4811 103292148 103573500 104807140 105135515 105720796 106490019 107019233 107325554 108497160 109919179
4802 109919179 111222754 111563160 113241754 114530579 115361647 115702700 116455408 117193642 117004931
4793 117004931 116570925 116127822 114911101 113948972 112831015 111063594 108734913 106380765
4785 106380765 103914014 101570986 99850884 97777161 95505268 93116667 90963702 89421474
4777 89421474 87621226 85660969 84175019 82732579 81394611 79708201 78986857 77304490
4769 77304490 75471959 74014284 73422595 71871559 70350194 68978257 67084209 65687487
4761F5687487j161678j645111j424549j663150r01116j076112m10326r84778j148842
4752E5271825p11156k10698j099851r17911L6818m87409m53495p17505k37476
4743E0473142l63189k96384k63123m40746o53193j077656j102740J83187l70797
4734D6088501j318203r30552r06102q92427o38892k8567j032166l53370K89490
4725D0277712J98466j26552M41382j9550m67529J275947P95832N20507L79183
4716D3275398Q08362R03545O95029M98892P40137L82574J256167O88622J191966
4707E0440692J354272J276557J165816J384907J804586J929498K238303J818971
4699F3413602J741457K554877K168446J607424J994132K169750J785446J884589
$$ plain form
4761 65687487 64525809 62880698 61456149 59792999 58891883 57815771 57405445 56420667 55271825
4752 55271825 54560669 54349971 53250120 52332209 52369027 51881618 51428123 50710618 50473142
4743 50473142 50109953 49813569 49550446 49109700 48456507 47378851 46276111 46459298 46088501
4734 46088501 44770298 43839746 42933644 42041217 41402325 41373758 40341592 39988222 40277712
4725 40277712 40476178 40349626 40791008 40771458 40303929 41579876 42375708 42896215 43275398
4716 43275398 44083760 44987305 45682334 46181226 46921363 47303937 48560104 49248726 50440692
4707 50440692 51794964 53071521 54237337 55622244 57426830 59356328 61594631 63413602
4699 63413602 65155059 67709936 69878382 71485806 73479938 75649688 77435134 79319723
4691G9319723J579539J683565J501215J623798J650574J603262J201176O74342
4683I0837194K006636J672600J653695J945869K859184J350415K767341L270922
4675A08363856L435572K701383L569336K798784L094508L087586K748456J605803
4667A31405284J787185R33814P2331K63568p67245j106864j912452k504392k555903
4658A25615326j849336j898482k626820k912382k566318k056048k136119j800104
4650A07769717k047649k439161j813632j565079j684026k261177j242692j976967
4642I2739334j790862j974652j917512k697783j367615k915827k508928l041641
4634G4524514k164354l389765k695076k702178k457958k338456k439882k272211
$$ plain form
4691 79319723 80899262 82582827 84084042 85707840 87358414 88961676 90162852 90837194
4683 90837194 92843830 94516430 96170125 98115994 100975178 102325593 105092934 108363856
4675 108363856 111799428 114500811 118070147 120868931 123963439 127051025 129799481 131405284
4667 131405284 133192469 134126283 134198614 134462182 133694937 132588073 130675621 128171229 125615326
4658 125615326 123765990 121867508 119240688 116328306 113761988 111705940 109569821 107769717
4650 107769717 105722068 103282907 101469275 99904196 98220170 95958993 94716301 92739334
4642 92739334 90948472 88973820 87056308 84358525 82990910 80075083 77566155 74524514
4634 74524514 72360160 68970395 66275319 63573141 61115183 58776727 56336845 54064634
4626E4064634j377783j442584j788150j525902j238572n09086m5935l33422j220565
4617D4582635K14763L17836N01278J057092J242123J836886K378176L423499M216342
4608E9770630M969370N983867O615248P836550P823689Q424617Q117823P308460
4600A16850254O865288R306599J0153148J0505500R967338J0121888Q343991P388179
4592A89502185M888741M545381N043961O949535P529525O898841M109674l28453
4584B29139390l579837n570762o358508n846282n107340n212574n030757o276729
4576A86156601q639358j0484477j1104255j1126114r442883q427414p674552q110876
4568A11146672q707443p369476q192441q656620q306555o551860o346754n020115
$$ plain form
4626 54064634 52686851 51244267 49456117 47930215 46691643 46182557 46136622 45803200 44582635
4617 44582635 44797398 45115234 45616512 46673604 47915727 49752613 52130789 55554288 59770630
4608 59770630 64740000 70723867 77339115 85175665 92999354 101423971 109541794 116850254
4600 116850254 123715542 133022141 143175289 153680789 163648127 173770015 182114006 189502185
4592 189502185 194390926 198936307 203980268 210929803 218459328 225358169 229467843 229139390
4584 229139390 225559553 219988791 213630283 207784001 202676661 197464087 192433330 186156601
4576 186156601 177517243 167032766 155928511 144802397 135359514 126932100 119257548 111146672
4568 111146672 102439229 95069753 86877312 78220692 69914137 63362277 57015523 51995408
4560E1995408m146045m134370l350875l118228k226669j957403j332166j722197
4552C0007455j400612j104942m14633p89023j107696j258386q24853p46997l69819
4543B1990494p39568m33260n94503j014753n8750n11789j178608r53807k63947
4534A6241509J85289k52871N981p44553j057711l85269k01359k13732k65104r11700
4524A2400480j67037L7423M61664q5919m01040l13644n52626j4751l53472o02611
4514A0408467o9251j60122m33646n59291K35620o31805j43102m90588M93454K63664
4504H913400l72505J35359k86093l8973m65971q8165K69611M4912k4500k70615
4494G816460m52988j20396j8778p07032K9260M91970n22301k91390p93N15765
$$ plain form
4560 51995408 47849363 43714993 40364118 37245890 35019221 33061818 31729652 30007455
4552 30007455 28606843 27501901 27087268 26298245 25190549 23932163 23107310 22360313 21990494
4543 21990494 21250926 20817666 20223163 19208410 19149660 18637871 17459263 16505456 16241509
4534 16241509 16426798 16173927 16179908 15435355 14377644 13992375 13791016 13577284 13312180 12400480
4524 12400480 12233443 12270866 12732530 12646611 12245571 11931927 11379301 11364550 11011078 10408467
4514 10408467 10339216 10179094 9745448 9186157 9421777 8789972 8646870 8156282 8649736 8913400
4504 8913400 8540895 8676254 8390161 8351188 7885217 7797052 8066663 8111575 8087075 7816460
4494 7816460 7363472 7243076 7224298 6517266 6546526 7038496 6516195 6224805 6224012 6739777
4484F739777q61230k17154P09424k96790m09340p4023Q4634l10984o13337N96352
4474E347329l66605k9482n08712k15853O08555J46793k32630n51443j68536k19558
4464C809858j69884K79724k1211J24807m31158Q8142J52686k01116r12804L5755
4454B754799L15995m12422j81944N40696O7332q49451J91676J125989l98935p75582
4444B378153l92321o6560N26047l66402n1651l95610l52795k74741M64627k91388
4434A177359J9935N31407l34684k19826O02196m3178N3236J62487j62735j88724
4424A597473J40418Q1696k72588l22005k12721n24665K60466o5143N92812k03330
4414A072413N01029j06059k54112l83020K09862j6312k76594L17207m57891M35240
$$ plain form
4484 6739777 5878547 5661393 6370817 6074027 5664687 5590664 5675298 5364314 4750977 5347329
4474 5347329 4980724 4951242 4442530 4226677 4835232 4982025 4749395 4197952 4029416 3809858
4464 3809858 3639974 3919698 3898487 4023294 3592136 3680278 3832964 3631848 2719044 2754799
4454 2754799 3070794 2658372 2476428 3017124 3084456 2235005 2426681 3552670 3153735 2378153
4444 2378153 1985832 1919272 2445319 2078917 2027266 1631656 1278861 1004120 1468747 1177359
4434 1177359 1197294 1728701 1394017 1174191 1776387 1733209 1786445 1948932 1786197 1597473
4424 1597473 1737891 1819587 1546999 1224994 1012273 487608 748074 682931 1275743 1072413
4414 1072413 1573442 1467383 1213271 830251 1040113 1023801 747207 1064414 606523 1041763
4404A041763l59893k91931n30294Q88525j858r1462o8543k41808j2191K93193
4394F25501j91043J6420M04987m93669k59425M0162K88497M49653l90406m54085
4384C6592M30051R814l13596N75419m08841j79489l51193N17739n5536M25947
4374F86907k86110m72170L13061J83116L67891r8687L9160m80742M67618J71504
4364H91548N3302l00661n41127p7143K35162P73940P8954r95762k22146K29225
4354A25292k02444r0906k86437L9050m71481L75335P4674M06278J23104m06741
4344c14276l15521J28214P00651j88354K30847K22832K46513l70459k32724J29300
4334B37023j0707q85582K20934L10515j04436j85829L84746N3461r9196p0409
$$ plain form
4404 1041763 681870 389939 -140355 748170 746312 654850 586307 344499 332308 625501
4394 625501 434458 450878 855865 362196 102771 142933 431430 881083 490677 36592
4384 36592 466643 476457 162861 738280 329439 149950 -201243 316496 260960 686907
4374 686907 400797 -71373 241688 424804 792695 694008 733168 252426 720044 891548
4364 891548 944850 644189 103062 25919 261081 1035021 1113975 118213 -103933 125292
4354 125292 -77152 -168058 -454495 -415445 -886926 -511591 -436917 -30639 92465 -314276
4344 -314276 -629797 -501583 199068 10714 241561 464393 710906 340447 107723 237023
4334 237023 226316 -659266 -438332 -127817 -232253 -418082 -33336 20125 -79071 -149480
4324a49480J87788O40225K75503p6856l77049j33280M97091m8134Q8308n49892
4314C54224k37105K056O83158j1663J11377n0008m45950K00872N64381J00844
4304A272186m70685l75689M4825Q27969M48668P9929l52211L62829j39035O07180
4294B305966j77452L53682r364M9009L48402L00247k4274p19476O7801N79541
4284C074082N56087m70227J87395J35684O44889N37270j26637k44868L81429N54998
4274E230102k83790K48862J14140l89955L37010K16640j77395M25357m72119k02659
4264E046193J088167J88305l73355O8803M83030o28046J085142L67115M03027
4255G728381J8083N3147L55019N4303O94871m3361M4492j0824P63660Q69736R51141
$$ plain form
4324 -149480 38308 678533 954036 877180 500131 366851 863942 815808 904116 354224
4314 354224 117119 119175 802333 790670 902047 852039 406089 606961 1171342 1272186
4304 1272186 801501 425812 470637 1298606 1747274 1827203 1474992 1837821 1698786 2305966
4294 2305966 2128514 2482196 2472832 2521841 2870243 3170490 3146216 2426740 2494541 3074082
4284 3074082 3630169 3159942 3347337 3483021 4127910 4665180 4538543 4293675 4675104 5230102
4274 5230102 4946312 5195174 5309314 4919359 5256369 5473009 5295614 5720971 5248852 5046193
4264 5046193 6134360 6322665 5949310 6018113 6501143 5873097 6958239 7325354 7728381
4255 7728381 7746464 7799611 8154630 8208933 8903804 8860443 8904935 8894111 9657771 10527507 11478648
4244A1478648K33427Q05194J215081J303238J48242J209785P53255J106605P51295
4235A9004770J662980J183258J185961J724610J800087J725155J843706K668188
4227C2798715K787379L065430L253180K181920L129348L474108L366803L741319
4219E7798202L693023L852722M808408M953530M488606N731559N144112M467741
4211I4937903N918809O363156O293437O442092N758900N986913N681847O877060
4203A44260117M812039N708922N998199O226605M556304N290940N547657M713254
4195A87114037M616242M217925L870064L699173L088697L022913K438378J368568
4187B13435997j68935J091805o9454j142129n81839j633610k371122k274535k597661
$$ plain form
4244 11478648 11712075 12517269 13732350 15035588 15183830 16393615 17146870 18253475 19004770
4235 19004770 20667750 21851008 23036969 24761579 26561666 28286821 30130527 32798715
4227 32798715 35586094 38651524 41904704 44086624 47215972 50690080 54056883 57798202
4219 57798202 61491225 65343947 70152355 75105885 79594491 85326050 90470162 94937903
4211 94937903 100856712 107219868 113513305 119955397 125714297 131701210 137383057 144260117
4203 144260117 149072156 154781078 160779277 167005882 171562186 176853126 182400783 187114037
4195 187114037 191730279 195948204 199818268 203517441 206606138 209629051 212067429 213435997
4187 213435997 213267062 214358867 214289413 213147284 212565445 210931835 208560713 206286178 203688517
4178B03688517l154108k958659l798470l558663m468422m674626n320681m595911
4170A71158977n202188n132618n941660n729079n885880m994355n650296n467446
4162A27155455m941506n914443n500240m899188m262454n276300n239377m440261
4154H6681686m188467l983336l443754l697288m486869l351580k323184k874064
4146E8333144l313649k440385k745355k296699k028421k081110k216927k044915
4138C9165683j974753j233627r67379k049255r56038j296450j360461r10725n39068
4129B7877927j288090q33434n28133p82967k23971m91154j031204j059638q30672
4120B0808664o41672m28212j038003j58611M19075m42054j125672L61297l76093
$$ plain form
4178 203688517 200534409 197575750 193777280 190218617 185750195 181075569 175754888 171158977
4170 171158977 165956789 160824171 154882511 149153432 143267552 138273197 132622901 127155455
4162 127155455 122213949 116299506 110799266 105900078 101637624 96361324 91121947 86681686
4154 86681686 82493219 78509883 75066129 71368841 66881972 63530392 61207208 58333144
4146 58333144 55019495 52579110 49833755 47537056 45508635 43427525 41210598 39165683
4138 39165683 37190930 35957303 34989924 32940669 31984631 30688181 29327720 28416995 27877927
4129 27877927 26589837 25756403 25228270 24445303 24221332 23730178 22698974 21639336 20808664
4120 20808664 20166992 19738780 18700777 18542166 18961241 18519187 17393515 17754812 17378719
4111A7378719o74487k68131J01240p01912q08087j01011L15182l42171p88659
4102A4110683o11845M11013L44055O29720k84590n22100m80058N69472K07030
4093A4373380m28318p6493k25180l95129m3154q3052o7428k13978J05554O35579
4083A3581781J39628J5748l33605M61509k21972L58705j3512M26348o3864J04368
4073A4455134j93232M10939k66325k56304O7605L73559M22771J150858k63263
4064A5901742L56462Q54767O28779j75907R28320L56710J02618P86757J130235
4055B0870483K85086P17755K36318J055971R17982J472681k87541J221863Q17630
4046B7308228J58631J655951P14680L07080M33083J433759P98716J270748J179557
$$ plain form
4111 17378719 16704232 16436101 16537341 15835429 15027342 14926331 15241513 14899342 14110683
4102 14110683 13498838 13909851 14253906 14883626 14599036 14076936 13596878 14166350 14373380
4093 14373380 13945062 13868569 13643389 13248260 13205106 13122054 13054626 12840648 12946202 13581781
4083 13581781 13721409 13737157 13403552 13865061 13643089 14001794 13988282 14414630 14350766 14455134
4073 14455134 14261902 14672841 14406516 14150212 14217817 14591376 15014147 16165005 15901742
4064 15901742 16258204 17112971 17741750 17565843 18494163 18850873 18953491 19740248 20870483
4055 20870483 21155569 21873324 22109642 23165613 24083595 25556276 25268735 26490598 27308228
4046 27308228 27466859 29122810 29837490 30144570 30577653 32011412 32810128 34080876 35260433
4037C5260433R43346N21390J560546J059353P83004J246199K080684N28668J002456
4028D4986079J100750J593798Q77354Q17531J025743J473365J050148J273668
4020E4198436J576089J840440Q73389K055542J940368J326058P70169K671921
4012F7252412J716131J342533J882865J240001J321953K092939K230358J341803
4004H0420995J181292J419517J448402J080682J134098R33421J240044R07965
3996H9766416J065105J321102P42603R84718J464274J883630R05129K007830K370618
3987A02511425J576959J996210K882815K666231K348815K537682L049975K947665
3979A22517777K022791L180070K619064K177911J590631K538518K102506J544482
$$ plain form
4037 35260433 36203779 36725169 38285715 39345068 40128072 41374271 43454955 43983623 44986079
4028 44986079 46086829 47680627 48557981 49375512 50401255 51874620 52924768 54198436
4020 54198436 55774525 57614965 58488354 60543896 62484264 63810322 64580491 67252412
4012 67252412 68968543 70311076 72193941 73433942 74755895 76848834 79079192 80420995
4004 80420995 81602287 83021804 84470206 85550888 86684986 87618407 88858451 89766416
3996 89766416 90831521 92152623 92895226 93879944 95344218 97227848 98132977 100140807 102511425
3987 102511425 104088384 106084594 108967409 111633640 113982455 116520137 119570112 122517777
3979 122517777 124540568 127720638 130339702 132517613 134108244 136646762 138749268 140293750
3971A40293750J413147J796282J818925J439530J410135J208636J710061J502388
3963A52592854Q31371M53352J709011J434489P53613J259068J374855N60179O43146
3954A61611938J812444J009751J357752P02918R88921J465627J571469M0012J247844
3945A71808676K168609J126961L58141J139641R22683R0374J140818L31079k81915
3936A78805067j50777j98132o72697n08202q10553j904679j747144j128600q04456
3927A70879827k201815k170162j346295j461985j419636o45582o54812p60291
3919A60219249K20624q5433k1426K81496L34609M65216J553836J825472K069229
3910A66862872K021336K746365K947218M185263L997005M845461N377107N459997
$$ plain form
3971 140293750 141706897 143503179 145322104 146761634 148171769 149380405 151090466 152592854
3963 152592854 153424225 153877577 155586588 157021077 157774690 159033758 160408613 160968792 161611938
3954 161611938 163424382 164434133 165791885 166494803 167483724 168949351 170520820 170560832 171808676
3945 171808676 173977285 175104246 175462387 176602028 177524711 177615085 178755903 179086982 178805067
3936 178805067 178654290 178456158 177783461 177275259 176464706 174560027 172812883 171684283 170879827
3927 170879827 168678012 166507850 165161555 163699570 162279934 161634352 160979540 160219249
3919 160219249 160439873 160354440 160333014 160614510 160949119 161414335 162968171 164793643 166862872
3910 166862872 168884208 171630573 174577791 178763054 182760059 187605520 192982627 198442624
3902A98442624N788985O344952O945961P726542Q149099Q936794J0037831J0325155
3894B62697943J1067572J2089677J3302034J3135843J3839652J4594053J4023101
3887C54749875J3972968J4267233J5029824J3212088J2308200J1892411J0597017
3880D46029616R875102Q367801O805802N116806L382321K236743J354991l94236
3872D82774946k687905l544615m220042o701140o859698p970230q961619j0331686
3864D31498011j0305333j1453634j2144958j2054143j2286046j2766821j2320251
3857C48166825j2420898j2027520j2004525j1767901j1182393j1207543j0171883
3850B67384162r870981q529592q470538q218702o936061o726082o556896o474574
$$ plain form
3902 198442624 204231609 210576561 217522522 225249064 233398163 242334957 252372788 262697943
3894 262697943 273765515 285855192 299157226 312293069 326132721 340726774 354749875
3887 354749875 368722843 382990076 398019900 411231988 423540188 435432599 446029616
3880 446029616 455904718 464272519 471078321 476195127 479577448 481814191 483169182 482774946
3872 482774946 480087041 476542426 472322384 465621244 458761546 450791316 441829697 431498011
3864 431498011 421192678 409739044 397594086 385539943 373253897 360487076 348166825
3857 348166825 335745927 323718407 311713882 299945981 288763588 277556045 267384162
3850 267384162 257513181 248983589 240513051 232294349 225358288 218632206 212075310 205600736
3842B05600736m581701m767351m321393l822765l513089l898991k678125k736967
3834A75280354k971843l328725l013261k569816k275063j979246k192558j975864
3826A54973978k657885j599035j308918j729920j998996j122543j411195k412764
3818A40732722j017261k40694j415726j284650k0710k87767o40232P01744J398750
3809A37926176Q29120J272207K304447K326799K568211K583217L722296M101081
3801A57633554M100093L946483N463051N367297O229118N318294O127219O813553
3793B00998662O619918P721731P487235O474441P163499O119598O647071P339930
3785B56572085O666002N089728N809197N611958N256336M243827M642341L534243
$$ plain form
3842 205600736 201019035 196251684 191930291 188107526 184594437 180695446 178017321 175280354
3834 175280354 172308511 168979786 165966525 163396709 161121646 159142400 156949842 154973978
3826 154973978 152316093 150717058 149408140 147678220 145679224 144556681 143145486 140732722
3818 140732722 139715461 139474767 138059041 136774391 136753681 136465914 135825682 136527426 137926176
3809 137926176 138755296 140027503 142331950 144658749 147226960 149810177 153532473 157633554
3801 157633554 161733647 165680130 171143181 176510478 182739596 188057890 194185109 200998662
3793 200998662 207618580 215340311 222827546 229301987 236465486 242585084 249232155 256572085
3785 256572085 263238087 268327815 274137012 279748970 285005306 289249133 293891474 297425717
3777B97425717K699013K611727L201677K713251J682527J371043J635177J328519
3769C14668651R23545J019504L00061o64412m62654J63900j410402m36447j084491
3760C13017255j857646j777793r85044j901520j678356j503911l195254l622369
3752B96495362k901990l967368l763114n409057m987640n667118n253649o458014
3744B58087412o390395o643791p129363p387664o569975o028033p111154p689124
3736B03137913p208025p100730p889329o771782o820230p430737o548379n587193
3728A47781508o678445o208374m699976m856974m732897l799420k950868l562464
3720A10292090l107581k410557j633431j635357j864043r87047l92653j022966
$$ plain form
3777 297425717 300124730 302736457 305938134 308651385 310333912 311704955 313340132 314668651
3769 314668651 315592196 316611700 316911761 316247349 315784695 315948595 314538193 314101746 313017255
3760 313017255 311159609 309381816 308396772 306495252 304816896 303312985 300117731 296495362
3752 296495362 293593372 289626004 285862890 280453833 275466193 269799075 264545426 258087412
3744 258087412 251697017 245053226 237923863 230536199 223966224 217938191 210827037 203137913
3736 203137913 195929888 188829158 180939829 174168047 167347817 159917080 153368701 147781508
3728 147781508 141103063 134894689 130194713 125337739 120604842 116805422 113854554 110292090
3720 110292090 107184509 104773952 103140521 101505164 99641121 98654074 98261421 97238455
3712I7238455j198330l43400p47988K05670j132714o69491j129855J09348M2829
3703I2374524l36517k77736n62603o68785n98053K27216q24561j164693j782620
3694H6386172m83017o92807j900731j639346r99545k229413j883123k260774j230198
3685G3067218j963811k358384j115645k431018k050505j692665j350372k407629
3677E7697189j982166j396910j868705j643289j648737j577798j318778j075979
3669D5184827j695768j360360j092912r21997o74021p26470j949749j037490J41892
3660C5867952j412472j183834j001172k25060r08034k99978j99895j008713l66994
3651B9261800k22224k38155k94742j81653q99404n13802o91156l33386l3239j145474
$$ plain form
3712 97238455 96040125 95696725 94948737 95154407 94021693 93352202 92222347 92331695 92374524
3703 92374524 92038007 91760271 91197668 90528883 89930830 90158046 89333485 88168792 86386172
3694 86386172 85903155 85210348 83309617 81670271 80670726 78441313 76558190 74297416 73067218
3685 73067218 71103407 68745023 67629378 65198360 63147855 61455190 60104818 57697189
3677 57697189 55715023 54318113 52449408 50806119 49157382 47579584 46260806 45184827
3669 45184827 43489059 42128699 41035787 40113790 39439769 38713299 36763550 35726060 35867952
3660 35867952 34455480 33271646 32270474 32045414 31137380 30837402 30637507 29628794 29261800
3651 29261800 29039576 28801421 28506679 28325026 27425622 26911820 26220664 25887278 25854039 24708565
3641B4708565l51706m82964n18599O17492k06045k67611m29707o56017m27190
3632B1986218m42321k24592j92027k92384j47133o45360O2243r8367k2970p40753
3622A9242554P7149j55494j047096J50267J55155o5263j251125J91418M77277
3613A7774842m60904L0910J49874n59487l34088L67998L10669o44922m09899q8787
3603A6136206j67090j02351R37375k0747l84459p34869n04266J64805N57990n54316
3593A5328278j23662J87091k74514l86533M34173M81443n55684l88829J43002
3584A4844765K89471J11703K44276j017211o87634K66388j5218p77760L09189
3575A3567969O19455j644830l77317M43200K46595j285792P1003N91475N23297
$$ plain form
3641 24708565 24356859 23873895 23355296 23972788 23766743 23499132 23069425 22413408 21986218
3632 21986218 21543897 21319305 21127278 20834894 20687761 20042401 20104644 20006277 19983307 19242554
3622 19242554 19319703 19164209 18117113 18267380 18422535 18357272 17106147 17297565 17774842
3613 17774842 17313938 17344848 17494722 16935235 16601147 16969145 17279814 16634892 16224993 16136206
3603 16136206 15969116 15866765 16804140 16783393 16398934 15664065 15159799 15324604 15882594 15328278
3593 15328278 15204616 15391707 15117193 14730660 15164833 15646276 15090592 14701763 14844765
3584 14844765 15134236 15245939 15490215 14473004 13785370 14051758 14036540 13258780 13567969
3575 13567969 14187424 12542594 12165277 12608477 12855072 11569280 11640283 12231758 12755055
3566A2755055n66205r1624k05564p2230N42477k65150m84919K23310j34979m46241
3556A1253930K05927J53028l33276p52802l39063J87415J58329o09819k31806
3547I691863j56622N19800o1115K68061m2601k46693n72674J36646J95355l02960
3537I429060n67375Q8754q13099K81062K45351k6368m87550J83108J83758N83673
3527I100374L07080k0537k01474K6372k37461J5427L41078o81397p11291j19267
3517G818904k23295K54330n71474M35672K84023L42615n85909K4313L06109L2380
3507H117668K56070L86555o25934l53744J86054K71311k98492K76334L3323m04680
3497G844465Q41461J204467R27707m32710k2443k99734M86371k45847n87947k04299
$$ plain form
3566 12755055 12188850 12097226 11891662 11819432 12361909 12096759 11611840 11835150 11700171 11253930
3556 11253930 11459857 11612885 11279609 10526807 10187744 10375159 10533488 9923669 9691863
3547 9691863 9535241 10055041 9993926 10261987 10219386 9972693 9400019 9536665 9732020 9429060
3537 9429060 8861685 8950439 8137340 8418402 8663753 8637385 8149835 8332943 8516701 9100374
3527 9100374 9407454 9386917 9185443 9211815 8974354 8989781 9330859 8649462 7938171 7818904
3517 7818904 7595609 7849939 7278465 7714137 7998160 8340775 7754866 7779179 8085288 8117668
3507 8117668 8373738 8760293 8134359 7780615 7966669 8237980 7939488 8215822 8249145 7844465
3497 7844465 8685926 9890393 10818100 10385390 10362947 10063213 10549584 10303737 9715790 9511491
3487I511491o97310l13571K61965N54058m46034q75397n3531L01923J91598q8498
3477H346694P0362n18566j05961P34720J75101l78169j11978j69851O27732J69831
3467H839915J059450o03032K81719J173808J314629N0202l3393M04975k78466
3458A2209807q46613o66533o73422q08605p2050j01393k04660o79642k73943L23304
3448H206250m85409J18723L37427K91768q00649m15930P54873P23892q41282k17290
3438G672373L94451k23953J99073K94906M44501m89131J003538J080837N71807
3429A0948402j40155j28520k43625j29644o69596m66247j039920r77171q992J86578
3419G331110k5613k64425K88405Q6936N44640L16699O61164n34277J3192K19376
$$ plain form
3487 9511491 8814181 8500610 8762575 9316633 8870599 7995202 7941671 8243594 8435192 8346694
3477 8346694 8417056 7898490 7792529 8527249 8702350 8324181 8212203 8042352 8670084 8839915
3467 8839915 9899365 9296333 9578052 10751860 12066489 12116691 12083298 12488273 12209807
3458 12209807 11363194 10696661 10023239 9214634 9142584 9041191 8836531 8156889 7882946 8206250
3448 8206250 7720841 7839564 8176991 8468759 7668110 7252180 8007053 8730945 7889663 7672373
3438 7672373 8066824 7842871 8041944 8336850 8781351 8292220 9295758 10376595 10948402
3429 10948402 10808247 10679727 10436102 10306458 9636862 9170615 8130695 7153524 7144532 7331110
3419 7331110 7305497 7041072 7329477 7416413 7961053 8277752 8938916 8404639 8417831 8637207
3409H637207O79801m98138k61191n74562K6380k3337K59340o19875m59687j8237
3399G147701L71544R2132P0920o73458j15461j08852N03445M39303k18170o70361
3389F838743j55307N11045J37097N3829l70638L7138k75649J248928M27801N8553
3379H511540N38549N37989L51436M04385p13278j44939k70775r06229n47375K80687
3369H041990k66483m63159n76157M14751L74128J16885n45713L98493J86726L57146
3359H038607j65643p0446N07974K25284j53729q1958L59406m71155p4288K00397
3349H314449M17421l89895j088530N18361P22498O65309m66866o04617j10669
3340G977461k37902k02564L36182m54685K73250q92631j69793J01136M40945m83785
$$ plain form
3409 8637207 9317008 8818870 8557679 7983117 8009497 7986160 8245500 7625625 7165938 7147701
3399 7147701 7519245 7611377 7682297 7008839 6893378 6784526 7287971 7727274 7509104 6838743
3389 6838743 6683436 7194481 7331578 7385407 7014769 7051907 6776258 8025186 8452987 8511540
3379 8511540 9050089 9588078 9939514 10343899 9630621 9485682 9214907 8308678 7761303 8041990
3369 8041990 7775507 7312348 6736191 7150942 7525070 7641955 7096242 7494735 7681461 8038607
3359 8038607 7872964 7802518 8310492 8535776 8382047 8300089 8659495 8188340 8114052 8314449
3349 8314449 8731870 8341975 7253445 7771806 8494304 9159613 8692747 8088130 7977461
3340 7977461 7739559 7536995 7873177 7418492 7691742 6799111 6629318 6730454 7171399 6687614
3330F687614j22827M56865L28563L64059K97780J80184P43553P45313M15396K02556
3320A0299056R37690N43944N16928J524292K263497J141534K108227L284935M497513
3311B7117616N889236Q071101J0559899J2376719J1259140P776408M913719R85489
3303H8949327o909140j1114215q950095q802043p475740o428450m430845l390239
3295C1448560k707758k538556j232298r19218p51875r7019P32816l1223J130639
3286B5034068R61377K474079L249722L963954M239647O230406Q607653J1711450
3278F6472356J5761972K1364716K3418180J9675872J3253977Q998667k734901
3271A66210839j7910073k0497360j8458982j7578494j4823634j0871267q831912
$$ plain form
3330 6687614 6564787 7021652 7350215 7714274 8012054 8192238 8935791 9681104 10096500 10299056
3320 10299056 11236746 11780690 12297618 13821910 16085407 17226941 19335168 22620103 27117616
3311 27117616 33006852 41077953 51637852 64014571 75273711 83050119 87963838 88949327
3303 88949327 82040187 70925972 61975877 53173834 45698094 39269644 34838799 31448560
3295 31448560 28740802 26202246 24969948 24050730 23298855 23201836 23934652 23903429 25034068
3286 25034068 25995445 28469524 31719246 35683200 39922847 46153253 54760906 66472356
3278 66472356 82234328 103599044 127017224 146693096 159947073 168945740 166210839
3271 166210839 148300766 127803406 109344424 91765930 76942296 66071029 57239117
3264E7239117o515487n650073m430049k322614l158650k880196j864086j439119
3256B8978843k69349n80125J9716M31390M15191J299631K060582L240287M085275
3247C9681441N584923P753151J0801954J0968157Q061146M567862K618359l336413
3239H6700580r496609j0568500q861213q088323o215241n516884l944526l363427
3231C0645857k611507k091305k548031j902320j460919j331241j623124p38684
3223A6338726n46032o38535p43097m00738j20176o06101n98441l37931J48027
3214A2495702L30213j417164q98577L48354J24683p09313l65143j71416m5878
3205I691461o25282L00304L83203k46825q42845k09254O00528K72q41496o17518
$$ plain form
3264 57239117 50723630 45073557 40643508 38320894 35162244 32282048 30417962 28978843
3256 28978843 28709494 28129369 28149085 28580475 28995666 30295297 32355879 35596166 39681441
3247 39681441 45266364 53019515 63821469 74789626 82850772 87418634 90036993 86700580
3239 86700580 77203971 66635471 57774258 49685935 43470694 37953810 34009284 30645857
3231 30645857 28034350 25943045 23395014 21492694 20031775 18700534 17077410 16338726
3223 16338726 15792694 15154159 14411062 14010324 13890148 13284047 12685606 12347675 12495702
3214 12495702 12825915 11408751 10510174 10858528 10983211 10273898 9908755 9737339 9691461
3205 9691461 9066179 9366483 9749686 9502861 8660016 8450762 9051290 9051562 8210066 7592548
3195G592548K05983l48376j88605k0107P6729k04655N2550J77351k16653q1405
3185G045360J41638R7236k4958j73310R2615q38961m76297O8987L68435m93249
3175E807496L4040L65268M9300J64969k11675k7451j02385K89046q08488k97939
3165E262181K05838j45721J09594K48209m47694o95351m34415O09781N78864K87023
3155E578309q22487J0127K89447N28414k00493J44010l79564l99183p98394N11900
3145D462086O37861n34143q84147l4645q7665M43025P70855k29137k19623L44965
3135D669432L71953r27961l04009L64601k01574K88550k44953k3010j01569m56870
3125C434590k51391M09347O332q1079K78259J25987Q3302l5684k34181K46196
$$ plain form
3195 7592548 7798531 7450155 7261550 7241443 7318172 7113517 7166067 7343418 7126765 7045360
3185 7045360 7186998 7284234 7259276 7085966 7178581 6339620 5863323 5932310 6300745 5807496
3175 5807496 5841536 6206804 6256104 6421073 6209398 6181947 6079562 6368608 5560120 5262181
3165 5262181 5468019 5322298 5431892 5680101 5232407 4537056 4102641 4712422 5291286 5578309
3155 5578309 4755822 4765949 5055396 5583810 5383317 5527327 5147763 4748580 3950186 4462086
3145 4462086 5099947 4565804 3681657 3647012 3559347 4002372 4773227 4544090 4324467 4669432
3135 4669432 5041385 4113424 3809415 4174016 3972442 4260992 4016039 3993029 3891460 3434590
3125 3434590 3183199 3592546 3598878 3517799 3796058 3922045 4005347 3969663 3735482 3981678
3115C981678Q0167k93963j28596J40704n71761p5604M03682k8833j12094N7745
3105C453125N98727k50429M67536j50580j11388m77869l49378o4998l2228n03981
3095B578537L6885l53702K81347P61298r6494j20013L79002O78910M89393J11531
3085D746694n64940l61048L88231k09667p1842o0261o61312p14298O94863O0104
3075C246524m06093L01332j40674J3514K63891J36415m15670J20360K40942J36871
3065C497412J47944n5239J78933l65948o93588m4945K232r2808Q6301L94329J93463
3054C248086r03978J52316J090947K1270j026297M20718j47167m51802N79405
3045B983498L01976m76802m47830j77333K64822N24683M44351q19703k9255K07958
$$ plain form
3115 3981678 4061845 3767882 3639286 3779990 3208229 3132625 3536307 3507474 3395380 3453125
3105 3453125 4051852 3801423 4268959 4118379 4006991 3529122 3179744 3114746 3082518 2578537
3095 2578537 2615422 2261720 2543067 3304365 3207871 3087858 3466860 4145770 4635163 4746694
3085 4746694 4181754 3820706 4208937 3999270 3927428 3867167 3205855 2491557 3186420 3246524
3075 3246524 2840431 3141763 3001089 3014603 3278494 3414909 2999239 3119599 3360541 3497412
3065 3497412 3645356 3590117 3769050 3403102 2709514 2664569 2666801 2573993 2660294 3054623 3248086
3054 3248086 2344108 2496424 3587371 3608641 2582344 3003062 2855895 2404093 2983498
3045 2983498 3285474 2808672 2360842 2183509 2448331 2973014 3417365 2597662 2568407 2776365
3035B776365o536O0962Q4714l96725n03349r3580L62633J05693N48442P7174p21364
3024B294429N70768K55714p59563J54836K60189o39138k53956O47246J6445J45177
3014B692147m17552k81648k86020N7627K99629o03684K8395P10969k30137k77474
3004A692252N60476K87421o98144m72598M23018l7752M34683m33253M83566k90023
2994A949646M11223m5392k82413R52190L90690j68690m10184N9297J45694j59510
2984B842551M61694n33822p59669j17432o3345N53383O9304k78050j001068M93492
2974A667038M98030K96478J43520m79812m03068k96845P23347n53398M79045L24615
2964B398950j008195j83995J403650M2273q97941N258M85715Q2597m01940K34493
$$ plain form
3035 2776365 2769829 2830791 2915505 2518780 2015431 1921851 2284484 2390177 2938619 3015793 2294429
3024 2294429 2865197 3120911 2361348 2516184 2776373 2137235 1883279 2530525 2546970 2692147
3014 2692147 2274595 1992947 1706927 1764554 2064183 1460499 1488894 2199863 1969726 1692252
3004 1692252 2252728 2540149 1842005 1369407 1792425 1754673 2189356 1756103 2239669 1949646
2994 1949646 2360869 2315477 2033064 2985254 3375944 3207254 2797070 2856367 3002061 2842551
2984 2842551 3304245 2770423 2010754 1893322 1829977 2383360 2452664 2174614 1173546 1667038
2974 1667038 2165068 2461546 2605066 2125254 1722186 1425341 2148688 1595290 2074335 2398950
2964 2398950 1390755 1206760 2610410 2652683 1754742 1760000 2245715 2328312 1926372 2160865
2954B160865q0768m92492l2724j97429K98146l6728M16231m25743n527J82006
2944A785837J60359k69543k08721L31928q5431m90774J82548K74116M94647j76466
2934A998500k93164K27575l95571O70617m91442l07292l56107J97310K44169J7482
2924A512077J01436l68264L53802k13707O4711P65559o00960k68036M78795n51576
2914A273837m11654P88952J90431q36923O2886N20516l3308k29177L08859K65109
2904A899528m03253L61638K09466J07090R6327n49507l55637l2692k5132o24594
2894F83234J08493m9644P29524k62115l9612R8709K57603K11951m91536K44280
2884A490887J06771l42626J42837Q16560k60163o77921p92407N31743O81614o7097
$$ plain form
2954 2160865 2080097 1587605 1554881 1357452 1655598 1618870 2035101 1609358 1603831 1785837
2944 1785837 1946196 1676653 1467932 1799860 1714429 1223655 1406203 1680319 2174966 1998500
2934 1998500 1705336 1932911 1537340 2207957 1716515 1409223 1053116 1250426 1494595 1512077
2924 1512077 1613513 1245249 1599051 1385344 1450055 2215614 1614654 1346618 1825413 1273837
2914 1273837 862183 1651135 1841566 1004643 1067529 1588045 1554737 1325560 1634419 1899528
2904 1899528 1496275 1857913 2067379 2174469 2270796 1721289 1365652 1332960 1307828 683234
2894 683234 791727 742083 1471607 1209492 1169880 1268589 1526192 1738143 1246607 1490887
2884 1490887 1597658 1255032 1397869 2214429 1954266 1276345 483938 1015681 1697295 1630198
2874A630198q28682q8505L53276r6157j75512o5719k44920O17886M64134l72947
2864A193052m68222J18898l64090j8598N70644L12985K25148L26281l93399j39006
2854A363693R6201j602m55718O03131n00737k71558O39602j35122m92073l42963
2844E02854L33617J71476P69566j23585l53494M33291K75399n96157N72709J79853
2834B165529o97701k70287J86349O3046l43232J09934R3492o37760L46302O3867
2824A079539m54354N53143l3161o03094M00883Q36190L88992m60808m47776q05326
2814D54228L24514N61501k9852n2329k90073k21901L68117L70295r4199m6815
2804A343486o56606J52419K47397Q04176r14963l84711J26795K73862P9162K06971
$$ plain form
2874 1630198 801516 713011 1066287 970130 794618 728899 483979 1101865 1565999 1193052
2864 1193052 724830 843728 479638 461040 1031684 1344669 1569817 1896098 1502699 1363693
2854 1363693 1459894 1458292 1002574 1605705 1104968 833410 1473012 1337890 845817 502854
2844 502854 836471 1007947 1777513 1653928 1300434 1733725 2009124 1412967 1985676 2165529
2834 2165529 1467828 1197541 1383890 1446936 1103704 1213638 1307130 669370 1015672 1079539
2824 1079539 625185 1178328 1145167 542073 942956 1779146 2168138 1707330 1259554 454228
2814 454228 778742 1340243 1310391 1258062 967989 746088 1114205 1484500 1390301 1343486
2804 1343486 686880 839299 1086696 1890872 975909 591198 717993 991855 1071017 1277988
2794A277988K66298n7636j42780j12813P27718k96438m66053o64887K23890l54716
2784D00571m73915P02228L93656n28779J08127O23468o16369O34348M81627J05138
2774A830100m83043M6809K63177o83239J33884J29569p94424l17651J86729L93672
2764G05583L17153m06829o49214M46284N92606K22393L58128p6732j08761j55369
2754A245242K50261m18645j091132K19523m15734L76426J32541j47628o8621J93684
2744B75917R69194l20359l04286L37103M62959K93938M3164j54300n7498o92942
2734H52890m91997R1624J04207o83502j27088K80105L97309N86467M37693p99780
2724F47928N4588N47354K76646l4180l45942j85631k18941J80480o6079r7832
$$ plain form
2794 1277988 1544286 1486650 1343870 1231057 1958775 1662337 1196284 531397 755287 400571
2784 400571 -73344 628884 1022540 493761 601888 1225356 608987 1243335 1724962 1830100
2774 1830100 1347057 1393866 1657043 973804 1107688 1237257 442833 125182 311911 705583
2764 705583 1022736 615907 -33307 412977 1005583 1227976 1586104 1509372 1400611 1245242
2754 1245242 1495503 1076858 -14274 205249 -210485 165941 298482 150854 82233 275917
2744 275917 1245111 924752 620466 957569 1420528 1714466 1757630 1603330 1545832 852890
2734 852890 360893 452517 556724 -126778 -253866 26239 423548 1010015 1447708 647928
2724 647928 702516 1249870 1526516 1492336 1146394 960763 741822 922302 856223 758391
2714G58391L08354n14484m9848L0731K89024j14613P10743m3555l75666n39001
2704D60076M56830l45359J48425L55445l62476m60978N49042J09534J91502M13713
2694A515754k42667m43904l26495P69139k22610N8241n30506k74539j48253P74542
2684I28702N15960n55304p73485o17873J444013N45850m13951q50406J77958M92065
2674H93529J35263K31819J2174l04596p89727J85264M89238l20302j00303J67669
2664F00028l01236J54391Q3443O23863k07108J92937L54386l16886j39167k24034
2654H20617M2768k66267J75215K4048n57852j24710O03984O69122n77919N13191
2644A322197n97845J62372K74716J30423O5097m45440m66087k01864J84398L46385
$$ plain form
2714 758391 1066745 552261 502413 533144 822168 707555 1418298 1374743 999077 460076
2704 460076 916906 571547 719972 1075417 712941 251963 801005 910539 1102041 1515754
2694 1515754 1273087 829183 502688 1271827 1049217 1107458 576952 302413 154160 928702
2684 928702 1444662 889358 115873 -502000 942013 1487863 1073912 223506 401464 893529
2674 893529 1028792 1260611 1272785 968189 178462 363726 852964 532662 432359 600028
2664 600028 298792 453183 536626 1160489 953381 1146318 1500704 1183818 1044651 820617
2654 820617 863385 597118 772333 796381 238529 113819 717803 1386925 809006 1322197
2644 1322197 724352 886724 1161440 1291863 1356960 911520 445433 243569 427967 774352
2634G74352n62411n31105j12956N90860K12846N44736l71710J64003p4666K69669
2624I03618R3716L79975j16976n69487L61974j99678j19765l76525N09543P6309
2614I42704m17697P5987K35710n60492N7820N60226J73898q26061J9242P657J90423
2603D59417j99057L24063j52442J79745K56906J41011J76990L8668k11737p08303
2593C05261P5163M53470m58819j02990N3817j28522J79834k45595N02274p3468
2583E60425m46208K43878K93932M62609m0661m4520J59616o77073j48008m60826
2573i6836L51935j90205j06903j77544J21545M00014O86209L35101l64545n94742
2563C64029O26765k00510l52384K18955l45550k11999N72071l50620n28568J3669
$$ plain form
2634 774352 211941 -319164 -432120 158740 371586 916322 544612 708615 633949 903618
2624 903618 997334 1377309 1260333 690846 1052820 853142 733377 356852 866395 942704
2614 942704 525007 600994 836704 276212 334032 894258 1068156 242095 261337 268994 459417
2603 459417 260360 584423 431981 611726 868632 1009643 1186633 1225301 1013564 305261
2593 305261 380424 833894 375075 272085 325902 197380 377214 131619 633893 560425
2583 560425 114217 358095 652027 1114636 1073975 1029455 1189071 511998 363990 -96836
2573 -96836 255099 64894 -42009 -219553 -98008 302006 988215 1323316 958771 364029
2563 364029 990794 790284 437900 656855 311305 99306 671377 320757 -207811 -194142
2553a94142J67671K85455M66414j16823l32059L79553O76738n910n83752n72739
2543A70406j32143O18251l56695m26976l28275M87384j23365N64220M08012M6535
2533I27354k15458O9534K74615M92308J26811k49638m78966n90776J25479M31341
2523I12604q74881n47586L84470J56569J80598j03688M85640j23787j11763P12474
2513A070650J0616l28299j31193O33932k93515p77329l9719l9782j27469N44531
2503E22423j15879O8568K33266k55524o3815N06100k65991l36823k36719M93461
2493E49067o2564K02466p93664l77047M70812M58295k12559L90650N08522r45273
2483A88705l49399R32379M52755l24109M5584q3234n64735k45433M81408N49975
$$ plain form
2553 -194142 -26471 258984 725398 608575 276516 656069 1332807 1326897 743145 170406
2543 170406 38263 656514 299819 -127157 -455432 31952 -91413 472807 880819 927354
2533 927354 711896 781430 1056045 1548353 1675164 1425526 946560 355784 481263 912604
2523 912604 37723 -509863 -125393 31176 211774 108086 593726 469939 358176 1070650
2513 1070650 1081266 752967 621774 1255706 962191 184862 145143 105361 -22108 522423
2503 522423 406544 475112 708378 452854 389039 895139 629148 292325 55606 549067
2493 549067 486503 688969 -104695 -481742 -10930 447365 234806 625456 1133978 188705
2483 188705 -160694 771685 1224440 900331 945915 862681 297946 52513 533921 1083896
2473A083896n67050r8227j04240m0027M35944K55408p68149J22488j46516j06161
2463F7366N2227J20241L48630l51402m68779J33670J144923L31275n59422k60644
2453E58085K32432m81865L7548M79382K4335j138961m85748j5080N89870n99441
2443g99443L11490Q03326j89846P743L45194L36731K38631K51945l64549q8805
2433H52417Q09110n28841k46647j125733J55246k18735l25634J58209O3541K11438
2423a95629m06545K83501Q35972K42445N3466m65321K10721N18711l85666l33704
2413C57951M15403J22526q39368L5369L21665j21564m32793l48249L40104J70710
2403B1754O93209Q9774r4414j73609K45418m57582k65169k13821J56351l57555
$$ plain form
2473 1083896 516846 418619 314379 274352 710296 965704 197555 320043 173527 67366
2463 67366 119593 239834 588464 237062 -231717 -98047 1046876 1378151 818729 558085
2453 558085 790517 308652 346200 825582 849917 -289044 -774792 -789872 -200002 -799443
2443 -799443 -487953 315373 125527 133270 478464 815195 1053826 1305771 941222 852417
2433 852417 1661527 1132686 886039 -239694 -84448 -303183 -628817 -470608 -407067 -195629
2423 -195629 -602174 -318673 517299 759744 813210 347889 558610 1077321 691655 357951
2413 357951 773354 895880 56512 91881 413546 291982 -140811 -489060 -148956 21754
2403 21754 714963 804737 710323 536714 782132 324550 59381 -154440 1911 -355644
2393c55644J61348N12317K93640m8052l32202j98000Q6345J44785m28742K48844
2383H4639M95111l4659l82221K33572k8687J28111l45090n82244M64382j50568
2373a17654J52898m06150J48213M11140l11490r8501P33133K71336m90429r6141
2363A96355R73325N22017o10722m26802k31421l30407J95866p4189m64223M43634
2353A93433n23615J70474K85431K94655o37725K94401K8280J07626O06770l33201
2343D86529j16331J41651Q7699L50210l78084J76829m23815q92890o6768L67541
2333b67429k05423K96246j54143J62329l68712J50090L34782M70378l49182j83120
2323a14184K7790L20463L84244k57760o62588j47206O98372k23507J03332K28334
$$ plain form
2393 -355644 -194296 318021 611661 563609 231407 33407 119752 264537 -164205 84639
2383 84639 579750 545091 162870 396442 367755 495866 150776 -431468 32914 -117654
2373 -117654 35244 -370906 -222693 188447 -123043 -221544 511589 782925 292496 196355
2363 196355 1169680 1691697 1080975 654173 422752 92345 288211 214022 -250201 193433
2353 193433 -330182 -159708 125723 420378 -217347 77054 105334 212960 819730 486529
2343 486529 370198 511849 599548 949758 571674 748503 324688 -568202 -634970 -267429
2333 -267429 -472852 -176606 -330749 -168420 -537132 -387042 -52260 418118 68936 -114184
2323 -114184 -86394 234069 618313 360553 -302035 -449241 249131 25624 128956 357290
2313C57290k31632j23532M90842N64426l47565k49987m09687j65185L7249Q0506
2303B725l5880K14004K09861k66155l96526K29676L89376k51244O110J06393p5263
2292A33077k54968P94399J98085p64792m24854M64776N92136q57286R0730j64948
2282a93645p880n00290O62529L32928l52177l08735N17107N08870m34180j43359
2272H1168J45074L72101k39453M21317j3780n63557j43392N04525j79112J65814
2262E50705K08924m73695l68031q5112p7832J30487M23612l19867o36264Q59983
2252B12910M39176O1125m69351L8663l89593j56128K07726N55634k76956n24048
2242c00842j6238O53297n26112j64750K72474K34131K3465l82454K34086Q4438
$$ plain form
2313 357290 125658 2126 492968 1057394 709829 459842 50155 -115030 -77781 2725
2303 2725 -33155 180849 390710 124555 -271971 -42295 347081 95837 101947 208340 133077
2292 133077 -121891 672508 870593 105801 -319053 145723 737859 -119427 -28697 -193645
2282 -193645 -201525 -701815 -39286 293642 -58535 -367270 149837 658707 224527 81168
2272 81168 226242 598343 358890 780207 766427 202870 59478 564003 384891 550705
2262 550705 759629 285934 -82097 -167209 -245041 -114554 309058 -10809 -647073 212910
2252 212910 652086 713211 243860 282523 -107070 -263198 -55472 500162 223206 -300842
2242 -300842 -317080 336217 -189895 -354645 -82171 151960 175425 -207029 27057 111495
2232A11495M13762o27204K7395O7229O7348N5740L9753j21906l6997N8021k92339
2221b37703L76519O57512O53155p73259M52899l44148Q7242l78755m2324m58643
2211g505n08511K55448J11644j89839l69802K2420N12277O59643L20779j62626
2201F43928j06755O16629l02129l19682j00994j8900l53479p71925N73343j19496
2191b59460J48049k39703M57669j2114k29598j50145N35241k1692l90019P519
2181a54253k75626J20972L60471M85035q94400O2687m73134L60059P2996P68679
2171D33486j07417p63565K69149K24301N05564l39335j06653l03535j04660M0746
2161b51919O66108P6684o39124M99243l1434l57145J23314O71202o20138n63370
$$ plain form
2232 111495 525257 -101947 -74552 -7323 60025 115765 155518 33612 -3385 54636 -237703
2221 -237703 138816 796328 1449483 676224 1129123 784975 872217 493462 451138 -7505
2211 -7505 -516016 -260568 -148924 -338763 -708565 -686145 -173868 485775 806554 643928
2201 643928 537173 1153802 851673 531991 430997 412097 58618 -713307 -139964 -259460
2191 -259460 -111411 -351114 106555 94441 -135157 -285302 249939 228247 -161772 -154253
2181 -154253 -429879 -308907 51564 536599 -357801 -295114 -768248 -408189 -335193 433486
2171 433486 326069 -437496 -168347 55954 561518 222183 115530 -188005 -292665 -251919
2161 -251919 414189 490873 -148251 350992 319558 -37587 85727 756929 136791 -426579
2151d26579J0360K99167p90144M71757N79285J42432j051103K90209J536291k10271
2141H51404l54561n59664K01660r7512m5378Q9012L08065p01807p39787L31784
2131g16784P15942P3754l96317K62887j77181N29544J46275K30883N74412k96394
2121I47021q39068M57143k82544n57148l59493J35728k09096L8425l7845o1693
2111g68570O24960J88946J75783J96711o5447M49981r6122K0868q68580L7623
2101a03847p8816k10997l15906N26171j41346n60000K72660M94228n7941j13989
2091b89783O78278r3795R7272j12549l14629l92740j94355O96356K75203m77227
2081a27969j97681j21960j16034P43821Q34176j15381j098414L97529O16117o68319
$$ plain form
2151 -426579 -416219 -117052 -907196 -435439 143846 286278 -764825 -474616 1061675 851404
2141 851404 496843 -62821 138839 41327 -4051 84961 393026 -308781 -1048568 -716784
2131 -716784 -842 72912 -323405 -60518 -237699 291845 438120 669003 1243415 947021
2121 947021 107953 565096 282552 -274596 -634089 -498361 -707457 -669032 -706877 -768570
2111 -768570 -143610 45336 221119 417830 352383 802364 706242 727110 -141470 -103847
2101 -103847 -182663 -393660 -709566 -183395 -324741 -884741 -612081 -117853 -175794 -289783
2091 -289783 388495 294700 391972 279423 -35206 -427946 -622301 74055 349258 -127969
2081 -127969 -325650 -447610 -563644 180177 1014353 898972 -199442 198087 814204 145885
2071A45885l90119J73715j78467r20595P04727K07689j50641p35027J267000J07185
2061B31352J08293K38331r9904j91391m93023J09676l1930j42986o53246M30602
2051d94226K92535l16888L47088l28973j199r5241R72426j92980m54453L31001
2041E9090P86956p47997L42083P06333n69460q29629K2474K23647j8350j46889
2031a71742J10280l5787o64930L25977N15868k59383m25390M34818r5142M6867
2021b18564L01981L88193l80106l95526O85331j97778l88692K3345M80323l88322
2011h9815k48088L09861o6406n9300l02250P29751m74247n02271k61427O15921
2001c48271L69666K6520m83595Q67784N448k80971N37317k5619l06405p49441
$$ plain form
2071 145885 -244234 -70519 -248986 -1169581 -464854 -257165 -407806 -1142833 124167 231352
2061 231352 339645 577976 478072 286681 -206342 -96666 -128596 -271582 -924828 -494226
2051 -494226 -201691 -518579 -171491 -500464 -501663 -596904 375522 182542 -271911 59090
2041 59090 846046 98049 440132 1146465 577005 -252624 -230150 -6503 -24853 -171742
2031 -171742 -61462 -97249 -762179 -436202 79666 -179717 -605107 -170289 -265431 -218564
2021 -218564 83417 471610 91504 -304022 381309 183531 -205161 -181816 298507 -89815
2011 -89815 -337903 -28042 -94448 -153748 -455998 273753 -200494 -702765 -964192 -348271
2001 -348271 21395 47915 -435680 432104 437552 156581 693898 668279 361874 -387567
1991c87567N2545M48215R72875j011301l53736j81445L88807O71476J35645n35926
1981A99588k49216K87872M55577l73595K12123n30096n93149K93455N07921m41732
1971b31252o30845q5236N27361N4035L00639p9976j04023j13649M69578O53969
1961G60601l84312k04148l40724n0144j30905J89910j74017J24551j02465O68377
1951C56724k78678j08204n24953Q04097j13081j95100L41453J47968l99355J37187
1941A68058j51902m31020n07328N5229J62544N11409l51439j84482L31541M97028
1931I9638M6415K93195n32523o18339K81308K62064N4764J0115q6395n4221L10274
1920F6295j1081l12099k00325N06168m5877L8629M08713l41473n53952j42486
$$ plain form
1991 -387567 -335022 113193 1086068 74767 -278969 -460414 -71607 599869 735514 199588
1981 199588 -49628 238244 693821 320226 532349 2253 -590896 -297441 210480 -231252
1971 -231252 -862097 -947333 -419972 -365937 -65298 -145274 -249297 -362946 106632 760601
1961 760601 376289 172141 -168583 -218727 -349632 -159722 -333739 -209188 -311653 356724
1951 356724 78046 -30158 -555111 248986 135905 -59195 282258 430226 30871 168058
1941 168058 16156 -414864 -922192 -866963 -704419 -193010 -544449 -728931 -397390 99638
1931 99638 146053 439248 -93275 -711614 -430306 -168242 -113478 -103363 -189758 -243979 66295
1920 66295 55214 -256885 -457210 48958 3081 41710 450423 108950 -445002 -587488
1910e87488L84867j20395k88668k77556K18489N87474K52611k37873J43046J16428
1900A90935o17053L37979R745L43035J45461L074n64652j32553J5410m55611J61542
1889e62688J027865j74209j214297M42795O51592l73695L7470K00030K04780l98492
1879a58849M65913J85156N6316j29321k02286L38192k92584j74344j55561j70649
1869b38017M5381K8968P4844l90176O76682p7518o50006j06899K26801L78103
1859c1837o14178M90119L24310j39381m45223M58945M48424k42919l20923M57013
1849C84350L61211n86885o86503L81187k49795J09542K60442m096m50023q4724
1839e65294O82603k70369M72365K00979k98823J13392N91594n70856o89598k051
$$ plain form
1910 -587488 -202621 -323016 -611684 -889240 -670751 -83277 169334 -68539 74507 190935
1900 190935 -426118 -88139 -78394 264641 410102 413176 -151476 -284029 -268619 -724230 -562688
1889 -562688 465177 290968 -923329 -480534 171058 -202637 -165167 34863 239643 -158849
1879 -158849 307064 492220 548536 419215 216929 555121 262537 88193 -67368 -238017
1869 -238017 -192636 -163668 -88824 -479000 197682 120164 -529842 -636741 -409940 -31837
1859 -31837 -646015 -155896 168414 29033 -416190 42755 491179 248260 -72663 384350
1849 384350 745561 158676 -527827 -146640 -396435 -286893 -26451 -30547 -480570 -565294
1839 -565294 117309 -153060 319305 520284 221461 334853 926447 355591 -334007 -336058
1829c36058N18483l71254m3435j75251N04066j39637P3354O0483L65680l46797
1819A09634n19973J224209M61793j033397o2980L69831O9512j107778N02741j36316
1809a22724M96327m30440l74919j44642K43275N823m76963J041177N00554j65370
1799E72098p73060J61003J81103J68296r07918P24061m37558k21952l13652K25628
1789f21951j54533K00791K21976p0406K54810M91650J24606l3589o9285L06054
1779F50123l40748k35677n01223K97476l52545j05271L30072l25733j17344J76911
1769e23959P14827j31657M08518m50391L70197l09052K13031j25230o6260l37775
1759b37751K76103l72487j85838J25755N66812m73209L03624O00342r98073l78336
$$ plain form
1829 -336058 182425 -188829 -232264 -407515 96551 -43086 30268 90751 456431 109634
1819 109634 -410339 813870 1275663 242266 179286 549117 618629 -489149 13592 -122724
1809 -122724 373603 -56837 -431756 -576398 -333123 -327300 -804263 236914 737468 572098
1799 572098 -200962 -39959 141144 309440 -598478 125583 -311975 -533927 -847579 -621951
1789 -621951 -776484 -575693 -353717 -424123 -169313 322337 446943 413354 344069 650123
1779 650123 309375 73698 -427525 -130049 -482594 -587865 -257793 -583526 -700870 -523959
1769 -523959 190868 59211 467729 17338 387535 78483 291514 166284 100024 -237751
1759 -237751 38352 -334135 -519973 -394218 172594 -300615 3009 603351 -394722 -773058
1749g73058J070125K29786j076536J43326P07621k58463J60445m41266j88543
1740d26563j84935N69712M95879o71018L34438K12730L96755m19260N38282j064629
1730b18609K83103j68192M21754j79083N20n28476K79638l1024J47449m08186
1720d01106M32061k87028J61438K65814q8183o14443J34557P21588j36547j20940
1710F7211L52326l94614Q3005L90770q1361l06680K11505K29006j39187o6548
1700C45433n11970J63895p75832N1176k54943N50700l88690N7996j22920P66380
1690a18775J81540J20005j47259N62571o684p4804j93743O73541m51491q60478
1680c15577K9499R6612p42323l6822O14592N7177l48376L55609l7984L16128R1602
$$ plain form
1749 -773058 297067 526853 -549683 -406357 301264 42801 203246 -238020 -426563
1740 -426563 -611498 -41786 454093 -216925 117513 330243 726998 307738 846020 -218609
1730 -218609 64494 -103698 318056 138973 139493 -388983 -109345 -140369 7080 -401106
1720 -401106 30955 -256073 -94635 171179 82996 -531447 -396890 324698 188151 67211
1710 67211 419537 24923 107928 498698 417337 110657 322162 551168 411981 345433
1700 345433 -166537 -2642 -778474 -727298 -982241 -431541 -820231 -762235 -885155 -118775
1690 -118775 62765 182770 35511 598082 591398 516594 322851 996392 544901 -315577
1680 -315577 -286078 -189466 -931789 -968611 -354019 -296842 -645218 -289609 -327593 -11465 80137
1669H0137Q8731q3634L1959Q1257l21326K15734m54913L4124M9891j33885J46194
1658b65731P45159j080308J03476Q48844O85077j092886l41024O51338J45016
1649C98961q92698K87765L38253n00339k73822q0374Q08828J89804J95460l45483
1639A26355l24804J47535N75279J82120m3386P8970p97231n21945M82864R11795
1629H17552o40276q21428J15842J30195J3439J30026M55016l76195p03569N06781
1619c72617J262104l21070q23149l00784J096221j14406q61801P26753q7734q55569
1609f52052j14008J387658l60974q31979j78191K98254J85006L27131o6692n35514
1599e41361j48245P26015K30540k27551L15394m54650L14241p1733j18360J46476
$$ plain form
1669 80137 168868 85234 117193 198450 -122876 92858 -362055 -327931 -278040 -411925 -265731
1658 -265731 479428 -600880 -497404 351440 1036517 -56369 -397393 253945 398961
1649 398961 -493737 -205972 132281 -368058 -641880 -722254 86574 276378 471838 126355
1639 126355 -198449 -50914 524365 706485 663099 742069 -55162 -577107 -94243 817552
1629 817552 177276 -644152 -528310 -398115 -384676 -254650 200366 -175829 -879398 -372617
1619 -372617 889487 568417 -254732 -555516 540705 426299 -435502 291251 203517 -652052
1609 -652052 -766060 621598 260624 -571355 -749546 -451292 -266286 60845 -5847 -541361
1599 -541361 -689606 36409 266949 39398 354792 -99858 214383 142650 24290 170766
1589A70766L271p18780J22311j77508p5356M6031L23262Q6707m65834M9230L37159
1578b98741N4655P07532L5692o88522j69517N32850J13950j43047o32913K01948
1568b86113j5415K69992K30749l63847n62511k7858O07306k3708J74928k4707
1558b1184m7929m18547K60618L80462m49346o81027L41480k33357N38528r0217
1548d20519k36060N13521J78717m47850K55714O57789l65748m36269J04580j9790
1538b15915M2365K3324P83440k66581k44782k56611j44691K08022N97977r6778
1528D29770p18035M2908N56236m42202K69176L56669n00720M4060L27867J32689
1518D98418p93014K67212J6035M35071Q8739m51805l84790J33192q4991J92834
$$ plain form
1589 170766 174037 -544743 -422432 -599940 -675296 -629265 -306003 -219296 -685130 -635900 -298741
1578 -298741 -244086 463446 499138 -189384 -358901 173949 287899 144852 -488061 -286113
1568 -286113 -301528 -31536 199213 -164634 -727145 -755003 -147697 -171405 3523 -21184
1558 -21184 -69113 -487660 -227042 153420 -295926 -976953 -635473 -868830 -330302 -420519
1548 -420519 -656579 -143058 35659 -412191 -156477 501312 135564 -300705 -196125 -215915
1538 -215915 -173550 -150226 633214 366633 121851 -134760 -279451 -71429 526548 429770
1528 429770 -288265 -245357 310879 -131323 137853 494522 -6198 37862 365729 498418
1518 498418 -294596 -27384 -11349 423722 512461 60656 -324134 -190942 -275933 -83099
1508h3099o19788M20208l82623J16448N39598k37746l18035L29984K57794M90303
1498E13044k37772k9059l09186L9723Q12481k13769r28751k37298L45326k42918
1488d88179k116k04560M09640m18622K94923m78220M53744N73999o86008m58450
1478a003849Q80514P86991K83361o41328l3519m38036o6890K64753p2147n83798
1468f23948R9064N9316k96660j10181N66321p29095j59462J010363n0329m39231
1458f73842R64802J33726l63452N33226m93940p4032N54038L17965o93131J33162
1448C38522R9517n68276j73490L70748l19891l30737k19960K20504J68948K12024
1438b02091j92632l15464O50903K30742M16675M56519j69172r41724n2825R56770
$$ plain form
1508 -83099 -702887 -282679 -665302 -548854 -9256 -247002 -565037 -235053 22741 513044
1498 513044 275272 246213 -62973 -23250 789231 575462 -353289 -590587 -245261 -488179
1488 -488179 -490295 -694855 -285215 -703837 -408914 -887134 -433390 140609 -545399 -1003849
1478 -1003849 -123335 663656 947017 305689 272170 -165866 -232756 31997 -40150 -623948
1468 -623948 -524884 -465568 -762228 -872409 -306088 -1035183 -1194645 -184282 -234611 -673842
1458 -673842 290960 424686 61234 594460 100520 26488 580526 898491 205360 338522
1448 338522 438039 -130237 -303727 67021 -252870 -583607 -803567 -583063 -414115 -202091
1438 -202091 -394723 -710187 -59284 171458 588133 1044652 875480 -66244 -119069 837701
1428H37701k97293n92325p94556O2533K16401K30600m2987L07304K56942n00517
1418c16197l08130R0700K85814M33931p8720k28069l81176q2561J82216M00060
1408b132K14572j35414J91950j05296M03297q5257K94232q55143J00914N30747
1398E52470n25422L541p7157m32770r30004M01010M43885k13417N59336N77141
1388C58613J88387K63739o3831l07903r8683L15505k03045q37886J17193O83748
1378D15837r24148o3968k79650q95J35186L85991L42883m44716l58343N41981
1368b49842O46127k61914o37347L14994j18346J50356m4402J08156j79702l76642
1358f48562J49370M96182J7338n41863l18147K48063k9724k28970J68938L95710
$$ plain form
1428 837701 540408 -51917 -846473 -783940 -567539 -336939 -379926 -72622 184320 -316197
1418 -316197 -624327 -533627 -247813 186118 107398 -120671 -501847 -584408 -402192 -2132
1408 -2132 212440 77026 268976 163680 566977 481720 775952 -79191 21723 552470
1398 552470 27048 30589 -46568 -479338 -1409342 -1008332 -564447 -777864 -218528 358613
1388 358613 547000 810739 746908 439005 340322 655827 452782 -385104 -267911 415837
1378 415837 -508311 -572279 -851929 -852824 -717638 -331647 11236 -433480 -791823 -249842
1368 -249842 396285 134371 -502976 -187982 -306328 -155972 -200374 -92218 -271920 -648562
1358 -648562 -499192 -3010 14328 -527535 -845682 -597619 -627343 -856313 -687375 -291665
1348b91665J7810N98765O7083n60011K37345p5458l26967k74576M47437o31946
1338g92183l94832M93093N86663p43879j14246J60953L55660J41336N52706n46280
1328c01009j78994J007744k8125n89694M439j0481l21824J05313k1900l0750k09590
1317e74871l67087J46093P42899m41192k45562M03247L94231L18064j00402L75179
1307F50599r71309m4744J34134M38636m01781n65573K71037L4206O1606p8197
1297d71386k23247n00643R70459J06411j01804l79044J63796j61822L36155P85971
1287E24846k69978n21315j21474O23132n31515p26551M16125j7619j24002R28770
1277A80419O6724o55663J35467Q4946K60370k20899k60328j39045L14563N67088
$$ plain form
1348 -291665 -273855 324910 391993 -168018 69327 -6131 -333098 -607674 -160237 -792183
1338 -792183 -1187015 -693922 -107259 -851138 -965384 -804431 -448771 -307435 245271 -301009
1328 -301009 -480003 527741 499616 -90078 -85639 -96120 -417944 -312631 -334531 -365281 -574871
1317 -574871 -941958 -795865 -52966 -494158 -739720 -336473 57758 375822 275420 650599
1307 650599 -320710 -365454 -231320 207316 -194465 -760038 -489001 -454795 -393189 -471386
1297 -471386 -694633 -1195276 -224817 -118406 -220210 -599254 -435458 -597280 -261125 524846
1287 524846 254868 -266447 -387921 235211 -296304 -1022855 -606730 -624349 -748351 180419
1277 180419 247143 -408520 -273053 -188107 72263 -148636 -408964 -548009 -233446 333642
1267C33642n35220K65937J59067p22201j3613R67537n49283q58298M65392R56933
1257D69893k76963j86677l48137L15894O2186L8329L53302o21374n45815l25934
1247a065296Q83177L06765j80154O873R4089q6544m99361M9572o8263M66327j50864
1236b43679j62630L41229J3036K0371K81602r1603k6264K29697J96224k02259
1226C55724n3862p4550n24475l83241k21731L50983j92165O81820k90931j36386
1216d88814K71648M66522k29988k28934L54076j62238M10393N27938p88933l35895
1206b04225j56074n63152P37483k65694J01137N44050k29777n93430K1732L27036
1196b80914M4988l5274L61353j49889l60978J40654j21894N65707o93477K63443
$$ plain form
1267 333642 -201578 64359 223426 -498775 -512388 455149 -94134 -952432 -487040 469893
1257 469893 192930 6253 -341884 -25990 36196 74525 427827 -193547 -739362 -1065296
1247 -1065296 -182119 124646 -55508 -48635 45454 -41090 -540451 -490879 -559142 -92815 -243679
1236 -243679 -406309 -65080 -52044 -31673 249929 158326 132062 361759 557983 355724
1226 355724 301862 227312 -297163 -680404 -902135 -551152 -743317 -61497 -352428 -488814
1216 -488814 -217166 249356 19368 -209566 144510 -17728 392665 920603 131670 -204225
1206 -204225 -360299 -923451 -185968 -451662 -350525 193525 -36252 -629682 -607950 -280914
1196 -280914 -235926 -271200 90153 -59736 -420714 -280060 -401954 163753 -529724 -266281
1186b66281L53884M51056m36787K7885j29372o71063P59647N17962l09893o19157
1176c22119P33319o28901j14223J45241N84535p05233p49456K26812R78625M4491
1166A93091L4208r6509j64557J97850L85205K05102l62920J39886l95070l8117
1156I8169K30796k08659k13640j58822k94936j32117n46017k27708P1281Q12165
1146e69488k1003o13606J061579P43362P4235k10212O12353Q3245p88445N92310
1136I64330p1520j68908j406255K52266j96629J24311l36594J02368o94793M30400
1126a001024N49914K82172J84882j23390n35011N81949Q13082K03297m58646n12720
1116a5495K87338n41097M22334m21955j29763N48312K62832j078681J54803J267753
$$ plain form
1186 -266281 87603 538659 101872 129757 385 -670678 88969 606931 297038 -322119
1176 -322119 411200 -217701 -331924 -186683 397852 -307381 -1056837 -830025 148600 193091
1166 193091 227299 130790 -33767 164083 549288 754390 391470 531356 136286 98169
1156 98169 328965 120306 -93334 -252156 -547092 -679209 -1225226 -1452934 -1381653 -569488
1146 -569488 -590491 -1204097 -142518 600844 675079 464867 1077220 1160465 372020 964330
1136 964330 892810 723902 -682353 -430087 -626716 -502405 -838999 -736631 -1431424 -1001024
1126 -1001024 -451110 -168938 15944 -107446 -642457 -60508 752574 955871 497225 -15495
1116 -15495 271843 -269254 153080 -268875 -398638 149674 412506 -666175 -511372 756381
1106G56381k90342k84326J13841l42947n1078k89288O99597J84310l78270j144114
1096a026236P38976L35351N67718o51015n61956M53439r6784l26616M36311M39717
1086C08905j64248j17336l42842J20394m01178L18281l62818L50290J22059p70604
1076i39097O56312P21826m3719p46762K39847p5861L73894L24810J51829l47756
1066C15323m95303M80048J05507q5861j37333o9191r67598J44812O36487O86881
1056F13772r04999o27055L02917N45902L09572m22414J39285j18690L04649j18075
1046B4864M13280j0421l09756l55567Q8546M23053l62775k25216N04764K20962
1036D11734l40610k21560l89147M45977k85123j34245L7681K29916k31980k06047
$$ plain form
1106 756381 466039 181713 295554 -47393 -98471 -387759 311838 496148 117878 -1026236
1096 -1026236 -287260 48091 615809 -35206 -597162 -143723 -240507 -567123 -130812 308905
1086 308905 144657 27321 -315521 -195127 -596305 -278024 -640842 -290552 -168493 -939097
1076 -939097 -282785 439041 395322 -351440 -111593 -187454 186440 511250 663079 315323
1066 315323 -179980 300068 405575 319714 182381 113190 -854408 -709596 -73109 613772
1056 613772 -291227 -918282 -615365 -69463 240109 -182305 -43020 -161710 142939 24864
1046 24864 438144 427723 117967 -237600 -149054 273999 -88776 -313992 190772 411734
1036 411734 71124 -150436 -539583 -93606 -378729 -512974 -475293 -245377 -477357 -683404
1026f83404Q61045n8144m39427J00072N98239j62680k33495L61364p0294K56598
1016E29874n34401j87794j57351k73054M29167M66132r0306j98567M8094k33555
$$ plain form
1026 -683404 177641 119497 -319930 -219858 378381 215701 -17794 343570 273276 529874
1016 529874 -4527 -192321 -349672 -622726 -193559 272573 182267 -16300 31794 -201761
$$ [...]
##END NTUPLES=NMR SPECTRUM
##END=
