##TITLE=1H_DE-80H_X3
 200.13MHz, d2o
 8 sc
 
 19ns.26.2.2025
##JCAMPDX= 6.0         $$ Bruker NMR JCAMP-DX V2.0
##DATA TYPE= NMR SPECTRUM
##DATA CLASS= NTUPLES
##ORIGIN= UXNMR, Bruker Analytische Messtechnik GmbH
##OWNER= pz
$$ XWIN-NMR		Version 3.5
$$ Thu Jun  4 12:02:33 2026 Russian Standard Time (UT+4h)  Yarkov@DPX200
##.OBSERVE FREQUENCY= 200.1313
##.OBSERVE NUCLEUS= ^1H
##.ACQUISITION MODE= SIMULTANEOUS
##.ACQUISITION SCHEME= undefined
##.AVERAGES= 8
##.DIGITISER RES= 18
##SPECTROMETER/DATA SYSTEM= spect
##.PULSE SEQUENCE= zg30
##.SOLVENT NAME= DMSO
##.SHIFT REFERENCE= (INTERNAL, DMSO, 0, 15.5001)
##AUDIT TRAIL= $$ (NUMBER, WHEN, WHO, WHERE, WHAT)
$$ ##TITLE= Audit trail, XWIN-NMR		Version 3.5
$$ ##JCAMPDX= 5.01
$$ ##ORIGIN= Bruker BioSpin GmbH
$$ ##OWNER= Yarkov
$$ C:/Bruker/XWIN-NMR/data/yarkov2/nmr/H-C/1/pdata/1/auditp.txt
$$ ##AUDIT TRAIL=  $$ (NUMBER, WHEN, WHO, WHERE, WHAT)
(   1,<2026-06-04 12:01:51.81 +0400>,<Yarkov>,<DPX200>,
      <created by zg, POWCHK disabled, PULCHK disabled
       configuration hash MD5:
       00 E9 B6 7A A2 85 ED C7 34 08 36 98 17 FE 4E 26
       data hash MD5: 16K
       0C A6 59 5A A6 8E 09 FC 29 18 6B BD 00 23 D5 66>)
(   2,<2026-06-04 12:02:00.23 +0400>,<Yarkov>,<DPX200>,
      <Start of raw data processing
       efp BC_mod = 2 LB = 0.25 FT_mod = 6 PKNL = 1 PHC0 = -6376.443 PHC1 = 8.221958 SI = 16K 
       data hash MD5: 16K
       40 29 91 F1 33 07 65 11 F1 7C 32 70 9B 3D 07 62>)
$$ ##END=
$$ 
$$ hash MD5
$$ 24 F3 28 3A 71 09 F2 9F 2E 0A 69 CE 5E 4C 07 E9
##$RELAX= 
##$RELAX= 
##$RELAX= 
##$RELAX= 
##$RELAX= 
##$RELAX= 
$$ Bruker specific parameters
$$ --------------------------
##$DU= <C:/Bruker/XWIN-NMR>
##$EXPNO= 1
##$NAME= <H-C>
##$PROCNO= 1
##$TYPE= <nmr>
##$USER= <yarkov2>
##$AMP= (0..31)
100 100 100 100 100 100 100 100 100 100 100 100 100 100 100 100 100 100 
100 100 100 100 100 100 100 100 100 100 100 100 100 100 
##$AQSEQ= 0
##$AQ_mod= 1
##$AUNM= <au_zg>
##$AUTOPOS= <>
##$BF1= 200.13
##$BF2= 200.13
##$BF3= 200.13
##$BF4= 200.13
##$BF5= 200.13
##$BF6= 200.13
##$BF7= 200.13
##$BF8= 200.13
##$BYTORDA= 1
##$CFDGTYP= 0
##$CFRGTYP= 5
##$CHEMSTR= <none>
##$CNST= (0..31)
1 1 145 1 1 1 1 1 1 1 1 1 1 1 1 1 1 1 1 1 1 1 1 1 1 1 1 1 1 1 1 1 
##$CPDPRG= <>
##$CPDPRG1= <>
##$CPDPRG2= <>
##$CPDPRG3= <>
##$CPDPRG4= <mlev>
##$CPDPRG5= <mlev>
##$CPDPRG6= <mlev>
##$CPDPRG7= <mlev>
##$CPDPRG8= <mlev>
##$CPDPRGB= <>
##$CPDPRGT= <>
##$D= (0..31)
0 0.7 0 0 0 0 0 0 0 0 0 0.03 0 0 0 0 0 0 0 0 0 0 0 0 0 0 0 0 0 0 0 0 
##$DATE= 1780560111
##$DBL= (0..7)
120 120 120 120 120 120 120 120 
##$DBP= (0..7)
150 150 150 150 150 150 150 150 
##$DBP07= 0
##$DBPNAM0= <>
##$DBPNAM1= <>
##$DBPNAM2= <>
##$DBPNAM3= <>
##$DBPNAM4= <>
##$DBPNAM5= <>
##$DBPNAM6= <>
##$DBPNAM7= <>
##$DBPOAL= (0..7)
0.5 0.5 0.5 0.5 0.5 0.5 0.5 0.5 
##$DBPOFFS= (0..7)
0 0 0 0 0 0 0 0 
##$DE= 6
##$DECBNUC= <off>
##$DECIM= 32
##$DECNUC= <off>
##$DECSTAT= 4
##$DIGMOD= 1
##$DIGTYP= 9
##$DL= (0..7)
0 120 120 120 120 120 120 120 
##$DP= (0..7)
$$ [...]
##$SUBNAM2= <"">
##$SUBNAM3= <"">
##$SUBNAM4= <"">
##$SUBNAM5= <"">
##$SUBNAM6= <"">
##$SUBNAM7= <"">
##$SUBNAM8= <"">
##$SUBNAM9= <"">
##$SW= 18.0517328524113
##$SWIBOX= (0..15)
0 0 2 0 0 0 0 0 0 0 0 0 0 0 0 0 
##$SW_h= 3612.71676300578
##$TD= 16384
##$TD0= 1
##$TE= 0
##$TE2= 300
##$TE3= 300
##$TEG= 300
##$TL= (0..7)
0 120 120 120 120 120 120 120 
##$TP= (0..7)
150 150 150 150 150 150 150 150 
##$TP07= 0
##$TPNAME0= <>
##$TPNAME1= <>
##$TPNAME2= <>
##$TPNAME3= <>
##$TPNAME4= <>
##$TPNAME5= <>
##$TPNAME6= <>
##$TPNAME7= <>
##$TPOAL= (0..7)
0.5 0.5 0.5 0.5 0.5 0.5 0.5 0.5 
##$TPOFFS= (0..7)
0 0 0 0 0 0 0 0 
##$TUNHIN= 0
##$TUNHOUT= 0
##$TUNXOUT= 0
##$USERA1= <user>
##$USERA2= <user>
##$USERA3= <user>
##$USERA4= <user>
##$USERA5= <user>
##$V9= 5
##$VALIST= <valist>
##$VCLIST= <CCCCCCCCCCCCCCC>
##$VD= 0
##$VDLIST= <DDDDDDDDDDDDDDD>
##$VPLIST= <PPPPPPPPPPPPPPP>
##$VTLIST= <TTTTTTTTTTTTTTT>
##$WBST= 1024
##$WBSW= 4
##$XGAIN= (0..3)
0 0 0 0 
##$XL= 0
##$YL= 0
##$YMAX_a= 264845
##$YMIN_a= -140248
##$ZGOPTNS= <>
##$ZL1= 120
##$ZL2= 120
##$ZL3= 120
##$ZL4= 120
##$ABSF1= 0
##$ABSF2= 0
##$ABSG= 0
##$ABSL= 0
##$ALPHA= 0
##$AQORDER= 0
##$ASSFAC= 0
##$ASSFACI= 0
##$ASSFACX= 0
##$ASSWID= 0
##$AUNMP= <proc_1d>
##$AZFE= 0.1
##$AZFW= 0.1
##$BCFW= 0
##$BC_mod= 2
##$BYTORDP= 0
##$COROFFS= 0
##$CY= -3
##$DATMOD= 1
##$DC= 0
##$DFILT= <>
##$DTYPP= 0
##$F1P= 0
##$F2P= 0
##$FCOR= 1
##$FTSIZE= 16384
##$FT_mod= 6
##$GAMMA= 0
##$GB= 0
##$INTBC= 1
##$INTSCL= 3.241238e-09
##$ISEN= 128
##$LB= 0.25
##$LEV0= 0
##$LPBIN= 0
##$MAXI= 10000
##$MC2= 0
##$MEAN= 0
##$ME_mod= 0
##$MI= 1.114404
##$NCOEF= 0
##$NC_proc= -9
##$NLEV= 6
##$NOISF1= 3.799351
##$NOISF2= 2.8
##$NSP= 0
##$NTH_PI= 0
##$NZP= 0
##$OFFSET= 15.50009
##$PC= 1
##$PHC0= -6376.443
##$PHC1= 8.221958
##$PH_mod= 1
##$PKNL= yes
##$PPARMOD= 0
##$PSCAL= 0
##$PSIGN= 0
##$REVERSE= no
##$SF= 200.130004326066
##$SI= 16384
##$SIGF1= 3
##$SIGF2= 2
##$SINO= 0.751879
##$SIOLD= 32768
##$SREGLST= <19F.Aceton>
##$SSB= 0
##$STSI= 16384
##$STSR= 0
##$SW_p= 3612.71676300578
##$SYMM= 0
##$S_DEV= 0
##$TDeff= 16384
##$TDoff= 0
##$TI= <>
##$TILT= no
##$TM1= 0
##$TM2= 0
##$TOPLEV= 0
##$USERP1= <user>
##$USERP2= <user>
##$USERP3= <user>
##$USERP4= <user>
##$USERP5= <user>
##$WDW= 1
##$XDIM= 16384
##$YMAX_p= 517478586
##$YMIN_p= -3812261
$$ End of Bruker specific parameters
$$ ---------------------------------
##NTUPLES= NMR SPECTRUM
##VAR_NAME=  FREQUENCY,     SPECTRUM/REAL,   SPECTRUM/IMAG
##SYMBOL=    X,             R,               I
##VAR_TYPE=  INDEPENDENT,   DEPENDENT,       DEPENDENT
##VAR_FORM=  AFFN,          ASDF,            ASDF
##VAR_DIM=   16384,         16384,           16384
##UNITS=     HZ,            ARBITRARY UNITS, ARBITRARY UNITS
##FACTOR=    0.220516191357247, 1,           1
##FIRST=     3102.03300778546, 0,            0
##LAST=      -510.683755220321, 0,           0
##MIN=       -510.683755220321, -3812261,    0
##MAX=       3102.03300778546, 517478586,    0
$$ Real data points
##PAGE= N=1
##DATA TABLE= (X++(R..R)), XYDATA
$$ [...]
$$ plain form
6772 24809530 24860118 24899388 24833483 24019441 23586445 24587852 24987270 24928057 24814480 24989434
6762 24989434 24589177 24796345 24861356 24995726 25589992 25970954 26035974 25069064 24589330 25637443
6752 25637443 25353849 24775726 24851602 24520184 24887258 25272692 24955116 24744995 24531521 24352859
6742 24352859 24828549 25829546 25363673 25244973 25404986 25795599 25742190 25232991 25787848
6733 25787848 25250912 25225507 25103512 25125873 25203717 25078527 26120370 26438190 26369389 26147369
6723 26147369 26563160 26135263 26218479 26997807 26442476 26101010 25891142 25726688 26198340 26479629
6713 26479629 25916233 25828058 25388807 25182920 25992476 25886536 25800581 26884624 26952922 26227375
6703 26227375 26583460 25919792 26284168 26812054 27123821 27659863 26949755 27472530 27719097
$$ packed form
6772B4809530N0588L9270o5905q14042m32996J001407L99418n9213j13577J74954
6762B4989434m00257K07168O5011J34370N94266L80962O5020r66910m79734J048113
6752B5637443k83594n78123P5876l31418L67074L85434l17576k10121k13474j78662
6742B4352859M75690J000997m65873j18700J60013L90613n3409n09199N54857
6733B5787848n36936k5405j21995K2361P7844j25190J041843L17820o8801k22020
6723B6147369M15791m27897Q3216P79328n55331l41466k09868j64454M71652K81289
6713B6479629n63396q8175m39251k05887Q09556j05940q5955J084043O8298p25547
6703B6227375L56085o63668L64376N27886L11767N36042p10108N22775K46567
$$ plain form
6694 27719097 27946069 27825201 28030594 27883732 27378147 27754108 28068957 27165721 27622341
6685 27622341 27285941 27255344 27564353 27850014 28064088 26958108 27446867 27679015 27454114
6676 27454114 28083277 27879754 26949379 27239213 27719119 27909444 26980616 26791674 27484928
6667 27484928 27544534 27661948 28103247 28112776 27675710 28372698 28738988 28364135 28274218 28707615
6657 28707615 28184265 28193324 29229936 29109363 28224887 27817799 27512733 28056561 28046745 27934605
6647 27934605 28447360 28462840 28625736 29617446 29676463 28808047 28685276 28822809 28919298 29158198
6637 29158198 29303655 29852066 29489690 29989104 29801018 28731610 28989732 28817984 28721365
6628 28721365 29212234 30098422 29399404 28825612 29374225 29815514 29548367 30082516 30047831 29683435
$$ packed form
6694B7719097K26972j20868K05393j46862n05585L75961L14849r03236M56620
6685B7622341l36400l0597L09009K85661K14074j105980M88759K32148k24901
6676B7454114O29163k03523r30375K89834M79906J90325r28828j88942O93254
6667B7484928N9606J17414M41299R529m37066O96988L66290l74853q9917M33397
6657B8707615n23350R059J036612j20573q84476m07088l05066N43828r816j12140
6647B7934605N12755J5480J62896R91710N9017q68416j22771J37533R6489K38900
6637B9158198J45457N48411l62376M99414j88086j069408K58122j71748r6619
6628B8721365M90869Q86188o99018n73792N48613M41289k67147N34149l4685l64396
$$ plain form
6618 29683435 29760515 29893591 30442073 30494691 30900257 31078076 30793237 30247240 30732900 31022764
6608 31022764 30857131 31042389 31395352 31417429 31700469 32325153 32650228 32002520 32329711 33374192
6598 33374192 33216550 33587612 32359031 31947595 31791635 32205980 32278512 32268820 33057420 33937914
6588 33937914 33956482 34448916 33940545 33207037 32903974 33016236 33902490 34148470 33918307 33866912
6578 33866912 34987412 35393398 35417232 35832067 35643135 34672745 34116796 35890518 35341119
6569 35341119 35615218 34584055 34326500 34151960 33665216 34409456 34957151 35205214 35330627
6560 35330627 34778985 33731829 34659349 35382273 35465931 36262951 36432998 35480939 34842810
6551 34842810 35051804 36166774 35272572 35671356 35993335 36257235 36275586 35961013 36116519
$$ packed form
6618B9683435P7080J33076N48482N2618M05566J77819k84839n45997M85660K89864
6608C1022764j65633J85258L52963K2077K83040O24684L25075o47708L27191J044481
6598C3374192j57642L71062j228581m11436j55960M14345P2532r692P88600Q80494
6588C3937914J8568M92434n08371p33508l03063J12262Q86254K45980k30163n1395
6578C3866912J120500M05986K3834M14835j88932r70390n55949J773722n49399
6569C5341119K74099j031163k57555j74540m86744P44240N47695K48063J25413
6560C5330627n51642j047156R27520P22924Q3658P97020J70047r52059o38129
6551C4842810K08994J114970q94202L98784L21979K63900J8351l14573J55506
$$ plain form
6542 36116519 35904033 36332295 36270585 36309534 36844502 37271713 36235997 35555085 36898065
6533 36898065 36429090 36418368 36643638 36608484 36517411 36742002 36527122 36315896 37229473 37336731
6523 37336731 37870565 38624528 37817108 38548519 39227143 38248667 37780874 38117516 38856683
6514 38856683 39031916 39480465 39905258 40478377 39595741 38954283 40715970 40706247 40555166 40377893
6504 40377893 40673316 40548340 40656575 40533524 40984736 41037518 41020762 42007652 42202201 42577866
6494 42577866 42474738 42854733 43634634 43623411 43847707 44355765 45303975 45388661 45253943 44991371
6484 44991371 45908154 46349500 46813153 47094511 47640100 47010958 48589411 48596177 47495330
6475 47495330 48143509 48429431 48500877 48992814 50148307 50224812 51302239 52024724 52625268
$$ packed form
6542C6116519k12486M28262o1710L8949N34968M27211j035716o80912J342980
6533C6898065m68975j0722K25270l5154r1073K24591k14880k11226R13577J07258
6523C7336731N33834P53963q07420P31411O78624r78476m67793L36642P39167
6514C8856683J75233M48549M24793N73119q82636o41458J761687r723j51081j77273
6504D0377893K95423j24976J08235j23051M51212N2782j6756R86890J94549L75665
6494D2577866j03128L79995P79901j1223K24296N08058R48210Q4686j34718k62572
6484D4991371R16783M41346M63653K81358N45589o29142J578453O766j100847
6475D7495330O48179K85922P1446M91937J155493P6505J077427P22485O00544
$$ plain form
6466 52625268 52630715 53440289 54733615 54956720 55979660 57295111 58042526 58831080 60448299
6457 60448299 61943894 62330720 63947083 64686896 65368509 66321492 68630040 70388767 71099998
6448 71099998 71621741 72727687 72976761 73895120 73966070 74247431 74567030 74892121 75299626
6439 75299626 74504658 74234618 74002276 73159742 71735325 70652903 70568244 69645977 68101081
6430 68101081 68165557 66772242 64901092 63941747 63458219 63052945 62709893 61873880 60651257
6421 60651257 60152144 58809440 59047577 58954781 57912542 57558487 56812343 56100754 55519804
6412 55519804 55727548 55833318 55968131 55982913 55620520 55686619 55063387 54575944 54263582 53928513
6402 53928513 54445303 54135125 54129307 54336046 53971784 54535625 54056869 53893723 54260524 55140334
$$ packed form
6466E2625268N447Q09574J293326K23105J022940J315451P47415P88554J617219
6457F0448299J495595L86826J616363P39813O81613R52983K308548J758727P11231
6448G1099998N21743J105946K49074R18359P0950K81361L19599L25091M07505
6439G5299626p94968k70040k32342q42534j424417j082422q4659r22267j544896
6430F8101081O4476j393315j871150r59345m83528m05274l43052q36013j222623
6421F0651257m99113j342704K38137r2796j042239l54055p46144p11589n80950
6412E5519804K07744J05770J34813J4782l62393O6099o23232m87443l12362l35069
6402E3928513N16790l10178n818K06739l64262N63841m78756j63146L66801Q79810
$$ plain form
6392 55140334 55006650 53980680 53768025 53605324 54094164 53507997 53561954 54532970 55507622
6383 55507622 55034107 54615632 54327624 54283280 54350523 54315524 54615500 53986756 53876582 54388081
6373 54388081 55155940 55499027 55715955 54867535 53971977 54875519 55298729 54942561 54899593 55026118
6363 55026118 55314039 55018417 54338155 54344832 54732117 54322554 54217739 54802049 55247133 54844590
6353 54844590 55053449 54453913 54177680 54126021 54091379 53563798 54463797 54604846 53998990 54556991
6343 54556991 54403627 54565960 54829446 54626554 54935082 55658431 55986261 55676860 55399290
6334 55399290 55980332 55783916 55471840 55168545 54982389 55038721 54923297 55729748 56187762 57040457
6324 57040457 56829058 56348775 56124375 56017433 56157945 55729053 56712487 57727796 57177579
$$ packed form
6392E5140334j33684j025970k12655j62701M88840n86167N3957R71016R74652
6383E5507622m73515m18475k88008m4344O7243l4999K99976o28744j10174N11499
6373E4388081P67859L43087K16928q48420q95558R03542M23210l56168m2968J26525
6363E5026118K87921k95622o80262O677L87285m09563j04815N84310M45084m02543
6353E4844590K08859n99536k76233n1659l4642n27581Q99999J41049o05856N58001
6343E4556991j53364J62333K63486k02892L08528P23349L27830l09401k77570
6334E5399290N81042j96416l12076l03295j86156N6332j15424Q06451M58014Q52695
6324E7040457k11399m80283k24400j06942J40512m28892R83434J015309n50217
$$ plain form
6315 57177579 57441111 58436724 58022152 56740662 56285725 56347602 57485122 58076671 57538718
6306 57538718 57520077 56594793 57375108 58051050 59139620 59561679 59852348 59857391 60519645 59900134
6296 59900134 59654852 61269953 61483969 61553974 61605865 61876162 62974357 63358774 64006152
6287 64006152 63343948 63917940 64046724 64098762 64577661 66012517 66224008 67444236 68047308
6278 68047308 68709853 69595375 69668476 69711860 69523665 69317200 69455199 69236237 68327331 68741514
6268 68741514 69012228 69298524 68938962 68713549 68019004 67417945 68157165 67628304 67960957
6259 67960957 67548651 66034067 66250991 66930139 66906591 66424437 67064036 66796512 67380103
6250 67380103 66453672 66147006 66189272 66614290 66851453 66660580 67489311 67938744 67177839 66914556
$$ packed form
6315E7177579K63532R95613m14572j281490m54937O1877J137520N91549n37953
6306E7538718j8641r25284P80315O75942J088570M22059K90669N043O62254o19511
6296E9900134k45282J615101K14016P0005N1891K70297J098195L84417O47378
6287F4006152o62204N73992J28784N2038M78899J434856K11491J220228O03072
6278F8047308O62545Q85522P3101M3384j88195k06465J37999k18962r08906M14183
6268F8741514K70714K86296l59562k25413o94545o01059P39220n28861L32653
6259F7960957m12306j514584K16924O79148k3548m82154O39599k67524N83591
6250F7380103r26431l06666M2266M25018K37163j90873Q28731M49433p60905k63283
$$ plain form
6240 66914556 66307886 67167926 67436393 67368104 67279951 68182631 68086723 67712507 67652150 67146602
6230 67146602 66868514 68032220 69272750 68243939 67946983 68578242 69117483 68582714 67752655
6221 67752655 68418188 69338345 69236572 69076383 69527817 69437088 69232802 70388178 70492686
6212 70492686 70812231 70800163 70223271 70203106 70785805 71710506 72090465 71391854 72201092 72312935
6202 72312935 72160276 72991380 73046778 72976355 72256010 72764544 73468477 72562363 72666837 73930990
6192 73930990 73792581 74377431 74813295 74952733 76773059 77350123 78061193 77523439 77623271
6183 77623271 78261858 77907501 78471368 78369114 78544475 79065050 79586605 80758461 81330321
6174 81330321 82194054 82145602 82219218 82848215 82973149 83385696 83706180 85364090 86130853 85443151
$$ packed form
6240F6914556o06670Q60040K68467o8289q8153R02680r5908l74216o0357n05548
6230F7146602k78088J163706J240530j028811k96956O31259N39241n34769q30059
6221F7752655O65533R20157j01773j60189M51434r0729k04286J155376J04508
6212G0492686L19545j2068n76892k0165N82699R24701L79959o98611Q09238J11843
6202G2312935j52659Q31104N5398p0423p20345N08534P03933r06114J04474J264153
6192G3930990j38409N84850M35864J39438J820326N77064P11070n37754R9832
6183G7623271O38587l54357N63867j02254J75361N20575N21555J171856N71860
6174H1330321Q63733m8452P3616O28997J24934M12547L20484J657910P66763o87702
$$ plain form
6164 85443151 86218243 86510994 86542874 87130082 86809025 88134793 89213923 89556664 90197433
6155 90197433 91543013 91798597 92635823 92443190 93238172 93697843 94848481 96092074 96117076
6146 96117076 96835142 96918584 97500929 98619192 99492938 100097134 100510495 100914349 101522329
6137 101522329 102588444 103092664 103771835 104596499 104987995 105626425 106368990 107401549 106901340
6128 106901340 106482624 106787572 108193752 109161780 109904327 110229933 110039949 110190955 110481059
6119 110481059 110708422 111025472 111976821 112197336 112036913 111976124 112254716 112689785 112269746
6110 112269746 112113325 112743358 113499756 113661202 113347127 113447743 114066102 113734163 113557632
6101 113557632 114963115 115002615 114902996 115579761 115572144 116102170 117435626 118512480 118328857
$$ packed form
6164H5443151P75092K92751L1880N87208l21057J325768J079130L42741O40769
6155I0197433J345580K55584Q37226j92633P94982M59671J150638J243593K5002
6146I6117076P18066Q3442N82345J118263Q73746O04196M13361M03854O07980
6137A01522329J066115N04220O79171Q24664L91496O38430P42565J032559n00209
6128A06901340m18716L04948J406180R68028P42547L25606j89984J51006K90104
6119A10481059K27363L17050R51349K20515j60423o0789K78592M35069m20039
6110A12269746j56421O30033P56398J61446l14075J00616O18359l31939j76531
6101A13557632J405483L9500r9619O76765p617N30026J333456J076854j83623
$$ plain form
6092 118328857 119429422 120244311 120702927 121738953 122850528 123542535 124943245 124568035 124913776
6083 124913776 125336922 126422022 127454424 128459942 129673805 129785092 130261910 130896858 131014321
6074 131014321 132377534 133224453 133654946 134449031 133972035 133698030 133700879 134300857 135102771
6065 135102771 135505612 135532443 136173863 135861448 135600994 135809465 136414037 137613905 138431610
6056 138431610 138600991 138838317 139130761 139341151 138455214 138829075 140005214 141308672 142054606
6047 142054606 142621728 143284688 143688607 144030601 144303157 144280242 144615459 144657301 144670381 146042353
6037 146042353 146134093 145555005 147103173 147912369 149073589 148819116 148658813 149425460 149830885
6028 149830885 150755090 150583699 151250085 151786196 152140396 152909759 153137813 153340297 153521874
$$ packed form
6092A18328857J100565Q14889M58616J036026J111575O92007J400710l75210L45741
6083A24913776M23146J085100J032402J005518J213863J11287M76818O34948J17463
6074A31014321J363213Q46919M30493P94085m76996k74005K849N99978Q01914
6065A35102771M02841K6831O41420l12415k60454K08471O04572J199868Q17705
6056A38431610J69381K37326K92444K10390q85937L73861J176139J303458P45934
6047A42054606N67122O62960M03919L41994K72556k2915L35217M1842J3080J371972
6037A46042353R1740n79088J548168Q09196J161220k54473j60303P66647M05425
6028A49830885R24205j71391O66386N36111L54200P69363K28054K02484J81577
$$ plain form
6019 153521874 154014498 154612837 154867918 156118097 156008108 156827983 157282356 157989205 157960470
6010 157960470 158598270 159473765 159621829 159635825 160419014 161087256 162057774 162975964 163054463 163418469
6000 163418469 164178217 164560774 164490537 165357890 165496727 165649655 165735308 166854299 167207692
5991 167207692 167180738 167394263 168252939 168381657 167962741 167852806 167995699 168916811 169014832 168797578
5981 168797578 169188314 168675952 168546416 168152316 167721621 166897864 165694321 164748894 164810422
5972 164810422 165552708 164453558 163859104 163861644 162588997 161226117 159757777 159173123 158057011
5963 158057011 157325982 157272526 156162544 156475917 155001551 153684928 152582260 151647480 152096785
5954 152096785 151100371 149382992 148038042 146795447 146121388 145743917 144856871 144512194 144217466
$$ packed form
6019A53521874M92624N98339K55081J250179j09989Q19875M54373P06849k8735
6010A57960470O37800Q75495J48064J3996P83189O68242R70518R18190P8499L64006
6000A63418469P59748L82557p0237Q67353J38837J52928Q5653J118991L53393
5991A67207692k6954K13525Q58676J28718m18916j09935J42893R21112R8021k17254
5981A68797578L90736n12362j29536l94100m30695q23757j203543r45427O1528
5972A64810422P42286j099150n94454K540j272647j362880j468340n84654j116112
5963A58057011p31029n3456j109982L13373j474366j316623j102668r34780M49305
5954A52096785r96414j717379j344950j242595o74059l77471q87046l44677k94728
$$ plain form
5945 144217466 143175246 142432133 142474000 142081038 141676690 140953548 140296092 139742632 139756733
5936 139756733 138520487 138112839 137619289 138131378 138171251 138188722 137529402 136377371 135713862
5927 135713862 135173911 134881102 134653652 133873928 132869865 132699939 132624129 132997156 132293710
5918 132293710 131862659 131551727 131204164 130493509 130224068 129290437 128602670 129276740 127729682
5909 127729682 127303795 127647167 127194365 127251917 126921610 126555691 126050204 126240768 124908232
5900 124908232 123673801 124083991 124456661 123203849 122776859 122950868 122377777 122245067 121717345
5891 121717345 120948039 121883535 122306206 121082525 120729144 120612743 120083434 119448651 120357602
5882 120357602 120057312 118887959 119384710 119012807 119399757 119365796 119232020 119332652 118836606
$$ packed form
5945A44217466j042220p43113M1867l92962m04348p23142o57456n53460J4101
5936A39756733j236246m07648m93550N12089L9873J7471o59320j152031o63509
5927A35713862n39951k92809k27450p79724j004063j69926p5810L73027p03446
5918A32293710m31051l10932l47563p10655k69441r33631o87767O74070j547058
5909A27729682m25887L43372m52802N7552l30307l65919n05487J90564j332536
5900A24908232j234431M10190L72670j252812m26990J74009n73091j32710n27722
5891A21717345p69306R35496M22671j223681l53381j16401n29309o34783R08951
5882A20357602l00290j169353M96751l71903L86950l3961j33776J00632m96046
$$ plain form
5873 118836606 117544346 117159199 117528588 118045691 117853706 117955825 117954991 116992229 117612750 118105085
5863 118105085 118330733 117545312 118527362 118416506 117839140 117409153 117720391 118699179 118090583
5854 118090583 118278917 118448129 118704317 118873554 119050687 118779105 119582310 119483268 119523124 120395906
5844 120395906 121208040 122011516 123593380 123285423 124286085 125664273 125472362 126011352 126167096
5835 126167096 126929857 128057364 127996841 128137831 128054318 127341976 126942884 127605830 126737855
5826 126737855 126123946 126261057 126274156 125003867 123574023 122556445 121751384 122056112 120931685
5817 120931685 120337802 120881777 120490592 120194064 119236221 118960403 118471701 118136114 117697324
5808 117697324 116826650 116795591 115995506 115920514 115591989 116501060 116055038 115732715 115147503 114575128
$$ packed form
5873A18836606j292260l85147L69389N17103j91985J02119q34r62762O20521M92335
5863A18105085K25648p85421R82050j10856n77366m29987L11238R78788o08596
5854A18090583J88334J69212K56188J69237J77133k71582Q03205r9042L9856Q72782
5844A20395906Q12134Q03476J581864l07957J000662J378188j91911N38990J55744
5835A26167096P62761J127507o0523J40990q3513p12342l99092O62946q67975
5826A26737855o13909J37111J3099j270289j429844j017578q05061L04728j124427
5817A20931685n93883N43975l91185k96528r57843k75818m88702l35587m38790
5808A17697324q70674l1059q00085p4992l28525R09071m46022l22323n85212n72375
$$ plain form
5798 114575128 114855378 115065922 114877438 114580098 114274851 113488023 113791954 113672868 113118110
5789 113118110 112477851 112284228 112429413 112022096 112226956 112277497 111922608 111819106 111440502
5780 111440502 111215305 110973713 110353137 110441492 110273188 110335280 109824875 109910743 109815671 109945311
5770 109945311 109646403 109107669 107954301 107814355 107816597 108465635 108636304 108478976 108700727
5761 108700727 108867084 108181606 108477383 108062901 107428922 106966918 106886151 107329235 106749188
5752 106749188 107023567 107006762 107170130 106440527 106301915 105772978 105681615 106277500 106918608 107235530
5742 107235530 106717114 106427132 106358099 106480065 106248358 105730415 105432971 105952269 106136766
5733 106136766 106081828 105623049 105544217 105778855 105975361 106388942 106212155 105580787 106040517 106745086
$$ packed form
5798A14575128K80250K10544j88484k97340l05247p86828L03931j19086n54758
5789A13118110o40259j93623J45185m07317K04860N0541l54889j03502l78604
5780A11440502k25197k41592o20576Q8355j68304O2092n10405Q5868r5072J29640
5770A09945311k98908n38734j153368j39946K242O49038J70669j57328K21751
5761A08700727J66357o85478K95777m14482o33979m62004q0767M43084n80047
5752A06749188K74379j6805J63368p29603j38612n28937r1363N95885O41108L16922
5742A07235530n18416k89982o9033J21966k31707n17943k97444N19298J84497
5733A06136766n4938m58779p8832K34638J96506M13581j76787o31368M59730P04569
$$ plain form
5723 106745086 106546235 105991678 105381564 105046200 105302052 105143788 105163774 105631296 104640811
5714 104640811 104851842 105646473 105670906 105700996 105104254 104108725 104161361 104530761 104988267 104562625
5704 104562625 104760012 104595896 104472073 105114402 104777346 105104598 106397152 105905484 106626589
5695 106626589 106538436 106317148 106526305 106931233 107201378 107364729 107498122 108165804 108397041
5686 108397041 108459533 107995722 108250066 108803616 107471187 107848115 108178176 107836288 108501842
5677 108501842 109606862 109596835 109565365 109054119 109932575 110683432 109733767 109783048 110555340 110383973
5667 110383973 110188381 110763857 110656875 110218628 109591553 109600327 109839978 110409730 110817551 110828749
5657 110828749 110370325 109965095 109576048 109775874 109820003 109913063 110614921 110553888 110436936 110872078
$$ packed form
5723A06745086j98851n54557o10114l35364K55852j58264J9986M67522r90485
5714A04640811K11031P94631K4433L0090n96742r95529N2636L69400M57506m25642
5704A04562625J97387j64116j23823O42329l37056L27252J292554m91668P21105
5695A06626589q8153k21288K09157M04928K70145J63351J33393O67682K31237
5686A08397041O2492m63811K54344N53550j332429L76928L30061l41888O65554
5677A08501842J105020j0027l1470n11246Q78456P50857r49665M9281P72292j71367
5667A10383973j95592N75476j06982m38247o27075Q774K39651N69752M07821J1198
5657A10828749m58424m05230l89047J99826M4129R3060P01858o1033j16952M35142
$$ plain form
5647 110872078 112132532 112305313 111909340 112625370 112309725 112065460 112539712 112174844 112499470
5638 112499470 113067635 112726803 113036556 113041188 112479026 112837566 112907676 112395697 111964084 111745322
5628 111745322 111702968 111653784 112727690 112514326 111692917 111619610 111682048 111133937 110368900 109994599
5618 109994599 109584457 109666637 108649685 107683460 107328351 106733154 106564340 106590583 106719374
5609 106719374 106539781 106125055 105995045 105334214 106051138 106063414 105598962 104083475 104577894
5600 104577894 104133059 103657145 104000966 103491170 102201689 101285803 101677100 100720710 99381124
5591 99381124 98924580 98597283 98238176 97944533 97580625 96803278 95883125 95200778 94848164
5582 94848164 95033426 94259454 93019433 92975944 93123394 93219589 92601285 92001937 91626176 90965155
$$ packed form
5647A10872078J260454J72781l95973P16030l15645k44265M74252l64868L24626
5638A12499470N68165l40832L09753M632n62162L58540P0110n11979m31613k18762
5628A11745322m2354m9184J073906k13364q21409p3307O2438n48111p65037l74301
5618A09994599m10142Q2180j016952r66225l55109n95197j68814K6243J28791
5609A06719374j79593m14726j30010o60831P16924J2276m64452j515487M94419
5600A04577894m44835m75914L43821n09796j289481r15886L91297r56390j339586
5591I9381124m56544l27297l59107k93643l63908p77347r20153o82347l52614
5582I4848164J85262p73972j240021m3489J47450R6195o18304n99348l75761o61021
$$ plain form
5572 90965155 90231413 89485479 89389941 90208487 89832685 89636140 90082954 89230358 88968273 88022381
5562 88022381 87398008 88052107 88753008 88455564 87878076 86895747 86552875 86861735 86858830 86960540
5552 86960540 86533020 86171412 86131177 86176863 86018985 85897825 85147761 85252252 85007158 84867993
5542 84867993 84909149 84668309 85485436 84326996 84273641 84275905 83792724 83806593 83638078 83220028
5532 83220028 82897003 82761735 82057843 82871897 82558766 82113524 81909782 82185039 82404761
5523 82404761 82909240 83093771 82623938 81723556 81802894 81200155 80599272 81517285 81443229 81495372
5513 81495372 80979153 81465674 81669239 80576434 79552277 79911911 80435042 81429223 80825270
5504 80825270 80431746 80470642 80885425 81115673 81773363 82223965 81166480 79823796 80351471
$$ packed form
5572I0965155p33742p45934r5538Q18546l75802j96545M46814q52596k62085r45892
5562H8022381o24373O54099P00901k97444n77488r82329l42872L08860k905J01710
5552H6960540m27520l61608m0235M5686j57878j21160p50064J04491k45094j39165
5542H4867993M1156k40840Q17127j158440n3355K264m83181J3869j68515m18050
5532H3220028l23025j35268p03892Q14054l13131m45242k03742K75257K19722
5523H2404761N04479J84531m69833r00382P9338o02739o00883R18013p4056N2143
5513H1495372n16219M86521K03565j092805j024157L59634N23131R94181o03953
5504H0825270l93524L8896M14783K30248O57690M50602j057485j342684N27675
$$ plain form
5495 80351471 80123166 79990193 80456437 80689806 80657523 81528779 81504024 81152737 81019439 80681478
5485 80681478 80485323 80500172 80649270 80663336 81539032 82297455 81447187 81491560 82156589 81819744
5475 81819744 82652734 82790460 82667157 82759102 83540075 84109799 84218565 85188578 85255177 85119834
5465 85119834 85970334 86126271 85891402 87249201 88689606 88997597 88763950 89495506 89700372
5456 89700372 90205824 91192116 92080825 92620802 92944597 93313090 94902032 96730541 98400347
5447 98400347 99882758 100541460 100958283 102788476 104852967 105980179 106757997 107334075 108486524
5438 108486524 110261393 111496606 111688415 113647335 114588157 114750188 113790063 113869598 114685442
5429 114685442 115026508 113156427 113035987 112763692 111675848 110587863 110270019 110164643 109518862
$$ packed form
5495H0351471k28305j32973M66244K33369l2283Q71256k4755l51287j33298l37961
5485H0681478j96155J4849J49098J4066Q75696P58423q50268M4373O65029l36845
5475H1819744Q32990J37726j23303R1945P80973N69724J08766R70013O6599j35343
5465H5119834Q50500J55937k34869J357799J440405L07991k33647P31556K04866
5456H9700372N05452R86292Q88709N39977L23795L68493J588942J828509J669806
5447I8400347J482411O58702M16823J830193K064491J127212P77818N76078J152449
5438A08486524J774869J235213J91809J958920R40822J62031r60125P9535Q15844
5429A14685442L41066j870081j20440k72295j087844j087985l17844j05376o45781
$$ plain form
5420 109518862 108245303 107883755 107058092 106848945 107205629 107238097 106500898 106248752 106342981
5411 106342981 106396475 106388311 106418252 106334698 105747753 105283467 105076196 104873650 105126757 104103370
5401 104103370 104385123 103840716 102561034 101564179 101532896 100515535 99411534 98595441 96591681
5392 96591681 95485267 94534161 92510344 90544933 89159600 87589203 87001361 85826674
5384 85826674 85113204 83785780 83385402 82722054 81323620 80861640 80253096 78669556 78662642
5375 78662642 77961278 76439120 75606213 75853356 75741609 73826768 73153293 72957780 71795150
5366 71795150 71750663 70984431 71233249 70440179 69527375 69541992 68873794 68370606 68272749 68048248
5356 68048248 67411096 66701620 67038530 65857767 65738686 65106395 65386034 65445052 65167758
$$ packed form
5420A09518862j273559l61548q25663k09147L56684L2468p37199k52146R4229
5411A06342981N3494q164K9941q3554n86945m64286k07271k02546K53107j023387
5401A04103370K81753n44407j279682r96855l1283j017361j104001q16093k003760
5392I6591681j106414r51106k023817j965411j385333j570397n87842j174687
5384H5826674p13470j327424m00378o63348j398434m61980o08544j583540o914
5375G8662642p01364j522158q32907K47143j11747j914841o73475j95513j162630
5366G1795150m4487p66232K48818p93070r12804J4617o68198n03188r7857k24501
5356F8048248o37152p09476L36910j180763j19081o32291K79639N9018k77294
$$ plain form
5347 65167758 64460299 64068170 63683689 63155563 63616417 62693714 61603349 61591082 60993757
5338 60993757 61026129 61296959 61472288 61342355 60657919 60094715 60088466 59947126 59602017 59526948
5328 59526948 59703728 59665055 58798607 58402113 58144123 57646736 57428751 57189223 56940074 57586780
5318 57586780 57407444 57172644 56739384 56934061 56509042 55924371 56505258 57250644 56598084
5309 56598084 55855839 55316404 54158980 54046145 54029749 53249386 54353174 53728684 52902786
5300 52902786 53311835 53572676 52944297 51865926 52722281 52995731 52778078 53057205 52127771
5291 52127771 52203807 52598524 51688733 51179745 50944182 50703081 50158804 50491536 51398218 51228803
5281 51228803 50722086 50541447 49979109 49538284 50148630 49267179 48606909 48597512 48263217 48011591
$$ packed form
5347F5167758p07459l92129l84481n28126M60854r22703j090365j2267n97325
5338F0993757L2372K70830J75329j29933o84436n63204o249j41340l45109p5069
5328E9526948J76780l8673q66448l96494k57990m97387k17985k39528k49149O46706
5318E7586780j79336k34800m33260J94677m25019n84671N80887P45386o52560
5309E6598084p42245n39435j157424j12835j6396p80363J103788o24490q25898
5300E2902786M09049K60841o28379j078371Q56355K73450k17653K79127r29434
5291E2127771P6036L94717r09791n08988k35563k41101n44277L32732R06682j69415
5281E1228803n06717j80639n62338m40825O10346q81451o60270r397l34295k51626
$$ plain form
5271 48011591 48417297 49123732 48583469 48104051 48096129 47453359 47120068 47627410 47025076 46508231
5261 46508231 46725951 47104213 46222496 46130990 46228521 46789340 46528743 45985231 45947777 46120374
5251 46120374 46509467 46088708 45405049 45679195 45547403 44824147 45124761 44845194 45498549
5242 45498549 44368482 44860837 44831496 45054279 45882128 45586522 45000432 45288143 45216500 44406150
5232 44406150 44417262 44148230 43865537 44336459 44730144 43933493 43634097 43374306 43443376 44013212
5222 44013212 44187080 44130485 44545507 43273532 43033839 43253809 43481821 44154914 43199346
5213 43199346 43261658 42446222 42616559 43341345 43815951 43736664 42713351 42602688 42156534 42313361
5203 42313361 42903622 42436637 42378756 42746975 42915433 43856822 43012696 42903335 42207499 42334385
$$ packed form
5271D8011591M05706P06435n40263m79418p922o42770l33291N07342o02334n16845
5261D6508231K17720L78262q81717r1506R7531N60819k60597n43512l7454J72597
5251D6120374L89093m20759o83659K74146j31792p23256L00614k79567O53355
5242D5498549j130067M92355k9341K22783Q27849k95606n86090K87711p1643q10350
5232D4406150J1112k69032k82693M70922L93685p96651k99396k59791O9070N69836
5222D4013212J73868n6595M15022j271975k39693K19970K28012O73093r55568
5213D3199346O2312q15436J70337P24786M74606p9287j023313j10663m46154J56827
5203D2313361N90261m66985n7881L68219J68458R41389q44126j09361o95836J26886
$$ plain form
5193 42334385 42824041 42574336 42742989 43003919 42785736 42420818 42402698 42397298 42724637 42404827
5183 42404827 42708140 42695335 42901565 43082310 43488021 43977386 43289376 42736763 42096361 42577126
5173 42577126 42550660 42646771 43329233 43429856 42968691 42708041 43196715 42672402 42587933 43273335
5163 43273335 43413405 42683693 42646268 43000956 43646846 43594655 43797251 43940340 44066798 44558875
5153 44558875 44240759 44135043 43857163 45087055 45467778 44348302 45199254 45826919 46005455
5144 46005455 45945215 46098716 46306457 46607855 47367313 47938593 47690970 48066986 48538168 48937502
5134 48937502 49054308 48970733 49080563 49831877 49773389 49245930 49804132 50505708 51789464 52229985
5124 52229985 52812367 53889752 54287109 54304938 54868537 55278272 55281777 56192277 56403788 57071292
$$ packed form
5193D2334385M89656k49705J68653K60930k18183l64918j8120n400L27339l19810
5183D2404827L03313j2805K06230J80745M05711M89365o88010n52613o40402M80765
5173D2577126k6466R6111O82462J00623m61165k60650M88674n24313q4469O85402
5163D3273335J40070p29712l7425L54688O45890n2191K02596J43089J26458M92077
5153D4558875l18116j05716k77880J229892L80723j119476Q50952O27665J78536
5144D6005455o0240J53501K07741L01398P59458N71280k47623L76016M71182L99334
5134D8937502J16806q3575J09830P51314n8488n27459N58202P01576J283756M40521
5124E2229985N82382J077385L97357J7829N63599M09735L505R10500K11511O67504
$$ plain form
5114 57071292 57441512 57255443 58304705 58525573 58175469 58103056 57979962 57881506 59063689
5105 59063689 59563882 59475221 59959630 60872924 60713430 60411986 59920400 59732630 60774753
5096 60774753 60527106 60569788 61152921 61483847 62207091 61714585 61102662 61167763 61253340 61495487
5086 61495487 62236488 61630856 62082495 62832897 61976077 62380562 62701164 62879782 63384382
5077 63384382 63514441 63280246 62866496 62854355 63090347 63280688 63604319 63779944 63334614 64148873
5067 64148873 64891830 64886022 65359382 65523684 65601807 66086664 66511370 66847025 66124511 66909341
5057 66909341 66939503 67462861 67600847 66863766 67018541 66362933 67105762 67474409 67140858 66644580
5047 66644580 66543378 66235488 65726324 64954852 63866521 64655422 64597831 63321162 61692075
$$ packed form
5114E7071292L70220j86069J049262K20868l50104p2413j23094r8456J182183
5105E9063689N00193q8661M84409R13294j59494l01444m91586j87770J042123
5096F0774753k47647M2682N83133L30926P23244m92506o11923O5101Q5577K42147
5086F1495487P41001o05632M51639P50402q56820M04485L20602J78618N04600
5077F3384382J30059k34195m13750j2141K35992J90341L23631J75625m45330Q14259
5067F4148873P42957n808M73360J64302P8123M84857M24706L35655p22514P84830
5057F6909341L0162N23358J37986p37081J54775o55608P42829L68647l33551m96278
5047F6644580j01202l07890n09164p71472j088331P88901n7591j276669j629087
$$ plain form
5038 61692075 61554425 61415041 61705330 61446758 59610811 58492631 57633435 58547749 57995543
5029 57995543 57521767 57162275 56416735 55930647 55658898 55036661 54084751 54203535 53916071
5020 53916071 53132454 53652328 53224794 52853184 52730389 52077614 52010534 52387804 51248161
5011 51248161 50545110 50521574 50676229 50604920 50166300 49966362 49486678 48653008 48459162 48748837
5001 48748837 48475288 48320435 48859004 48737999 47089986 47473256 47673008 47527154 48909420
4992 48909420 48943308 49106774 49706779 49498768 48551044 47718599 48207901 48129259 48319956 47825392
4982 47825392 47520735 48360093 48910168 49662233 49514292 49681103 50157873 50609447 50741818
4973 50741818 50942486 51272366 50701781 51111269 51555243 52076875 52609443 52799629 52611850
$$ packed form
5038F1692075j37650j39384K90289k58572j835947j118180q59196R14314n52206
5029E7995543m73776l59492p45540m86088k71749o22237r51910J18784k87464
5020E3916071p83617N19874m27534l71610j22795o52775o7080L77270j139643
5011E1248161p03051k3536J54655p1309m38620j99938m79684q33670j93846K89675
5001D8748837k73549j54853N38569j21005j648013L83270J99752j45854J382266
4992D8909420L3888J63466O00005k08011r47724q32445M89302p8642J90697m94564
4982D7825392l04657Q39358N50075P52065j47941J66811M76770M51574J32371
4973E0741818K00668L29880n70585M09488M43974N21632N32568J90186j87779
$$ plain form
4964 52611850 52865070 54101101 55169537 55857743 55642364 55743990 56819114 56734354 57158325
4955 57158325 59370541 60030719 60214172 60272099 61086289 62087197 62042296 62910401 64336976
4946 64336976 63776243 65100607 66103932 66104160 66935648 67209498 67276921 67477425 67812716 68470115
4936 68470115 68866955 69778891 70334566 70806110 70843554 71078454 72426869 72369213 71808817 71596711
4926 71596711 72859400 72676193 72969078 73965055 74460370 74997413 76413860 76692471 76133679
4917 76133679 77027867 77382271 77462409 77427441 78229992 77701333 77821343 77742946 78663479 78912204
4907 78912204 79349496 80818641 80665193 80103816 80626506 80822967 80125215 80870249 81283958
4898 81283958 82151069 82714287 82728525 83140283 83634219 84190554 84649813 84941445 84906572 84636944
$$ packed form
4964E2611850K53220J236031J068436O88206k15379J01626J075124q4760M23971
4955E7158325K212216O60178J83453N7927Q14190J000908m4901Q68105J426575
4946F4336976n60733J324364J003325K28Q31488K73850O7423K00504L35291O57399
4936F8470115L96840R11936N55675M71544L7444K34900J348415n7656n60396k12106
4926G1596711J262689j83207K92885R95977M95315N37043J416447K78611n58792
4917G6133679Q94188L54404Q0138l4968Q02551n28659J20010p8397R20533K48725
4907G8912204M37292J469145j53448n61377N22690J96461o97752P45034M13709
4898H1283958Q67111N63218J4238M11758M93936N56335M59259K91632l4873k69628
$$ plain form
4888 84636944 85650109 85011135 84300236 85002903 85755882 86071472 85714837 86403991 87103816
4879 87103816 86858412 87757503 88416461 88833711 89134684 88256377 87370470 88292345 88823544
4870 88823544 89044004 89985621 91009073 90100178 90313880 91508417 91259358 91384814 92241491
4861 92241491 92904143 94119959 94056505 94853433 95420513 95272962 95678418 96550656 96755449
4852 96755449 97012130 97870738 98641962 98874469 99595879 99745487 100870751 102077110 102760913
4843 102760913 103476363 104168050 104169923 105352293 106174078 105926199 106659684 106800855 107655706
4834 107655706 108233071 108501197 108857839 109428917 109452136 109910682 109607259 108783268 108104014
4825 108104014 108015247 107941212 108066010 108221338 107086586 105713753 106163275 106440922 106551538
$$ packed form
4888H4636944J013165o38974p10899P02667P52979L15590l56635O89154O99825
4879H7103816k45404Q99091O58958M17250L00973q78307q85907R21875N31199
4870H8823544K20460R41617J023452r08895K13702J194537k49059J25456Q56677
4861I2241491O62652J215816o3454P96928N67080j47551M05456Q72238K04793
4852I6755449K56681Q58608P71224K32507P21410J49608J125264J206359O83803
4843A02760913P15450O91687J873J182370Q21785k47879P33485J41171Q54851
4834A07655706N77365K68126L56642N71078K3219M58546l03423q23991o79254
4825A08104014q8767p4035J24798J55328j134752j372833M49522K77647J10616
$$ plain form
4816 106551538 105421234 104693092 103929462 103579571 105174662 105665615 104572377 104578553 104576867
4807 104576867 103833937 103675810 104678549 104842007 105146558 105081519 103612972 103383679 103171801
4798 103171801 102401152 102093597 102044819 101298878 100421371 100385203 99335721 98530414 97947696
4789 97947696 96639883 96266923 95460033 95210037 94514897 93224466 92688868 92376865 91292976
4780 91292976 90640043 90213309 90160098 90171044 89208729 89014407 87396273 86968802 85979783 85534700
4770 85534700 85441588 84563296 83346225 82929904 83367173 83419079 82447455 82020675 81344391 81591719
4760 81591719 80241979 79331604 79298019 79094954 79064662 78332763 77551614 76667349 76214627 76094526
4750 76094526 76587024 76252309 76199573 76369665 76568762 76813763 76130664 76346708 76258250 75762951
$$ packed form
4816A06551538j130304p28142p63630l49891J595091M90953j093238O176j686
4807A04576867p42930j58127J002739J63458L04551o5039j468547k29293k11878
4798A03171801p70649l07555m8778p45941q77507l6168j049482q05307n82718
4789I7947696j307813l72960q06890k49996o95140j290431n35598l12003j083889
4780I1292976o52933m26734n3211J0946r62315j94322j618134m27471r89019m45083
4770H5534700r3112q78292j217071m16321M37269N1906r71624m26780o76284K47328
4760H1591719j349740r10375l3585k03065l0292p31899p81149q84265m52722j20101
4750G6094526M92498l34715n2736J70092J99097K45001o83099K16044q8458m95299
$$ plain form
4740 75762951 76322821 76574462 76554323 76746196 77754205 77832873 77528189 78129320 79318259
4731 79318259 79426947 80198546 80532207 80559898 81453811 82769527 82950931 83370708 84767985
4722 84767985 85951244 86282263 87403838 88544267 88986474 90233417 91842963 92198422 94128113
4713 94128113 95974810 96379344 96953945 98444810 100128663 102085456 103351405 103887377 105973883
4704 105973883 107898404 108796387 109383432 111076248 113012709 114363276 114966064 115891314 117581044
4695 117581044 119625876 120713810 122448367 123586239 124673438 126125205 126530094 127258861
4687 127258861 128869961 131201912 132168968 132996629 134506939 135656528 137181183 138148762
4679 138148762 139054853 140390066 140983981 141406144 141743106 142405676 142858282 143486207 143170476
$$ packed form
4740G5762951N59870K51641k0139J91873J008009P8668l04684O01131J188939
4731G9318259J08688P71599L33661K7691Q93913J315716J81404M19777J397277
4722H4767985J183259L31019J121575J140429M42207J246943J609546L55459J929691
4713I4128113J846697M04534N74601J490865J683853J956793J265949N35972K086506
4704A05973883J924521Q97983N87045J692816J936461J350567O02788R25250J689730
4695A17581044K044832J087934J734557J137872J087199J451767M04889P28767
4687A27258861J611100K331951R67056Q27661J510310J149589J524655R67579
4679A38148762R06091J335213N93915M22163L36962O62570M52606O27925l15731
$$ plain form
4670 143170476 142864112 142825446 142720312 141533363 141625733 141514933 140679385 139982041 138636941
4661 138636941 138454733 137222889 136536890 137080839 137059067 135698736 134315301 134050377 133545042
4652 133545042 132580601 130897725 130834424 129682039 128358734 128219134 128294899 127782292 127138906
4643 127138906 126606346 125748137 125927329 125656648 125049120 125167659 125178817 124639742 125267636
4634 125267636 125878906 126182572 127075962 128724465 130467814 130823765 132243257 133097047 134736274
4625 134736274 137173507 139093596 141549192 143551177 145334686 146265762 148045405 150268435
4617 150268435 151872121 153152784 154026252 154736238 155879672 157547380 158416876 158720067 160843915
4608 160843915 162992715 165389276 167864654 169255638 172072781 175920915 179726922 184019855
$$ packed form
4670A43170476l06364l8666j05134j186949R2370j10800q35548o97344j345100
4661A38636941j82208j231844o85999N43949k1772j360331j383435k64924n05335
4652A33545042r64441j682876o3301j152385j323305j39600P5765n12607o43386
4643A27138906n32560q58209J79192k70681o07528J18539J1158n39075O27894
4634A25267636O11270L03666Q93390J648503J743349L55951J419492Q53790J639227
4625A34736274K437233J920089K455596K001985J783509R31076J779643K223030
4617A50268435J603686J280663Q73468P09986J143434J667708Q69496L03191K123848
4608A60843915K148800K396561K475378J390984K817143L848134L806007M292933
$$ plain form
4600 184019855 187361802 191331831 195132912 198301279 203568468 208079780 211760379 214830508
4592 214830508 217729328 220228698 223804856 226895416 228406113 231104567 232200194 232774572
4584 232774572 232499885 232858451 233039840 231068670 229906102 227940132 224534831 220963966
4576 220963966 217283904 212613708 207644272 203615495 198943225 194281657 188603584 183316924
4568 183316924 177645502 172261737 166922937 161138266 155587772 150859642 145939221 141133042
4560 141133042 135728099 130295740 126205139 120833512 116440146 113204909 109377710 107101166
4552 107101166 104257976 100629539 97480613 95029995 92692525 89810370 87911571 86294965
4544 86294965 83760539 81371406 78855119 77637281 76257877 75570045 72522351 70556322
$$ packed form
4600A84019855L341947L970029L801081L168367N267189M511312L680599L070129
4592B14830508K898820K499370L576158L090560J510697K698454J095627N74378
4584B32774572k74687L58566J81389j971170j162568j965970l405301l570865
4576B20963966l680062m670196m969436m028777m672270m661568n678073n286660
4568A83316924n671422n383765n338800n784671n550494m728130m920421m806179
4560A41133042n404943n432359m090601n371627m393366l235237l827199k276544
4552A07101166k843190l628437l148926k450618k337470k882155j898799j616606
4544H6294965k534426k389133k516287j217838j379404o87832l047694j966029
$$ plain form
4536 70556322 70098937 68280893 67632592 66417038 64712457 64144813 63304197 62414837 61152797
4527 61152797 59897543 59294653 57779232 57046127 57327594 56008200 53945701 54233900 53671584
4518 53671584 52575710 52696681 52073135 51148646 50444613 50352209 48916665 47203202 47496392
4509 47496392 46667287 46488354 45216377 44661762 44845280 44457797 43993520 42817060 42920374
4500 42920374 43077278 43529228 42980775 42538510 42775750 41453978 41300860 40614865 40375673
4491 40375673 40495385 40670863 39626242 40699813 40130395 40177634 40421888 39414661 38843496
4482 38843496 38946264 38774572 37410563 36522272 36823816 36926905 36659626 35991099 35749333
4473 35749333 36017697 35401903 35399698 34665872 33457905 34063119 34340971 34031375 33082739 33517994
$$ packed form
4536G0556322m57385j818044o48301j215554j704581n67644q40616q89360j262040
4527F1152797j255254o02890j515421p33105K81467j319394k062499K88199n62316
4518E3671584j095874J20971o23546r24489p04033r2404j435544j713463K93190
4509D7496392q29105j78933j271977n54615J83518l87483m64277j176460J03314
4500D2920374J56904M51950n48453m42265K37240j321772j53118o85995k39192
4491D0375673J19712J75478j044621J073571n69418M7239K44254j007227n71165
4482C8843496J02768j71692j364009q88291L01544J03089k67279o68527k41766
4473C5749333K68364o15794k205p33826j207967O05214K77852l09596r48636M35255
$$ plain form
4463 33517994 34045672 33470476 33849236 33539809 33209064 32743862 32077676 32510845 32580532 32824620
4453 32824620 33298838 32761529 32637697 31421486 30717156 31051668 30885544 30419001 31056962
4444 31056962 31564976 31543027 30764995 30494041 30191045 30228756 30689311 31017677 29757841 29577218
4434 29577218 29937588 28784552 28803928 29056437 28852687 29132989 29228253 29240302 28925117 28806781
4424 28806781 29177333 28977611 27985705 29297288 29834893 28963276 29009218 29222762 28882248
4415 28882248 28822124 28515325 28977993 29201080 29360470 29571177 29365480 28576995 27858906 28718955
4405 28718955 30350574 30455007 29947215 30371076 29934154 29427350 29077637 29318452 29864151
4396 29864151 30890657 30536531 29590210 29386739 28997804 29145182 28928019 29154362 30132212
$$ packed form
4463C3517994N27678n75196L78760l09427l30745m65202o66186M33169O9687K44088
4453C2824620M74218n37309j23832j216211p04330L34512j66124m66543O37961
4444C1056962N08014k1949p78032k70954l02996L7711M60555L28366j259836j80623
4434B9577218L60370j153036J9376K52509k03750K80302R5264J2049l15185j18336
4424B8806781L70552j99722r91906J311583N37605q71617M5942K13544l40514
4415B8882248o0124l06799M62668K23087J59390K10707k05697p88485p18089Q60049
4405B8718955J631619J04433n07792M23861m36922n06804l49713K40815N45699
4396B9864151J026506l54126r46321k03471l88935J47378k17163K26343R77850
$$ plain form
4387 30132212 30756137 30868450 31402173 31535789 31322839 31520905 31341002 30852673 30879179 31273500
4377 31273500 31410194 31295030 31458506 32050080 32165035 32101378 31972300 31563666 32535377 33064604
4367 33064604 32274195 31866549 32118642 32473493 32985389 33085319 32538135 32688154 32660693 33610540
4357 33610540 33713352 35146704 34992184 34215409 34374366 35017755 34947558 35294378 35997810
4348 35997810 35918437 36456194 36314996 36692043 37744217 37440045 37438766 38060970 38341263 39072790
4338 39072790 38867296 39287123 40345253 40239134 40402669 40997923 41442733 41305532 41854329
4329 41854329 41901078 42186261 42550907 43469996 43789019 44164261 44209775 44892270 45296045 45323369
4319 45323369 46393101 48244454 49630082 49398428 49757655 50708857 51742540 51836560 52642942
$$ packed form
4387C0132212O23925J12313N33723J33616k12950J98066j79903m88329K6506L94321
4377C1273500J36694j15164J63476N91574J14955o3657j29078m08634R71711N29227
4367C3064604p90409m07646K52093L54851N11896R9930n47184J50019k7461R49847
4357C3610540J02812J433352j54520p76775J58957O43389p0197L46820P03432
4348C5997810p9373N37757j41198L77047J052174l04172j279O22204K80293P31527
4338C9072790k05494M19827J058130j06119J63535N95254M44810j37201N48797
4329D1854329M6749K85183L64646R19089L19023L75242M5514O82495M03775K7324
4319D5323369J069732J851353J385628k31654L59227R51202J033683R4020Q06382
$$ plain form
4310 52642942 53687601 54109097 53909425 56003000 57349430 57597619 58059262 58786197 60611077
4301 60611077 61462189 61558718 63138281 64289966 65127787 66293443 67740667 68365600 69123806
4292 69123806 70136688 71703184 72993631 75080416 75848252 77614703 79208712 80320052
4284 80320052 82349914 83687606 85783465 87473843 89066112 91478443 94138414 96797482
4276 96797482 98344643 100242751 103457933 106562288 108689174 110808636 113849862 117103687
4268 117103687 120147991 123130794 125971174 128335528 131786557 135142391 137914751 141942142
4260 141942142 146603432 149539525 152600762 156396946 159856642 163650667 168161365 172061203
4252 172061203 176070588 180904022 184361920 188746722 193328686 196930924 200030396 204488848
$$ packed form
4310E2642942J044659M21496j99672K093575J346430K48189M61643P26935J824880
4301F0611077Q51112R6529J579563J151685Q37821J165656J447224O24933P58206
4292F9123806J012882J566496J290447K086785P67836J766451J594009J111340
4284H0320052K029862J337692K095859J690378J592269K412331K659971K659068
4276I6797482J547161J898108L215182L104355K126886K119462L041226L253825
4268A17103687L044304K982803K840380K364354L451029L355834K772360M027391
4260A41942142M661290K936093L061237L796184L459696L794025M510698L899838
4252A72061203M009385M833434L457898M384802M581964L602238L099472M458452
$$ plain form
4244 204488848 208870037 212649601 215817003 218952834 222321748 225367576 228567894 231981066
4236 231981066 234206714 236214661 237961556 240243332 243168556 244689123 246849316 248564232
4228 248564232 250884731 252017889 253137797 254168554 255062601 255795535 256853637 258613164
4220 258613164 260721446 261602229 261928456 262564024 264283749 266609733 266806205 266817575 268665669
4211 268665669 270831150 272478393 274510231 278039803 280537844 283835001 287408519 291837197
4203 291837197 296878735 302470439 306439961 312778649 320784988 329364692 339049797 349488348
4195 349488348 360776699 373855871 388535897 403463416 419538035 435218244 449802164
4188 449802164 463984163 477646299 488570124 499099270 508777229 515847736 517478586
$$ packed form
4244B04488848M381189L779564L167402L135831L368914L045828L200318L413172
4236B31981066K225648K007947J746895K281776K925224J520567K160193J714916
4228B48564232K320499J133158J119908J030757Q94047P32934J058102J759527
4220B58613164K108282Q80783L26227O35568J719725K325984J96472J1370J848094
4211B68665669K165481J647243K031838L529572K498041L297157L573518M428678
4203B91837197N041538N591704L969522O338688Q006339Q579704R685105J0438551
4195C49488348J1288351J3079172J4680026J4927519J6074619J5680209J4583920
4188D49802164J4181999J3662136J0923825J0529146R677959P070507J630850
$$ plain form
4181 517478586 514189888 506193421 494999281 481572096 464430658 444997152 424439221
4174 424439221 403595077 382682957 364189397 346812825 330260160 315293501 301586714
4167 301586714 289829416 278850417 267810541 258079717 249818021 240541057 232763774 224367580
4159 224367580 216950837 208919171 202550793 197736126 192499743 187287709 182215051 178431171
4151 178431171 174033167 169823869 166938477 163578793 159105933 155089783 151876465 148784247
4143 148784247 146124755 143191512 140391808 137012708 135012597 132573589 130265226 128675125
4135 128675125 126159555 124345208 122612556 121670530 120193258 118324366 116510404 115390858
4127 115390858 113956890 113016328 111796537 110955211 110193802 108550124 107583293 106606904 106466740
$$ packed form
4181E17478586l288698p996467j1194140j3427185j7141438j9433506k0557931
4174D24439221k0844144k0912120j8493560j7376572j6552665j4966659j3706787
4167C01586714j1757298j0978999j1039876r730824q261696r276964p777283q396194
4159B24367580p416743q031666o368378m814667n236383n212034n072658l783880
4151A78431171m398004m209298k885392l359684m472860m016150l213318l092218
4143A48784247k659492k933243k799704l379100k000111k439008k308363j590101
4135A28675125k515570j814347j732652r42026j477272j868892j813962j119546
4127A15390858j433968r40562j219791q41326p61409j643678r66831r76389j40164
$$ plain form
4118 106466740 105376849 104653910 104852714 104431605 104250426 102949031 102958904 102430417 101594788
4109 101594788 101021054 100888765 100372128 99151057 98982229 98784923 99501022 99798490 99862218
4100 99862218 99431055 98941843 99350467 100082777 99468219 99843357 100374462 100094371 100323244
4091 100323244 101232931 101331303 102425073 103799755 103237334 103658136 104219137 105084272 105609363
4082 105609363 106443350 106828976 107396187 107994370 109231400 111174405 111954546 113033093 114529123
4073 114529123 115288641 115389085 115894928 118083507 120164325 121003744 122224210 123511240 125448463
4064 125448463 127705237 129615575 130138337 132073527 133784775 135442605 137741078 139500925
4056 139500925 141443379 143927434 146476758 148451431 150999351 153449364 155438588 157535194
$$ packed form
4118A06466740j089891p22939J98804m21109j81179j301395R873n28487q35629
4109A01594788n73734j32289n16637j221071j68828j97306P16099K97468O3728
4100I9862218m31163m89212M08624P32310o14558L75138N31105k80091K28873
4091A00323244R09687R8372J093770J374682n62421M20802N61001Q65135N25091
4082A05609363Q33987L85626N67211N98183J237030J943005P80141J078547J496030
4073A14529123P59518J00444N05843K188579K080818Q39419J220466J287030J937223
4064A25448463K256774J910338N22762J935190J711248J657830K298473J759847
4056A39500925J942454K484055K549324J974673K547920K450013J989224K096606
$$ plain form
4048 157535194 160463169 163777155 165541612 167876003 170919433 172779380 175977081 178746269
4040 178746269 181518306 184497592 187637543 190455712 194051194 197602345 201800175 204184279
4032 204184279 207547529 210925346 214335670 217863292 222653809 226921192 230330382 234255122
4024 234255122 237789771 241775719 245386575 249542241 253015591 256037719 259389715 263201717
4016 263201717 265859403 268124514 270933314 274298852 276406402 280044618 283595936 287142170
4008 287142170 290879943 294631751 298722092 302855615 307071373 311778987 316954245 322279733
4000 322279733 326532892 331695582 336188731 341679022 346800129 351690181 357352029 362393931
3992 362393931 366495748 371752601 376860375 381941592 387359571 392046999 396736642 401332570
$$ packed form
4048A57535194K927975L313986J764457K334391L043430J859947L197701K769188
4040A78746269K772037K979286L139951K818169L595482L551151M197830K384104
4032B04184279L363250L377817L410324L527622M790517M267383L409190L924740
4024B34255122L534649L985948L610856M155666L473350L022128L351996L812002
4016B63201717K657686K265111K808800L365538K107550L638216L551318L546234
4008B87142170L737773L751808M090341M133523M215758M707614N175258N325488
4000C22279733M253159N162690M493149N490291N121107M890052N661848N041902
3992C62393931M101817N256853N107774N081217N417979M687428M689643M595928
$$ plain form
3984 401332570 405629701 408685158 412388532 415190167 417972607 421439719 424015653 426447643
3976 426447643 428445583 430607310 431646511 431744256 431795376 431357001 430591239 430436151 429210026
3967 429210026 427249031 425247154 423645020 421059009 417621006 414626647 411496686 408600884
3959 408600884 404596001 400748867 396874586 392615568 388080127 383310907 378684359 375453960
3951 375453960 369951404 364807521 359088487 353791498 348935500 344251700 339039956 333931681
3943 333931681 328923736 324096070 318551736 314647336 310289028 305207012 300817643 297103484
3935 297103484 293135206 288354844 285071816 280840117 276745470 273823964 271438713 268079442
3927 268079442 264356254 260831728 256885322 253541360 250729377 247979997 244806762 241658927
$$ packed form
3984D01332570M297131L055457L703374K801635K782440L467112K575934K431990
3976D26447643J997940K161727J039201R7745N1120m38375p65762j55088j226125
3967D29210026j960995k001877j602134k586011l438003k994359l129961k895802
3959D08600884m004883l847134l874281m259018m535441m769220m626548l230399
3951C75453960n502556n143883n719034n296989m855998m683800n211744n108275
3943C33931681n007945m827666n544334l904400m358308n082016m389369l714159
3935B97103484l968278m780362l283028m231699m094647k921506k385251l359271
3927B68079442l723188l524526l946406l343962k811983k749380l173235l147835
$$ plain form
3919 241658927 239168194 236736011 234358752 231429525 228420720 226491436 224520143 222445892
3911 222445892 219381676 216162710 214249643 211867420 210115838 207652889 205084319 202753370
3903 202753370 200912345 198303841 196119910 195068552 192913783 190554669 189360330 188539330
3895 188539330 187096789 184735601 183224218 182165730 180187304 179381210 178745541 177683537
3887 177683537 175801100 175489379 174686005 173442506 172905134 171812021 170673635 171533607 171714858
3878 171714858 171079921 171167530 170195798 169725074 170210368 170077602 169331578 168998392 169296365
3869 169296365 168727951 168323237 168677141 168353180 168711103 168819458 168050217 168161094 168938649
3860 168938649 167896652 167576895 167494069 167611689 167707883 168094842 168347020 168704860 169621598
$$ packed form
3919B41658927k490733k432183k377259k929227l008805j929284j971293k074251
3911B22445892l064216l218966j913067k382223j751582k462949k568570k330949
3903B02753370j841025k608504k183931j051358k154769k359114j194339q21000
3895A88539330j442541k361188j511383j058488j978426q06094o35669j062004
3887A77683537j882437l11721q03374j243499n37372j093113j138386Q59972J81251
3878A71714858o34937Q7609r71732m70724M85294j32766p46024l33186K97973
3869A69296365n68414m04714L53904l23961L57923J08355p69241J10877P77555
3860A68938649j041997l19757q2826J17620R6194L86959K52178L57840R16738
$$ plain form
3851 169621598 170529342 170601479 170512142 171133154 171323342 172641956 174529829 174980543 175329896
3842 175329896 176936245 178450725 178917243 180855706 182479994 185371659 187472869 190082060
3834 190082060 191910426 194144335 196822199 199933315 203323705 206822337 210658252 213552994
3826 213552994 216483060 220054440 223243898 226821754 231278394 235295384 239606850 244036263
3818 244036263 248039148 251813134 256146071 259445118 262903509 267028510 271474323 275074349
3810 275074349 278091768 281171589 284672016 286352667 289355477 291794032 294503853 297578906
3802 297578906 299151912 299802031 300611565 301406268 302522001 304342424 305024735 305913950 306255051
3793 306255051 305930467 306190082 306036366 304993136 303737270 302936111 301851768 299968046 298652910
$$ packed form
3851A69621598R07744P2137q9337O21012J90188J318614J887873M50714L49353
3842A75329896J606349J514480M66518J938463J624288K891665K101210K609191
3834A90082060J828366K233909K677864L111116L390390L498632L835915K894742
3826B13552994K930066L571380L189458L577856M456640M016990M311466M429413
3818B44036263M002885L773986M332937L299047L458391M125001M445813L600026
3810B75074349L017419L079821L500427J680651L002810K438555K709821L075053
3802B97578906J573006O50119Q09534P94703J115733J820423O82311Q89215L41101
3793C06255051l24584K59615j53716j043230j255866q01159j084343j883722j315136
$$ plain form
3784 298652910 297552277 295613261 292618870 289532161 287210842 285675373 282906887 279698894
3776 279698894 276667648 273759522 270214567 266047193 262147786 257854780 254121759 250282008
3768 250282008 246506594 241859190 237023982 232946430 229319604 225738305 220809892 216820748
3760 216820748 212568906 208485804 204668492 201186842 197738403 193416619 189484344 185083969
3752 185083969 181332204 179267616 176521675 172791579 169953816 167372383 164823823 162174956
3744 162174956 159386445 156724982 154894345 152380640 150086119 147844744 145693184 144308662
3736 144308662 143293903 141355274 139105738 138474295 136967638 135423837 134047510 131972303
3728 131972303 130592109 129190591 127619115 125022674 124130658 123426637 121655855 120356948
$$ packed form
3784B98652910j100633j939016k994391l086709k321319j535469k768486l207993
3776B79698894l031246k908126l544955m167374l899407m293006l733021l839751
3768B50282008l775414m647404m835208m077552l626826l581299m928413l989144
3760B16820748m251842m083102l817312l481650l448439m321784l932275m400375
3752A85083969l751765k064588k745941l730096k837763k581433k548560k648867
3744A62174956k788511k661463j830637k513705k294521k241375k151560j384522
3736A44308662j014759j938629k249536o31443j506657j543801j376327k075207
3728A31972303j380194j401518j571476k596441q92016p04021j770782j298907
$$ plain form
3720 120356948 118462856 117300179 116210901 114417514 112428660 110973680 109450946 107561166
3712 107561166 106157292 104797951 103472952 102043179 99749136 98906356 98127848 95993530
3704 95993530 95200423 92924439 91332864 91060879 88844900 87049945 85862530 84998075 84108030
3695 84108030 82335561 80200636 78692272 78321507 77196655 76803189 74827540 74176225 74063026
3686 74063026 73265525 71469996 69848672 69935332 69516904 67525310 66239418 65709838 64968832
3677 64968832 63978056 63661250 63285365 62801538 62799491 61622110 60935776 59897544 59896165 58871566
3667 58871566 58422073 57021906 56144334 55765588 55589120 55149622 53960913 52605911 52131787
3658 52131787 51660820 50994045 50823873 50116287 50115944 49364272 48952177 48948569 48688082 48324319
$$ packed form
3720A20356948j894092j162677j089278j793387j988854j454980j522734j889780
3712A07561166j403874j359341j324999j429773k294043q42780p78508k134318
3704I5993530p93107k275984j591575k71985k215979j794955j187415q64455q90045
3695H4108030j772469k134925j508364l70765j124852l93466j975649o51315j13199
3686G4063026p97501j795529j621324Q6660m18428j991594j285892n29580p41006
3677F4968832r90776l16806l75885m83827k047j177381o86334j038232j379j024599
3667E8871566m49493j400167q77572l78746j76468m39498j188709j355002m74124
3658E2131787m70967o66775j70172p07586l43p51672m12095l608k60487l63763
$$ plain form
3648 48324319 47540855 46752177 46135687 46343873 46374491 45652181 45328457 44210475 44040991
3639 44040991 43988523 43399052 43317018 43530196 43363600 42720682 41990412 41750768 41478960 40929200
3629 40929200 40921619 41145434 41389826 40405300 40239828 40040847 40119512 40090741 39004306 38341036
3619 38341036 38631078 38829922 38249942 37793154 37211349 36632426 36094138 36530361 36384566
3610 36384566 35939451 36123463 35804436 36126785 35918961 35489758 35447311 35770462 35756043 34841558
3600 34841558 34776773 34332147 34480241 34290086 33443602 32506933 32336437 33080085 32919244 33262392
3590 33262392 33146101 32950189 32829804 33440194 32607925 32068027 32232683 32244044 31074919
3581 31074919 31885499 32200014 31901749 31083184 30385430 30134711 31278565 31811241 31054438
$$ packed form
3648D8324319p83464p88678o16490K08186L0618p22310l23724j117982j69484
3639D4040991n2468n89471q2034K13178j66596o42918p30270k39644k71808n49760
3629D0929200p581K23815K44392r84526j65472j98981P8665k8771j086435o63270
3619C8341036K90042J98844n79980m56788n81805n78923n38288M36223j45795
3610C6384566m45115J84012l19027L22349k07824m29203m2447L23151j4419r14485
3600C4841558o4785m44626J48094j90155q46484r36669j70496P43648j60841L43148
3590C3262392j16291j95912j20385O10390q32269n39898J64656J1361j169125
3581C1074919Q10580L14515k98265q18565o97754k50719J143854N32676p56803
$$ plain form
3572 31054438 30329957 30290801 30587901 29917365 29739734 29456369 28772642 28735287 29750171 29939358
3562 29939358 30078434 30543791 30106421 29484155 29403322 28645047 29018428 28640130 27679488 27990198
3552 27990198 28129731 28217070 28860028 28845929 29451251 29276769 29038789 29146568 28600947 28659396
3542 28659396 28656268 28333739 28678982 28701615 28026024 28292730 28498447 28479430 28261730 28797575
3532 28797575 29780368 29075891 29314736 29675097 29882790 29915978 30061754 29544603 28700950 28337642
3522 28337642 27981638 27954497 28187898 28101793 28639899 28825239 29304103 29138286 28580699 28200045
3512 28200045 28973515 28859853 28237521 28720892 28837435 29358530 28947371 28413102 28297261
3503 28297261 28492763 28748822 28684318 28802605 28533460 29085133 28897569 28103569 27501747 27878517
$$ packed form
3572C1054438p24481l9156K97100o70536j77631k83365o83727l7355J014884J89187
3562B9939358J39076M65357m37370o22266q0833p58275L73381l78298r60642L10710
3552B7990198J39533Q7339O42958j4099O05322j74482k37980J07779n45621N8449
3542B8659396l128l22529L45243K2633o75591K66706K05717j9017k17700N35845
3532B8797575R82793p04477K38845L60361K07693L3188J45776n17151q43653l63308
3522B8337642l56004k7141K33401q6105N38106J85340M78864j65817n57587l80654
3512B8200045P73470j13662o22332M83371J16543N21095m11159n34269j15841
3503B8297261J95502K56059o4504J18287k69145N51673j87564p94000o01822L76770
$$ plain form
3493 27878517 28587500 28732095 28557280 29683823 29235885 28093357 27836985 27996328 28223038
3484 28223038 27889441 28118493 28731588 28618772 27535100 27188594 26837725 26798740 27775081
3475 27775081 27397970 27594909 27544839 27263302 27008337 27312346 26840003 26698528 26778463 27346807
3465 27346807 26951469 26261136 26366531 26042666 26345467 26742278 26839315 26817473 26973922 26692535
3455 26692535 26346657 26252843 26049422 25604137 25872452 26135837 26138534 26441584 26483482 26193730
3445 26193730 26497098 26661222 26579982 27736928 27642229 27173333 27762158 28116347 27568500 26549946
3435 26549946 26573027 26068216 26500465 26616399 26625022 25583955 25651928 26571364 26861387 25967085
3425 25967085 26257309 25909217 25677405 25084625 24857791 25590675 25283439 24554170 24701574
$$ packed form
3493B7878517P08983J44595j74815J126543m47938j142528k56372J59343K26710
3484B8223038l33597K29052O13095j12816j083672l46506l50869l8985R76341
3475B7775081l77111J96939n0070k81537k54965L04009m72343j41475P9935N68344
3465B7346807l95338o90333J05395l23865L02801L96811R7037k1842J56449k81387
3455B6692535l45878r3814k03421m45285K68315K63385K697L03050M1898k89752
3445B6193730L03368J64124q1240J156946r4699m68896N88825L54189n47847j018554
3435B6549946K3081n04811M32249J15934Q623j041067O7973R19436K90023q94302
3425B5967085K90224l48092k31812n92780k26834P32884l07236p29269J47404
$$ plain form
3416 24701574 23594213 23548144 23250890 23191170 22757855 23284231 23156526 23177909 22670006 21884720
3406 21884720 21758083 21745438 22222493 22151619 22203656 22065413 22107670 22644716 22237400 22203586
3396 22203586 22116284 21727950 22359551 22625354 21855717 21383837 20929158 20615926 21003976 21440714
3386 21440714 21455778 21501958 21456824 21100971 21625617 21492956 21112399 20814719 21396906 21850432
3376 21850432 21566135 21048285 20922839 20590780 20657856 20653449 20591758 20805101 20199065 19909870
3366 19909870 21027988 21487814 20250377 19620108 20534086 20363292 19845112 19974930 19796897
3357 19796897 20107058 20035449 19596578 19644204 19229788 18671054 18792567 20182382 19901791 19551516
3347 19551516 19233451 19967966 19634777 19577869 18417861 18034785 18193991 17850320 18027924
$$ packed form
3416B4701574j107361m6069k97254n9720m33315N26376j27705K1383n07903p85286
3406B1884720j26637j2645M77055p0874N2037j38243M2257N37046m07316l3814
3396B2203586q7302l88334O31601K65803p69637m71880m54679l13232L88050M36738
3386B1440714J5064M6180m5134l55853N24646j32661l80557k97680N82187M53526
3376B1850432k84297n17850j25446l32059O7076m407o1691K13343o06036k89195
3366A9909870J118118M59826j237437o30269R13978j70794n18180J29818j78033
3357A9796897L10161p1609m38871M7626m14416n58734J21513J389815k80591l50275
3347A9551516l18065P34515l33189n6908j160008l83076J59206l43671J77604
$$ plain form
3338 18027924 17499018 17827430 17829553 17717384 18840129 18708013 18241977 17692669 18089057 17868323
3328 17868323 17365348 18006959 17050197 17068359 18424861 17913625 17222097 17558366 16982036
3319 16982036 17000361 17270215 17052791 17753623 17451141 16795247 15974816 15849452 16132901 16408639
3309 16408639 16441213 15484780 15007661 14919006 15696189 14995252 15131818 15450260 15064605 15630505
3299 15630505 16210871 15225811 15017413 14987469 14944388 14523075 14500045 15162908 15705902 15724765
3289 15724765 16475547 15370315 13983440 14495593 14579465 14731064 14890172 15244851 14658325
3280 14658325 14155036 14300935 14429025 14111637 14356274 14976299 14067141 13602886 13654893 13503185
3270 13503185 14254752 13895608 13119278 14439219 14566249 13934533 14495522 14053804 13203295
$$ packed form
3338A8027924n28906L28412K123j12169J122745j32116m66036n49308L96388k20734
3328A7868323n02975O41611r56762J8162J356502n11236o91528L36269n76330
3319A6982036J8325K69854k17424P00832l02482o55894q20431j25364K83449K75738
3309A6408639L2574r56433m77119q8655P77183p00937J36566L18442l85655N65900
3299A5630505N80366r85060k08398k9944m3081m21313k3030O62863N42994J8863
3289A5724765P50782j105232j386875N12153Q3872J51599J59108L54679n86526
3280A4658325n03289J45899J28090l17388K44637O20025r09158m64255N2007j51708
3270A3503185P51567l59144p76330J319941J27030o31716N60989m41718q50509
$$ plain form
3261 13203295 13204051 12984687 12800246 13889188 14196993 13640771 13198514 13188978 12394355 12880953
3251 12880953 13662524 14232824 13037377 12425162 12313465 12494919 12901527 12927104 12336352
3242 12336352 12547245 12459323 12022312 13136130 13335278 12696590 12695972 13060390 12906137 12365837
3232 12365837 12889767 12584568 11841430 11604523 11387547 11334693 11920347 12213563 12544027 12142055
3222 12142055 12100910 12008356 11359414 11064525 11457856 11548423 11215208 12028569 11867562 11824158
3212 11824158 11349365 12089436 11838970 11190229 10930242 11401530 11163314 11223284 11083424 11451530
3202 11451530 10945391 10300226 11732958 10985201 10700211 11407241 10616989 9738905 10474827
3193 10474827 11205424 10937531 11197864 11211999 10969212 10940854 11499889 10989988 10985713 10783916
$$ packed form
3261A3203295P56k19364j84441J088942L07805n56222m42257r536p94623M86598
3251A2880953P81571N70300j195447o12215j11697J81454M06608K5577n90752
3242A2336352K10893q7922m37011J113818J99148o38688o18L64418j54253n40300
3232A2365837N23930l05199p43138k36907k16976n2854N85654K93216L30464m01972
3222A2142055m1145r2554o48942k94889L93331R0567l33215Q13361j61007m3404
3212A1824158m74793P40071k50466o48741k59987M71288k38216N9970j39860L68106
3202A1451530n06139o45165J432732p47757k84990P07030p90252q78084P35922
3193A0474827P30597k67893K60333J4135k42787k8358N59035n09901m275k01797
$$ plain form
3183 10783916 11229259 12064179 11832032 11931639 11548767 11650168 11823382 10977104 11083410 10981208
3173 10981208 10934149 11649507 11829146 11400703 11431494 10851278 11532504 11086629 10995955 11399129
3163 11399129 11367097 12052694 12200928 11747047 11774844 11424331 10227256 11561652 11586256 10601710
3153 10601710 11151870 10893203 10779404 11481243 11591802 11351287 11375946 11800723 11946747 12650367
3143 12650367 12899893 12202145 12765418 12373557 12334981 11935631 12002580 13362203 13831021 13499742
3133 13499742 14509436 14295626 14114069 13566303 12662192 13204465 13905115 13961484 13593443
3124 13593443 13192815 13647503 13798556 14209298 14634041 14748527 14588224 14567111 15224618 15573148
3114 15573148 16462593 16388037 16577060 17539240 17865561 17836001 18360426 17088269 17693856 18440898
$$ packed form
3183A0783916M45343Q34920k32147R9607l82872J01401J73214q46278J06306j02202
3173A0981208m7059P15358J79639m28443L0791n80216O81226m45875r0674M03174
3163A1399129l2032O85597J48234m53881K7797l50513j197075J334396K4604r84546
3153A0601710N50160k58667j13799P01839J10559k40515K4659M24777J46024P03620
3143A2650367K49526o97748N63273l91861l8576l99350O6949J359623M68818l31279
3133A3499742J009694k13810j81557n47766r04111N42273P00650N6369l68041
3124A3593443m00628M54688J51053M10742M24743J14486j60303k1113O57507L48530
3114A5573148Q89445p4556J89023R62180L26321k9560N24425j272157O05587P47042
$$ plain form
3104 18440898 18800389 18321898 18314143 18887476 19388912 19109669 19607783 18623338 18600693 18910665
3094 18910665 18820299 18310897 18507060 18720083 18274475 17510392 17331149 17332974 16742943 16913541
3084 16913541 16255683 16886904 16826333 16845040 16691868 16618526 16899673 16096049 15481960 15475827
3074 15475827 15806106 15089041 14956491 14099279 13659152 13926662 13970188 13909205 14407656 14512827
3064 14512827 13630222 14061514 14541389 13898709 14276201 14038215 13707357 14202055 14386132
3055 14386132 14724364 13546820 13295287 14198335 13665250 13108182 13306934 12767481 12873426
3046 12873426 12793142 12032466 11755214 11046263 11760079 11931611 11722984 11995566 11786297 11341408
3036 11341408 10833929 10394802 10437835 10861409 11064778 10824610 10549819 10665460 10394944 9844500
$$ packed form
3104A8440898L59491m78491p755N73333N01436k79243M98114r84445k2645L09972
3094A8910665r0366n09402J96163K13023m45608p64083j79243J825n90031J70598
3084A6913541o57858O31221o0571J8707j53172p3342K81147q03624o14089o133
3074A5475827L30279p17065j32550q57212m40127K67510M3526o0983M98451J05171
3064A4512827q82605M31292M79875o42680L77492k37986l30858M94698J84077
3055A4386132L38232j177544k51533R03048n33085n57068J98752n39453J05945
3046A2873426q0284p60676k77252p08951P13816J71532k08627K72582k09269m44889
3036A1341408n07479m39127M3033M23574K03369k40168k74791J15641k70516n50444
$$ plain form
3026 9844500 9540659 9362067 9283315 9346646 9724121 9254696 8974209 9146490 9603996 10190960
3016 10190960 10541787 9822220 9683981 10520541 10082758 9708605 9496105 9059950 9445598
3007 9445598 9407242 8944209 8695312 8924605 9051522 8030584 8764350 8712613 8859595 8603543
2997 8603543 8756210 7766549 7616847 8689930 9246557 8796939 8295523 8395741 8048036
2988 8048036 7971713 8425581 8386676 8581708 8076848 8479305 8628392 8179045 8194038 7563202
2978 7563202 7312100 7746077 7287671 7310408 8016268 7656143 8187878 8677633 8207278 8372263
2968 8372263 8731236 7532353 7891199 8315436 7634459 7511321 7479018 7028866 6702292 6942736
2958 6942736 6621345 7802398 8235789 7543575 7274336 7201264 6228183 7155224 7457453 7177425
$$ packed form
3026I844500l03841j78592p8752O3331L77475m69425k80487J72281M57506N86964
3016A0190960L50827p19567j38239Q36560m37783l74153k12500m36155L85648
3007I445598l8356m63033k48897K29293J26917j020938P33766n1737J46982k56052
2997H603543J52667r89661j49702J073083N56627m49618n01416J00218l47705
2988H048036p6323M53868l8905J95032n04860M02457J49087m49347J4993o30836
2978G563202k51102M33977m58406K2737P05860l60125N31735M89755m70355J64985
2968H372263L58973j198883L58846M24237o80977j23138l2303m50152l26574K40444
2958F942736l21391J181053M33391o92214k69239p3072r73081R27041L02229k80028
$$ plain form
2948 7177425 7368210 7800901 7802914 7775977 7560311 7384093 7040570 6819046 7114938 6516058
2938 6516058 6418384 6976383 7342060 7133331 6915944 6687088 6680902 6842186 7612344 6939111
2928 6939111 7418164 8523352 7891604 7215943 6810172 6363772 6669154 6480077 6361722
2919 6361722 6811136 6149304 6072232 6208431 6118910 6868495 6947439 6572574 6852685 6992229
2909 6992229 7383167 7280368 7079969 7234295 7223536 7381659 6934246 6841614 5991906 6108933
2899 6108933 6597534 7523026 6773044 6233512 6658573 5936903 6476175 6829754 6616395 6204193
2889 6204193 5797557 6398920 5737834 5674677 5620862 5972878 6039954 5755235 6759597 7250708
2879 7250708 7203469 6639116 7081672 7569229 6820775 5735184 5872344 5912848 5850275 6303965
$$ packed form
2948G177425J90785M32691K013k6937k15666j76218l43523k21524K95892n98880
2938F516058r7674N57999L65677k08729k17387k28856o186J61284P70158o73233
2928F939111M79053J105188o31748o75661m05771m46400L05382j89077j18355
2919F361722M49414o61832p7072J36199q9521P49585P8944l74865K80111J39544
2909F992229L90938j02799k00399J54326j0759J58123m47413r2632q49708J17027
2899F108933M88601R25492p49982n39532M25061p21670N39272L53579k13359m12202
2889F204193m06636O01363o61086o3157n3815L52016O7076k84719J004362M91111
2879G250708m7239n64353M42556M87557p48454j085591J37160M0504o2573M53690
$$ plain form
2869 6303965 6419337 5917028 5851646 5783289 5855198 6219247 6732003 6476276 5441210 5922599
2859 5922599 5788486 5446825 5634050 6631480 5587258 5734654 5433733 5239049 5709470
2850 5709470 5341665 6527423 6345291 5707658 6162297 6321925 6686211 5568004 5447718
2841 5447718 6593417 7004761 7321576 7397650 7521386 6996402 5651973 5742447 6391614 7437706
2831 7437706 7056955 6335989 5872892 5339808 5492732 5868743 6032874 5464459 5629977 6126330
2821 6126330 6090202 5787098 5885663 5353859 4625433 5351096 6457901 6485160 6528891 7032187
2811 7032187 6571925 5526724 6278773 6498581 6738037 7129770 7225920 5960304 4853957
2802 4853957 5293697 6374364 6901683 6261934 6231578 6513741 5894845 5537518 5871758 5722225
$$ packed form
2869F303965J15372n02309o5382o8357P1909L64049N12756k55727j035066M81389
2859E922599j34113l41661J87225R97430j044222J47396l00921j94684M70421
2850E709470l67805J185758j82132o37633M54639J59628L64286j118207j20286
2841E447718J145699M11344L16815P6074J23736n24984j344429R0474O49167J046092
2831G437706l80751p20966m63097n33084J52924L76011J64131n68415J65518M96353
2821F126330l6128l03104R8565n31804p28426P25663J106805K7259M3731N03296
2811G032187m60262j045201P52049K19808K39456L91733R6150j265616j106347
2802D853957M39740J080667N27319o39749l0356K82163o18896l57327L34240j49533
$$ plain form
2792 5722225 6252335 5866210 5200362 5617842 4717724 4745970 6129524 6078190 5966848 7448909
2782 7448909 7520938 6332217 6335025 6442812 5886528 6175889 6367374 6306334 5599249 5411264
2772 5411264 5344473 5093545 4765324 5547115 5718835 6226371 6222745 6379107 5679910 5357603
2762 5357603 5679627 6063611 5846298 5811539 5940180 5390222 5461822 5278977 5466045 5187078
2752 5187078 5449733 5608183 5296701 5690856 5389899 6407525 6896321 6381789 6250155
2743 6250155 6477578 5912515 5746932 5816367 5802443 5651209 5369843 5037082 5210236 5571265
2733 5571265 5394069 5430650 4643283 5229669 5631985 5221742 6061167 5879542 5346782 5066682
2723 5066682 4719556 4844858 4755204 5431587 5491349 5279570 4975945 5233496 5229841 5643311
$$ packed form
2792E722225N30110l86125o65848M17480r00118K8246J383554n1334j11342J482061
2782G448909P2029j188721K808J07787n56284K89361J91485o1040p07085j87985
2772E411264o6791k50928l28221P81791J71720N07536l626J56362o99197l22307
2762E357603L22024L83984k17313l4759J28641n49958P1600j82845J87068k78967
2752E187078K62655J58450l11482L94155l00957J017626M88796n14532j31634
2743F250155K27423n65063j65583O9435j3924j51234k81366l32761J73154L61029
2733E571265j77196L6581p87367N86386M02316m10243Q39425j81625n32760k80100
2723E066682l47126J25302q9654O76383N9762k11779l03625K57551l655M13470
$$ plain form
2713 5643311 4917323 3829623 4176132 4458045 5148620 5530842 5782334 4935808 4614160
2704 4614160 5543603 4956198 5207006 5311111 4771107 4690292 6023080 5712648 5211968 5442854
2694 5442854 5382155 3679885 3811780 4397693 4422682 5117221 5433099 5292352 5034372 5111332
2684 5111332 4779628 4416360 4534343 4150266 4292774 4302165 4295071 4560480 4862331 5210334
2674 5210334 4330284 4552934 4453175 4678801 5467917 4121849 4687401 5397470 4885809 5256846
2664 5256846 4775802 4722522 4598778 4920608 4919210 4424136 4622528 4701165 5359233 4664302
2654 4664302 4550714 5139937 4996831 5029172 5804591 5699130 4614895 4129378 4520694 4991099
2644 4991099 4203833 4134167 3746563 3761739 4592737 5025290 5261603 5724322 5370854 4523855
$$ packed form
2713E643311p25988j087700L46509K81913O90575L82222K51492q46526l21648
2704D614160R29443n87405K50808J04105n40004q0815J332788l10432n00680K30886
2694E442854o0699j702270J31895N85913K4989O94539L15878j40747k57980P6960
2684E111332l31704l63268J17983l84077J42508R391p094K65409L01851L48003
2674E210334q80050K22650r9759K25626P89116j346068N65552P10069n11661L71037
2664E256846m81044n3280j23744L21830j398m95074J98392P8637O58068o94931
2654D664302j13588N89223j43106L2341P75419j05461j084235m85517L91316M70405
2644D991099p87266o9666l87604J5176Q30998M32553K36313M62719l53468q46999
$$ plain form
2634 4523855 4124664 3616284 3970066 4588797 4459274 4808510 5079029 5032177 5016536 5116608
2624 5116608 5021665 4426445 4831083 4610536 3839321 4442546 4155163 4124562 5051108 5812455
2614 5812455 4642521 4412750 4287588 4969190 5590292 5621341 5695113 5837480 5022018 5429391
2604 5429391 5257440 4318951 4802498 4358167 4742230 5078364 5119783 5296156 5272674 4775164
2594 4775164 4681999 4852824 5113049 5716183 5819768 4700295 4097679 4661991 4907980 4406491
2584 4406491 4801103 5715027 5885233 5423342 4876140 5402092 4370424 3935298 4262190
2575 4262190 3804391 5072454 4568096 4015377 4394819 4155627 4389988 5081530 5790034
2566 5790034 5562156 4052115 4735851 4397696 4470786 4529249 3915517 4778847 5227820 5338062
$$ packed form
2634D523855l99191n08380L53782O18731j29523L49236K70519m6852j5641J00072
2624E116608r4943n95220M04638k20547p71215O03225k87383l0601R26546P61347
2614E812455j169934k29771j25162O81602O21102L1049P3772J42367q15462M07373
2604E429391j71951r38489M83547m44331L84063L36134M1419J76373k3482m97510
2594D775164r3165J70825K60225O03134J03585j119473o02616N64312K45989n01489
2584D406491L94612R13924J70206m61891n47202N25952j031668m35126L26892
2575D262190m57799J268063n04358n52719L79442k39192K34361O91542P08504
2566E790034k27878j510041O83736l38155P3090N8463o13732Q63330M48973J10242
$$ plain form
2556 5338062 5982721 5854305 5599147 5970070 5527027 4889121 4683862 5151971 4749876 4803525
2546 4803525 4500892 4667559 4781370 4795051 5207371 5122815 4453541 5431092 4992061 4409293
2536 4409293 5529756 5318335 4789577 4969181 4638581 4602024 5094262 4479814 4550093 3856649
2526 3856649 3410664 3767755 3718094 3929211 3926325 4094073 4645983 5356671 4755233 4394885
2516 4394885 4817117 3651388 4809881 4795107 4589906 5112707 5191425 4526166 4266338 5132121
2506 5132121 5662599 5569460 5755659 5207684 4615983 3860409 4350784 5192122 4356625 3812087
2496 3812087 4343783 4538224 3734241 4089501 4561225 4772333 4162539 4898312 5345431 5131170
2486 5131170 4878428 4560654 4544255 3928185 3917091 4527272 3844838 4097159 4527313 4584696
$$ packed form
2556E338062O44659j28416k55158L70923m43043o37906k05259M68109m02095N3649
2546D803525l02633J66667J13811J3681M12320q4556o69274R77551m39031n82768
2536D409293J120463k11421n28758J79604l30600l6557M92238o14448P0279o93444
2526C856649m45985L57091m9661K11117k886J67748N51910P10688o01438l60348
2516D394885M22232j165729J158493j4774k05201N22801P8718o65259k59828Q65783
2506E132121N30478r3139J86199n47975n91701p55574M90375Q41338q35497n44538
2496C812087N31696J94441q03983L55260M71724K11108o09794P35773M47119k14261
2486E131170k52742l17774j6399o16070j1094O10181o82434K52321M30154N7383
$$ plain form
2476 4584696 4643846 4539876 4991532 4340506 3981277 4673630 3795960 3996902 4057434 3682106
2466 3682106 3988220 4321463 4508126 4864795 4341812 4197057 4482899 3933735 3955559 4344519
2456 4344519 4898641 5044540 4751680 5148329 4668745 3957159 3818648 4938426 5505652
2447 5505652 5306312 4593532 4848140 5301169 4807700 4313224 4126789 4437312 4518921 4485196
2437 4485196 5518944 4892095 4675494 4266447 4840664 5622264 5347755 4539654 4818534
2428 4818534 5045778 3556616 3669781 4075266 5289037 5091096 5363718 4691434 4586484
2419 4586484 4798281 5017295 5432434 6337929 6196372 5972115 5650208 5077417 4840516 4925751
2409 4925751 5264571 4829157 4619485 4845865 5463397 5636496 5392443 6029206 6135876 6092328
$$ packed form
2476D584696N9150j03970M51656o51026l59229O92353q77670K00942O0532l75328
2466C682106L06114L33243J86663L56669n22983j44755K85842n49164K1824L88960
2456D344519N54122J45899k92860L96649m79584p11586j38511J119778N67226
2447E505652j99340p12780K54608M53029m93469m94476j86435L10523Q1609l3725
2437D485196J033748o26849k16601m09047N74217P81600k74509q08101K78880
2428D818534K27244j489162J13165M05485J213771j97941K72622o72284j04950
2419D586484K11797K19014M15139R05495j41557k24257l21907n72791k36901Q5235
2409D925751L38820m35414k09672K26380O17532J73099k44053O36763J06670m3548
$$ plain form
2399 6092328 6275451 6104287 6026810 6465603 6798982 6458599 6002385 6195112 6237794 7412359
2389 7412359 6543129 6285939 6402583 6349166 6717210 5797111 6805334 7308630 6982926 7019868
2379 7019868 7220863 8420725 8235852 7587820 7362469 7623488 8088526 8184006 8050783 7942975
2369 7942975 8225621 8424598 8563871 8857320 8689408 9278833 9464191 9656335 9757920 9673173
2359 9673173 9540348 10247771 9946165 10330168 10845786 10323146 11480941 12398108 12035976
2350 12035976 12158768 11854291 11937031 13071770 13383466 14459471 13939434 14182321 15391794
2341 15391794 15797637 16206926 16595808 16671691 17774227 18938776 20319928 20725960 21355572
2332 21355572 22771363 23169674 24765887 25989548 26601365 28020655 29090873 30421676
$$ packed form
2399F092328J83123j71164p7477M38793L33379l40383m56214J92727M2682J174565
2389G412359q69230k57190J16644n3417L68044r20099J008223N03296l25704L6942
2379G019868K00995J199862j84873o48032k25351K61019M65038R5480j33223j07808
2369G942975K82646J98977J39273K93449j67912N89425J85358J92144J01585q4747
2359I673173j32825P07423l01606L84003N15618n22640J157795R17167l62132
2350A2035976J22792l04477Q2740J134739L11696J076005n20037K42887J209473
2341A5391794M05843M09289L88882P5883J102536J164549J381152M06032O29612
2332B1355572J415791L98311J596213J223661O11817J419290J070218J330803
$$ plain form
2324 30421676 32160319 33971955 34734400 36420158 38172504 39633058 40187506 41491255
2316 41491255 42919742 43380542 42372488 42081255 40365337 39072905 38459746 36578673 34600466
2307 34600466 33903621 32852770 31421003 29635266 27164577 25653810 24998884 24008140 22994973
2298 22994973 22280658 21118363 20134098 19859203 19889451 19573973 17808740 16380426 16254126
2289 16254126 15871915 15935155 15038775 14845196 14279622 14011066 14328918 13780808 13363196 12435241
2279 12435241 12288299 12234092 11913084 12264523 11354348 10491434 10852488 10127062 10509658 10062945
2269 10062945 9201972 9149139 8773524 9200584 8629458 8782861 9263126 8894651 8320075 8264442
2259 8264442 8209610 8318386 7878421 8523680 8350274 7847625 8608521 8639437 8230801 7507035
$$ packed form
2324C0421676J738643J811636P62445J685758J752346J460554N54448J303749
2316D1491255J428487M60800j008054k91233j715918j292432o13159j881073j978207
2307C4600466o96845j050851j431767j785737k470689j510767o54926r90744j013167
2298B2994973p14315j162295r84265k74895L0248l15478j765233j428314j26300
2289A6254126l82211O3240q96380j93579n65574k68556L17852n48110m17612r27955
2279A2435241j46942n4207l21008L51439r10175q62914L61054p25426L82596m46713
2269A0062945q60973n2833l75615M27060n71126J53403M80265l68475n74576n5633
2259H264442n4832J08776m39965O45259j73406n02649P60896L0916m08636p23766
$$ plain form
2249 7507035 7649817 7329055 7207340 7715804 7118875 7421564 6755409 6375371 6207213 7069882
2239 7069882 6975267 6899040 6867289 6243109 5780931 6092540 6536030 5916131 5797100 6972684
2229 6972684 6706097 6370245 6318778 6098844 5691970 5036096 5327748 5881157 6813743 7005130
2219 7005130 6155210 5876066 6014077 5506624 5660720 5777127 5234710 3919695 3216571
2210 3216571 4208548 4768385 4633134 5509054 5311892 5192909 5658945 5465222 5188035 4792192
2200 4792192 4953623 4742548 4252964 4679334 5160564 4940407 4692236 5089038 4334098 4463309
2190 4463309 4611157 5083092 5141968 4366120 4063236 4561528 3787999 3964759 3902590 4427240
2180 4427240 4846374 4401734 4367859 4141720 3880932 4107506 3852373 3766149 4714062 4399763
$$ packed form
2249G507035J42782l20762j21715N08464n96929L02689o66155l80038j68158Q62669
2239G069882r4615p6227l1751o24180m62178L11609M43490o19899j19031J175584
2229F972684k66587l35852n1467k19934m06874o55874K91652N53409R32586J91387
2219G005130q49920k79144J38011n07453J54096J16407n42417j315015p03124
2210C216571R91977N59837j35251Q75920j97162j18983M66036j93723k77187l95843
2200D792192J61431k11075m89584M26370M81230k20157k48171L96802p54940J29211
2190D463309J47848M71935N8876p75848l02884M98292p73529J76760o2169N24650
2180D427240M19134m44640l3875k26139k60788K26574k55133q6224R47913l14299
$$ plain form
2170 4399763 4827468 3946373 3563075 4233583 4781651 5141251 4222626 3840627 4190293 3919520
2160 3919520 3880047 3577993 4024350 3908771 3908635 3738081 3098818 3697662 3713442 3927151
2150 3927151 4460190 4101023 3871085 4028247 3920370 4092367 3673443 4036083 4368957 4397017
2140 4397017 4562121 4094000 3980034 4819232 5624161 4442844 4041219 4199202 4006810
2131 4006810 4157489 4393727 4481886 4285364 3749148 3741981 3147829 2526526 3856070 4132718
2121 4132718 3804016 4313425 4553303 5128561 4638904 4301245 3497524 3907994 4360312 4008264
2111 4008264 4010839 3420870 3355556 3588000 2885797 2828400 3115310 2790688 2294260 2796815
2101 2796815 3349592 3188901 3112889 3239443 3498965 3970234 3655687 3872218 3909728 3446972
$$ packed form
2170D399763M27705q81095l83298O70508N48068L59600r18625l81999L49666k70773
2160C919520l9473l02054M46357j15579j36j70554o39263N98844J5780K13709
2150C927151N33039l59167k29938J57162j07877J71997m18924L62640L32874K8060
2140D397017J65104m68121j13966Q39198Q04929j181317m01625J57983j92392
2131D006810J50679K36238Q8159j96522n36216p167n94152o21303J329544K76648
2121D132718l28702N09409K39878N75258m89657l37659q03721M10470M52318l52048
2111D008264K575n89969o5314K32444p02203n7397K86910l24622m96428N02555
2101B796815N52777j60691p6012J26554K59522M71269l14547K16531L7510m62756
$$ plain form
2091 3446972 3433307 3644767 3823311 3822990 4012190 3180496 3306557 3478423 3800889 3715583
2081 3715583 3569142 3426329 3792355 3788295 3729942 3685567 3691770 3949450 3665956 2927194 3582584
2070 3582584 4466645 4211690 4244454 4367887 2905964 2712582 3503753 3620684 4219550 3940140
2060 3940140 4130147 4453575 4123920 4095113 4103021 3946871 3465861 4223955 4138981 4153041
2050 4153041 3760121 3678384 3473795 3402779 3417209 2878620 2407188 2474334 3140656 4001760
2040 4001760 3417195 3597242 4278646 3657044 3851877 3872405 4766024 4635861 4146282 4196718
2030 4196718 3152393 3579900 4563180 3931455 3073259 2572830 3280299 3275566 2939318 2886610
2020 2886610 3404639 4202320 4157714 3131646 2279264 2501368 2780274 3255881 2958620 2634897
$$ packed form
2091C446972j3665K11460J78544l21J89200q31694J26061J71866L22466q5306
2081C715583j46441j42813L66026m060n8353m4375O203K57680k83494p38762O55390
2070C582584Q84061k54955L2764J23433j461923j93382P91171J16931N98866k79410
2060C940140J90007L23428l29655k8807P908j56150m81010P58094q4974J4060
2050D153041l92920q1737k04589p1016J4430n38589m71432O7146O66322Q61104
2040D001760n84565J80047O81404o21602J94833K0528Q93619j30163m89579N0436
2030D196718j044325M27507R83280o31725q58196n00429P07469m733l36248n2708
2020B886610N18029P97681m4606j026068q52382K22104K78906M75607k97261l23723
$$ plain form
2010 2634897 2967891 3065698 3212396 3293079 3300762 2899530 3057162 3370201 3519805 3412783
2000 3412783 3703573 3108541 2995363 3119630 3255034 3848649 4070803 3995189 4341590 3485758
1990 3485758 2961257 3705277 3667645 3030326 2445839 1891915 2390839 2894897 3077749 2491496
1980 2491496 2553830 3349094 3519241 3177339 2674871 2837411 2929929 3059021 3550918 2907248
1970 2907248 3128051 3380751 3788142 3875180 3085787 2978925 3112918 3399763 4048436 3311349
1960 3311349 2735427 3321775 2553958 2179738 1989614 2862893 3835947 4427191 4213661 3326934
1950 3326934 3090157 3402481 3151539 2702911 2569809 2843222 3105553 3485204 3079901 2932846
1940 2932846 3196726 2813738 2548841 2674005 3048041 3421408 3883225 3652742 3929599 3558257
$$ packed form
2010B634897L32994R7807J46698Q0683P683m01232J57632L13039J49604j07022
2000C412783K90790n95032j13178J24267J35404N93615K22154p5614L46401q55832
1990C485758n24501P44020l7632o37319n84487n53924M98924N04058J82852n86253
1980B491496O2334P95264J70147l41902n02468J62540R2518J29092M91897o43670
1970B907248K20803K52700M07391Q7038p89393j06862J33993K86845O48673p37087
1960C311349n75922N86348p67817l74220j90124Q73279R73054N91244k13530q86727
1950C326934k36777L12324k50942m48628j33102K73413K62331L79651m05303j47055
1940B932846K63880l82988k64897J25164L74036L73367M61817k30483K76857l71342
$$ plain form
1930 3558257 3006955 2433403 2054475 2171220 2284887 2677055 3704147 4210469 3462830
1921 3462830 2971354 2646246 3223372 2055423 1793580 2636874 2869878 2747960 3012420
1912 3012420 3148085 3690461 3215034 3111703 2895329 3339799 2952750 2431742 3064882 3487410
1902 3487410 3299359 3716790 3220386 3689116 3518168 3255925 3403352 2538740 2508018 3351482
1892 3351482 3014309 2732073 2290948 2269651 2384784 2689159 3285765 3274363 3660351 3840691
1882 3840691 3847148 3585816 3511055 2867254 2765780 2539075 3104019 3290215 3587414 3449163
1872 3449163 2753192 2430444 2620816 2069568 2960756 3294839 3677590 2136495 2181640 3096611
1862 3096611 3338971 3031337 2715711 2320153 2131706 2884980 3476251 2818627 2514786 2872008
$$ packed form
1930C558257n51302n73552l78928J16745J13667L92168J027092N06322p47639
1921C462830m91476l25108N77126j167949k61843Q43294K33004j21918K64460
1912C012420J35665N42376m75427j03331k16374M44470l87049n21008O33140M22528
1902C487410j88051M17431m96404M68730j70948k62243J47427q64612l0722Q43464
1892C351482l37173k82236m41125k1297J15133L04375N96606j1402L85988J80340
1882C840691O457k61332p4761o43801j01474k26705N64944J86196K97199j38251
1872C449163o95971l22748J90372n51248Q91188L34083L82751j541095M5145R14971
1862C096611K42360l07634l15626l95558j88447P53274N91271o57624l03841L57222
$$ plain form
1852 2872008 3007950 2813026 3094079 2884874 2252759 2087108 2574005 2327804 2993695 3171235
1842 3171235 2798225 2685964 3291103 2636491 2546335 3026888 2853985 2288042 2569158 2424647
1832 2424647 2430473 2696414 2747392 3404202 3603412 3539860 3094353 2491700 1939134 2148363
1822 2148363 1697430 1706287 1174848 2335075 2653765 2735642 2688052 2662053 2406761 2143702
1812 2143702 2650968 3151716 2604769 3136276 2773547 2092952 3206722 3639772 3368294
1803 3368294 4052747 3943327 3587934 2819283 2504507 2828128 2772199 2807784 3010106 2786794
1793 2786794 2414444 2814072 2683859 2668329 2293981 2013586 2256847 2715173 3059462 2869871
1783 2869871 2595165 2303869 2152801 1483886 2241024 2489322 1944566 1651171 2365286 2942926
$$ packed form
1852B872008J35942j94924K81053k09205o32115j65651M86897k46201O65891J77540
1842C171235l73010j12261O05139o54612r0156M80553j72903n65943K81116j44511
1832B424647N826K65941N0978O56810J99210o3552m45507o02653n52566K09229
1822B148363m50933Q857n31439J160227L18690Q1877m7590k5999k55292k63059
1812B143702N07266N00748n46947N31507l62729o80595J113770M33050k71478
1803C368294O84453j09420l55393p68651l14776L23621n5929L5585K02322k23312
1793B786794l72350L99628j30213j5530l74348k80395K43261M58326L44289j89591
1783B869871k74706k91296j51068o68915P57138K48298n44756k93395P14115N77640
$$ plain form
1773 2942926 2890408 2688006 2185784 1540274 1941174 1918569 2434327 2098869 2003606 1887343
1763 1887343 2657681 2945315 3110674 3356237 2903118 2987946 3596702 3005112 3315980 2996907
1753 2996907 2845200 2856348 2753085 3321369 3529948 2732628 2303588 2852909 2212249 2557953
1743 2557953 2957090 3309816 3338979 3136109 2959166 3404724 2777624 3029148 2778906 2185473
1733 2185473 2427138 3434662 3465137 3243317 3004445 2000264 2308903 2552019 1770447
1724 1770447 2174320 2565394 2230027 2061046 3166921 2824407 2405752 2214305 3047482
1715 3047482 2871455 1960339 2097976 2221993 1967592 2378477 2811060 2957896 3521002 2844469
1705 2844469 2090833 1982383 2747877 3517421 2678601 2395299 2637907 3052849 2828006 2768234
$$ packed form
1773B942926n2518k02402n02222o45510M00900k2605N15758l35458r5263j16263
1763A887343P70338K87634J65359K45563m53119Q4828O08756n91590L10868l19073
1753B996907j51707J1148j03263N68284K08579p97320m29040N49321o40660L45704
1743B557953L99137L52726K9163k02870j76943M45558o27100K51524k50242n93433
1733B185473K41665J007524L0475k21820k38872j004181L08639K43116p81572
1724A770447M03873L91074l35367j68981J105875l42514m18655j91447Q33177
1715C047482j76027r11116J37637J24017k54401M10885M32583J46836N63106o76533
1705B844469p53636j08450P65494P69544q38820k83302K42608M14942k24843n9772
$$ plain form
1695 2768234 1593288 1311875 1961803 2092084 2250941 2859102 2606675 2851905 3031002
1686 3031002 2654879 2644783 1870270 2248973 2562029 3018253 2558799 2087302 2242723 2833811
1676 2833811 2223007 1826234 2775103 2483497 2575059 2195991 2068125 2447856 2857685 2424609
1666 2424609 2516032 1669736 1122862 1781220 2207834 2843994 3070820 2579774 2591391 2975182
1656 2975182 3096751 3454243 4000663 4124906 3999266 2578673 2605421 3202105 2840770 2824192
1646 2824192 2541816 2550853 3024232 3067250 1776198 2689653 3561566 3340268 2588529 3023638
1636 3023638 2232208 2204163 2606780 2268605 1930763 2801989 2981600 2362447 2357677 2073839
1626 2073839 2966284 3251547 2451041 2085902 1943197 2424429 3010091 2424619 2255779 2317306
$$ packed form
1695B768234j174946k81413O49928J30281J58857O08161k52427K45230J79097
1686C031002l76123j0096p74513L78703L13056M56224m59454m71497J55421N91088
1676B833811o10804l96773R48869k91606R1562l79068j27866L79731M09829m33076
1666B424609R1423q46296n46874O58358M26614O36160K26826m91046J1617L83791
1656B975182J21569L57492N46420J24243j25640j420593K6748N96684l61335j6578
1646B824192k82376R037M73379M3018j291052R13455Q71913k21298p51739M35109
1636C023638p91430k8045M02617l38175l37842Q71226J79611o19153m770k83838
1626B073839Q92445K85263q00506l65139j42705M81232N85662n85472j68840O1527
$$ plain form
1616 2317306 2474986 3029364 3020204 3511222 2666829 2488998 2458962 2087164 2582952 2602144
1606 2602144 2917343 3221141 2665384 1333148 1600883 2244036 1608820 1731005 2124033
1597 2124033 2241376 2410698 2922660 2863160 3353750 2887828 1902568 915429 2001757 2715679
1587 2715679 2259085 2890147 3346604 2353466 2667392 3176750 2755570 2547557 2212324 1662584
1577 1662584 1437649 2364305 3101099 4294503 3764702 3162308 2743314 2306650 2682813
1568 2682813 2695888 3175181 3574427 2833064 2985137 2840320 2070911 1791741 2398577 2573128
1558 2573128 1691407 1717454 2918175 2694266 2057643 1679294 1709854 2125330 2920084 2591188
1548 2591188 1553986 1554182 1375881 2322016 2445822 2873877 3302101 3286758 2701512 1782527
$$ packed form
1616B317306J57680N54378r160M91018q44393j77831l0036l71798M95788J9192
1606B602144L15199L03798n55757j332236K67735O43153o35216J22185L93028
1597B124033J17343J69322N11962n9500M90590m65922r85260r87139J086328P13922
1587B715679m56594O31062M56457r93138L13926N09358m21180k08013l35233n49740
1577A662584k24935R26656P36794J193404n29801o02394m18994m36664L76163
1568B682813J3075M79293L99246p41363J52073j44817p69409k79170O06836J74551
1558B573128q81721K6047J200721k23909o36623l78349L0560M15476P94754l28896
1548B591188j037202J96j78301R46135J23806M28055M28224j5343n85246r18985
$$ plain form
1538 1782527 2148878 1595642 1636721 2502772 2390150 2735272 3303579 2671562 2824464 3673782
$$ packed form
1538A782527L66351n53236M1079Q66051j12622L45122N68307o32017J52902Q49318
$$ [...]
##END NTUPLES=NMR SPECTRUM
##END=
