##TITLE=1H_DE-80H_X3
 200.13MHz, d2o
 8 sc
 
 19ns.26.2.2025
##JCAMPDX= 6.0         $$ Bruker NMR JCAMP-DX V2.0
##DATA TYPE= NMR SPECTRUM
##DATA CLASS= NTUPLES
##ORIGIN= UXNMR, Bruker Analytische Messtechnik GmbH
##OWNER= pz
$$ XWIN-NMR		Version 3.5
$$ Mon Jun  8 10:43:09 2026 Russian Standard Time (UT+4h)  Yarkov@DPX200
##.OBSERVE FREQUENCY= 200.1313
##.OBSERVE NUCLEUS= ^1H
##.ACQUISITION MODE= SIMULTANEOUS
##.ACQUISITION SCHEME= undefined
##.AVERAGES= 8
##.DIGITISER RES= 18
##SPECTROMETER/DATA SYSTEM= spect
##.PULSE SEQUENCE= zg30
##.SOLVENT NAME= CDCl3
##.SHIFT REFERENCE= (INTERNAL, CDCl3, 0, 15.4769)
##AUDIT TRAIL= $$ (NUMBER, WHEN, WHO, WHERE, WHAT)
$$ ##TITLE= Audit trail, XWIN-NMR		Version 3.5
$$ ##JCAMPDX= 5.01
$$ ##ORIGIN= Bruker BioSpin GmbH
$$ ##OWNER= Yarkov
$$ C:/Bruker/XWIN-NMR/data/yarkov2/nmr/H-C/1/pdata/1/auditp.txt
$$ ##AUDIT TRAIL=  $$ (NUMBER, WHEN, WHO, WHERE, WHAT)
(   1,<2026-06-08 10:41:25.45 +0400>,<Yarkov>,<DPX200>,
      <created by zg, POWCHK disabled, PULCHK disabled
       configuration hash MD5:
       00 E9 B6 7A A2 85 ED C7 34 08 36 98 17 FE 4E 26
       data hash MD5: 16K
       00 A0 91 22 C3 9C 95 EA C7 C7 94 3A D6 37 05 50>)
(   2,<2026-06-08 10:41:29.70 +0400>,<Yarkov>,<DPX200>,
      <Start of raw data processing
       efp BC_mod = 2 LB = 0.25 FT_mod = 6 PKNL = 1 PHC0 = -6376.443 PHC1 = 8.221958 SI = 16K 
       data hash MD5: 16K
       4B C3 DD 90 26 5F C6 F9 5B 45 1A F7 D6 AE 25 C3>)
$$ ##END=
$$ 
$$ hash MD5
$$ 82 72 70 36 DA 75 AC C8 7B A9 D0 3A A6 77 D9 DA
##$RELAX= 
##$RELAX= 
##$RELAX= 
##$RELAX= 
##$RELAX= 
##$RELAX= 
$$ Bruker specific parameters
$$ --------------------------
##$DU= <C:/Bruker/XWIN-NMR>
##$EXPNO= 1
##$NAME= <H-C>
##$PROCNO= 1
##$TYPE= <nmr>
##$USER= <yarkov2>
##$AMP= (0..31)
100 100 100 100 100 100 100 100 100 100 100 100 100 100 100 100 100 100 
100 100 100 100 100 100 100 100 100 100 100 100 100 100 
##$AQSEQ= 0
##$AQ_mod= 1
##$AUNM= <au_zg>
##$AUTOPOS= <>
##$BF1= 200.13
##$BF2= 200.13
##$BF3= 200.13
##$BF4= 200.13
##$BF5= 200.13
##$BF6= 200.13
##$BF7= 200.13
##$BF8= 200.13
##$BYTORDA= 1
##$CFDGTYP= 0
##$CFRGTYP= 5
##$CHEMSTR= <none>
##$CNST= (0..31)
1 1 145 1 1 1 1 1 1 1 1 1 1 1 1 1 1 1 1 1 1 1 1 1 1 1 1 1 1 1 1 1 
##$CPDPRG= <>
##$CPDPRG1= <>
##$CPDPRG2= <>
##$CPDPRG3= <>
##$CPDPRG4= <mlev>
##$CPDPRG5= <mlev>
##$CPDPRG6= <mlev>
##$CPDPRG7= <mlev>
##$CPDPRG8= <mlev>
##$CPDPRGB= <>
##$CPDPRGT= <>
##$D= (0..31)
0 0.7 0 0 0 0 0 0 0 0 0 0.03 0 0 0 0 0 0 0 0 0 0 0 0 0 0 0 0 0 0 0 0 
##$DATE= 1780900885
##$DBL= (0..7)
120 120 120 120 120 120 120 120 
##$DBP= (0..7)
150 150 150 150 150 150 150 150 
##$DBP07= 0
##$DBPNAM0= <>
##$DBPNAM1= <>
##$DBPNAM2= <>
##$DBPNAM3= <>
##$DBPNAM4= <>
##$DBPNAM5= <>
##$DBPNAM6= <>
##$DBPNAM7= <>
##$DBPOAL= (0..7)
0.5 0.5 0.5 0.5 0.5 0.5 0.5 0.5 
##$DBPOFFS= (0..7)
0 0 0 0 0 0 0 0 
##$DE= 6
##$DECBNUC= <off>
##$DECIM= 32
##$DECNUC= <off>
##$DECSTAT= 4
##$DIGMOD= 1
##$DIGTYP= 9
##$DL= (0..7)
0 120 120 120 120 120 120 120 
##$DP= (0..7)
$$ [...]
##$SUBNAM2= <"">
##$SUBNAM3= <"">
##$SUBNAM4= <"">
##$SUBNAM5= <"">
##$SUBNAM6= <"">
##$SUBNAM7= <"">
##$SUBNAM8= <"">
##$SUBNAM9= <"">
##$SW= 18.0517328524113
##$SWIBOX= (0..15)
0 0 2 0 0 0 0 0 0 0 0 0 0 0 0 0 
##$SW_h= 3612.71676300578
##$TD= 16384
##$TD0= 1
##$TE= 0
##$TE2= 300
##$TE3= 300
##$TEG= 300
##$TL= (0..7)
0 120 120 120 120 120 120 120 
##$TP= (0..7)
150 150 150 150 150 150 150 150 
##$TP07= 0
##$TPNAME0= <>
##$TPNAME1= <>
##$TPNAME2= <>
##$TPNAME3= <>
##$TPNAME4= <>
##$TPNAME5= <>
##$TPNAME6= <>
##$TPNAME7= <>
##$TPOAL= (0..7)
0.5 0.5 0.5 0.5 0.5 0.5 0.5 0.5 
##$TPOFFS= (0..7)
0 0 0 0 0 0 0 0 
##$TUNHIN= 0
##$TUNHOUT= 0
##$TUNXOUT= 0
##$USERA1= <user>
##$USERA2= <user>
##$USERA3= <user>
##$USERA4= <user>
##$USERA5= <user>
##$V9= 5
##$VALIST= <valist>
##$VCLIST= <CCCCCCCCCCCCCCC>
##$VD= 0
##$VDLIST= <DDDDDDDDDDDDDDD>
##$VPLIST= <PPPPPPPPPPPPPPP>
##$VTLIST= <TTTTTTTTTTTTTTT>
##$WBST= 1024
##$WBSW= 4
##$XGAIN= (0..3)
0 0 0 0 
##$XL= 0
##$YL= 0
##$YMAX_a= 504161
##$YMIN_a= -497141
##$ZGOPTNS= <>
##$ZL1= 120
##$ZL2= 120
##$ZL3= 120
##$ZL4= 120
##$ABSF1= 0
##$ABSF2= 0
##$ABSG= 0
##$ABSL= 0
##$ALPHA= 0
##$AQORDER= 0
##$ASSFAC= 0
##$ASSFACI= 0
##$ASSFACX= 0
##$ASSWID= 0
##$AUNMP= <proc_1d>
##$AZFE= 0.1
##$AZFW= 0.1
##$BCFW= 0
##$BC_mod= 2
##$BYTORDP= 0
##$COROFFS= 0
##$CY= -3
##$DATMOD= 1
##$DC= 0
##$DFILT= <>
##$DTYPP= 0
##$F1P= 0
##$F2P= 0
##$FCOR= 1
##$FTSIZE= 16384
##$FT_mod= 6
##$GAMMA= 0
##$GB= 0
##$INTBC= 1
##$INTSCL= 3.241238e-09
##$ISEN= 128
##$LB= 0.25
##$LEV0= 0
##$LPBIN= 0
##$MAXI= 10000
##$MC2= 0
##$MEAN= 0
##$ME_mod= 0
##$MI= 1.114404
##$NCOEF= 0
##$NC_proc= -8
##$NLEV= 6
##$NOISF1= 3.799351
##$NOISF2= 2.8
##$NSP= 0
##$NTH_PI= 0
##$NZP= 0
##$OFFSET= 15.47694
##$PC= 1
##$PHC0= -6376.443
##$PHC1= 8.221958
##$PH_mod= 1
##$PKNL= yes
##$PPARMOD= 0
##$PSCAL= 0
##$PSIGN= 0
##$REVERSE= no
##$SF= 200.130008957567
##$SI= 16384
##$SIGF1= 3
##$SIGF2= 2
##$SINO= 0.751879
##$SIOLD= 32768
##$SREGLST= <19F.Aceton>
##$SSB= 0
##$STSI= 16384
##$STSR= 0
##$SW_p= 3612.71676300578
##$SYMM= 0
##$S_DEV= 0
##$TDeff= 16384
##$TDoff= 0
##$TI= <>
##$TILT= no
##$TM1= 0
##$TM2= 0
##$TOPLEV= 0
##$USERP1= <user>
##$USERP2= <user>
##$USERP3= <user>
##$USERP4= <user>
##$USERP5= <user>
##$WDW= 1
##$XDIM= 16384
##$YMAX_p= 503170590
##$YMIN_p= -4859389
$$ End of Bruker specific parameters
$$ ---------------------------------
##NTUPLES= NMR SPECTRUM
##VAR_NAME=  FREQUENCY,     SPECTRUM/REAL,   SPECTRUM/IMAG
##SYMBOL=    X,             R,               I
##VAR_TYPE=  INDEPENDENT,   DEPENDENT,       DEPENDENT
##VAR_FORM=  AFFN,          ASDF,            ASDF
##VAR_DIM=   16384,         16384,           16384
##UNITS=     HZ,            ARBITRARY UNITS, ARBITRARY UNITS
##FACTOR=    0.220516191357247, 1,           1
##FIRST=     3097.40017186174, 0,            0
##LAST=      -515.316591144039, 0,           0
##MIN=       -515.316591144039, -4859389,    0
##MAX=       3097.40017186174, 503170590,    0
$$ Real data points
##PAGE= N=1
##DATA TABLE= (X++(R..R)), XYDATA
$$ [...]
8634 3463887 3309861 3251998 3505969 3299996 3153846 2963796 2621755 2601551 2702897 2750418
8624 2750418 3068978 3217318 3155578 2799473 2733871 3290025 3240645 2977777 3230305 3133110
8614 3133110 2897337 2957903 2843060 3025270 2593747 3070470 2814859 2584774 2460419 2567338
8604 2567338 2740020 2143918 2383185 2556716 2139697 2383189 2950019 2420900 2277721 2596919
8594 2596919 2815214 2349554 2468546 2543379 2669279 2965202 2676460 2818211 2662373 2741575
8584 2741575 2570188 2784433 2675476 2729033 3081260 2907118 3152581 2362902 1708648 2176597
8574 2176597 1977430 1880820 2344396 2247486 2218544 2011831 1715730 1532976 2014104 2383973
8564 2383973 2420538 2264734 2263729 2090906 1833818 1950555 1656705 1968185 2052135 1910573
8554 1910573 1638366 2017769 2285149 2474962 2527302 2521227 2724382 2425793 2029651 2459860
8544 2459860 2110873 2158191 2242561 1936475 1920681 1987276 1991185 1768162 2201096 2248827 2229244
8533 2229244 2119818 2035544 2112866 2416234 2336862 1669718 2294751 2465341 1788980 1516910
8523 1516910 1325496 1720779 1837012 1856653 1724131 1738848 1976424 2298059 1937586 1809017
8513 1809017 1575889 1602025 1612172 1660168 1884132 1836262 1881896 1449488 1428229 1739666 1804614
8502 1804614 1577920 1640491 1829067 1589072 1814399 1954624 1881519 1937783 1762920 1944092
8492 1944092 1937157 1446535 1281230 1194610 1255205 1284086 1656096 2091659 2528193 2395231
8482 2395231 2036640 1952262 1527858 1405601 1476386 1531878 1950470 1994339 1805416 1720025
8472 1720025 1858198 1650405 1769022 1682309 1705285 1533276 1737582 1516775 1581564 1804293
8462 1804293 1775449 1983450 1774775 1663955 1567264 1446160 1572324 1346360 845948 1325059
8452 1325059 1285800 1422916 1691702 1684130 1915092 1943618 1479058 790571 964875 1197489
8442 1197489 1177545 1403991 1455928 1109526 1218598 1397769 1516824 1282636 1088176 1336129
8432 1336129 1578307 1703776 1514299 1669206 1542143 1623930 1451301 1297336 1296814 1688676
8422 1688676 962838 865968 1394770 1402654 1093751 1162517 1308957 1198669 1766804 1464717
8412 1464717 1004556 1327949 1646267 1692944 1782558 1359920 1067957 1218109 1348114 1396867
8402 1396867 1642100 1314187 1286590 1084594 916797 1045383 1123409 1273172 993098 1167129
8392 1167129 1270303 1144408 1049282 1080100 1088122 1227387 1028121 921264 1374899 1636301
8382 1636301 998968 872715 884837 1084783 1055215 1016382 1001052 1256437 1171660 1042707
8372 1042707 961028 915370 381000 371502 789549 628828 1147328 1501545 1098729 969508
8362 969508 1286600 1036956 914653 976800 1238355 1202549 1126219 1157995 1308329 1178916
8352 1178916 1036346 996267 1253552 1131277 847893 758067 745076 978098 879622 1218788
8342 1218788 877690 188313 108264 771464 938659 762774 1021776 1225111 1108224 1025620
8332 1025620 687585 806909 812631 1054644 1491451 1022505 633193 358863 867579 1141678
8322 1141678 1142352 1152160 1177711 1143419 1187576 1382358 1259859 1318311 1156770 943889 1057624
8311 1057624 1200084 1058731 1245926 1038144 999373 1194296 1149652 1136837 1148079 1174360
8301 1174360 1151021 1209956 1120411 1368811 952792 780902 633537 681892 873469 910349
8291 910349 256396 751514 1084275 1104668 1036050 1192676 1096464 979285 939924 860281 944892
8280 944892 777594 852483 956909 508816 240296 363869 387789 470959 608952 972888
8270 972888 1264223 931447 1021865 1046046 669785 1089198 912954 465827 1137482 1055696
8260 1055696 816503 967006 826282 600792 606329 852842 627178 222163 325265 496236
8250 496236 344158 654910 1068669 1400006 1135096 597066 757476 1198911 888693 1082332
8240 1082332 799535 605169 589738 650233 534603 599404 814992 856195 535156 810955
8230 810955 1197212 1190018 1310188 996995 931932 674887 994083 1265846 1100703 1403401
8220 1403401 1002308 958805 744938 734482 997554 1200309 895368 985196 1329431 993681
8210 993681 882931 868252 603135 580908 894233 856297 1063254 790327 1080117 1458849
8200 1458849 984379 1133415 951566 425551 313035 381997 1089926 1324798 1153742 1544744
8190 1544744 1508464 1216238 1034961 1299913 1288526 939674 1380130 1185804 964900 828612
8180 828612 562245 792788 1016299 678637 539009 433939 718035 681817 997427 995340
8170 995340 703730 634860 767243 1025289 1003769 1292602 1483435 1329779 1055595 1278954
8160 1278954 1117353 1247680 1254754 1302603 1036070 1061886 1245667 1255126 938961 918092 1500346
8149 1500346 1211887 936452 1103904 1145832 1166765 1079774 908981 1199560 1138571 941140
8139 941140 862808 1199434 1137652 1128492 1130879 768858 991047 1190188 1127835 1340804 1065120
8128 1065120 1099718 1363676 917110 855137 837037 1023167 885305 709062 443537 698066
8118 698066 995223 1002847 992794 835327 1025051 965139 904534 860321 857534 927194 942898
8107 942898 1258854 1092709 957062 1347633 1308660 1055573 1016460 898868 1024302 1185206
8097 1185206 851470 1280967 1271780 693672 1262394 1588709 1157855 1093595 1006604 1154863
8087 1154863 1251580 935173 1245760 1286484 1216895 1135302 1154325 1237952 1677294 1379816 998407
8076 998407 716265 867715 1122833 1019038 873658 829946 1208454 697760 467347 857576
8066 857576 1232964 1354030 1438025 1184979 1302762 1398155 1256180 1109922 904096 855826
8056 855826 1111758 1379352 1259343 1024408 1509833 1192534 1166829 1315976 1030060 804214
8046 804214 906047 1254762 1313270 1376639 1709733 1830230 1685055 1652388 1330199 1206677
8036 1206677 1123747 1196802 1342929 1562507 1484356 1102037 1201035 1370816 1429684 1296158
8026 1296158 1307285 1163140 1181201 1545865 1238610 634255 853804 957016 1265844 1154947
8016 1154947 912459 1038454 1658609 1517569 1235228 1444756 965968 711755 792823 994214
8006 994214 1005982 1287775 1438836 1402606 1349012 1415648 1310125 1243486 1265406 1102362 701742
7995 701742 1113708 1683996 1735598 1567678 1637160 1256635 1450428 1840503 1845721 1503203
7985 1503203 1755474 1370676 1332479 1412739 1362070 1683263 1407275 1415134 1566276 1260291
7975 1260291 1095004 935523 541984 618336 1059768 1279243 1347179 1595601 1138156 1280401
7965 1280401 1792991 1614073 1167391 1166801 1579073 1693239 1519441 1560966 1547091 1586875 1657034
7954 1657034 1540016 1414999 1603196 1144710 1225065 1222553 1067458 991471 1209879 1448462
7944 1448462 1753547 1950851 1337186 1318558 1307500 854556 781133 1238426 1773751 1622732
7934 1622732 1877742 1653069 1411140 1565773 1519264 1652511 1641544 1451967 1384890 1286696
7924 1286696 945836 1022660 1418491 1529347 1421746 1369118 946533 858054 1145700 1470883
7914 1470883 1476136 1722492 1724963 1545291 1284153 1317914 1248258 1265351 1298431 1673482 1687467
7903 1687467 1858158 1854910 1389221 2079190 2115012 1845599 2025296 1643829 1304426 1221655
7893 1221655 1112950 1421959 1662791 1412999 1702586 1949815 1932473 1946963 2045736 1801818
7883 1801818 1429425 1362940 1004087 1418686 1433797 1355321 1226163 1162965 1506496 1415736
7873 1415736 1405901 1509655 1834892 1592133 1333774 1446745 1696456 1171486 1261066 988498
7863 988498 1157472 1882522 2087346 1666615 1451551 1580589 1340261 1368015 1354694 1576719
7853 1576719 1795844 1714035 1471766 1315344 1487386 1659778 1424759 1380604 1510253 1696055
7843 1696055 1420749 1414280 1407069 1042956 1181076 1243263 1186968 1761811 1578492 1508245 1149048
7832 1149048 1011781 1221705 1606047 1474466 1127362 1005673 1144602 1335914 1585761 1808055
7822 1808055 1514362 1402626 1461055 1825702 1668925 1695856 1903648 1013582 1090874 1582590
7812 1582590 1609056 1208035 1640607 1789166 2565909 2281089 1089370 1323074 1361499 1313855
7802 1313855 1216231 1058224 1058318 1548543 1515362 1452363 1500761 1669077 1515186 1485347 1508920
7791 1508920 1453287 1107390 1609370 1882101 1372108 1672074 1632860 1806596 1879879 1668541
7781 1668541 863331 1115861 1113627 942681 1058446 999623 1244685 1142742 1321844 961163
7771 961163 1369998 1689554 1797108 1472723 1171067 1317456 1219090 1036941 1390996 1695675
7761 1695675 1661315 1448965 1394329 1637719 1513352 1434567 1796713 2030334 1491682 1181732
7751 1181732 1037675 1514848 1379239 1137661 1164000 1152894 1106290 1259140 1367843 1182741
7741 1182741 1615042 1627761 1657319 1396246 1327877 1443372 1537667 1612474 1573455 933471 1207828
7730 1207828 1200520 1410638 1603083 1571937 1446606 1586279 1075470 962251 1043575 1268653
7720 1268653 1414115 1267944 1673567 1722989 1563613 1821493 1681680 1312540 1733750 1832413
7710 1832413 1681204 1742926 1461004 1476145 1606579 1183697 1029281 1107880 1196977 906797
7700 906797 1269581 1477982 1019735 1411991 1742941 1603348 1738967 1433459 1020176 962053
7690 962053 1175450 1048902 1699486 1712856 1899096 1903928 1488790 1295539 1172759 1203342
7680 1203342 1400464 1329389 964005 1324226 1671948 1644619 1883616 1699717 1170721 1371501
7670 1371501 1492988 1355022 1587973 1362539 1401144 1409570 1366915 1392409 1233252 1031048
7660 1031048 1420019 1543867 1461788 1500618 1401042 1620600 1644660 962759 1216519 1589977
7650 1589977 1441034 1328622 1044739 1222881 1788457 1974490 1281807 1426840 1333863 1410557
7640 1410557 1390590 1506278 1482197 1453920 1677064 1723880 1741602 1482685 1429094 1483112 1203210
7629 1203210 1426951 1292485 839076 1170490 1434300 1439135 1642210 1853631 1459215 1621690
7619 1621690 1162379 1036820 1783693 1648414 1320418 1414686 1278762 1170957 1516260 1603785
7609 1603785 1431259 1811952 1923907 1854789 1690786 1477083 1597806 1542324 1392183 1436798
7599 1436798 1591211 1504504 1794936 1583964 1576688 1957137 1670941 1733166 1796278 1847145 1728417
7588 1728417 2160407 1921197 2016608 1904859 1954695 1998019 1763329 1722382 1412695 1572349
7578 1572349 1672473 1969672 2126920 2000109 1576756 1573942 1468102 1681339 1424405 1802149
7568 1802149 1889026 1540708 1368730 1530628 1413854 1398017 1877147 1755603 1701958 1522959
7558 1522959 946335 1095702 1635639 1692132 1303221 1175623 1480339 1972987 1884004 1513762
7548 1513762 1756920 1474665 1269507 1589853 1732402 1563729 1665834 1738404 1680720 1685664
7538 1685664 2021860 1656918 1511526 1594926 1499479 1643281 1809740 1794596 1537145 1582673
7528 1582673 1688006 1984262 1860249 1871111 1996681 2124107 1978765 1838972 1601148 1800503
7518 1800503 1961006 1751222 1535018 1512685 1896142 1524247 1418133 1873832 2039071 1976358
7508 1976358 1852742 1700529 1791461 1926389 1610419 1676530 1957846 2103862 2005932 1896182
7498 1896182 1819045 1869938 2125462 2220644 2298905 2024075 1795490 2142375 2443640 2739045
7488 2739045 2459151 1910599 1629162 1751456 1646126 2187272 1954848 1550729 1764938 1866961
7478 1866961 2503340 2262817 2250601 2098416 1911074 1806898 1884859 1920325 1809081 2011337
7468 2011337 2067673 1806745 1695082 1788590 1787526 1637580 1435105 1623664 1888958 2169337
7458 2169337 2304415 1839213 1852315 1916031 1768585 1938772 2053546 2110551 2500423 2379176
7448 2379176 2102174 1840877 1678889 1874969 2115712 2082389 1764998 1647560 2037632 1695177
7438 1695177 1390325 1249834 1689395 2301419 2421287 2543850 2620853 2104788 1775065 1810851
7428 1810851 1854155 2115928 2229671 1843260 2275058 2600572 2422907 2524711 2276600 2217560
7418 2217560 2147233 2243743 2164164 2082581 2234912 2368341 2162598 2226515 2050521 2232649
7408 2232649 2523064 2343616 2202103 2606409 2392515 2078581 2249890 2417924 2581565 2430247
7398 2430247 2372639 2222706 2164668 2269803 1995661 2251666 2501405 2271994 2267373 2221372
7388 2221372 2487396 2551591 2610838 2626416 2460434 2073963 1955628 2275217 2220820 2331752
7378 2331752 2628501 2707366 2657110 2534125 2463669 2558207 2632882 2646748 2313685 1943288 1958520
7367 1958520 2453955 2767558 2424651 2706477 2632255 2650755 2415505 2523593 2663727 2750618
7357 2750618 2582782 2826652 2728858 2442658 2969480 3147075 3229789 2788690 3003629 2798001
7347 2798001 2534074 2547141 2865536 3024573 2946199 2740459 2444296 2455323 2605639 2557998
7337 2557998 2466530 2575324 3230495 3223145 3596783 3309707 3226545 3080829 2984274 2901416 2649368
7326 2649368 3054896 3076319 2967637 3020729 3380225 2727176 2640679 3428460 3643368 3543304
7316 3543304 3290856 3310753 3180232 3435607 3365892 3558648 3312909 3523884 3463560 3042875
7306 3042875 2974416 2905931 3141129 3252121 3326711 3233738 3614593 3294592 3263825 3276317 3496759
7295 3496759 3586512 3548183 3820483 3685122 3098911 3247496 3488587 4268270 3819070 3852749
7285 3852749 3940284 3601211 3934669 3801067 3624029 3602340 3566131 3505885 3809676 3834954
7275 3834954 3458431 3386210 3326123 3749451 3902426 3557644 3898003 3684558 3966139 3827938
7265 3827938 4132594 4536497 4121265 3823360 3651457 4043094 3964968 3841079 3813008 3408529
7255 3408529 3851352 3995526 3909137 3999755 4116835 4139189 4270569 4088098 4289963 4207075
7245 4207075 3685720 3730431 3748649 4027563 4026062 4055744 4130690 4390572 4096332 4462891 4207515
7234 4207515 4087463 4257278 4415760 4659018 4651771 4267353 4546918 4590561 4011571 4312236
7224 4312236 4522549 4540957 4367052 4270711 4554205 4685098 4849985 4183973 4277834 4731526
7214 4731526 4671511 4526916 4653006 4577664 4884367 4840798 4824261 4814568 4723886 4868115 4648267
7203 4648267 4898387 4782217 4715943 4456436 4592489 4672377 4837127 4606953 4472032 4436367
7193 4436367 4805633 4873600 4955866 5096775 5097783 4710110 4846531 5065974 4951781 4992265
7183 4992265 4712256 4737420 4990934 5038381 4968567 5217362 5002069 5283765 5385677 5222511
7173 5222511 5377552 5248089 5573454 5518682 5357847 4906538 5156117 5287002 5543967 5756651
7163 5756651 5840066 5360946 5000735 4627393 4884333 5245268 5715896 5441617 5243215 5403613
7153 5403613 5420042 5748990 5423846 5504993 5694464 5752039 5568684 5170621 4869690 5311854
7143 5311854 5400910 5744661 6002852 6091175 6124648 5982749 5755584 6128743 6567457 6715027
7133 6715027 6525670 6114454 6153124 6134355 6464521 6273544 5930313 5848706 5987654 6034497
7123 6034497 6214560 6373115 6249629 6503140 6057246 6196745 6395961 6708620 6449909 6761029
7113 6761029 6986781 7067261 7049644 6454261 6556585 6562030 6628473 6772234 6695152 6949862 6707613
7102 6707613 6848204 7146630 7198370 7484140 7310923 7001516 6964929 6942632 7115230 7313125
7092 7313125 7400775 7825081 7806816 7773764 7645272 7662833 7533449 7669949 7643294 7827140
7082 7827140 7707888 7593649 8045104 8543414 8553177 8098226 7958564 7918393 8056259 7933342
7072 7933342 8069570 8165614 8550609 8293215 8536006 8574974 8321425 8545426 9037144 8782807
7062 8782807 8893739 8864730 8713966 8341232 8496822 8973942 9288451 9604596 9465550 9587521
7052 9587521 9787077 10022419 9793202 9501851 9615059 9932318 9722862 9995485 10145054 10229635
7042 10229635 10517678 10581779 10349041 10627113 10660714 10911221 10842814 10751117 10926250 11117684
7032 11117684 11070079 11268104 11356009 11114150 11112166 11502726 11794725 12152112 12172598 11866520
7022 11866520 11788030 12431323 12018407 12096008 12381420 12334373 12777226 13514425 13441973 13402932
7012 13402932 13774768 14175349 14552865 14507405 14566854 14348138 14320113 14445842 14261668 14650409
7002 14650409 15178642 15133627 15152676 15179817 15100459 15396641 16059763 16337874 16626966 16488907
6992 16488907 16570043 16512388 16159641 16333339 16813243 16757997 16876278 17344645 17541404 17336660
6982 17336660 17595755 17804943 18268152 18369952 18480356 18470579 18944098 18956509 18789090 18756623
6972 18756623 18968592 19019426 19568926 19690708 19884332 19789849 19780621 20122346 20131949 20418775
6962 20418775 20512108 21046148 21058335 21344876 21600409 21229325 21169885 21299000 21384179 21824657
6952 21824657 21953890 21915319 21834509 22500525 22672800 22426026 22639221 22652706 22883478 22861767
6942 22861767 23028142 23209710 22801884 23039531 23222174 23563306 23370861 22847828 23091857
6933 23091857 23117188 23273081 23240040 23151855 23609312 23822749 23954340 23886661 23520248 23535879
6923 23535879 23080290 23131125 23359171 23199546 23353439 23257337 23337096 23397706 23621620 23370454
6913 23370454 23321419 23375214 23581107 23291660 22878628 22648248 22641980 22953023 23287315 23065780
6903 23065780 23081791 22902890 22031152 22061655 22016749 21826949 21784841 21657663 21434088 21613684
6893 21613684 21436255 21076905 21356150 21551340 21458919 21012939 20595045 20035706 19769935 20176481
6883 20176481 20393843 20224396 19949138 19816262 19710047 19759165 19727865 19907154 19260595 18952944
6873 18952944 19205501 19168137 18994352 18980201 18945156 18775605 18870906 18515521 18787894 18491395
6863 18491395 17924946 17996786 17896483 17774223 17807899 17475111 17006386 16904244 16665222 16876008
6853 16876008 17127262 17110673 17280097 17177664 17000559 17142774 16850608 16854389 16751320 16711556
6843 16711556 17236092 17081433 16944098 16886780 16746830 16533914 16718106 16749688 16351785 16167314
6833 16167314 16227795 16140884 16310410 16471691 16391318 16400158 16148438 16431307 16614979 16530210
6823 16530210 16808783 16634930 16774256 16854512 16761559 16760535 16556103 16816551 16903637 17323713
6813 17323713 17553872 17444490 17283200 17355276 17078751 17426512 18032004 17648052 17535425 17695419
6803 17695419 17862454 17918585 17899815 18322620 18277183 18013436 18215861 18278200 18659781 18895452
6793 18895452 18757643 18615669 18727000 19294884 18884133 18689947 18823463 19024150 19548400
6784 19548400 19660731 19537864 19083892 19353116 19844932 20429141 20621308 20629293 20908123 20814282
6774 20814282 20742622 21232998 21865823 21546384 21350690 21760692 22055173 21971430 21988414 22331280
6764 22331280 22212835 22390089 22542673 22767985 22994637 23072294 23158319 23455813 23827676 23747701
6754 23747701 23607415 23538983 24124182 24280833 24249241 23991812 24077250 24311367 24349023 24480596
6744 24480596 24758724 24824566 24911629 25094982 25575722 26142325 26046493 26060153 25962905 26190696
6734 26190696 25988565 25940398 25654747 26135018 26509119 26346231 26651828 26386952 26489558 26711729
6724 26711729 26833136 26821052 26704642 27113211 26913313 26809911 26909705 27081824 27240728 27038331
6714 27038331 26924168 27004777 27200457 27681835 27777193 27440026 27933018 27757309 27516639 27396613
6704 27396613 27081988 27306053 27255653 27616662 27871757 27472394 27418725 27688171 27505329 27326234
6694 27326234 27346584 27736679 27427118 27509841 27846093 27628880 27631368 27455614 27506650 27683646
6684 27683646 27449552 27351950 27788956 27665371 27274194 27067006 27129282 26959784 27210790 27094608
6674 27094608 26793791 26675966 26935481 27190951 26852881 27080808 27135828 26820888 26424118 26489679
6664 26489679 26566743 25752957 26102948 26243180 26151631 26180380 26366538 26252231 26053849 26025707
6654 26025707 26283649 26391398 25946812 25659198 25577432 25551045 25791462 26173098 25852972 26124159
6644 26124159 26165637 25615667 25377302 25651440 26008327 25593853 25476312 25389444 25212294 25724292
6634 25724292 25545168 25317372 25027611 25175479 25302532 25549272 24965940 24661792 24617820 24552859
6624 24552859 25057827 25271876 25557618 25307746 25318353 24960969 24888139 25300543 25459811 25531873
6614 25531873 25170316 24970619 25194456 25476863 25602348 25287638 25291811 25209411 25063722 25056683
6604 25056683 25473094 25244545 25650209 26004382 25308250 25618915 25414112 25398643 25811004 26050209
6594 26050209 26154925 26053537 26045910 25947664 25826770 25998645 26084283 26170923 26130420 26170450 26483163
6583 26483163 26273662 26785401 27109945 26875863 27233973 27093323 27049153 26896842 26975448 27277119
6573 27277119 27318276 27744371 28341797 28048543 28070627 28543212 28802693 28808612 28662750 28465220
6563 28465220 28737094 29187647 29315864 29341293 29612767 29726758 29748908 29985786 30020622 30035669
6553 30035669 30432389 30586964 30571787 30630066 31060321 31087811 31559273 32168589 32020091 32265171
6543 32265171 32503288 32537975 32551439 33151617 32964168 33140961 33900189 34369588 34378328 34298936
6533 34298936 34835335 34890752 35007408 35191112 35507815 35951181 35941479 36083759 36336816 36772476
6523 36772476 37245947 37432510 37933209 38567016 38828241 38973347 38962640 39541209 39782478 40017281
6513 40017281 40300998 40643329 40571633 41157527 41717289 42114970 42099440 42361173 42771983 43169522
6503 43169522 43944683 44819830 44828675 45196678 45756120 46384770 46733954 47029559 47438261 48064273
6493 48064273 48330096 48691630 49512655 49816732 50710673 51035311 51153195 51772270 52496505
6484 52496505 52750938 53216183 53665510 54660238 54912176 55446923 55837460 56674215 56920207
6475 56920207 57197873 58058032 58605092 59673338 60327920 60663805 61222499 61668342 62758166
6466 62758166 63729042 64396170 65274801 65780018 66161515 66579314 67645568 68241102 68939449
6457 68939449 69860996 70268609 71000593 72192913 73177632 73532992 74707221 75792127 76530352
6448 76530352 77263857 77804627 78556600 79568066 80589040 81378131 82408620 83318480 84162312
6439 84162312 84816771 85713758 87108889 87624386 88888348 89973735 90385063 91814305 92790309
6430 92790309 93764925 94905206 95795132 96826559 97953954 99343310 100126070 100943718 102586174
6421 102586174 103568278 104658285 105272355 106013253 107874406 109102696 110248298 111304315
6413 111304315 112211107 113559645 115253747 116635819 117759752 118781935 119895432 121357600
6405 121357600 122953215 124129859 125134958 126347553 127621853 129301048 130317068 131519366
6397 131519366 133305245 134507987 136272959 138076808 139262940 140547202 141984869 143328346
6389 143328346 144859958 146306184 147450390 148668947 150799595 152279411 153642952 155557349
6381 155557349 157105293 158585283 160468088 162005481 163624701 165139681 166698534 168322170
6373 168322170 169713764 171716392 173442365 175219296 176770958 178702887 180535504 182222789
6365 182222789 183656361 185141593 186862149 188349993 190439857 192712514 194281155 196024092
6357 196024092 197788787 199230807 200959186 202998710 204519982 206264788 207865438 209357759
6349 209357759 210815103 212807068 214833788 217002690 218577362 220024086 221949655 223419964
6341 223419964 224774589 226252269 227577218 229141239 230797252 232411367 234127302 235385329
6333 235385329 236742670 238389832 240040176 241143873 242608597 243709725 244305405 245312527
6325 245312527 246492476 247455243 248402548 250122454 251396600 252502980 253060405 253650629 254363887
6316 254363887 255203138 256101541 256676618 256889550 257547223 258052483 257951205 258294113 258757766
6307 258757766 258833331 259074134 259227341 259107658 259088959 258861272 258811182 258753678 258493255 258250288
6297 258250288 258005088 257201535 256713801 256147627 255429356 254107432 253407204 252841190 251874156
6288 251874156 250696934 249928867 248527893 247288348 246294324 244990242 243735068 242669049
6280 242669049 241134458 239547160 238056901 236478430 234861064 233451648 231642354 229944278
6272 229944278 227997676 226059687 224528186 222925201 220997197 219273443 217271613 215128174
6264 215128174 213315353 211195840 209131787 207086750 205158652 202788095 200505887 198085302
6256 198085302 195904840 193419873 191198146 189361662 187251738 184664589 182422970 179988771
6248 179988771 177840210 175396958 173383280 171086415 168742738 166623264 164657001 162371198
6240 162371198 160230767 158124574 155763569 153384121 151318865 149785475 147781548 145526902
6232 145526902 143308188 141645082 139596331 137262492 135272302 133388047 131403148 129425779
6224 129425779 127400174 125563101 123751686 121772637 119608910 118066866 116215998 114173643
6216 114173643 112622720 110879922 109689919 107945307 106267617 105101778 103199065 101596100
6208 101596100 100096543 99128223 97164472 95392073 94167212 92909436 91467844 90238962
6200 90238962 89466841 88447424 86705860 84902583 84021117 82562490 81768156 80817454 79861094
6191 79861094 78790201 77724474 76725471 75924808 74863819 73669832 73003453 71845565 71045503
6182 71045503 69544005 68436679 67758778 66810510 65942278 65127596 63938578 63073097 62497324
6173 62497324 61759033 60942487 60111113 59185522 58573392 58036567 57826500 57106801 56399172
6164 56399172 55780854 54650431 53787963 53232825 52630766 52102290 51584084 50678990 50212869
6155 50212869 49611858 48932806 48311178 47767939 46856679 45968194 45751811 45497368 44746056
6146 44746056 44560539 44000615 43424766 43480921 42862318 42463799 41764350 41174684 40861416 40058885
6136 40058885 40125053 39712806 39487167 39015484 38613057 38296120 37627783 37206839 36654342 36245815
6126 36245815 35857949 35664596 35339352 34806701 34824118 34622696 34615151 34227983 33530981 33370206
6116 33370206 33248869 32680132 32262755 32185619 31682506 31215934 31021182 30975677 30654069 30447718
6106 30447718 30014384 29589370 29490842 28971733 29042419 28642690 28180417 28239153 27802513 27782369
6096 27782369 27440486 27249078 27295700 26971146 26539188 26134519 26566820 26563571 26216636 26073882
6086 26073882 26105337 25634293 24787261 25054315 25365312 24996522 24885960 24784233 24539942 24592726
6076 24592726 24160379 23926226 23867856 23554310 23601030 23588802 23297879 23184786 23065569 22705156
6066 22705156 22338692 22501779 22319322 22484693 22336287 22135602 21731549 21666612 21500192 21988042
6056 21988042 21858384 21567153 21441057 21323939 21034778 21091253 21113691 20834690 20709325 20838117
6046 20838117 21159628 20727479 20793740 20519835 20412799 20248600 20296716 20005044 19958923 19705220
6036 19705220 19745588 19376999 19505961 19692590 19242496 19160553 19347692 19254358 19139840 19192161
6026 19192161 19431748 19303704 19466314 19247837 18564943 18601466 18688327 18468117 18151249 18006539
6016 18006539 18274463 17991198 17926797 18103423 18043480 17830763 17536328 17232150 17276191 17343723
6006 17343723 17211910 17831199 17455152 17330976 17398745 17282194 17094860 17332353 17119407 17119360
5996 17119360 17513071 17165967 17315605 17324977 16631700 16447334 16433252 16303189 16582458 16926705
5986 16926705 16654896 15929951 16067520 16410609 16596518 15974728 15546719 16040570 16292177
5977 16292177 15971232 16131397 16343891 16326383 16424338 15886401 16025199 16018424 15922573 15716151
5967 15716151 15590352 14999732 15048536 15588975 15426665 15338245 15281659 15476985 15193674 14866882
5957 14866882 14945971 15009011 15395489 14649933 14580145 15068435 14756579 14283743 14671076 14470785
5947 14470785 14323100 14160493 14389816 14513906 14414177 14346084 14384421 14549977 14575859 14506522
5937 14506522 14515642 14712645 14469612 14178920 13890848 13969167 13696195 13580699 13749974 13927683
5927 13927683 13755965 13547925 13106092 13224767 13620838 13691184 13454757 13663027 13489302 13496811
5917 13496811 13169684 12973003 13038618 12782054 12633163 12878223 12640934 12542372 12362766 12624332
5907 12624332 12738680 12793626 12584122 12196465 12500885 12620656 12404653 12357508 12525842 12364609
5897 12364609 12291869 12656473 12498681 12335725 12235523 12138828 12460952 11951949 11547035 11986438
5887 11986438 12110787 11841704 11728653 11715214 11900924 12117786 12006108 11789830 11986308 11847679
5877 11847679 11355069 11347331 11529915 11600771 11653511 11559130 11339713 11102825 11301032 11811791
5867 11811791 11897797 11877146 11552428 11777885 11858399 11878798 11595294 11206591 11416842 11495591
5857 11495591 11411357 11058850 10671167 10777858 11304411 11322589 11083044 11116595 11109499 10700817
5847 10700817 10582645 10727684 10634139 10953253 11074404 10581997 10326136 10292903 10588735 10740113
5837 10740113 10732422 11112862 10838430 10445507 10649231 10320768 10158889 9855102 10322777 10573497
5827 10573497 10451751 10518825 10569892 10241853 10254627 10121788 10146045 10404997 10452725 10089299
5817 10089299 9871201 10043153 10064887 9977880 9981618 9944446 10042472 10093951 9915495 9799169 9902760
5806 9902760 9963389 10270767 10338571 10496086 10236497 10729194 10474497 10283554 10478754 10140217
5796 10140217 10150369 10432162 9962040 9923708 10386593 10425431 10459770 10478585 10262877 9987301
5786 9987301 10392989 9884611 9713513 9698048 9689152 9696762 9707282 9818279 9678209 9534811 9468238
5775 9468238 9530357 9335046 9620241 9807448 9494398 9752409 9743688 10085658 10009198 10009819 9835469
5764 9835469 10005959 9609038 9462207 9385179 9628534 9251620 9467550 9741235 9960154 9898555
5754 9898555 9985390 9970905 9688292 9499478 9465476 9756497 9799135 9748681 9659651 9451375 9479401
5743 9479401 9630104 9789595 9988038 9870120 9525524 9812366 9654612 9690814 9848942 9843151
5733 9843151 9574741 9192455 9149703 9292417 9665631 9453208 9301858 9075477 9525960 9730700
5723 9730700 10001959 9976573 9966845 9828586 10234237 10332589 10004245 10099751 10592164 10259151
5713 10259151 9735530 9877918 10168437 10296979 10593799 10062225 9629482 9785933 9570792
5704 9570792 9572563 9863543 9892578 10254978 9647190 9384532 9144791 9572225 9780624 9860449
5694 9860449 10136204 10058672 9948485 9388917 9358403 9571809 9674846 10074807 10223033 10227793
5684 10227793 10221295 10399991 10148847 10004245 10129727 10132589 10137649 9683333 9811096 9900226 9987475
5673 9987475 9859629 9784037 10103003 9993531 10201003 9933656 9883310 9808154 9484724 9841313
5663 9841313 10250068 10122538 9667246 9614417 9433488 9646647 9896843 9811609 9729015 9979283
5653 9979283 9828228 9666243 9857092 10127933 9538872 9547652 9698628 9947585 10016111 10236904
5643 10236904 10325308 10308482 10103849 9921203 9851997 10512916 10798357 9970445 9754537 9990476
5633 9990476 9925639 10018964 10064680 10103585 10035578 9867979 10221320 10752078 10590558 10257148
5623 10257148 10384244 10290397 10307921 10413830 10102288 10127565 10161468 10216712 10136049 9835897
5613 9835897 9890570 10372136 10684919 10775669 10762683 10700313 10742757 10821318 10326553 9903836 10212002
5602 10212002 10275464 10162238 10419766 10827309 10605476 10316462 9943171 9848269 10416064 10676776
5592 10676776 10265416 10320263 10353581 10308267 10470033 10454619 10588609 10588297 10401158 10823144 11031965
5581 11031965 10561439 10306384 10148671 10205354 10287638 10550735 11059058 10970750 10880747 10820546
5571 10820546 10266872 10631858 10968491 11193663 11154908 10858262 11033819 11047288 11370933 11118361
5561 11118361 10734034 10839729 11011453 11082043 11502263 11377832 11208042 11096379 11119315 11309057
5551 11309057 11310982 11201478 10927304 11071343 11498462 11556024 11415197 11016018 11254424 11322100
5541 11322100 11030530 11287588 11458097 11361085 11448534 11340995 11625841 12063272 11900047 11519253
5531 11519253 11595625 11763424 11575435 11841443 11620407 11254970 11480862 11347949 11774259 11611910
5521 11611910 11550921 11655414 11460638 11670287 11855529 11774565 11823047 11901537 11681233 11979364
5511 11979364 11900970 12083814 12132075 12027100 12370190 12427470 12481804 12125447 12510302 12181034
5501 12181034 11896904 11890091 12072154 12377085 12418843 12268997 12195848 12471584 11989018 11998846
5491 11998846 12151985 12206093 12112787 12423241 12776402 12384650 12538262 12657844 12009532 12442917
5481 12442917 12890241 12814744 12697491 12556011 12849477 12888851 12572807 12457502 12773060 13161742
5471 13161742 13132961 13104568 13264168 12895701 12535033 12707726 12735767 13139834 13097763 13013722
5461 13013722 12839058 12760571 13159280 13457426 13391271 13745617 13527487 13416660 13536407 12997159
5451 12997159 13071378 13348195 13400895 13598793 13603572 13562194 13473718 13601200 13686465 13982287 13488824
5440 13488824 13627189 13764158 13521616 13711734 13645000 13727296 13641868 13872741 13811730 13752828
5430 13752828 13535161 13317158 13700042 13584003 13552848 13634241 13906760 13947976 13674888 13540846
5420 13540846 13589473 13627423 13679292 13845858 13451490 13342286 13564489 13551127 13797419 14008595
5410 14008595 14344870 14569962 14354032 14194542 14473727 14844847 14558744 14477735 14231839 14550412
5400 14550412 14781544 14513081 14695839 14971715 15408763 15249820 15144533 14717030 14809607 14740888
5390 14740888 14453771 14581753 14748600 15015169 14763585 14547916 14581554 14979614 14966110 15190904
5380 15190904 14842860 14646582 15083197 15386531 15402791 15607560 15564995 15344931 15714471 15982288
5370 15982288 15557670 15766061 15852860 15378919 15191774 15723935 15987470 16428987 16607398 16589355
5360 16589355 16535272 16306497 16335362 16202193 15938959 16122111 16355264 16484568 16568707 16557405
5350 16557405 16710797 16617481 16158069 16154376 16782497 16896529 16823085 16977455 17270203 17184271
5340 17184271 16976627 16927057 17297898 17381173 16994094 16960205 17576471 17438382 17402719 17832952
5330 17832952 17812486 17708651 17256344 17307691 17522014 17845639 18242301 18003521 17635773 17734225
5320 17734225 17477780 17708675 17873660 18167091 18358214 18270819 18415405 18236498 18539747 18698207
5310 18698207 18358191 18201287 18541666 18881397 18653408 18841842 19222278 19386031 19135599
5301 19135599 19048040 19724093 19490134 19597078 19863638 20064787 19846069 20114210 19878072 19987784
5291 19987784 20528749 20422970 20352575 20273115 20242533 20214636 20573217 20719348 20831818 21108132
5281 21108132 21261730 21551611 21704459 21391226 21549049 21485777 21354698 21291072 21437524 21444404
5271 21444404 21905367 22086855 22095674 22111218 22375752 22651346 22482504 22544631 22716777 23161034
5261 23161034 23343251 23148266 23046912 22926628 23119055 23418178 23299607 23888112 24258413
5252 24258413 24178641 24410744 24325227 23917057 24406238 24503571 24618391 24947777 25257851 25260974
5242 25260974 25433170 25464818 25511978 25646319 25625617 25564607 25870178 26069586 25914271 26290646
5232 26290646 26488436 26813953 27141514 27264848 27465202 27553209 27456821 27678424 28074871 28530249
5222 28530249 28641845 28881500 28850051 28889959 29154218 29251324 29486562 29767138 29711008 30162922
5212 30162922 30756450 31015980 30941086 30930634 30901485 30827087 31193513 31556057 31801643 32054379
5202 32054379 32477616 32618270 32822478 32982735 32929215 33436335 33184275 33706302 34310751 34665610
5192 34665610 35194780 34920692 35490318 36057396 36241925 35707786 35890406 36317341 36517205
5183 36517205 36849609 37152986 37351867 38099668 38264459 38130973 38423693 38499898 38546994 38897985
5173 38897985 39515255 39788719 40023440 40020854 40130695 40721532 40828547 41103384 41703815 41753160
5163 41753160 41799382 41949123 42746576 42827663 42575844 43014092 43481625 43729819 43821192 44305899
5153 44305899 44818782 45458561 45395194 45954970 45994369 45789801 45882490 45977412 45945432 46061922
5143 46061922 46140622 46524358 46966258 47444096 47692483 47573484 48019228 47786792 48227325 48283997
5133 48283997 48667916 48682123 48594126 49234817 49214794 49493571 49396449 49346779 49885417 50121800
5123 50121800 50505067 50385318 50325004 50790135 51100016 50993102 50745570 51251506 51256117 51112644
5113 51112644 51743168 51829713 51901888 51698837 51639500 51779040 52334600 52280742 52251239 52421329
5103 52421329 52916904 53037819 53572040 53488674 53654304 53657773 53644179 54124869 54070677 54496356
5093 54496356 54158990 54000374 54101884 54679073 54852827 54811105 55313032 55450090 55808539 55591648
5083 55591648 55555001 55724053 56014003 56261560 56603239 56655849 56729972 57381640 57403684 57782107
5073 57782107 57613852 57868662 58349487 58479146 58363198 58123959 58716572 59049693 59061397 59260819
5063 59260819 59346735 59611176 59843430 60245629 60483289 60438456 60635563 60784339 61302428 61805300
5053 61805300 61750479 62013468 62096382 62801000 63022298 63126912 63202331 63417763 64067879 64221337
5043 64221337 64528752 64593718 64552668 64755639 65170994 65411917 66130271 66529583 66603723 66978022
5033 66978022 67209869 67492480 67687915 68039885 68500026 69039283 69554093 69687438 69478898
5024 69478898 69702322 70209197 70531189 70698495 71229067 71636422 71947703 72631340 72969806
5015 72969806 73077078 73495224 74059086 74663299 74795009 74828891 75580067 75933156 76290998 77218148
5005 77218148 78012659 78430386 78652069 79193681 79904797 80225028 81004820 81779484 82194678
4996 82194678 82676956 83141372 83436478 84383473 84749207 84631873 85478093 86365587 87232793
4987 87232793 87489369 88172716 88660147 89424316 90436290 91371750 92416634 93394373 94366478
4978 94366478 95231828 96079412 96790928 97406807 98489840 98825121 99678282 100275340 101250377
4969 101250377 102235702 103318545 104711120 105713749 106327665 107552999 108461884 109765051
4961 109765051 111158964 111842781 112688741 113891670 115551726 117013732 117948143 119051471
4953 119051471 120365082 121313993 122653593 124004417 125329856 127097270 128553935 130095866
4945 130095866 131654093 132700841 134221473 135457654 137226789 138881798 141410214 143049936
4937 143049936 144122421 146106461 147806488 149058903 150990156 152969737 155262664 157299309
4929 157299309 159007883 160367878 162480869 165007583 167138587 168789523 171212442 173204390
4921 173204390 174880483 177035513 179798388 182352081 184636612 186862653 189265336 191790124
4913 191790124 194386929 197025977 199168759 201714254 204461236 206860560 209440642 211522821
4905 211522821 213551198 216265020 219174110 221964996 224462425 226649635 229699878 232674726
4897 232674726 235255920 238293175 240708682 243782238 246753256 249045979 251725714 254792318
4889 254792318 257965303 260506581 263318766 266271098 269118828 271479858 273723196 276467234
4881 276467234 279267891 282279946 284632247 287000749 289695476 291969107 294293970 296794657
4873 296794657 299628327 301810387 304330153 306590351 308306096 310636257 312516991 314872707
4865 314872707 316767655 318483236 320533394 322285521 323789542 326007913 327476113 329346442
4857 329346442 330856966 332191365 333681434 334929483 336111010 336962331 338202169 339608253
4849 339608253 340308218 341438745 342221050 342701913 343755027 344292814 344806193 345360051 345733009
4840 345733009 346374147 346791669 347038412 347354939 347632382 347946467 347882496 347614566 347983932
4831 347983932 348089571 347677177 347051545 347485349 347660869 347114389 347181892 346975671 346832410
4822 346832410 346764828 346652740 346409202 346039129 345941926 345693502 345411070 345201605 344626874 344494772
4812 344494772 344194175 344044349 343860121 343853416 343765427 343553879 343048043 342952427 343468920 343311655
4802 343311655 343536090 343227152 342879861 342945607 343115357 343137957 343023336 343329853 343733726 343725642
4792 343725642 343758197 343745831 344222288 344698859 344597841 344601536 344878387 345079754 345138488 345364378
4782 345364378 345494632 345731404 345614194 345754163 345727344 345619021 345990799 345776049 345666550
4773 345666550 345290591 345311641 345222873 345071159 344849236 344543145 344629007 344121046 343652745 342922498
4763 342922498 342334838 342010587 341311360 340634723 339790462 338823581 337914709 336590924 335299741
4754 335299741 334189528 333051083 331925538 330738271 329100371 327361160 325772379 323922514
4746 323922514 321658627 320117518 318657578 316443984 314112241 312231876 310180800 308154446
4738 308154446 305742040 303691038 301159998 298613153 296369546 293612774 290934871 288351725
4730 288351725 285841200 283519454 280804963 278184108 274932492 272003749 269445245 266528597
4722 266528597 263817928 260780220 258080676 254795532 252208736 249848718 247016067 244214610
4714 244214610 240725081 237707257 234816261 231620271 228608426 225725543 223091787 220237209
4706 220237209 217303076 214563085 211384995 208639233 206001453 203570258 201046773 198305859
4698 198305859 195433567 192951771 190741411 188158522 185826016 183469731 180991191 178775796
4690 178775796 176528171 174020563 171574952 169595881 167365253 165170449 163126804 160892110
4682 160892110 158940719 156727796 154643252 152723849 151233100 148989947 146793572 144944897
4674 144944897 143399539 141375497 139664616 138221941 136555455 134865479 133020057 131660421
4666 131660421 129891067 128373981 127031214 125329307 124022945 122399959 120965027 119793588
4658 119793588 118682196 117405980 115634583 114261442 112896026 111941639 110870820 110000821
4650 110000821 108743620 107338393 105904030 104946689 103863400 102361271 101735692 100848108
4642 100848108 100032057 98983630 97617625 96814862 95720854 94695619 93808199 92609201
4634 92609201 91878841 91462154 90412083 89457488 88996747 87926268 87033786 86189634 85239978
4625 85239978 84905895 84428730 83362638 83028713 82138902 81044026 80425329 79817992 79453826
4616 79453826 79069464 78170152 77701817 77168090 76200540 75370740 74923119 74550996 74177648
4607 74177648 73624989 73086071 72481116 71574203 71126970 70867522 69995136 69693792 69504864
4598 69504864 68823135 68105541 67938891 67676010 67235831 66720874 66138238 65409177 64930173
4589 64930173 64423211 64466799 63491918 62919526 62904945 62593404 61905447 61634751 61431794 60875369
4579 60875369 60661760 60479919 60146844 59838695 59442690 58984227 59127168 58540345 58370143
4570 58370143 57838084 57349845 57050000 57065417 56974215 56613371 55974255 55418332 55380283 55870160
4560 55870160 55563799 55312061 54582033 54659297 54395882 54143698 53852589 53575528 53535581 53389180
4550 53389180 52883949 52513330 52303460 52083071 51801242 51518033 51537444 51677640 51361029 51367548
4540 51367548 51230716 50890285 50919400 51189986 51312049 50717080 50305682 50085387 50040552 50027158
4530 50027158 50021864 49812108 49278500 49248815 48986037 49280135 49326953 49117336 48946159 48827119
4520 48827119 48900942 48713704 48816120 48744441 48529724 48379518 48098898 48171246 48252248 48544680
4510 48544680 48517228 48168509 48406022 48554199 48331398 47673365 47541661 47870846 47736587 47760843
4500 47760843 47885802 47908191 47861392 47731844 48508098 48258609 48258989 47722650 47864117 48082936
4490 48082936 47934959 47952407 47985223 47912369 47874491 47685497 47967870 48482521 48128501 47884519
4480 47884519 48285633 48424841 48568906 48606867 48890250 48351810 48562078 48549467 48420887 48621795
4470 48621795 48524673 48746789 48716054 48840689 49048477 49298866 49141972 49405070 49292505 49270941
4460 49270941 49488389 50129313 49998712 49939802 49867551 50106850 50917004 50649645 50733401 50752073
4450 50752073 50993517 51192651 50868473 51315018 51471743 51753585 51603850 51902760 52097352
4441 52097352 52323396 52744538 53209721 53292934 52891213 53484376 53496353 53559954 53804608 54043640
4431 54043640 54599952 55225130 54920303 55101579 55266595 55384506 55472836 56032208 56183840 56769415
4421 56769415 56597506 56766806 57068502 57236499 57361280 57918716 58430748 58594245 58795433
4412 58795433 58589951 58825297 59065734 59265889 59949768 60402557 60589094 60961788 60888673 60843916
4402 60843916 61213070 62032898 62009918 62601101 63008381 63278785 63225274 63686203 64097134 64134965
4392 64134965 64631411 65107638 64951466 65206675 65617890 66055868 66537334 66663479 66653135 67009587
4382 67009587 67235375 68055633 67979047 68428148 68458286 68344501 68899546 69506178 69995862 70095521
4372 70095521 70561698 70800963 71252283 71309801 71251155 71725405 72008587 72672919 72750110 73056991
4362 73056991 73497750 73422055 73794838 73899792 74149559 74679943 74587562 74821427 75111185 75291279
4352 75291279 75303530 75537908 75746218 76490017 76583865 76538332 76858400 77253857 77355978 77468385
4342 77468385 77998338 78051544 77990623 78452110 78734943 78439895 78631473 79497932 79568716 79317312
4332 79317312 79557254 79426225 79439463 79438828 79646896 79877087 79612065 79635109 80119385 79980680
4322 79980680 80671096 80533164 80572017 80458860 80680918 80633284 80996295 81333867 81208217 81164717
4312 81164717 81250994 81284635 81512260 81661912 81389481 81980635 82031929 81952309 82345875 82267310
4302 82267310 82498145 82469012 82106260 82418831 82456711 82377047 82228504 82814692 83212560 83014058
4292 83014058 83127961 82881534 83110889 83114561 83287239 83491502 83615993 83622721 83481933 83660496
4282 83660496 84141506 84217521 83888582 83676914 84267361 84608031 84659386 84836144 84633075 84286723
4272 84286723 84341588 84612329 84969782 85104676 84870910 84881754 85127867 85084969 84871234 85282024
4262 85282024 85655007 85377929 85613204 85819578 86001720 86328472 86481781 86422959 86277672 86760350
4252 86760350 87077914 87356825 87559131 87718640 87474309 87651623 87695655 87833125 87714358 87372538
4242 87372538 87737568 88069787 88297715 88590790 88716936 88621340 88700296 88870873 89219208 89732547
4232 89732547 90211061 90142509 89680620 90097341 90645909 90911849 90760445 91059313 91504333 91598098
4222 91598098 91884125 91945906 92413035 92638688 92824832 92912817 93096564 93678058 94123187 93981695
4212 93981695 94108982 94554223 95105410 94843408 95469439 95909797 96113748 96607366 96880055
4203 96880055 97154485 97653185 97973592 98244242 98408589 98969475 99745709 99844786 99989177 100049897
4193 100049897 100588222 100968698 101224723 101404392 101911853 102264037 102907580 103322773 103737525
4184 103737525 104269014 104746500 104998026 105642828 106169155 106323334 106481211 107035671 107288381
4175 107288381 107603393 107752747 108536157 109378953 109708225 110288105 110793989 110988241 111370343
4166 111370343 111492891 112478758 113170440 113849196 114375484 114863505 115280877 115656420 115981499
4157 115981499 116034094 116503127 117290850 118144025 118557923 118635756 119222498 119958791 120287665 120764411
4147 120764411 121511596 122053324 122863831 123029066 123701564 124390924 124686779 125366524 126131405
4138 126131405 126903825 127124364 127532660 128136505 128672653 128921458 129677756 130696679 131600143
4129 131600143 132219531 132708983 133276900 133907371 134784602 135361488 135924567 136414014 136854339
4120 136854339 137959626 138706297 139811825 140227082 141148062 142212545 143101899 143753295 144411460
4111 144411460 145204425 145974926 146820711 148168469 149134760 150096166 150605551 151179727 152324471
4102 152324471 153015062 154182575 155321021 156248551 157462505 158637591 159865075 160719267
4094 160719267 162327956 163534951 164735934 166083562 167255117 168191640 169342707 170967443
4086 170967443 172735765 173862829 175085275 176717359 178156495 179942493 181377417 183295963
4078 183295963 184588011 186023468 187445779 189445782 191107522 192748653 194585663 196186928
4070 196186928 198367484 200221868 202155082 203978285 206326592 208636706 210800686 213037898
4062 213037898 215449598 217798268 220570566 222975661 225058250 227064662 229850995 232760541
4054 232760541 235191806 238079023 240407362 242792775 246221965 249168258 251694554 254856453
4046 254856453 257736183 260814896 264177827 267515350 270594295 273979483 277392890 280779736
4038 280779736 284509496 287790314 290680481 294165486 297928427 301850245 305548662 309251117
4030 309251117 312989204 317226106 321021877 324769982 328741472 332904826 337156277 341182338
4022 341182338 344845987 348708788 353154531 357330919 361510317 365291592 369325246 373426460
4014 373426460 377820429 382064066 386546396 390732500 394972026 399285677 403352050 407400254
4006 407400254 411665880 415524743 419414434 423366268 427213087 431386585 435574203 439390323
3998 439390323 443236436 446394424 450030869 453784712 457122647 460470576 463707863 466886369
3990 466886369 470154287 472878054 475811761 478982743 481463087 483739780 485543544 488387575
3982 488387575 490680162 492343782 493851806 496025486 497493133 498756825 499578686 500860363
3974 500860363 501840231 502589869 502864307 502772761 502886023 503170590 503005326 502656673 502219699
3965 502219699 501481434 500767791 499702964 498477782 496952947 495333345 493901040 491905734
3957 491905734 489658024 487424159 485321665 482944257 479926928 476828463 474098943 471248830
3949 471248830 467996592 464465171 460990072 457508708 454059431 450442432 446226519 442028524
3941 442028524 438263876 434745154 430520851 425891988 421551857 416900269 412378249 408016141
3933 408016141 403366669 398636343 393967207 389569745 385216012 380766650 375732787 370814817
3925 370814817 366150045 361584620 357208610 352685119 347921234 343126093 338802976 334212000
3917 334212000 329594996 325156224 320997985 316530655 311965724 308352127 304240627 299809337
3909 299809337 295619034 291654888 287668730 284020156 279590634 275896967 272040819 267996761
3901 267996761 264498010 261084819 257871035 254545786 250515683 246963127 243607926 240261347
3893 240261347 237653846 234504490 231345199 228340442 225472443 222572567 220218764 217148271
3885 217148271 214048718 211485806 208897544 206711665 204469448 202061118 199597255 197006018
3877 197006018 194725584 192341909 189994739 188230434 185975163 183838960 181894158 180081039
3869 180081039 178210710 176471083 174640146 172588546 170558568 168931036 167340248 165863623
3861 165863623 164866506 163464911 161338209 159591917 158126624 156592985 155283057 153813339
3853 153813339 152624207 151626888 150136449 149106841 147841293 146596915 145890154 144805977
3845 144805977 143456394 142771645 142170099 141254392 139709126 138239069 137360662 137021849 136940563
3836 136940563 135977338 134811935 134224536 133544118 132756997 132238451 131231861 130225018 129826281
3827 129826281 129057126 128725889 128187061 127168161 126832810 126255902 125658404 125741512 125266380
3818 125266380 124690683 124470410 123959165 123125309 123028770 122549937 122295131 122034221 121500871
3809 121500871 121110394 121284650 121235777 121121011 120994101 120512013 120417401 120148289 120229730 120098675
3799 120098675 120207146 119979380 119961295 120069635 120183773 120133190 120318554 120330471 120429390 120515556
3789 120515556 120538547 120849675 121024604 120917446 121164737 121285546 121538673 122248704 122507130
3780 122507130 122832160 123065545 123476954 123626784 123756972 124171868 124222628 125101810 126040913
3771 126040913 126068265 126618212 126885124 127223208 128274866 128601608 129339628 130030603 130653391
3762 130653391 131114095 131990446 132832270 133857083 134588558 135449785 136103549 136918547 137810948
3753 137810948 138441430 139534152 140369054 141403760 142207546 143556079 144615436 145400658 146738208
3744 146738208 147629542 148562367 149404514 150835127 152517387 153779928 154854530 156216212
3736 156216212 157572598 159328086 160493557 162489825 164152444 165723010 166843520 167895215
3728 167895215 169573417 171185014 173293715 174980063 176661273 178579761 180468479 181865549
3720 181865549 183642381 185732422 187406889 189034502 191003879 193008782 195871476 198220304
3712 198220304 200586451 202636582 204493518 206945388 208983322 211079560 213289443 216036045
3704 216036045 218270240 220495378 223078124 225345410 227908236 230432240 232785051 235630100
3696 235630100 238886444 241390288 243910494 247020598 249720558 252484121 255607124 258334703
3688 258334703 261424936 264568909 267565840 270084764 273164605 276129323 279063326 282481768
3680 282481768 285992512 289006281 291984655 295411617 298454538 301645967 304684999 307889524
3672 307889524 311275946 314083458 317661898 321100524 324528696 328031403 331625169 334677326
3664 334677326 338284486 341673823 345001284 348175245 351105363 354642107 357807208 361139439
3656 361139439 364341273 367769583 371086615 373992597 377088404 379908779 383610911 386503414
3648 386503414 389250564 392269229 395001916 398247133 400940849 403537153 406061814 408620970
3640 408620970 411374023 413757793 416414936 419000384 421432940 423498985 425432008 427303482
3632 427303482 428978006 431013066 432777174 434945815 436701168 437552725 439142536 440577612
3624 440577612 441366164 442152824 443084589 443878917 444737887 445201368 445356963 445619120 445951446
3615 445951446 446052181 445863180 446006458 445971483 445403638 444805353 443896483 443624488 442814180
3606 442814180 441427464 440408678 439306004 438035171 436237612 435114293 433802965 432088046
3598 432088046 429683477 427635520 426010832 423599652 421374331 418859994 415889590 413091537
3590 413091537 409963363 407498763 404416827 401889442 398546804 395313608 391875296 388326332
3582 388326332 384775894 381480799 378143378 374604198 371065519 367014960 363147645 359617449
3574 359617449 355845508 352160575 348010912 343772024 339924758 336209441 332556788 328835202
3566 328835202 324694376 320568953 316451312 312720323 308985956 304837281 300540899 296373652
3558 296373652 292688017 288499163 284559944 280939799 277055448 273298331 269233605 265412436
3550 265412436 262136278 258502444 254939118 251083556 247229690 243492202 240366782 236148020
3542 236148020 232627563 229336642 225850170 222281540 219355699 216166829 212663682 209112107
3534 209112107 205811633 203526640 200257112 197227893 194532386 191686506 189284265 186545142
3526 186545142 183684229 181008136 178072210 175021625 172424969 170408382 168135499 165681976
3518 165681976 163293628 161148246 158936825 156798760 154461690 152442084 150458256 148762406
3510 148762406 146725320 144800780 142564683 140418022 138691537 136814565 135206147 133363670
3502 133363670 132013455 130267112 128620052 127291178 125481210 123703654 122587852 121018437
3494 121018437 119397037 117853770 116090718 114724733 113468335 111858434 110890249 109757779
3486 109757779 108230750 106930273 106243917 104832293 103079366 101888654 100865204 100184081
3478 100184081 98774616 96965198 95934671 94743139 93541103 93006264 91750620 91130890
3470 91130890 89788698 88323246 87419331 86707589 85743482 84681865 83846525 82840636 81900379
3461 81900379 81026160 80091170 79390792 78621541 77616268 76980221 75798636 74771522 74030949
3452 74030949 73055266 72346463 71764339 71140478 70364276 69282656 68622666 68041875 67338804
3443 67338804 66437943 65938936 65118046 64447906 64255886 63050551 62018917 61375985 60626794
3434 60626794 60275937 59852691 59527407 58512290 58108824 57395762 56558757 55927180 55385303
3425 55385303 55062230 54317397 53721228 53313540 52682980 52219417 51706926 51009366 50316320
3416 50316320 49892015 49405144 49459570 48720404 48348305 47967324 47862676 47738829 47068384 47043619
3406 47043619 46300829 45637556 45258659 44977036 44637499 44516037 43658562 43348734 42842134
3397 42842134 42619232 42244453 41687162 41356726 41426845 41167691 40974691 40420489 39810544 39380876
3387 39380876 39398762 39314570 39050270 38302626 38110649 38072928 37867767 37678828 37706607 37734652
3377 37734652 37182256 36817249 36607611 36138122 35681588 35562579 35221201 35225745 34810748 34331977
3367 34331977 34269385 34115414 33901439 33792457 33517532 33175268 33294215 33432564 32676309 32219217
3357 32219217 32310972 32174084 32212691 31993891 32067371 32021193 31755000 31488293 31226793 30831063
3347 30831063 30356308 30314732 30615635 30502920 30071661 30385065 29867549 29450888 29357226 29375504
3337 29375504 29095764 28647633 28813247 28984609 29231612 29013816 28333529 28232915 27617715
3328 27617715 27764474 27777473 27639193 27495954 27424746 27652356 27453033 27011884 27004914 26881669
3318 26881669 26844461 26525350 26257027 26699155 26364750 26054920 26010856 25797970 25837173 26087743
3308 26087743 25936395 25345144 25121953 25178660 24930184 24881214 24973164 24685180 24402652 23993368
3298 23993368 23970931 23904700 23674445 23925051 23927533 23990650 23833800 23234582 22809628 22819422 22880418
3287 22880418 23009483 23100605 22769505 22751854 22372660 22410518 22088889 21964819 21766434 21313926
3277 21313926 21215348 20944440 21263121 21240756 21168758 20733426 20917820 21357980 21133533 20837669
3267 20837669 20858440 20430627 20406102 20040139 19929946 19808217 19744965 19813218 19901132 19805139
3257 19805139 19930483 19590032 18924684 18917308 18598882 18553303 18934008 18477439 18470273 18315015
3247 18315015 18691116 18626838 18492092 18510449 18645983 18438172 17699231 18037641 17819189 17605933
3237 17605933 17787870 17900625 17427247 17146193 17310147 17431227 17232550 16913996 17027402
3228 17027402 16725169 16797983 16977968 16808498 16538490 16412176 16600458 16731358 16755031 16259799
3218 16259799 15906135 15730082 15994765 15880623 16001870 15979020 16122050 16277792 15929664 15648167
3208 15648167 15890872 15806717 15734184 15653142 15817718 15454951 15222438 15660344 15691264 15213250
3198 15213250 15241924 14942766 14532337 14699829 14797380 15053136 15302683 14841970 14506529 14617281
3188 14617281 14499773 14834171 14594455 14420964 14325977 14120978 14421217 14646871 14391787 14028615
3178 14028615 14023688 14101776 14154791 13585187 13458611 13749054 13928002 13812904 13553781 13495728
3168 13495728 13660966 13806189 13947587 13873930 13776282 13127392 13099201 13214288 13201578 13328241
3158 13328241 13157082 13201718 13290054 13021151 12772686 12952694 13083825 12837673 12702925 12822117
3148 12822117 13115999 13386578 12892577 12549339 12250280 12280992 12544389 13285120 13242355 12530693
3138 12530693 11782012 11571282 11844500 11791102 11590589 11829270 12050271 12183770 11612135 11761379
3128 11761379 11591142 11973172 11602095 11417561 11250462 11180407 11433673 10961216 11212519 11260783
3118 11260783 11236379 11118026 11083510 11130768 11343666 11251405 11092880 10603745 10475301 10227008
3108 10227008 10509491 10448778 10594934 10741356 10619794 10890879 10765109 10426988 10211594 9948142
3098 9948142 9994748 9798714 9879731 9965275 9999050 10401358 10372062 10413571 10303034 9521711 9219000
3087 9219000 9303136 9586134 9432086 9166655 9336883 9495337 9193471 9571295 9563708 9146392
3077 9146392 9292316 9173861 9265665 8899477 8859558 9120168 9059531 8514634 8543440 8640326
3067 8640326 8465102 8813243 8736321 8094156 8234280 8808956 8577976 8604077 8675194 8546570
3057 8546570 8663207 8248632 8367016 8698759 8188633 7725397 7953468 8046924 8147900 8101073
3047 8101073 7935430 8059707 8123578 8258215 8372995 8087826 8264820 8275857 7788574 7312774
3037 7312774 7561326 7654128 7780148 7414396 7049408 7170991 7293633 7260466 7584857 7776749
3027 7776749 7721231 7508829 7386760 7194803 7229446 6923269 7276876 7040180 6628544 7047631
3017 7047631 7167213 7158349 6796655 6886460 6930812 7252903 7105945 6733360 6760910 6591518
3007 6591518 6822738 7126453 6630472 6633250 6552437 6560995 6470791 6405332 6847039 6996676 6546379
2996 6546379 6672571 6119411 6245502 6626132 6448486 6444886 6449356 6188995 6052523 6259500
2986 6259500 6452888 6563197 6595917 6546231 6485607 6737222 6570429 6103740 6176475 5860046
2976 5860046 5965089 6009489 5894813 5913813 5609057 5796098 6153209 5856350 5901336 6006144
2966 6006144 5797869 5400767 5384180 5698226 5574251 5348492 5354599 5690940 5782292 5856499
2956 5856499 5606237 5495412 5875089 5936016 5900289 5986846 5584250 5662292 5689725 5473336
2946 5473336 5645147 5320244 5238022 5551208 5700077 5562735 5295661 5270675 5312443 5627023
2936 5627023 5582876 5357047 5538671 5127550 5163894 5139915 5084115 5339272 5627732 5353628
2926 5353628 5134796 5253437 5314852 5898696 5586103 5153037 4887255 4866852 4689880 4808750
2916 4808750 4770250 4833133 5036224 4965929 5011369 4824320 4891266 5083359 4996187 5128898 5261415
2905 5261415 4923951 4791519 5141025 5193835 4623750 4321571 4373920 4382308 4681454 4747277
2895 4747277 4573929 4513788 4457171 4348471 4312775 4189373 4325077 4651363 4575153 4640093
2885 4640093 4530914 4677485 4781374 4649313 4656453 4501526 4361889 4363404 4346398 4511924
2875 4511924 4639120 4247781 4309524 4567762 4706291 4243496 4220270 4204243 4348027 4165689
2865 4165689 3919025 4080871 4180544 3956153 4060325 4208806 3728129 3905339 4013144 3820695
2855 3820695 3765149 3993569 4375463 4223130 4183772 4113231 4111888 4290307 4335754 3978208 3572599
2844 3572599 4026267 4018596 3806790 3757000 3641430 3960195 4178195 4366700 4472585 4275130
2834 4275130 4100378 3498806 3697223 3972547 4022883 4204009 3660567 3392672 4054013 3798865
2824 3798865 4063268 4149723 3895936 4081389 4140237 4146107 3806272 3716305 4082165 4194700
2814 4194700 4008360 3978105 3355694 3568367 3965670 3502275 3389284 3607967 3682936 3654346
2804 3654346 3562588 3513477 3735558 3646738 3701595 3657813 3542415 3247605 3356106 3304550 3484230
2793 3484230 3514522 3620450 3640699 3225959 3531422 3474948 3289483 3079007 3183509 3682722
2783 3682722 3611055 3628594 4162545 4010008 3638772 3400410 3436645 3542439 3811870 3600292
2773 3600292 3482685 3424259 3734225 3735379 3139092 3212304 3590218 3416605 3444071 4078586
2763 4078586 3784560 3734846 3326830 3513878 3222975 3020258 3287257 2944861 3185558 3190171
2753 3190171 3107740 3039843 3322287 3218172 3423927 3118993 3261458 3141035 3341781 3121119
2743 3121119 2786800 2977888 2895006 3097387 2920346 2652479 2539285 2698932 2690444 2911095
2733 2911095 2783431 2658406 3036628 3174171 2965119 2495608 2902771 3057622 2952124 2858616
2723 2858616 2913172 2774780 2959282 3000924 2926886 2646858 3073828 3268887 3165887 3145425
2713 3145425 2861910 3261935 2854720 2804854 2901694 2839319 2417504 2525449 2913162 3261280
2703 3261280 2790065 3142840 3044481 2883379 2882449 2957984 2755923 2632060 2808548 2637210
2693 2637210 2603761 2762949 2929631 2881388 2704928 2838150 2775129 2724033 2600379 2426630
2683 2426630 2756226 2616383 2572135 2603210 2883881 2611415 2162849 2273033 2417536 2530761
2673 2530761 2560567 2524839 2337667 2379470 2553757 2798851 2883692 3024625 2485941 2497300
2663 2497300 2782462 3067244 3001381 2747519 2712994 2832091 2636615 2788436 2540305 2819035
2653 2819035 2800125 2789955 2848621 2738491 2932512 2952753 3208853 2811948 2554686 2750209
2643 2750209 3077178 2432510 2511148 2625986 2903962 2556499 2332179 2636324 2488643 3037571
2633 3037571 3401562 3008460 2751750 2600449 2738930 2780957 2924807 2822578 2644554 2464747
2623 2464747 2774694 3066587 2641761 2560766 2776251 2678309 2490876 2385360 2605018 2327824
2613 2327824 2426674 2394688 2362866 2526683 2421946 2543222 2343656 2241297 2680374 2749745
2603 2749745 3009582 3050182 2692020 2514539 2773529 2674867 2927083 3019197 2826168 2596020
2593 2596020 1887880 1855850 2236398 2831169 2943735 2596934 2737169 2800625 2997175 3175343
2583 3175343 3401611 3151923 2925125 2346625 2374584 2825408 2862905 2632313 2517121 2719392
2573 2719392 2863373 3282289 3343379 2677955 2761597 3124099 3014808 3279530 3136698 2885117
2563 2885117 3080564 3230851 3251547 3302548 3201139 3271297 3132835 2866966 2918618 3302208
2553 3302208 3102802 2737488 3027035 3007655 2970998 3037360 3102275 3357885 2687596 2826010
2543 2826010 2848917 3160633 3418900 3147167 2842507 2913384 3115896 3418865 3693623 3462672
2533 3462672 3132224 3377399 3391789 3349838 3399763 3108981 3097370 2649533 2809495 3062941
2523 3062941 3384677 3426547 3336821 3671882 3326070 3232640 3367978 3129167 3034149 3317112
2513 3317112 3464652 3346738 3537966 3357602 3063773 3312987 3325968 3215380 3394535 3893523
2503 3893523 3320100 3317286 3382169 3361467 3185468 2885557 3105591 3533260 3527583 3445990 3189142
2492 3189142 3024184 2968485 3392233 3617267 3718568 3616297 3582850 3613798 3377043 3426444
2482 3426444 3487717 3518606 3653687 3760705 3813971 3898601 3864080 3592030 3484434 4117832
2472 4117832 4624337 4167745 3796785 3889805 4130402 4340187 4387332 4113811 3921541 4289023
2462 4289023 4376708 4367613 4302470 4505443 4510600 4505974 4322708 4210857 4541994 4842892 4782899
2451 4782899 4724760 5046356 5108253 4698882 4721107 4530193 4975877 5475056 5188720 4853711
2441 4853711 5144511 5014886 4965148 5361482 5007237 5011094 5355791 5725456 6008833 6145067
2431 6145067 5918468 6275047 6498500 6466813 6159855 5881051 5916420 6066420 6281421 5968819
2421 5968819 6312479 6859040 7312679 6689360 6812510 7210967 7331989 7528400 7547348 7317428
2411 7317428 7239743 7336124 7608802 7881589 8128786 8495067 8414875 8438996 8671779 8640039
2401 8640039 8883256 9265386 9444799 9872698 9822691 9810561 10090807 9686296 9782709 9978493
2391 9978493 10392175 10600655 10886124 10922708 11357855 11100714 11133363 11263974 11519955 12008426
2381 12008426 12133981 12327164 12605417 12845779 12400744 12348145 13141151 13669829 13912181 14090563
2371 14090563 13792055 13540368 13923049 14818884 14927112 14979874 14865479 15164813 15592546 15458243
2361 15458243 16224979 16201857 15726150 15970218 16273612 16726400 16658172 16490647 16932278 17158979
2351 17158979 17520744 17278973 17349033 17723859 17554715 17865871 17703305 17886674 18080120 18402916
2341 18402916 18400891 18510366 19016963 19273976 18446289 18506529 18369449 18367224 18544444 18467402
2331 18467402 18288543 18371702 18573362 18104724 18204607 18359343 17665551 17802847 17387916 17465848
2321 17465848 17451414 16982491 17272875 17519165 17211310 16899808 16492532 16176696 16153679 16422935
2311 16422935 16207299 15411908 14849922 14786291 14954903 14451656 13982892 13897970 13773090 13578307
2301 13578307 13240176 13016363 12526202 12287799 11907520 11487861 11640419 11531163 11181758
2292 11181758 10869979 10504409 10240128 10140934 10552209 10309186 9742697 9499289 9410837 9470201
2282 9470201 9671293 9375277 8647042 8523995 8452557 8457073 8284100 8080090 7604600 7849282
2272 7849282 7115782 7176546 6832753 6707938 6744695 6697708 6638972 6288994 6311080 6460798
2262 6460798 6595315 6242235 6200510 6438188 6262810 5746574 5794172 5775489 5619641 5412734
2252 5412734 5418753 5419123 5437545 5528016 5538402 5206822 4879592 4381654 4583098 5249048 5055914
2241 5055914 4953674 4583093 4250314 4025073 4135145 4206732 4160232 4225886 3976202 4168045
2231 4168045 4207876 3808383 4051283 3804349 3525629 3660461 3557514 3521039 3115096 3117829
2221 3117829 3264423 3657714 3414964 3062801 3114450 3553645 3439552 3544564 3196837 3356178
2211 3356178 3492179 3543625 3414797 3138358 3288565 2692761 2918516 2387102 2169313 2471758
2201 2471758 2411824 2566223 2919473 2732881 2593108 2418179 2425613 2318123 2245053 2119337
2191 2119337 2470896 2288724 2279383 2326167 2403203 2204021 2464782 2769102 2443276 2315356
2181 2315356 2321507 2419576 2480042 2072475 1837517 1918875 1588771 1358017 1528956 1432046 1547110
2170 1547110 1842899 2194692 2293511 2167285 1817631 1792183 1894108 2055311 2033835 1576421
2160 1576421 1939684 2138698 2296498 2084835 1984527 2134952 1589126 1323562 1337797 1278890
2150 1278890 1176220 1591358 1790447 1569860 1381516 1152994 1308870 1093285 1186005 1367394
2140 1367394 1444754 1233533 1496502 1759089 2101466 1808523 1385093 1238552 1259118 1024411
2130 1024411 1119658 1038317 849045 875034 1152579 1176203 1395002 1626587 1379847 1165909
2120 1165909 991065 988706 604638 569020 885446 661321 512733 780739 609210 518947
2110 518947 782094 1132338 1066541 1331143 1089504 1175811 1238416 1304585 1111674 1140778 1015445
2099 1015445 845709 1626757 1245633 1097911 1192426 1191851 953722 861925 849031 855478 746996
2088 746996 936538 1024707 886251 1074562 1171098 919312 1187447 1191189 1074006 872582
2078 872582 671722 744120 982927 1189500 995028 1288166 1526544 1044329 1052982 877518
2068 877518 1035521 982017 1089035 998686 835052 1003568 1174139 807389 430215 533733
2058 533733 804850 579366 906270 1111700 1166929 683488 483745 610763 120052 541495
2048 541495 806969 699581 523804 577714 589957 910137 1167159 1082521 560250 1004332
2038 1004332 1108789 902048 793170 486580 437208 683241 629236 890752 790311 425119
2028 425119 227419 636820 527054 531091 471754 551559 582396 392763 322661 292371 748710
2017 748710 736590 911238 731192 299671 571089 520878 730800 612140 281038 907182
2007 907182 1141763 503117 591836 588298 1063058 891517 644876 728896 1341715 930398
1997 930398 515321 475353 562872 606493 -62150 30682 582994 474653 203473 590172
1987 590172 775717 906164 1196950 986849 422697 464460 297907 658501 928799 1096920
1977 1096920 864480 597175 356025 402669 590984 559691 733335 707029 551535 557494
1967 557494 533480 188238 358163 264899 563041 604522 310205 362063 110592 392469
1957 392469 475840 287600 163094 303368 305481 112877 -159693 -50702 311634 363112
1947 363112 446843 649200 251031 200538 -64630 219293 677763 611835 -1662 74141
1937 74141 387853 87871 209368 388331 322080 11415 -245614 329063 692182 684023
1927 684023 587281 438132 590629 589476 714250 710795 739885 331046 -21792 385355 766031
1916 766031 687275 179709 90266 283099 428006 373533 215071 386460 556290 572710
1906 572710 877097 693894 318841 289315 174356 -45810 286389 618076 424568 333039
1896 333039 554702 782276 699226 219500 533225 451389 -123426 317931 490550 645992
1886 645992 439218 385622 374582 23424 90104 -90556 176430 100380 -47803 331886
1876 331886 318393 351990 451864 460282 774048 213428 13382 292977 216325 274477 -120032
1865 -120032 -171079 346173 -64216 -344028 -196037 -7374 400135 111082 155328 255227
1855 255227 -39404 -350185 -247280 85360 46065 -371558 109430 -69168 53970 319755
1845 319755 -221065 -153918 81309 -295076 -211869 -108784 -5809 88480 65776 -77191
1835 -77191 -235542 225140 126370 65563 318724 137018 29314 -56226 464210 296509
1825 296509 -20947 377838 564502 339485 273854 -81804 -365279 -263354 -452166 -85148
1815 -85148 -103466 44903 57995 -166334 -185086 -372803 -354310 -454870 -198078 -26515 141610
1804 141610 82206 -112882 -282560 -379140 -449185 -229814 -54777 428106 351359 207945
1794 207945 348018 280141 93553 29292 607567 301332 -83934 -99350 242246 136828
1784 136828 350403 141539 314799 148674 53461 -321641 -120859 -1883 -247461 -36338
1774 -36338 -9300 -184358 -118823 -4484 -268421 -83936 85899 158373 -117589 50373
1764 50373 -144193 -252548 82357 -124602 -293442 -59661 30424 498141 510576 376346
1754 376346 -22696 -350246 -388817 -164076 -215568 -512208 -129873 -661478 -768398 -172501
1744 -172501 -348477 -132776 129824 -174159 -97448 12674 219495 82203 -270037 -168772
1734 -168772 -1940 45651 72653 325615 301075 355146 -71461 -40216 -143087 -49042 -199825
1723 -199825 -232636 -197226 -116598 -172534 -207591 41725 356201 684700 541953 176126 -267813
1712 -267813 -122127 -67612 56776 46860 -15451 -149184 215997 365008 -37570 -435070
1702 -435070 -504325 -298940 -150263 -385407 -151940 -38607 12248 124627 -47815 131287
1692 131287 -171201 -633386 153053 35822 -206421 -433297 -335086 75302 -21425 232902
1682 232902 185443 12966 -506838 -333071 -267461 -324650 -267913 -38860 -16522 -52191 219653
1671 219653 -412603 -410627 -499457 -488604 -110460 -84713 -448583 -491831 -220161 -60026 -46127
1660 -46127 -376777 -155234 -241041 -556814 -451835 -388344 -595524 -773792 -400378 -383494
1650 -383494 -617042 -550601 -596252 -597317 -624744 -723316 -181505 877 278372 77301 -372890
1639 -372890 69613 69396 292207 309710 255832 182487 -47005 -275100 -404612 -441293 -275384
1628 -275384 -522817 -145939 -54367 -86413 86221 151149 -338376 -493332 -463900 -565722
1618 -565722 -582650 -719381 -153128 -639202 -623144 -358292 -220557 -172733 -226220 -47856
1608 -47856 380215 -159677 -542968 -272705 -402272 -309063 -410186 -156217 7674 -270185
1598 -270185 94325 16822 -233780 -261511 -88159 -29796 -520810 -369046 375855 332237
1588 332237 -391496 -329809 -283798 -207401 -225259 60062 -108438 -98730 258949 235714 149827
1577 149827 5883 -96361 178843 180251 -5874 -62966 -481156 -401321 -350671 -203766 208911
1566 208911 244643 -191030 -543379 -574347 -687278 -394272 -505900 -531022 -516828 -330536
1556 -330536 -119496 -643758 -780887 -355749 -119081 -302278 -337513 -434347 -106618 -45020
1546 -45020 67439 158809 5103 -49059 155336 292565 89832 7274 -361547 -555561
1536 -555561 -309662 -268296 -273874 63232 -60179 74583 451084 381886 142989 142666 419182
1525 419182 213453 195396 139065 187709 -187750 -518224 -199964 -284027 78152 444901
1515 444901 376680 -171519 -434075 -525202 -261665 -199398 -253423 -44707 137954 207750 -103273
1504 -103273 60228 -18352 -179825 -176009 -88467 -375054 -269089 -23059 43725 71234 -259379
1493 -259379 -105867 -332221 -581934 -426937 -370000 -239626 -580025 -681255 -470949 -445669
1483 -445669 -241344 63679 231632 -31638 -407771 -581202 -350839 -421803 -568502 -670584
1473 -670584 -531914 -410297 -608672 -658263 -645955 -725801 -215525 -274780 -735133 -214419
1463 -214419 -400309 -388716 -51349 -151032 -120645 -78024 -456807 -843907 -942577 -844871 -428471
1452 -428471 149990 218763 -100439 -205453 -237642 -7874 -327826 -656060 -157695 44073
1442 44073 87303 -153796 -254038 -128267 -399194 -384781 -250904 64358 -118896 -405900
1432 -405900 -314276 -280028 -823326 -651775 -83227 -325427 -304424 -477395 -327825 -290862
1422 -290862 -460762 -451345 -483397 -1091199 -895223 -317942 -350254 -109422 -366724 -720043
1412 -720043 -406730 -527277 -308188 -482803 -391364 -184869 -390647 -640978 -379617 -364688
1402 -364688 -488736 -228747 -490342 -342991 -244713 -762822 -803348 -765443 -781024 -482774
1392 -482774 -506286 -519745 -930514 -962587 -857320 -395673 -845954 -1025972 -484561 -704783
1382 -704783 -659168 -308840 -28263 -54699 -383930 -285852 -402595 -537854 -427963 -658660
1372 -658660 -445509 -132963 -70403 -148009 -192599 -813568 -861145 -465476 -833430 -597044
1362 -597044 -202231 -78961 139228 215320 48630 -390099 -661744 -547906 -454232 -66556
1352 -66556 -376702 -532996 -221597 -272598 -501644 -388579 -243693 -441994 -65064 -393704
1342 -393704 -863431 -841397 -531407 -617365 -150829 -322553 -476967 -540348 -523627 -438119 -394080
1331 -394080 -199065 -455964 -694558 -511736 -389025 -117441 304473 -123586 -279450 -239435
1321 -239435 43578 -365939 -646873 -644710 -334792 -169154 -131119 -641595 -466564 -187797
1311 -187797 83237 -225853 -346830 -555938 -241417 174706 -121107 -513318 -816551 -1229060
1301 -1229060 -1126507 -501646 -522747 -517104 -394579 -660621 -556531 -548051 -205303 -80029
1291 -80029 -6421 -287583 -339302 -541888 -528253 -332901 -745328 -803203 -926947 -647084 -313586
1280 -313586 -365554 -339235 -440524 -643100 -759300 -796429 -574381 -564289 -311086 -726432
1270 -726432 -319102 -842331 -502232 -611044 -401589 -227389 -271769 -464862 -372795 -59410
1260 -59410 -297265 -73010 -141670 133116 180038 -298906 -358276 -194093 44537 -44490 -182012
1249 -182012 -202430 -112744 -191437 -478222 -282160 -664178 -679077 -314878 -25153 -267844
1239 -267844 -640175 -581729 -979170 -819434 -669477 -642468 -694864 -729754 -889971 -548295
1229 -548295 -538290 -820610 -753920 -638774 -383900 -410236 -335486 -274236 -577016 1516 -127938
1218 -127938 -707739 -836489 -542844 -619056 -579005 -145159 -134944 -126290 -180884 4272 -9072
1207 -9072 -408340 -322856 -343596 -781572 -789020 -909613 -314342 -261498 -560515 -727536 -583966
1196 -583966 -570536 -355469 -701029 -660230 -500714 -202996 -206263 -470267 -809950 -787009 -546875
1185 -546875 -231541 -283913 -364939 -250754 -349380 -657275 -605684 -389702 -386377 -150140 -102432
1174 -102432 -273199 -292224 -354759 -148956 -422883 -306697 -406160 -611377 -769148 -691257
1164 -691257 -427016 -623255 -462346 -604117 -924845 -1284953 -1050988 -1266185 -1154522 -743019
1154 -743019 -838753 -771494 -627340 -599502 -615480 -567368 -336971 -404620 -343630 -743100 -973397
1143 -973397 -717413 -380464 -370327 -473194 -910449 -597199 -660989 -819233 -468060 -611385
1133 -611385 -830564 -721624 -1096822 -978879 -1052319 -1033053 -561008 -537187 -671626 -538048
1123 -538048 -518676 -500013 -743982 -567062 -511595 -901301 -473787 -651135 -355062 -514640
1113 -514640 -435400 -154623 -274874 -397570 -329578 -550948 -689781 -769236 -706224 -332728
1103 -332728 60986 -240523 -238179 -22841 -201508 -93576 -150129 -200381 -413418 -473742 -355934
1092 -355934 -387315 -277051 -325532 -547000 -896053 -1043246 -574897 -114252 -381990 -731782
1082 -731782 -892291 -577088 -491914 -491427 -926613 -699673 -602014 -940276 -605593 -187935 -501090
1071 -501090 -602146 -815641 -860333 -869212 -968199 -705370 -897090 -688475 -921908 -673032
1061 -673032 -516600 -759760 -648088 -184559 -730353 -816468 -226907 -299361 -453805 -348440
1051 -348440 -412110 -782998 -893290 -1010674 -1089695 -1336037 -846225 -706431 -577839 -488740
1041 -488740 -547506 -389459 -861625 -844566 -674080 -770573 -716678 -527562 -189904 32921
1031 32921 -26605 -363571 -970266 -459688 -230443 -550586 -787964 -423337 -548147 -627092
1021 -627092 -561572 -456037 -422548 -390729 -127920 -41380 -375389 -440015 -296841 -65723 -97785
1010 -97785 -611375 -491490 -558741 -587773 -543252 -345971 99079 -163607 -264374 -215967 -556609
999 -556609 -807174 -401142 -526049 -344691 -691487 -759667 -275882 -599139 -633364 -701660
989 -701660 -691479 -560537 -582269 -672089 -514194 -645499 -491311 -447096 -84859 83125 -433536
978 -433536 -794202 -387169 -538733 -777560 -858824 -993792 -982102 -942747 -694764 -853338
968 -853338 -906626 -1092560 -616273 -281427 -377642 -349393 -322002 -231305 -394114 -483673 -689572
957 -689572 -498717 -522880 -426219 -363979 -315711 -337763 -592306 -523767 -542541 -660167 -668414
946 -668414 -272264 -247484 -404690 -732513 -357894 92811 -458957 -707239 -530102 -279508
936 -279508 -569993 -1016012 -1082293 -961480 -767320 -542360 -262956 -349984 -15502 -57626
926 -57626 -708677 -665200 -592450 -337160 -561212 -419002 -588331 -627909 -863293 -727563 -526607
915 -526607 -673909 -660594 -679586 -847242 -862371 -914111 -715496 -769683 -452051 -489892 -314454
904 -314454 -58461 -419222 -806835 -892741 -415360 -350677 -231862 -443534 -869213 -966134
894 -966134 -844452 -895132 -598457 -218645 -166972 -682432 -592891 -657542 -802040 -469409 -193128
883 -193128 -455516 -797577 -729388 -366194 -445887 -508688 -590993 -455735 -543693 -500912 -258988
872 -258988 -606427 -610160 -151240 -89250 -469052 -592967 -955781 -950317 -513512 -648285 -1005728
861 -1005728 -700343 -515997 -583663 -672992 -772676 -579245 -896810 -934420 -482359 -667046
851 -667046 -480617 -428849 -354079 -518775 -933103 -508109 -586744 -670532 -809473 -939986 -815807
840 -815807 -202634 220960 -93885 -692735 -943942 -355639 -420295 -724303 -538823 -90850
830 -90850 -22054 6824 -38239 -506379 -232713 -431387 -376397 -295650 -397082 -438447 -686695
819 -686695 -704301 -579175 -703115 -305158 -87205 -285647 -624734 -919051 -579807 -222202
809 -222202 -155892 -262428 -290468 -382556 -373810 -658185 -1081992 -872250 -585793 -399255 -272919
798 -272919 -553695 -502206 -610459 -818590 -692515 -968270 -915666 -1212493 -1086216 -308095
788 -308095 -254179 -427220 -659166 -835127 -1081559 -1084211 -938086 -1004733 -933577 -1019196 -759882
777 -759882 -771529 -860454 -965091 -879841 -724174 -868280 -866976 -959952 -490567 -493631 -661554
766 -661554 -792016 -814065 -808632 -685857 -936189 -1015727 -687506 -702175 -578123 -550732 -753082
755 -753082 -955889 -734270 -686040 -784760 -711238 -1029351 -1167171 -856460 -715409 -933655
745 -933655 -904953 -1031646 -709441 -653049 -707836 -431344 -995584 -962139 -600017 -628870 -696572
734 -696572 -550139 -537660 -413166 -278003 -592247 -494047 -397084 -418279 -907721 -891409 -805005
723 -805005 -852382 -860087 -641368 -448660 -404002 -50508 -91351 -445731 -538125 -667782 -346990
712 -346990 -532828 -392205 -711138 -918322 -691454 -647620 -676196 -561234 -137311 -557674
702 -557674 -474160 -799629 -862080 -731512 -458514 -623699 -893835 -781539 -798304 -440422
692 -440422 -400144 -362645 -482728 -763648 -819565 -1193795 -837612 -627904 -426011 -731454
682 -731454 -831763 -704515 -1016986 -967544 -519511 -596514 -716764 -310475 -803952 -993896
672 -993896 -973550 -426415 51652 -340126 -335321 -636975 -661495 -731233 -705447 -332228 -419701
661 -419701 -888784 -1079812 -1049143 -1067565 -574815 -507709 -413132 -597883 -656047 -841265 -887087
650 -887087 -1164920 -677352 -544207 -631948 -1015953 -1001440 -973653 -981100 -640729 -929690 -900976
639 -900976 -1069174 -586019 -588547 -625376 -831804 -300169 -456337 -719530 -483628 -218376
629 -218376 -656020 -846909 -755683 -678842 -465880 -660880 -906534 -1093329 -888106 -538195
619 -538195 -408231 -296118 -680500 -947166 -873316 -513577 -226287 -342108 -454072 -540057
609 -540057 -420841 -648960 -448348 -198452 -443917 -432250 -230804 -398452 -404241 -553354
599 -553354 -563857 -747310 -698957 -744418 -580003 -579406 -381577 -460869 -919471 -1614523 -1164688
588 -1164688 -816866 -976451 -794780 -951107 -734423 -762292 -602933 -511093 -818915 -855903
578 -855903 -588766 -850500 -809339 -889225 -894281 -643526 -923890 -610188 -531946 -480365 -390473
567 -390473 -511792 -312761 -679813 -950304 -989874 -1068440 -903475 -669724 -948613 -1288054
557 -1288054 -1051618 -584870 -573619 -997641 -1177470 -655998 -394879 -515762 -506088 -438406
547 -438406 -614502 -268672 -499391 -181492 -121047 -103773 -555719 -1055064 -1311675 -1593059
537 -1593059 -1260403 -862002 -743324 -1129927 -1338018 -958557 -679690 -708578 -660651 -906785
527 -906785 -602494 -619464 -729338 -440739 -630048 -977870 -878347 -816521 -876779 -850529 -480029
516 -480029 -682427 -679775 -586670 -431361 -597566 -574368 -639086 -612627 -673288 -774740 -671282
505 -671282 -676856 -667922 -658798 -512151 -531850 -571601 -582065 -648892 -777646 -846626 -1051800 -1204349
493 -1204349 -1269406 -1246563 -1013054 -1068455 -770884 -667001 -963908 -825305 -1043235 -893739
483 -893739 -641625 -641842 -1185378 -1320720 -1188114 -1003077 -747436 -836630 -1027764 -1131920 -1150129
472 -1150129 -998110 -883813 -838722 -475849 -412231 -646925 -816477 -865787 -1124320 -904096
462 -904096 -725089 -682416 -718345 -397861 -695846 -1238126 -1142418 -1187136 -1030783 -879180 -1065085
451 -1065085 -1166987 -737383 -789939 -1118612 -883546 -794737 -1038362 -944346 -431162 -326633
441 -326633 -825252 -884317 -684987 -455903 -425951 -446823 -508998 -789359 -432349 -322841 -325652
430 -325652 -596841 -480941 -607887 -791853 -816893 -694314 -932483 -717043 -559333 -417116
420 -417116 -220997 -94900 289710 -119513 -801782 -1220520 -978222 -697628 -613958 -821234
410 -821234 -641477 -807667 -1059088 -808487 -972939 -615480 -445410 -461012 -357121 -954640
400 -954640 -794984 -798683 -476111 -279585 -520562 -578081 -663156 -528792 -227585 -753915 -919704
389 -919704 -895337 -829226 -697765 -420476 -289070 -507854 -597335 -629319 -1015345 -717628 -645545
378 -645545 -616446 -555178 -869732 -952683 -734311 -605731 -655009 -346290 -287998 -494643 -584071
367 -584071 -513786 -536899 -478914 -857706 -757560 -643710 -714173 -615417 -679372 -510838 -888329
356 -888329 -1267098 -1182922 -928669 -497162 -167937 -408475 -230244 -233948 -421425 -632419
346 -632419 -721931 -777534 -899026 -771441 -978924 -776088 -656114 -889496 -1066766 -900375
336 -900375 -967531 -1046911 -955342 -743910 -645216 -618032 -954699 -947219 -708396 -946564 -522127
325 -522127 -509816 -1136933 -910664 -690023 -767441 -962966 -559613 -569719 -1036895 -1063525 -375691
314 -375691 -347995 -857667 -795455 -289039 -162096 -128746 -401902 -755304 -650357 -333711
304 -333711 -583632 -1021990 -986898 -725917 -821996 -860390 -919857 -921724 -743382 -1079128 -540857
293 -540857 -578667 -771158 -492325 -461901 -568381 -685396 -603882 -270782 -519430 -680189
283 -680189 -585040 -269539 -508808 -680681 -858862 -1001552 -957728 -801557 -345724 -495679
273 -495679 -354366 -337196 -649651 -524930 -543999 -915667 -919529 -1009539 -1047074 -869939 -621292
262 -621292 -766085 -830745 -592467 -636888 -472485 -1038019 -1217812 -1065045 -1103817 -813938
252 -813938 -473511 -541277 -733814 -738433 -799223 -630445 -453607 -347934 -328155 -530075 -424444
241 -424444 -441667 -932488 -828579 -646920 -542941 -436403 -328382 -831377 -1318954 -1040551
231 -1040551 -834659 -648382 -476346 -513302 -758255 -1008655 -714383 -914356 -992113 -876090
221 -876090 -1065477 -1320030 -976698 -793579 -1146132 -1356461 -1303481 -998850 -1131551 -1172610
211 -1172610 -624933 -654276 -796943 -1134284 -1078061 -1125926 -1056151 -964487 -1028563 -769796 -851602
200 -851602 -1035348 -940415 -947365 -791714 -685028 -992822 -903208 -494079 -551559 -730853 -947447
189 -947447 -1162984 -995822 -853085 -979519 -1570048 -1236456 -849552 -1023923 -864809 -896152
179 -896152 -1029786 -1067653 -1132823 -1055704 -1215978 -1081101 -1122593 -736066 -656843 -1032041 -974022
168 -974022 -1258040 -1371754 -931930 -875544 -1113112 -1097197 -1022431 -912135 -1115162 -1150487 -1139891
157 -1139891 -1226741 -1133215 -1174539 -1153559 -981486 -814513 -1058003 -1292218 -1240962 -1214922 -1322921
146 -1322921 -1153827 -1156978 -1304169 -1473107 -1563259 -1426608 -1268057 -1286297 -1086349 -1353542
136 -1353542 -1275841 -1207618 -1477859 -1643398 -1647790 -1411588 -1175024 -1386694 -1104891 -1343719
126 -1343719 -1552070 -1488852 -1313443 -1169439 -865789 -1200724 -1307453 -1247364 -1535136 -1532643
116 -1532643 -1312448 -1182371 -1438245 -1405514 -1378957 -1636018 -1581864 -1277032 -1398692 -1345353
106 -1345353 -1147820 -1098850 -1347444 -1409899 -1493985 -1259487 -1195487 -1294652 -1687865 -1487926 -1312186
95 -1312186 -1712462 -1776574 -1658188 -1643141 -1349077 -1241497 -1456515 -1837527 -1875875 -1646153
85 -1646153 -1646048 -2200926 -2029523 -1824197 -1749478 -1636816 -1767267 -1869240 -1998708 -1743727 -1551501
74 -1551501 -1897482 -2015923 -1863187 -1860025 -2241942 -2051131 -1810505 -1617274 -1839507 -1844396 -1837736
63 -1837736 -1771715 -1791868 -2298906 -2396052 -2171974 -2063306 -1935434 -1866201 -1843686 -2038881 -2034967
52 -2034967 -1840080 -2004028 -2034807 -1814122 -1676021 -1949549 -1985857 -2002930 -1946016 -1775014 -1962731
41 -1962731 -2277580 -2247046 -2357386 -2232658 -2097450 -2148973 -2455871 -2434215 -2331859 -2487568
31 -2487568 -2366592 -2297121 -1997522 -2115711 -2110227 -2289244 -2386072 -2278808 -2141506 -2172769 -2136288
20 -2136288 -2209197 -2416843 -2492202 -2570122 -2530111 -2637308 -2577674 -2653419 -2708890 -2640439 -2409676
9 -2409676 -2315532 -2444428 -2416828 -2453074 -2540417 -2448510 -2753560 -2679913 -2773447
0 -2773447
$$ Imaginary data points
##PAGE= N=2
##DATA TABLE= (X++(I..I)), XYDATA
16383 -7398659 -7099740 -6907973 -7064835 -6800731 -6388113 -6525044 -6150476 -5852858 -5937777 -5904692
16373 -5904692 -5954626 -6082974 -5816565 -5602789 -5492182 -5154896 -4954396 -4697237 -4348041 -4525259
16363 -4525259 -4487480 -4452141 -4018196 -3865133 -3989173 -3844766 -3563666 -3023256 -2942767 -3016945
16353 -3016945 -2948443 -2725541 -2306846 -2226784 -2364026 -2229329 -2236531 -2003059 -1612672 -1397838
16343 -1397838 -1421047 -1544501 -1618517 -1286682 -1163609 -893264 -905672 -839088 -869203 -639072
16333 -639072 -191344 10713 84541 388261 295929 335715 481902 655366 697858 723973
16323 723973 789237 890780 1109181 1394420 1326822 1570080 1762380 2033771 2196906 2123232
16313 2123232 2113484 2281541 2554290 2694631 2747941 2763533 2917665 3365023 3493571 3509606
16303 3509606 3666472 3860800 3692848 3898377 3820150 3684134 4372803 4501612 4520170 4437828
16293 4437828 4592198 5012511 4737314 4838950 5174500 5079060 5068373 5281779 5696036 5717652
16283 5717652 6070533 5966522 6039800 6219504 6457355 6304637 6075714 6247808 6329534 6170022
16273 6170022 6583706 6662363 6896412 7163159 7187924 7291533 7399830 7598109 7606509 7529800
16263 7529800 7484308 7710653 8183779 7887754 7965044 8031053 8309365 8262597 8362576 7947344
16253 7947344 8198947 8401974 8715427 8835986 8742725 9002411 8978082 9237831 8825796 9399569
16243 9399569 8995526 9088507 9378530 9668180 9574476 9718397 10104682 10214135 10067203 10082583
16233 10082583 9929886 9857390 9845183 9899823 10232961 9991525 10291551 10659115 10691684 10942052
16223 10942052 11202379 10967069 10833989 11173652 11450712 11082815 10516845 10895507 11221341
16214 11221341 11540996 11654654 11640951 11833188 11505317 11522955 11631080 11757303 12037279 11997558
16204 11997558 11893111 11935933 12239222 12198655 12268719 12722933 12568823 12337820 12932926 12789397
16194 12789397 12358868 12792800 12627083 12955538 13430566 13414986 13154577 13231157 13086570 13168922
16184 13168922 13150570 12879215 12912851 12820680 12923512 13586330 13610846 13237115 13316012 13309607
16174 13309607 13511994 13444194 13629877 13176856 13229264 13424884 13593505 13516344 13659086 13669051
16164 13669051 14065812 14045224 13675660 13707529 13917367 13837032 13649428 13794867 13787760 14002414
16154 14002414 14219602 13938723 13757540 13889042 13846751 14064995 14381666 14677140 14153325
16145 14153325 14009989 14354817 14657718 14714661 14740983 14657642 14830415 14808807 14830254 14627112
16135 14627112 14726852 14311382 14426099 14859606 14900932 14912906 14734454 14593815 14686742 14969590
16125 14969590 14829110 14572132 14581513 14850596 15142974 14983086 14679351 14581288 14444903 15036701
16115 15036701 14873309 14456455 14822983 14757767 14770111 14867239 14745463 15004428 15033271 14998833
16105 14998833 15140245 15279408 15408770 15493046 15286544 15295316 15335414 15104313 14970262 14955660
16095 14955660 15404120 15760798 15626150 15835799 15841066 15798362 15697132 15531436 15576872 15514525
16085 15514525 15460684 14960815 15247742 15382463 15397511 15439925 15316750 15416813 15591320 15525787
16075 15525787 15438416 15746608 16121476 15825710 15628778 15541764 15633068 15528639 15628147 15490835
16065 15490835 15124366 15067423 15264863 15232714 15119027 15438720 15375438 15386694 15511176 15862619
16055 15862619 15611509 15576623 15718237 15872412 15661390 15453793 15310354 15275022 15572525 15913045
16045 15913045 15608519 15275052 15005153 15245980 15568856 15242063 15523072 15755343 15656056
16036 15656056 15873333 15730551 15954753 15934227 16080809 15824811 15670836 15864767 15802250 15939536
16026 15939536 15636030 16031446 15760624 15665156 15795015 15673704 16005835 16028575 15704995 15588457
16016 15588457 15897739 15622848 15447720 15537166 15439626 15374716 15709463 15299867 15155111 15298186
16006 15298186 15336371 15828783 15849520 15789490 15795689 15739231 15668727 16202801 16181183 15737947 15357919
15995 15357919 15451546 15510921 15661676 15707218 15621737 15500735 15734434 15822508 15364580 15571503
15985 15571503 15543293 15467849 15738491 15960484 15532672 15753138 15954799 15803007 16176025 15614972
15975 15614972 15232214 16015472 15743472 15861321 16072666 16020091 16039197 15950751 15883144 16164627
15965 16164627 16278713 16025995 15906577 15966676 16028690 15929720 15873502 15465704 16010161 15752788
15955 15752788 15748360 15611851 15671370 15676712 15535901 16119375 16342560 16368370 15948715 15704970
15945 15704970 15952393 15670409 15728334 15972139 15592464 15886440 16030987 15842777 15911223 15757262
15935 15757262 15470381 15402019 15917956 15904463 15919071 16303422 16145774 16073199 16175105 16031257
15925 16031257 16098180 16384473 16109300 15795334 15719052 15931589 15697752 15709211 16052282 16320717
15915 16320717 16216347 16191912 16299599 16079603 15787079 15960938 16021528 16098909 16197612 16177759
15905 16177759 16316036 16237300 16405585 16275824 16308548 15909834 15929272 16072177 16057699 15901892
15895 15901892 16046309 16051455 15746964 15992465 16308046 15627543 15526386 15724051 15757184 15804876
15885 15804876 15713251 15846977 15965306 16159743 16390081 16355107 16208239 16192324 16200050 16167405
15875 16167405 16006942 16030589 16189355 16313296 16058634 16101012 16344775 16244429 15450212 15723437
15865 15723437 15791962 16471491 16269675 16169041 16009126 15584730 15972015 16004893 15589799 15777696
15855 15777696 15928324 15931070 15821253 16058205 16249613 16181705 16210007 15999307 16293746 16310238
15845 16310238 16246039 16376880 16641965 16874585 16785095 16587958 16514407 15943440 15859276 16115448
15835 16115448 16133192 16062189 15839604 15939907 16414730 16276968 16523640 16238153 16411954 16505570
15825 16505570 16248161 16383711 16584585 16398029 16197657 16250917 16407618 16378797 16076116 16041770
15815 16041770 16006930 16160973 15857017 16119973 16419867 16562212 16475000 16452144 16155521 16081979
15805 16081979 16738281 16658603 16720892 16519048 16621458 16075120 16346332 16614107 16284459 16442386
15795 16442386 16337065 16200242 16552444 16581226 16433199 16361045 16776891 16715473 16621843 16736395
15785 16736395 16449468 16761768 16335149 16035446 15811407 15973560 15906091 16026292 16519137
15776 16519137 16488153 16798952 16908071 16794081 16888631 16668134 16532580 16746111 16703386 16739440
15766 16739440 16426856 16262458 16116360 15977821 15965839 16014795 16216781 16191595 16206392 16249598
15756 16249598 16662338 16696167 16587602 16797170 16548687 16420806 16154041 16354806 16990575
15747 16990575 16566497 16326911 16546475 16800874 16270642 16295008 16334384 16624371 16810830 16344009
15737 16344009 16505482 16411090 16112173 16220298 16376085 16361771 16690000 17011396 16846963 16536221
15727 16536221 16584962 16713235 16598040 16625180 16591109 16817162 16592282 16519065 16196147 16490300
15717 16490300 16552966 16546887 16678780 16579554 16853357 16672687 16624017 16686703 16367641 16585669
15707 16585669 16731309 16651530 16377268 16210104 15975668 16085277 16996695 17044586 16711223 16449732
15697 16449732 16525207 16565307 16416969 16568556 16899355 17374628 17308559 16965340 17080488 16644272
15687 16644272 16966643 17060192 16691769 16971859 16742743 16707695 16720892 16730830 16754430 16591615
15677 16591615 16312420 16110655 16179971 16523440 16630667 16788694 16966951 16927166 16958989 16907137
15667 16907137 16485593 16487435 16855565 16612808 16396063 16869700 16987377 16432322 16698312 16572954
15657 16572954 16871262 17018522 16770354 16563853 16736475 16409974 16751278 16889794 16873801
15648 16873801 16968390 16662390 16592692 17242060 16762675 16543511 16854029 16540753 16838523 16855563
15638 16855563 16629226 16547421 16800359 16534214 16674205 16786376 16349213 16511055 16521701 16880313
15628 16880313 16748212 16610504 16836840 16755089 16366254 16363508 16946044 16753229 16967401 17084985
15618 17084985 16612384 16489107 16923100 17108175 16852543 16990411 16846067 16864618 16994768
15609 16994768 16759127 16941883 16818829 16792163 17084819 17015733 16694600 16804379 17326451 16917193
15599 16917193 16540130 16388394 16441580 16765432 16727566 16862285 16496500 16264208 16334485 16559899
15589 16559899 16592324 17120087 16985735 16863802 16830103 16878699 16859793 16940615 16861488 16891579
$$ [...]
##END NTUPLES=NMR SPECTRUM
##END=
