##TITLE=1H_DE-80H_X3
 200.13MHz, d2o
 8 sc
 
 19ns.26.2.2025
##JCAMPDX= 6.0         $$ Bruker NMR JCAMP-DX V2.0
##DATA TYPE= NMR SPECTRUM
##DATA CLASS= NTUPLES
##ORIGIN= UXNMR, Bruker Analytische Messtechnik GmbH
##OWNER= pz
$$ XWIN-NMR		Version 3.5
$$ Wed Jun  3 10:23:58 2026 Russian Standard Time (UT+4h)  Yarkov@DPX200
##.OBSERVE FREQUENCY= 200.1313
##.OBSERVE NUCLEUS= ^1H
##.ACQUISITION MODE= SIMULTANEOUS
##.ACQUISITION SCHEME= undefined
##.AVERAGES= 8
##.DIGITISER RES= 18
##SPECTROMETER/DATA SYSTEM= spect
##.PULSE SEQUENCE= zg30
##.SOLVENT NAME= DMSO
##.SHIFT REFERENCE= (INTERNAL, DMSO, 0, 15.5001)
##AUDIT TRAIL= $$ (NUMBER, WHEN, WHO, WHERE, WHAT)
$$ ##TITLE= Audit trail, XWIN-NMR		Version 3.5
$$ ##JCAMPDX= 5.01
$$ ##ORIGIN= Bruker BioSpin GmbH
$$ ##OWNER= Yarkov
$$ C:/Bruker/XWIN-NMR/data/yarkov2/nmr/H-C/1/pdata/1/auditp.txt
$$ ##AUDIT TRAIL=  $$ (NUMBER, WHEN, WHO, WHERE, WHAT)
(   1,<2026-06-03 10:22:18.81 +0400>,<Yarkov>,<DPX200>,
      <created by zg, POWCHK disabled, PULCHK disabled
       configuration hash MD5:
       00 E9 B6 7A A2 85 ED C7 34 08 36 98 17 FE 4E 26
       data hash MD5: 16K
       48 ED 02 9B 29 23 AC 2A C0 8C 34 DD 15 9B 3E E5>)
(   2,<2026-06-03 10:22:58.18 +0400>,<Yarkov>,<DPX200>,
      <Start of raw data processing
       efp BC_mod = 2 LB = 0.25 FT_mod = 6 PKNL = 1 PHC0 = -6384.896 PHC1 = 21.22195 SI = 16K 
       data hash MD5: 16K
       B7 DB 94 29 EE 8C 86 2A F6 09 4A 27 D4 32 DA B3>)
(   3,<2026-06-03 10:23:05.45 +0400>,<Yarkov>,<DPX200>,
      <abs ABSG = 5 
       data hash MD5: 16K
       71 D0 77 CF 5C 18 4C 50 44 E7 8A 87 FC 94 05 1F>)
(   4,<2026-06-03 10:23:22.04 +0400>,<Yarkov>,<DPX200>,
      <pk PHC0 = 25.21694 PHC1 = -32.4 
       data hash MD5: 16K
       5E F7 40 2D 3F 2D 5C 47 75 87 E5 F7 AF C7 AF F8>)
$$ ##END=
$$ 
$$ hash MD5
$$ 32 00 DF 29 40 6C 95 8A 6C F3 BA E3 02 10 C3 AC
##$RELAX= 
##$RELAX= 
##$RELAX= 
##$RELAX= 
##$RELAX= 
##$RELAX= 
$$ Bruker specific parameters
$$ --------------------------
##$DU= <C:/Bruker/XWIN-NMR>
##$EXPNO= 1
##$NAME= <H-C>
##$PROCNO= 1
##$TYPE= <nmr>
##$USER= <yarkov2>
##$AMP= (0..31)
100 100 100 100 100 100 100 100 100 100 100 100 100 100 100 100 100 100 
100 100 100 100 100 100 100 100 100 100 100 100 100 100 
##$AQSEQ= 0
##$AQ_mod= 1
##$AUNM= <au_zg>
##$AUTOPOS= <>
##$BF1= 200.13
##$BF2= 200.13
##$BF3= 200.13
##$BF4= 200.13
##$BF5= 200.13
##$BF6= 200.13
##$BF7= 200.13
##$BF8= 200.13
##$BYTORDA= 1
##$CFDGTYP= 0
##$CFRGTYP= 5
##$CHEMSTR= <none>
##$CNST= (0..31)
1 1 145 1 1 1 1 1 1 1 1 1 1 1 1 1 1 1 1 1 1 1 1 1 1 1 1 1 1 1 1 1 
##$CPDPRG= <>
##$CPDPRG1= <>
##$CPDPRG2= <>
##$CPDPRG3= <>
##$CPDPRG4= <mlev>
##$CPDPRG5= <mlev>
##$CPDPRG6= <mlev>
##$CPDPRG7= <mlev>
##$CPDPRG8= <mlev>
##$CPDPRGB= <>
##$CPDPRGT= <>
##$D= (0..31)
0 0.7 0 0 0 0 0 0 0 0 0 0.03 0 0 0 0 0 0 0 0 0 0 0 0 0 0 0 0 0 0 0 0 
##$DATE= 1780467738
##$DBL= (0..7)
120 120 120 120 120 120 120 120 
##$DBP= (0..7)
150 150 150 150 150 150 150 150 
##$DBP07= 0
##$DBPNAM0= <>
##$DBPNAM1= <>
$$ [...]
##$SUBNAM3= <"">
##$SUBNAM4= <"">
##$SUBNAM5= <"">
##$SUBNAM6= <"">
##$SUBNAM7= <"">
##$SUBNAM8= <"">
##$SUBNAM9= <"">
##$SW= 18.0517328524113
##$SWIBOX= (0..15)
0 0 2 0 0 0 0 0 0 0 0 0 0 0 0 0 
##$SW_h= 3612.71676300578
##$TD= 16384
##$TD0= 1
##$TE= 0
##$TE2= 300
##$TE3= 300
##$TEG= 300
##$TL= (0..7)
0 120 120 120 120 120 120 120 
##$TP= (0..7)
150 150 150 150 150 150 150 150 
##$TP07= 0
##$TPNAME0= <>
##$TPNAME1= <>
##$TPNAME2= <>
##$TPNAME3= <>
##$TPNAME4= <>
##$TPNAME5= <>
##$TPNAME6= <>
##$TPNAME7= <>
##$TPOAL= (0..7)
0.5 0.5 0.5 0.5 0.5 0.5 0.5 0.5 
##$TPOFFS= (0..7)
0 0 0 0 0 0 0 0 
##$TUNHIN= 0
##$TUNHOUT= 0
##$TUNXOUT= 0
##$USERA1= <user>
##$USERA2= <user>
##$USERA3= <user>
##$USERA4= <user>
##$USERA5= <user>
##$V9= 5
##$VALIST= <valist>
##$VCLIST= <CCCCCCCCCCCCCCC>
##$VD= 0
##$VDLIST= <DDDDDDDDDDDDDDD>
##$VPLIST= <PPPPPPPPPPPPPPP>
##$VTLIST= <TTTTTTTTTTTTTTT>
##$WBST= 1024
##$WBSW= 4
##$XGAIN= (0..3)
0 0 0 0 
##$XL= 0
##$YL= 0
##$YMAX_a= 418727
##$YMIN_a= -474581
##$ZGOPTNS= <>
##$ZL1= 120
##$ZL2= 120
##$ZL3= 120
##$ZL4= 120
##$ABSF1= 15.43508
##$ABSF2= -2.61677
##$ABSG= 5
##$ABSL= 3
##$ALPHA= 0
##$AQORDER= 0
##$ASSFAC= 0
##$ASSFACI= 0
##$ASSFACX= 0
##$ASSWID= 0
##$AUNMP= <proc_1d>
##$AZFE= 0.1
##$AZFW= 0.1
##$BCFW= 0
##$BC_mod= 2
##$BYTORDP= 0
##$COROFFS= 0
##$CY= -3
##$DATMOD= 1
##$DC= 0
##$DFILT= <>
##$DTYPP= 0
##$F1P= 0
##$F2P= 0
##$FCOR= 1
##$FTSIZE= 16384
##$FT_mod= 6
##$GAMMA= 0
##$GB= 0
##$INTBC= 1
##$INTSCL= 3.241238e-09
##$ISEN= 128
##$LB= 0.25
##$LEV0= 0
##$LPBIN= 0
##$MAXI= 10000
##$MC2= 0
##$MEAN= 0
##$ME_mod= 0
##$MI= 1.114404
##$NCOEF= 0
##$NC_proc= -6
##$NLEV= 6
##$NOISF1= 3.799351
##$NOISF2= 2.8
##$NSP= 0
##$NTH_PI= 0
##$NZP= 0
##$OFFSET= 15.50009
##$PC= 1
##$PHC0= -6359.679
##$PHC1= -11.17805
##$PH_mod= 1
##$PKNL= yes
##$PPARMOD= 0
##$PSCAL= 0
##$PSIGN= 0
##$REVERSE= no
##$SF= 200.130004325003
##$SI= 16384
##$SIGF1= 3
##$SIGF2= 2
##$SINO= 0.751879
##$SIOLD= 32768
##$SREGLST= <19F.Aceton>
##$SSB= 0
##$STSI= 16384
##$STSR= 0
##$SW_p= 3612.71676300578
##$SYMM= 0
##$S_DEV= 0
##$TDeff= 16384
##$TDoff= 0
##$TI= <>
##$TILT= no
##$TM1= 0
##$TM2= 0
##$TOPLEV= 0
##$USERP1= <user>
##$USERP2= <user>
##$USERP3= <user>
##$USERP4= <user>
##$USERP5= <user>
##$WDW= 1
##$XDIM= 16384
##$YMAX_p= 517370623
##$YMIN_p= -1486709
$$ End of Bruker specific parameters
$$ ---------------------------------
##NTUPLES= NMR SPECTRUM
##VAR_NAME=  FREQUENCY,     SPECTRUM/REAL,   SPECTRUM/IMAG
##SYMBOL=    X,             R,               I
##VAR_TYPE=  INDEPENDENT,   DEPENDENT,       DEPENDENT
##VAR_FORM=  AFFN,          ASDF,            ASDF
##VAR_DIM=   16384,         16384,           16384
##UNITS=     HZ,            ARBITRARY UNITS, ARBITRARY UNITS
##FACTOR=    0.220516191357247, 1,           1
##FIRST=     3102.03300776898, 0,            0
##LAST=      -510.683755236797, 0,           0
##MIN=       -510.683755236797, -1486709,    0
##MAX=       3102.03300776898, 517370623,    0
$$ Real data points
##PAGE= N=1
##DATA TABLE= (X++(R..R)), XYDATA
$$ [...]
$$ plain form
7072 -1019037 -1105689 -1060789 -1102628 -955882 -859550 -803586 -658087 -673996 -708787 -776277 -924994
7061 -924994 -920509 -845747 -951605 -965865 -1039082 -1037475 -980945 -1145942 -1074347 -940686 -1010065
7050 -1010065 -991376 -942949 -946784 -932036 -862812 -798404 -677556 -825828 -867283 -776137 -826910
7039 -826910 -810160 -881400 -955710 -938441 -1008631 -978563 -1005187 -1058038 -804013 -669040 -673186
7028 -673186 -823389 -887776 -755756 -795320 -874796 -831665 -761841 -894482 -914568 -762235 -797641
7017 -797641 -859669 -917604 -924257 -916158 -1022069 -962839 -852894 -800216 -755438 -743073 -812976 -823076
7005 -823076 -1000854 -1046340 -975148 -1090844 -1143890 -925574 -902456 -990706 -938285 -1025787 -1050178
6994 -1050178 -1036000 -1079946 -1081030 -1094261 -923778 -711546 -950116 -827624 -653116 -811512
$$ packed form
7072a019037q6652M4900m1839J46746R6332N5964J45499j5909l4791o7490j48717
7061i24994M485P4762j05858j4260p3217J607N6530j64997P1595J33661o9379
7050a010065J8689M8427l835J4748O9224O4408J20848j48272m1455R1146n0773
7039h26910J6750p1240p4310J7269p0190L0068k6624n2851K54025J34973m146
7028f73186j50203o4387J32020l9564p9476M3131O9824j32641k0086J52333l5406
7017g97641o2028n7935o653Q099j05911N9230J09945N2678M4778J2365o9903j0100
7005h23076j77778m5486P1192j15696n3046K18316K3118q8250N2421q7502k4391
6994a050178J4178m3946j084j3231J70483K12232k38570J22492J74508j58396
$$ plain form
6984 -811512 -743035 -933781 -1034390 -925694 -1033697 -1032014 -1037543 -1071609 -808348 -775335 -942641
6973 -942641 -1020834 -1225413 -1120540 -946873 -1105107 -1059759 -944361 -877201 -616737 -695147
6963 -695147 -674519 -590993 -742678 -757006 -724332 -849569 -674101 -641547 -682065 -617087 -698853
6952 -698853 -696085 -586246 -906611 -1061120 -983580 -1063967 -850282 -832566 -836915 -921036 -1017947
6941 -1017947 -864240 -937427 -1005765 -1027047 -1039286 -860394 -810333 -883891 -889040 -882837 -869388
6930 -869388 -733609 -906407 -1105364 -968123 -864265 -756849 -794793 -899447 -961495 -940873
6920 -940873 -1272032 -1333288 -1209370 -1212410 -908911 -801291 -942258 -889414 -864397 -853158 -737135
6909 -737135 -891127 -701921 -698295 -1003022 -946059 -900796 -959103 -978660 -1063601 -1019519 -947384
$$ packed form
6984h11512O8477j90746j00609J08696j08003J683n529l4066K63261L3013j67306
6973i42641p8193k04579J04873J73667j58234M5348J15398O7160K60464p8410
6963f95147K0628Q3526j51685j4328L2674j25237J75468L2554m0518O4978q1766
6952f98853K768J09839l20365j54509P7540q0387K13685J7716m349q4121r6911
6941a017947J53707p3187o8338k1282j2239J78892N0061p3558n149O203J3449
6930h69388J35779j72798j98957J37241J03858J07416l7944j04654o2048K0622
6920i40873l31159o1256J23918l040L03499J07620j40967N2844K5017J1239J16023
6909g37135j53992J89206L626l04727N6963M5263n8307j9557q4941M4082P2135
$$ plain form
6898 -947384 -1087527 -1194110 -919783 -891791 -793022 -812664 -954483 -890261 -950601 -943343 -892371
6887 -892371 -780733 -603498 -646749 -903188 -892762 -861626 -785185 -864863 -1149208 -1096613 -1036956
6876 -1036956 -1116283 -1055059 -1061358 -1031311 -782525 -753407 -857182 -871271 -952316 -875889 -910993
6865 -910993 -1057739 -974148 -935159 -942002 -910535 -924430 -1009898 -889221 -1043213 -1026032 -1036876
6854 -1036876 -1124806 -991556 -981169 -859509 -724686 -795047 -965461 -1013186 -1083783 -987798 -976010
6843 -976010 -1065878 -992107 -878409 -941522 -921908 -933116 -882130 -729332 -920093 -787912 -688366
6832 -688366 -862705 -852393 -821151 -831015 -761199 -824296 -866393 -771151 -782947 -861644 -903588 -1017888
6820 -1017888 -1020978 -951138 -1109339 -1088712 -1056856 -970092 -870281 -796706 -914854 -814684 -768446
$$ packed form
6898i47384j40143j06583K74327K7992R8769j9642j41819O4222o0340P258N0972
6887h92371J11638J77235m3251k56439J0426L1136P6441p9678k84345N2595N9657
6876a036956p9327O1224o299L0047K48786K9118j03775j4089q1045P6427l5104
6865i10993j46746Q3591L8989o843L1467j3895q5468J20677j53992J7181j0844
6854a036876q7930J33250J0387J21660J34823p0361j70414m7725p0597R5985J1788
6843i76010q9868P3771J13698o3113J9614j1208N0986J52798j90761J32181R9546
6832f88366j74339J0312L1242r864O9816o3097m2097R5242j1796p8697m1944j14300
6820a017888l090O9840j58201K0627L1856Q6764R9811P3575j18148J00170M6238
$$ plain form
6809 -768446 -809615 -936316 -1000711 -834244 -955823 -1026353 -981809 -1009952 -997848 -1007312 -1056655
6798 -1056655 -998734 -1009001 -1076347 -962602 -955610 -1122439 -1090098 -1055705 -977778 -905074 -1017263
6787 -1017263 -949804 -946517 -1086739 -1065011 -1104268 -1014192 -885823 -1083267 -1014374 -936736 -1014707
6776 -1014707 -837211 -715705 -722050 -754819 -835277 -768321 -771674 -842146 -799752 -822415 -909280
6765 -909280 -1054846 -1002323 -1026151 -986815 -1005790 -811692 -904571 -1050969 -847670 -843267 -854215
6754 -854215 -931322 -906392 -737628 -583393 -720306 -648772 -624455 -765039 -831822 -814680 -962060
6743 -962060 -1121705 -1096435 -991745 -998430 -1010715 -1033760 -1020647 -1098910 -1222214 -1195693 -1149261
6732 -1149261 -1114801 -954628 -910886 -863776 -807495 -765891 -656221 -785900 -842210 -897650 -993206
$$ packed form
6809g68446m1169j26701o4395J66467j21579p0530M4544k8143J2104r464m9343
6798a056655N7921j0267o7346J13745O992j66829L2341L4393P7927P2704j12189
6787a017263O7459L287j40222K1728l9257R0076J28369j97444O8893P7638p7971
6776a014707J77496J21506o345l2769q0458O6956l353p0472M2394k2663q6865
6765i09280j45566N2523k3828L9336j8975J94098r2879j46398K03299M403j0948
6754h54215p7107K4930J68764J54235j36913P1534K4317j40584o6783J7142j47380
6743i62060j59645K5270J04690o685j2285k3045J3113p8263j23304K6521M6432
6732a149261L4460J60173M3742M7110N6281M1604J09670j29679n6310n5440r5556
$$ plain form
6721 -993206 -1099744 -965155 -978714 -1046995 -1141049 -1139407 -1076090 -1133425 -1335107 -1116005 -942701
6710 -942701 -925075 -903395 -893820 -857867 -1066234 -1047273 -919482 -935953 -858024 -764845 -734081
6699 -734081 -894796 -974925 -936332 -904024 -956990 -1012857 -1043255 -1099693 -1246444 -1102019 -1007292
6688 -1007292 -1072824 -1038736 -1082598 -867656 -814319 -941988 -712221 -665462 -680069 -688898 -899250
6677 -899250 -1016933 -1037185 -975907 -815180 -800668 -950683 -820149 -929362 -1043636 -1011518
6667 -1011518 -902637 -778779 -785275 -952939 -858984 -995151 -1065269 -915263 -768632 -761085 -904962
6656 -904962 -880828 -790937 -854958 -876401 -747472 -887374 -930016 -958595 -1058333 -947187 -952176
6645 -952176 -941023 -774641 -836592 -1157545 -1256189 -1199418 -1043952 -987124 -983531 -892008 -864973
$$ packed form
6721i93206j06538J34589j3559o8281r4054J642O3317n7335k01682K19102J73304
6710i42701J7626K1680R575L5953k08367J8961J27791j6471P7929R3179L0764
6699g34081j60715q0129L8593L2308n2966n5867l0398n6438j46751J44425R4727
6688a007292o5532L4088m3862K14942N3337j27669K29767M6759j4607q829k10352
6677h99250j17683k0252O1278J60727J4512j50015J30534j09213j14274L2118
6667a011518J08881J23858o496j67664R3955j36167p0118J50006J46631P547j43877
6656i04962K4134Q9891o4021k1443J28929j39902m2642k8579r9738J11146m989
6645i52176J1153J66382o1951l20953r8644N6771J55466N6828L593R1523K7035
$$ plain form
6634 -864973 -900580 -799372 -822874 -937893 -955396 -965157 -1077754 -1088843 -1237658 -1260611 -1128924
6623 -1128924 -1147970 -1126717 -1099729 -1063605 -1135265 -1163297 -1152658 -1073244 -1039218 -1030302 -1035267 -999671
6611 -999671 -848702 -846024 -908593 -767827 -842118 -918404 -985934 -987456 -967934 -1196949 -1203258 -991159
6599 -991159 -1020812 -1010973 -886660 -806779 -701612 -648632 -870392 -733864 -903918 -994260 -863472
6588 -863472 -1003445 -912916 -897502 -837163 -697269 -823641 -790146 -538853 -738181 -908374
6578 -908374 -948411 -981701 -1001980 -1093986 -986328 -667101 -628444 -743858 -789224 -820187 -972373
6567 -972373 -1141491 -1089394 -1214768 -1250816 -1038840 -964458 -932633 -853061 -763705 -738626 -919002
6556 -919002 -1117173 -1106067 -1111192 -1014130 -972151 -742791 -763668 -721995 -766795 -943447 -1044283
$$ packed form
6634h64973l5607J01208k3502j15019j7503r761j12597j1089j48815k2953J31687
6623a128924j9046K1253K6988L6124p1660k8032J0639P9414L4026Q916m965L5596
6611i99671J50969K678o2569J40766p4291p6286o7530j522J9522k29015o309K12099
6599i91159k9653R839J24313P9881J05167N2980k21760J36528j70054r0342J30788
6588h63472j39973R0529J5414O0339J39894j26372L3495K51293j99328j70193
6578i08374m0037l3290k0279r2006J07658L19227L8657j15414m5366l0963j52186
6567i72373j69118N2097j25374l6048K11976P4382L1825P9572Q9356K5079j80376
6556i19002j98171J1106n125R7062M1979K29360k0877M1673m4800j76652j00836
$$ plain form
6545 -1044283 -1279019 -1280567 -1217542 -1312520 -1277538 -1188491 -1169944 -1071295 -1144919 -1083430 -1140287
6534 -1140287 -1194405 -1146823 -1035232 -1070503 -913810 -722989 -814081 -838099 -818764 -912723 -1020066
6523 -1020066 -1107189 -1020082 -1013740 -1172442 -1243494 -1098179 -994133 -1033191 -998172 -812960 -698745
6512 -698745 -1016346 -988021 -974127 -1088280 -999271 -933735 -743202 -720947 -836910 -714791 -628796
6501 -628796 -808937 -911130 -1080894 -962850 -1093543 -1276336 -1007527 -941498 -965031 -844361
6491 -844361 -959169 -1089788 -1177581 -1239354 -1052276 -997405 -1090059 -1015169 -896303 -842780 -865772
6480 -865772 -913474 -818620 -801643 -954749 -1012352 -974281 -1128763 -1156237 -1155297 -1025335 -996842
6469 -996842 -1272299 -1181456 -1046926 -992430 -952722 -994518 -975749 -814873 -858013 -1041483 -910288
$$ packed form
6545a044283k34736j548O3025r4978L4982Q9047J8547R8649p3624O1489n6857
6534a140287n4118M7582J11591l5271J56693J90821r1092k4018J9335r3959j07343
6523a020066q7123Q7107O342j58702p1052J45315J04046l9058L5019J85212J14215
6512f98745l17601K8325J3894j14153Q9009O5536J90533K2255j15963J22119Q5995
6501f28796j80141j02193j69764J18044j30693j82793K68809O6029k3533J20670
6491h44361j14808j30619q7793o1773J87078N4871r2654P4890J18866N3523k2992
6480h65772m7702R4854J6977j53106n7603L8071j54482k7474R40J29962K8493
6469i96842k75457R0843J34530N4496L9708m1796J8769J60876m3140j83470J31195
$$ plain form
6458 -910288 -890529 -1027251 -1011865 -995900 -978964 -1045404 -1067635 -952153 -947004 -929150 -869961
6447 -869961 -926384 -958247 -979031 -973965 -868173 -1000003 -1062242 -909570 -784961 -892271 -867208
6436 -867208 -932337 -874010 -928772 -1175731 -1046734 -923596 -1028264 -1039014 -1016044 -847706 -830618
6425 -830618 -840610 -815861 -841987 -887491 -860918 -906718 -1052805 -1132327 -1154818 -1132982 -1140918 -1180939
6413 -1180939 -1015243 -953628 -975702 -1063126 -1097606 -906285 -823938 -962354 -1081926 -1020862 -918925
6402 -918925 -940082 -953891 -877917 -905584 -1021117 -917711 -938434 -1057242 -1165091 -1199143 -1071061
6391 -1071061 -1035215 -1069768 -1013961 -834639 -984426 -1004417 -1055638 -1084126 -1135693 -1143333 -943431
6380 -943431 -744131 -798110 -831773 -670013 -710005 -886771 -1041201 -1047797 -954575 -1127693 -1030990
$$ packed form
6458i10288J9759j36722J5386J5965J6936o6440k2231J15482N149J7854N9189
6447h69961n6423l1863k0784N066J05792j31830o2239J52672J24609j07310K5063
6436h67208o5129N8327n4762k46959J28997J23138j04668j0750K2970J68338J7088
6425h30618r992K4749k6126m5504K6573m5800j46087p9522k2491K1836p936m0021
6413a180939J65696O1615k2074q7424l4480J91321Q2347j38416j19572O1064J01937
6402i18925k1157j3809P5974k7667j15533J03406k0723j18808j07849l4052J28082
6391a071061L5846l4553N5807J79322j49787j9991n1221k8488n1567p640J99902
6380i43431J99300n3979l3663J61760l9992j76766j54430o596R3222j73118R6703
$$ plain form
6369 -1030990 -1010794 -1103404 -1074338 -1016968 -782320 -611590 -804375 -724330 -742967 -852389 -956756
6358 -956756 -1192830 -1179923 -1034123 -997033 -856105 -802211 -926221 -929658 -948646 -1032121 -1060419
6347 -1060419 -1183936 -1140116 -1051298 -1049386 -928224 -761740 -714558 -728628 -906448 -906028 -802789
6336 -802789 -947584 -889848 -954168 -1034490 -985888 -1127392 -1152791 -1144769 -1268658 -977090 -821819
6325 -821819 -927148 -937075 -875048 -744832 -786643 -856816 -842277 -912098 -866212 -847165 -942742
6314 -942742 -986062 -1007838 -1053486 -1006702 -1031056 -1008901 -896469 -918644 -781133 -690759 -905628
6303 -905628 -951745 -873714 -753150 -739960 -858197 -808007 -751593 -895887 -868984 -978102 -1101608
6292 -1101608 -1168562 -1096472 -956768 -944860 -981721 -907562 -825413 -934065 -928666 -934269 -934962 -916156
$$ packed form
6369a030990K0196r2610K9066N7370K34648J70730j92785Q0045j8637j09422j04367
6358i56756k36074J2907J45800L7090J40928N3894j24010l437j8988q3475k8298
6347a060419j23517M3820Q8818J912J21162J66484M7182j4070j77820M20J03239
6336h02789j44795N7736o4320q0322M8602j41504k5399Q022j23889K91568J55271
6325h21819j05329r927O2027J30216m1811p0173J4539o9821M5886J9047r5577
6314i42742m3320k1776m5648M6784k4354K2155J12432k2175J37511R0374k14869
6303i05628m6117P8031J20564J3190j18237N0190N6414j44294K6903j09118j23506
6292a101608o6954P2090J39704J1908l6861P4159Q2149j08652N399n603o93J8806
$$ plain form
6280 -916156 -941728 -819021 -797106 -865046 -862255 -973822 -887426 -943772 -983315 -876277 -1017165
6269 -1017165 -973941 -872858 -899707 -980451 -1042197 -1005326 -883704 -1017522 -1151573 -1014534
6259 -1014534 -914571 -867807 -794200 -776736 -988372 -1160126 -1280125 -1217043 -989227 -1109328
6249 -1109328 -1004646 -995958 -917875 -867773 -1091267 -1153661 -1169534 -1145494 -969183 -948598 -1091866
6238 -1091866 -1003640 -973390 -910697 -886790 -837379 -856231 -979986 -1099650 -1166888 -1252399 -1159766
6227 -1159766 -1118066 -1157973 -1214149 -1150419 -1037480 -912697 -912570 -957500 -877006 -923193 -1063942
6216 -1063942 -1085466 -972726 -709406 -688956 -917398 -894045 -1088989 -1095341 -980678 -1003942 -998402
6205 -998402 -1033085 -1003175 -796339 -897943 -859981 -656160 -680955 -762778 -805754 -857432 -987150
$$ packed form
6280i16156k5572J22707K1915o7940K791j11567Q6396n6346l9543J07038j40888
6269a017165M3224J01083k6849q0744o1746L6871J21622j33818j34051J37039
6259a014534R9963M6764P3607J7464k11636j71754j19999O3082K27816j20101
6249a109328J04682Q688P8083N0102k23494o2394j5873K4040J76311K0585j43268
6238a091866Q8226L0250O2693K3907M9411j8852j23755j19664o7238q5511R2633
6227a159766M1700l9907n6176O3730J12939J24783J27m4930Q0494m6187j40749
6216a063942k1524J12740K63320K0450k28442K3353j94944o352J14663k3264N540
6205i98402l4683K9910K06836j01604L7962K03821k4795q1823m2976n1678j29718
$$ plain form
6194 -987150 -1012786 -1019756 -877889 -955484 -1079527 -901041 -881528 -932181 -925057 -952198 -796190
6183 -796190 -758518 -912272 -777445 -867466 -898302 -617091 -746238 -831251 -856003 -887044 -780092
6172 -780092 -845757 -901086 -808996 -781781 -826265 -885247 -907605 -859157 -794431 -828647 -792471 -873626
6160 -873626 -952460 -1060580 -1179231 -1059806 -1036440 -963783 -994247 -1032752 -932323 -875828 -847832
6149 -847832 -942366 -913404 -937137 -873452 -732897 -652688 -763803 -915407 -834339 -897072 -882117
6138 -882117 -867180 -872816 -848539 -990453 -884004 -693518 -791254 -955451 -959062 -821807 -605366
6127 -605366 -867876 -913464 -946427 -1150550 -1036065 -1061043 -1232761 -1040093 -907926 -735642
6117 -735642 -592813 -768427 -747152 -673836 -677986 -880766 -1100085 -942749 -868628 -1006048 -1036609
$$ packed form
6194i87150k5636o970J41867p7595j24043J78486J9513n0653P124k7141J56008
6183g96190L7672j53754J34827r0021l0836K81211j29147q5013k4752l1041J06952
6172g80092o5665n5329R2090K7215m4484n8982k2358M8448O4726l4216L6176q1155
6160h73626p8834j08120j18651J19425K3366P2657l0464l8505J00429N6495K7996
6149h47832r4534K8962k3733O3685J40555Q0209j11115j51604Q1068o2733J4955
6138h82117J4937n636K4277j41914J06449J90486r7736j64197l611J37255K16441
6127f05366k62510m5588l2963k04123J14485k4978j71718J92668J32167J72284
6117g35642J42829j75614K1275P3316m150k02780k19319J57336P4121j37420l0561
$$ plain form
6106 -1036609 -1040595 -1076716 -959508 -965230 -1048404 -983034 -1073439 -946216 -920630 -1155954 -1081145
6095 -1081145 -961705 -927315 -746382 -826321 -785174 -792449 -940591 -868091 -978287 -1162758 -942298
6084 -942298 -991638 -997295 -1038642 -1098340 -904747 -847939 -1073391 -1083724 -1199819 -1103871 -1037681
6073 -1037681 -1119624 -993182 -967689 -968427 -880426 -1001872 -1196937 -1086737 -992079 -880208 -745682
6062 -745682 -754981 -692105 -775313 -1005510 -1053219 -1089294 -1166282 -1146985 -1262845 -1201622 -1024264
6051 -1024264 -1122463 -819586 -799232 -893547 -860399 -984387 -939401 -814552 -804768 -887148 -891148
6040 -891148 -770112 -662843 -787414 -978739 -1142660 -1188940 -1111131 -1049816 -1020409 -993289 -902369
6029 -902369 -939860 -937263 -1011726 -1027717 -1087660 -1130440 -1113316 -1160982 -1181736 -1103995 -1214984 -1186372
$$ packed form
6106a036609l986l6121J17208n722q3174O5370r0405J27223K5586k35324P4809
6095a081145J19440L4390J80933p9939M1147p275j48142P2500j10196j84471K20460
6084i42298m9340n657m1347n9698J93593N6808k25452j0333j16095R5948O6190
6073a037681q1943J26442K5493p38Q8001j21446j95065J10200R4658J11871J34526
6062g45682r299O2876q3208k30197m7709l6075p6988J9297j15860O1223J77358
6051a024264r8199L02877K0354r4315L3148j23988M4986J24849R784q2380m000
6040h91148J21036J07269j24571j91325j63921m6280P7809O1315K9407K7120R0920
6029i02369l7491K597p4463j5991n9943m2780J7124m7666k0754P7741j10989K8612
$$ plain form
6017 -1186372 -1042020 -933201 -1044332 -1080687 -1050964 -1151474 -1148604 -1152317 -1144922 -1102991 -1029066
6006 -1029066 -1093850 -1133026 -1221656 -1151185 -1138562 -1247911 -1183848 -1200414 -1188877 -1140535 -1198377
5995 -1198377 -1135334 -952568 -817937 -758813 -777348 -774959 -841568 -896444 -924708 -955328 -1039162
5984 -1039162 -1009661 -1130802 -1104161 -1066170 -1010152 -837121 -830537 -965926 -1115600 -1104597 -1028580
5973 -1028580 -925210 -1061937 -920077 -876490 -905347 -905575 -980072 -976099 -952095 -1007332 -1016375 -915280
5961 -915280 -957492 -973358 -963074 -891149 -970368 -1094376 -1146060 -1085318 -1102595 -1179491 -1146386
5950 -1146386 -1107477 -1032345 -1032874 -959050 -1127801 -1267285 -1229675 -1138540 -1093190 -1086928 -1060714 -1025356
5938 -1025356 -959934 -1016192 -1215242 -1203081 -1057224 -1132116 -1137431 -1183873 -1128300 -876518 -852554
$$ packed form
6017a186372J44352J08819j11131l6355K9723j00510K870l713P395M1931P3925
6006a029066o4784l9176q8630P0471J2623j09349O4063j6566J1537M8342n7842
5995a198377O3043J82766J34631N9124j8535K389o6609n4876k8264l0620q3834
5984a039162K9501j21141K6641L7991N6018J73031O584j35389j49674J1003P6017
5973a028580J03370j36727J41860M3587k8857k28p4497L973K4004n5237r043J01095
5961i15280m2212j5866J0284P1925p9219j24008n1684O0742j7277p6896L3105
5950a146386L8909P5132n29P3824j68751j39484L7610R1135M5350O262K6214L5358
5938a025356O5422n6258j99050J2161J45857p4892n315m6442N5573K51782K3964
$$ plain form
5927 -852554 -879952 -1023487 -1140723 -1169570 -1144591 -1213035 -1217794 -1201712 -1045728 -1056622 -1059780
5916 -1059780 -986000 -1042318 -977177 -894206 -947878 -974580 -1038727 -998399 -764322 -784612 -994260
5905 -994260 -981551 -887310 -899928 -979985 -1030823 -960204 -1014570 -1062013 -946788 -1094607 -1081338
5894 -1081338 -990334 -982942 -823914 -851586 -831736 -760078 -718173 -953120 -1058570 -1036383 -990594
5883 -990594 -1017007 -1014646 -1023526 -971955 -949727 -794643 -734306 -730892 -933441 -905687 -877670 -1022093
5871 -1022093 -1155732 -1176793 -1058717 -1067453 -1188206 -1100894 -1122568 -1214519 -1247535 -1201984 -1169535
5860 -1169535 -1290184 -1102752 -963320 -969458 -945907 -854247 -866874 -970914 -1274939 -1392282
5850 -1392282 -1310770 -1362463 -1217793 -1173190 -1253248 -1294798 -1299039 -1083023 -1109398 -1182014 -1076334
$$ packed form
5927h52554k7398j43535j17236k8847K4979o8444m759J6082J55984j0894l158
5916a059780P3780n6318O5141Q2971n3672k6702o4147M0328K34077k0290k09648
5905i94260J2709R4241j2618q0057n0838P0619n4366m7443J15225j47819J3269
5894a081338R1004P392J59028k7672J9850P1658M1905k34947j05450K2187M5789
5883i90594k6413K361q880N1571K2228J55084O0337L414k02549K7754K8017j44423
5871a022093j33639k1061J18076q736j20753Q7312k1674r1951l3016M5551L2449
5860a169535j20649J87432J39432o138K3551R1660j2627j04040l04025j17343
5850a392282Q1512n1693J44670M4603q0058m1550m241K16016k6375p2616J05680
$$ plain form
5839 -1076334 -1059599 -1034646 -957099 -983948 -876917 -794874 -807364 -784618 -882055 -1036400 -1096389
5828 -1096389 -1173210 -1116328 -1105300 -1124224 -954461 -837390 -936326 -924745 -988386 -925619 -834342
5817 -834342 -941403 -994948 -935962 -874621 -787083 -819312 -789627 -759088 -957495 -919777 -884153
5806 -884153 -975683 -832074 -764145 -663044 -565950 -820621 -773064 -538613 -539023 -518369 -641585
5795 -641585 -690322 -697011 -832772 -827199 -776516 -770702 -521317 -258171 -327603 -395735 -425893 -479411
5783 -479411 -413926 -466149 -446902 -438594 -361779 -191768 -137854 -174870 -184120 -158320 -193701 -275352
5771 -275352 -257150 -196371 -117389 -80525 73709 385238 493296 593486 746307 926526
5761 926526 1250914 1725969 2184171 2707334 3383150 4622946 6504436 9116424 12012449
$$ packed form
5839a076334J6735K4953P7547k6849J07031Q2043j2490K2746r7437j54345n9989
5828a096389p6821N6882J1028j8924J69763J17071r8936J1581o3641O2767R1277
5817h34342j07061n3545N8986O1341Q7538l2229K9685L0539j98407L7718L5624
5806h84153r1530J43609O7929J01101R7094k54671M7557K34451m10K0654j23216
5795f41585m8737o689j35761N573N0683N814K49385K63146o9432o8132l0158n3518
5783d79411O5485n2223J9247Q308P6815J70011N3914l7016r250K5800l5381q1651
5771b75352J8202O0779P8982L6864J54234L11529J08058J00190J52821J80219
5761I26526L24388M75055M58202N23163O75816J239796J881490K611988K896025
$$ plain form
5752 12012449 15652057 19893438 22423352 22525139 22503094 22264081 21230054 18617577 14886544
5743 14886544 12007806 9857673 8068978 6491115 5291717 4257137 3474533 2845326
5735 2845326 2363694 2021749 1616741 1310339 1129822 954174 860432 730935 538079 527135
5725 527135 531947 622191 626069 439230 442288 359845 289487 335978 260829 246782 343411 150687
5713 150687 79527 -61695 -118461 -52343 -175362 -344035 -301655 -334139 -334965 -123595 -212373
5702 -212373 -74994 -176140 -157892 76708 42291 -158154 -138583 -54349 -58627 -246399 -400562
5691 -400562 -370881 -436925 -324845 -192804 -388842 -398490 -567923 -660443 -626630 -813637 -752407
5680 -752407 -547639 -506549 -484983 -559538 -655422 -510764 -538741 -490947 -530426 -663833 -686778
$$ packed form
5752A2012449L639608M241381K529914J01787k2045k39013j034027k612477l731033
5743A4886544k878738k150133j788695j577863j199398j034580p82604o29207
5735B845326m81632l41945m05008l06402j80517j75648r3742j29497j92856j0944
5725E27135M812R0244L878j86839L058q2443p0358M6491p5149j4047R6629j92724
5713A50687p1160j41222n6766O6118j23019j68673M2380l2484q26K11370q8778
5702b12373J37379j01146J8248K34600l4417k00445J9571Q4234m278j87772j54163
5691d00562K9681o6044J12080J32041j96038r648j69433r2520L3813j87007O1230
5680g52407K04768M1090K1566p4555r5884J44658k7977M7794l9479j33407k2945
$$ plain form
5669 -686778 -710519 -822345 -746049 -757035 -820289 -807149 -847401 -834793 -786766 -737589 -607269
5658 -607269 -739050 -983022 -873477 -680456 -678813 -833401 -935957 -842823 -972296 -1031689
5648 -1031689 -930734 -776468 -819025 -679896 -617070 -749224 -1054643 -1074034 -814070 -756864
5638 -756864 -949572 -882381 -641432 -620700 -665895 -725144 -801365 -928135 -979622 -916485 -782722
5627 -782722 -1051817 -1090074 -863055 -723187 -831101 -1120613 -1083970 -920921 -994067 -1000184 -1038373
5616 -1038373 -1043998 -937936 -935967 -1066994 -992218 -890146 -690530 -828370 -985005 -1037556 -1036650
5605 -1036650 -957374 -1035703 -1118556 -1037098 -988164 -1019677 -942177 -1099869 -1178733 -891779 -739051
5594 -739051 -867453 -985186 -938673 -834892 -1016796 -1062075 -920691 -1033171 -1079631 -958683
$$ packed form
5669f86778k3741j11826P6296j0986o3254J3140m0252J2608M8027M9177J30320
5658f07269j31781k43972J09545J93021J643j54588j02556R3134j29473n9393
5648a031689J00955J54266m2557J39129O2826j32154l05419j9391K59964N7206
5638g56864j92708O7191K40949K0732m5195n9249p6221j26770n1487O3137J33763
5627g82722k69095l8257K27019J39868j07914k89512L6643J63049p3146o117l8189
5616a038373n625J06062J969j31027P4776J02072J99616j37840j56635n2551R06
5605a036650P9276p8329q2853Q1458M8934l1513P7500j57692p8864K86954J52728
5594g39051j28402j17733M6513J03781j81904m5279J41384j12480m6460J20948
$$ plain form
5584 -958683 -739891 -774964 -1012210 -911796 -631644 -821886 -1055596 -979909 -853400 -792469
5574 -792469 -941467 -836531 -912823 -1132764 -958709 -890736 -1035930 -1058336 -1000262 -810123
5564 -810123 -924779 -1244961 -1159495 -896223 -1018989 -995937 -913338 -1005885 -974572 -963239 -823116
5553 -823116 -739706 -883034 -963832 -899522 -898102 -1017352 -1035788 -908635 -970846 -1013156 -952491
5542 -952491 -938415 -1050247 -904789 -906912 -911831 -998460 -1040524 -839015 -941615 -1031796 -943835
5531 -943835 -918047 -934700 -995558 -1124915 -1041557 -952620 -887104 -874503 -1036368 -1062880 -890437
5520 -890437 -820560 -1116327 -1200629 -1040442 -972742 -1035345 -1237704 -1239722 -1016069 -993204 -928485
5509 -928485 -816805 -931644 -968069 -937599 -976610 -1113296 -1162300 -1142036 -1157083 -1182593 -1129894
$$ packed form
5584i58683K18792l5073k37246J00414K80152j90242k33710P5687J26509O0931
5574g92469j48998J04936p6292k19941J74055O7973j45194k2406N8074J90139
5564h10123j14656l20182Q5466K63272j22766K3052Q2599r2547L1313J1333J40123
5553h23116Q3410j43328q0798O4310J420j19250j8436J27153o2211m2310O0665
5542i52491J4076j11832J45458k123m919q6629m2064K01509j02600r0181Q7961
5531i43835K5788j6653o0858j29357Q3358Q8937O5516J2601j61865k6512J72443
5520h90437O9877k95767q4302J60187O7700o2603k02359k018K23653K2865O4719
5509i28485J11680j14839l6425L0470l9011j36686m9004K0264j5047k5510N2699
$$ plain form
5498 -1129894 -1090492 -1040759 -1274206 -1195222 -1077956 -1096466 -1338813 -1473413 -1099464 -920333
5488 -920333 -866404 -809150 -879652 -865004 -1041044 -1134262 -924087 -982721 -1053762 -1018478 -1082090
5477 -1082090 -1032863 -1155963 -1282928 -1149653 -1175112 -1063940 -935765 -1016427 -1077150 -1049354
5467 -1049354 -818004 -756781 -962839 -998776 -880544 -840642 -976642 -1164779 -1226920 -1310732
5457 -1310732 -1257102 -1185457 -1196562 -1264610 -1143433 -1076364 -1038835 -823090 -1103828 -1187306 -1006846
5446 -1006846 -950484 -919149 -891823 -920575 -889660 -977580 -1140577 -1189698 -1362835 -1286750 -1252016
5435 -1252016 -1292573 -1310831 -1342711 -1262903 -1278348 -1369214 -1195068 -1029329 -950451 -927233 -1045878
5424 -1045878 -1034583 -960135 -862652 -895369 -1080776 -1062622 -979394 -1071484 -1083059 -1255158 -1112818
$$ packed form
5498a129894L9402M9733k33447P8984J17266j8510k42347j34600L73949J79131
5488i20333N3929N7254p0502J4648j76040r3218K10175n8634p1041L5284o3612
5477a082090M9227j23100j26965J33275k5459J11172J28175q0662o0723K7796
5467a049354K31350O1223k06058l5937J18232L9902j36000j88137o2141q3812
5457a310732N3630P1645j1105o8048J21177O7069L7529K15745k80738q3478J80460
5446a006846N6362L1335K7326k8752L0915q7920j62997m9121j73137P6085L4734
5435a252016m0557j8258l1880P9808j5445r0866J74146J65739P8878K3218j18645
5424a045878J1295P4448R7483l2717j85407J8154Q3228r2090j1575j72099J42340
$$ plain form
5413 -1112818 -998678 -1077064 -1149876 -1215300 -1224178 -1211856 -1111272 -1083389 -1090057 -935502 -883312
5402 -883312 -625662 -774316 -995148 -929477 -1036677 -1088297 -1105206 -1113904 -1129940 -1140849 -975383
5391 -975383 -799717 -1098895 -1157319 -1089016 -1048346 -1020322 -1168478 -1141293 -1017266 -874335 -1002248
5380 -1002248 -1045358 -860736 -911210 -904347 -1004389 -955311 -855394 -1021279 -1169541 -1152428 -1292885
5369 -1292885 -1082979 -956313 -915834 -856414 -977800 -778985 -797030 -883083 -931258 -951210 -901368
5358 -901368 -809835 -775580 -637124 -563078 -585092 -743029 -695674 -778909 -929551 -936256 -821946
5347 -821946 -711517 -878226 -868037 -706748 -656899 -496790 -559307 -654712 -649437 -768503 -596100
5336 -596100 -695559 -997541 -845234 -549394 -409663 -432196 -436690 -161172 -62032 -9774 55822
$$ packed form
5413a112818J14140p8386p2812o5424q878J2322J00584K7883o668J54555N2190
5402h83312K57650j48654k20832O5671j07200n1620j6909q698j6036j0909J65466
5391i75383J75666k99178n8424O8303M0670K8024j48156K7185J24027J42931j27913
5380a002248m3110J84622n0474O863j00042M9078R9917j65885j48262J7113j40457
5369a292885K09906J26666M0479N9420j21386J98815j8045q6053m8175j9952M9842
5358i01368R1533L4255J38456P4046k2014j57937M7355q3235j50642o705J14310
5347h21946J10429j66709J0189J61289M9849J60109o2517r5405N275j19066J72403
5336e96100r9459l01982J52307K95840J39731k2533m494K75518R9140N2258O5596
$$ plain form
5325 55822 253746 492491 652564 969698 1231256 1164653 1037803 967058 885314 637241
5315 637241 296921 215746 111461 -139898 -250595 -503858 -564767 -691042 -680361 -550851
5305 -550851 -673239 -836569 -702215 -760598 -778287 -764843 -630401 -367018 -418594 -667388
5295 -667388 -720790 -657914 -793799 -803020 -795905 -806209 -859381 -942622 -890548 -943236 -1034636 -958530
5283 -958530 -1089069 -1009191 -906539 -1059548 -914399 -937662 -1015314 -904413 -879499 -833875 -864987
5272 -864987 -786963 -678052 -840975 -1068332 -932791 -1018568 -933634 -948550 -852949 -627089 -615301
5261 -615301 -681318 -655608 -749659 -652724 -533183 -733492 -830351 -857174 -671440 -576810 -718570
5250 -718570 -914448 -854347 -781288 -789939 -819303 -806434 -624634 -571091 -448441 -379146 -633467
$$ packed form
5325E5822J97924K38745J60073L17134K61558o6603j26850p0745q1744k48073
5315F37241l40320q1175j04285k51359j10697k53263o0909j26275J0681J29510
5305e50851j22388j63330J34354n8383j7689J3444J34442K63383n1576k48794
5295f67388n3402O2876j35885r221P115j0304n3172q3241N2074n2688r1400P6106
5283i58530j30539P9878J02652j53009J45149k3263p7652J10901K4914M5624l1112
5272h64987P8024J08911j62923k27357J35541q5777Q4934j4916R5601K25860J1788
5261f15301o6017K5710r4051R6935J19541k00309r6859k6823J85734R4630j41760
5250g18570j95878O0101P3059q651k9364J2869J81800N3543J22650O9295k54321
$$ plain form
5239 -633467 -704520 -597360 -541599 -587332 -647812 -589853 -642961 -794050 -828283 -772229 -749336
5228 -749336 -724484 -756327 -720793 -719616 -666642 -582870 -536085 -435030 -475619 -430072 -434820 -483012
5216 -483012 -478230 -415319 -290930 -252326 -376667 -319967 -376520 -537151 -438650 -287813 -363882
5205 -363882 -451375 -415721 -508222 -577386 -659692 -559710 -439828 -472529 -583493 -592335 -391800
5194 -391800 -382041 -238881 -152486 -249726 -316784 -386977 -298794 -332585 -319882 -162773 -92014
5183 -92014 -150667 -375957 -547594 -525118 -525846 -399572 -205356 -202177 -221962 -89180 -31395
5172 -31395 305511 513432 684958 949546 956048 1150581 1306769 1367556 1613395 1971304
5162 1971304 2075467 2150856 1998636 1748523 1707910 1478309 1229925 1069261 870830 896737
$$ packed form
5239f33467p1053J07160N5761m5733o0480N7959n3108j51089l4233N6054K2893
5228g49336K4852l1843L5534J177N2974Q3772M6785J01055m0589M5547m748m8192
5216d83012M782O2911J24389L8604j24341N6700n6553j60631R8501J50837p6069
5205c63882q7493L5654r2501o9164q2306R9982J19882l2701j10964q842K00535
5194c91800R759J43160Q6395r7240o7058p0193Q8183l3791J2703J57109P0759
5183i2014n8653k25290j71637K2476p28J26274J94216L179j9785J32782N7785
5172c1395L36906K07921J71526K64588O502J94533J56188O0787K45839L57909
5162A971304J04163P5389j52220k50113m0613k29601k48384j60664j98431K5907
$$ plain form
5152 896737 827479 770935 764482 667755 865785 1030866 795566 710070 845229 978087 1081528
5141 1081528 1149726 1495375 1628221 1521432 1424201 1366288 1330606 1449376 1634666 1781110
5131 1781110 1622131 1421589 1460541 1403355 1549551 1517513 1671874 1736630 1720506 1875380
5121 1875380 2015336 2108209 2213533 2466431 2714591 2779365 2788005 3057078 3408651 3588165
5111 3588165 3835332 4043463 4288536 4697181 4870867 5136696 5311632 5361958 5569975 5628681
5101 5628681 5581153 5589219 5393254 5542634 5721818 5719623 5909993 6071646 6254242 6686251
5091 6686251 6935678 7277891 7742139 8057195 8482123 9002435 9388368 9766524 10165783 10519609
5081 10519609 10708488 10725807 11055272 11388916 11499660 11872622 12278137 12595245 13180877 13619982
$$ packed form
5152H96737o9258n6544o453r6727J98030J65081k35300q5496J35159J32858J03441
5141A081528O8198L45649J32846j06789r7231n7913l5682J18770J85290J46444
5131A781110j58979k00542L8952n7186J46196l2038J54361O4756j6124J54874
5121A875380J39956R2873J05324K52898K48160O4774Q640K69073L51573J79514
5111C588165K47167K08131K45073M08645J73686K65829J74936N0326K08017N8706
5101E628681m7528Q066j95965J49380J79184k195J90370J61653J82596M32009
5091F686251K49427L42213M64248L15056M24928N20312L85933L78156L99259L53826
5081A0519609J88879J7319L29465L33644J10744L72962M05515L17108N85632M39105
$$ plain form
5071 13619982 14044905 14512496 15075006 15601349 16204397 16676888 17146903 17646706 17991344
5062 17991344 18430133 18811840 19173854 19517839 19718529 20008797 20193469 20147824 20052392 19975338
5052 19975338 19842550 19538354 19185968 18973914 18700720 18399549 18220901 17886001 17500337
5043 17500337 17011870 16586187 16162503 15623535 14941877 14508565 14098676 13560234 12959018
5034 12959018 12396746 12038081 11496565 10958509 10499141 10017116 9466265 8988254 8809504
5025 8809504 8479502 8030636 7749901 7510751 7227888 6901865 6753425 6658970 6468672 6199914
5015 6199914 5786352 5622112 5358115 5105751 5132696 4977039 4749425 4502712 4426392 4439656
5005 4439656 4153620 3896512 3948827 3890931 3671314 3550061 3498955 3465703 3533151 3443322 3495304
$$ packed form
5071A3619982M24923M67591N62510N26343O03048M72491M70015M99803L44638
5062A7991344M38789L81707L62014L43985K00690K90268J84672m5645r5432p7054
5052A9975338j32788l04196l52386k12054k73194l01171j78648l34900l85664
5043A7500337m88467m25683m23684n38968o81658m33312m09889n38442o01216
5034A2959018n62272l58665n41516n38056m59368m82025n50851m78011j78750
5025H809504l30002m48866k80735k39150k82863l26023j48440r4455j90298k68758
5015F199914m13562j64240k63997k52364K6945j55657k27614k46713p6320J3264
5005D439656k86036k57108N2315n7896k19617j21253n1106l3252O7448q9829N1982
$$ plain form
4994 3495304 3477072 3429472 3336756 3201338 3058399 2853460 2706205 2627810 2455963 2356142
4984 2356142 2283956 2224742 2193492 2108969 1901554 1902289 1965620 1722950 1707212 1535288 1289785
4973 1289785 1278313 1306284 1148726 1061013 913482 917539 1071163 1043211 1135269 1022844 1015551
4962 1015551 1209915 1142097 1182744 1008534 751411 665735 502195 373708 517814 437909
4952 437909 326039 180992 -26970 -85658 -220987 -268656 -41844 -119250 -22347 298581
4942 298581 432813 361100 371076 376500 436607 190528 -45402 -28897 -240009 -258476 -158529
4931 -158529 -274215 -363779 -411330 -518073 -329062 -506306 -527860 -393615 -249169 -363501
4921 -363501 -531309 -425828 -243811 -221079 -171426 -49216 -227826 -481816 -495285 -505034 -556019
$$ packed form
4994C495304j8232m7600r2716j35418j42939k04939j47255p8395j71847r9821
4984B356142p2186n9214l1250q4523k07415P35O3331k42670j5738j71924k45503
4973A289785j1472K7971j57558q7713j47531M057J53624k7952R2058j12425p293
4962A015551J94364o7818M0647j74210k57123q5676j63540j28487J44106p9905
4952D37909j11870j45047k07962n8688j35329m7669K26812p7406R6903L20928
4942B98581J34232p1713R976N424O0107k46079k35930J6505k11112j8467R9947
4931a58529j15686q9564m7551j06743J89011j77244k1554J34245J44446j14332
4921c63501j67808J05481J82017K2732M9653J22210j78610k53990j3469r749n0985
$$ plain form
4910 -556019 -667252 -773568 -563058 -534477 -679220 -608176 -491471 -305173 -294078 -290250 -213962
4899 -213962 -309634 -306699 -204477 -241322 -180093 -282723 -323834 -161644 -308665 -277730 -229330
4888 -229330 -303902 -384938 -496570 -440529 -531837 -527311 -466633 -489133 -470578 -419479 -425655 -534542
4876 -534542 -497530 -490068 -499021 -464028 -649633 -774063 -601744 -696446 -587138 -473236 -502520
4865 -502520 -471401 -575650 -420841 -285361 -354763 -310942 -263828 -226476 -75984 -53554 79790
4854 79790 164668 183016 314411 200018 -100747 -100090 -21647 -89730 -188551 -226807 -280428 -233653
4842 -233653 -311345 -58788 202585 197322 300826 233822 271327 329897 443977 776287 1175890
4831 1175890 1598132 2217423 2915652 3875012 5146288 6851975 8605456 10977423 13729948
$$ packed form
4910e56019j11233j06316K10510K8581j44743P1044J16705J86298J1095L828P6288
4899b13962r5672K935J02222l6845O1229j02630m1111J62190j47021L0935M8400
4888b29330p4572q1036j11632N6041r1308M526O0678k2500J8555N1099o176j08887
4876e34542L7012P462q953L4993j85605j24430J72319r4702J09308J13902k9284
4865e02520L1119j04249J54809J35480o9402M3821M7114L7352J50492K2430J33344
4854G9790Q4878J8348J31395j14393l00765O57P8443o8083r8821l8256n3621M6775
4842b33653p7692K52557K61373n263J03504o7004L7505N8570J14080L32310L99603
4831A175890M22242O19291O98229R59360J271276J705687J753481K371967K752525
$$ plain form
4822 13729948 15907823 16685930 16551039 16320456 15439384 13118036 10621300 8635206 7084652
4813 7084652 5976059 4963696 4321762 4147738 3975902 4058642 4359700 4625066 5322030
4804 5322030 6156480 7366965 8433848 9116556 9710412 9942267 9674387 9102463 8181639
4795 8181639 7027181 5963331 4955662 4034603 3351274 2564695 2283632 1929484 1540175
4786 1540175 1464432 1104299 902270 968991 806500 693051 496846 156368 177791 74378
4776 74378 117446 218362 53682 273766 454674 317663 318988 269388 191255 294565 171989
4765 171989 218400 177727 115101 412699 416247 407662 455482 276008 372939 570408 563357 753710
4753 753710 1007899 1130807 1259180 1376381 1554779 1923841 2438738 3082231 3785902 4616685
$$ packed form
4822A3729948K177875P78107j34891k30583q81072k321348k496736j986094j550554
4813G084652j108593j012363o41934j74024j71836Q2740L01058K65366O96964
4804E322030Q34450J210485J066883O82708N93856K31855k67880n71924r20824
4795H181639j154458j063850j007669r21059o83329p86579k81063l54148l89309
4786A540175p5743l60133k02029O6721j62491j13449j96205l40478K1423j03413
4776G4378M3068J00916j64680K20084J80908j37011J325m9600p8133J03310j22576
4765A71989M6411m0673o2626K97598L548q585M7820j79474R6931J97469p051J90353
4753G53710K54189J22908J28373J17201J78398L69062N14897O43493P03671Q30783
$$ plain form
4743 4616685 5828011 7206889 8707788 10359412 11789224 12906747 13402913 13304076 12985338
4734 12985338 12226394 11018936 9581941 8060298 6732982 5549939 4535781 3881377
4726 3881377 3126642 2540996 2065843 1794806 1726017 1318505 1011901 944386 814943 669760
4716 669760 673436 470635 368730 257522 296402 510802 306934 -27394 -55907 -119065 -241841
4705 -241841 -301267 -409091 -435945 -550263 -669448 -506942 -454156 -400077 -307804 -243617 -183390
4694 -183390 -249325 -334737 -238308 -284074 -358371 -329468 -404131 -258841 -390528 -620791 -514706
4683 -514706 -535433 -659551 -666821 -498618 -429446 -612611 -631902 -519470 -617128 -599114 -475021
4672 -475021 -314241 -433949 -483794 -502720 -413560 -398818 -468057 -468757 -581194 -699901 -629755
$$ packed form
4743D616685J211326J378878J500899J651624J429812J117523M96166r8837l18738
4734A2985338p58944j207458j436995j521643j327316j183043j014158o54404
4726C881377p54735n85646m75153k71037o8789m07512l06604o7515j29443j45183
4716F69760L676k02801j01905j11208L8880K14400k03868l34328k8513o3158j22776
4705b41841n9426j07824k6854j14318j19185J62506N2786N4079R2273O4187O0227
4694a83390o5935q5412R6429m5766p4297K8903p4663J45290j31687k30263J06085
4683e14706k0727j24118p270J68203O9172j83165j9291J12432r7658J8014J24093
4672d75021J60780j19708m9845j8926Q9160J4742o9239p00j12437j18707P0146
$$ plain form
4661 -629755 -594044 -628389 -711076 -684948 -533504 -522928 -559179 -656977 -561894 -457089 -480702
4650 -480702 -490904 -394099 -472107 -503530 -501392 -465509 -629046 -611749 -460374 -399868 -387505
4639 -387505 -492531 -433898 -244626 -388668 -353460 -316149 -195725 29963 199053 557661
4629 557661 1120681 1648086 2309328 2893309 3492874 3766440 3732198 3719080 3611843 3295950
4619 3295950 2707792 2269998 1969559 1842194 1762680 1743709 1911586 2062086 2136226 2473898
4609 2473898 2922567 3296575 3510816 3948322 4550606 4920950 5280801 5869246 6258663 6655726
4599 6655726 7216309 7743785 8314073 8630808 8861950 9276952 9499599 9699455 10138093 10449804
4589 10449804 10618140 10550043 10486405 10422688 10040526 9544964 9307242 9197592 8699616 8133498
$$ packed form
4661f29755L5711l4345q2687K6128J51444J0576l6251r7798R5083J04805k3613
4650d80702j0202R6805p8008l1423K138L5883j63537J7297J51375O0506J2363
4639c87505j05026N8633J89272j44042L5208L7311J20424K25688J69090L58608
4629E57661N63020N27405O61242N83981N99565K73566l4242j3118j07237l15893
4619C295950n88158m37794l00439j27365p9514j8971J67877J50500P4140L37672
4609B473898M48669L74008K14241M37506O02284L70344L59851N88445L89417L97063
4599F655726N60583N27476N70288L16735K31142M15002K22647J99856M38638L11711
4589A0449804J68336o8097o3638o3717l82162m95562k37722j09650m97976n66118
$$ plain form
4579 8133498 7704292 7427307 6957719 6460602 6146759 5645414 4933545 4470682 4096499 3670629
4569 3670629 3246305 2606485 2358553 2207204 1786289 1634650 1478683 1431066 1246757 1048543
4559 1048543 1107875 933418 717235 715552 757246 895092 1008565 1109833 1408029 1214347
4549 1214347 1213140 1424241 1400830 1485900 1527456 1829551 2121832 2484779 2693767 3060532
4539 3060532 3400392 3810743 4276761 4540026 4810683 4974068 5069892 5167548 5084280 4740176
4529 4740176 4429185 4116129 3844363 3457421 2972404 2625161 2414062 2158014 1928382 1592173
4519 1592173 1422084 1351655 1248555 1338423 1199663 1035953 1014613 961440 1004886 874534
4509 874534 761821 563005 436620 263909 98204 63084 36769 189164 426407 466749
$$ packed form
4579H133498m29206k76985m69588m97117l13843n01345p11869m62863l74183m25870
4569C670629m24324o39820k47932j51349m20915j51639j55967m7617j84309j98214
4559A048543N9332j74457k16183j683M1694J37846J13473J01268K98196j93682
4549A214347j207K11101k3411Q5070M1556L02095K92281L62947K08988L66765
4539C060532L39860M10351M66018K63265K70657J63385R5824R7656q3268l44104
4529D740176l10991l13056k71766l86942m85017l47243k11099k56048k29632l36209
4519A592173j70089p0429j03100Q9868j38760j63710k1340n3173M3446j30352
4509H74534j12713j98816j26385j72711j65705l5120k6315J52395K37243M0342
$$ plain form
4499 466749 333162 55524 -153255 -162410 -251468 -324889 -210245 -116221 -121576 -215368 -283244
4488 -283244 -222830 -323679 -249511 -279481 -600312 -574476 -507832 -370144 -358768 -350565 -258609
4477 -258609 -177368 -208867 -374885 -436034 -285916 -204228 -385377 -612320 -665633 -549446 -405670
4466 -405670 -358238 -433846 -265802 -111753 -7676 154918 14033 78497 435856 599797
4456 599797 748540 909123 910234 1073525 1154108 1334134 1560752 1693406 2190088 2606553
4446 2606553 3205148 3692298 4268637 5076361 6187148 7411316 8664809 10037895 11528006
4437 11528006 12924375 14332516 15480576 16526559 17330983 17856032 18346805 18570504 18574700
4428 18574700 18642347 18664020 18816262 18975004 19242600 19713603 20050358 20262092 20301779 20242943
$$ packed form
4499D66749j33587k77638k08779r155q9058p3421J14644R4024n355r3792o7876
4488b83244O0414j00849P4168k9970l20831K5836O6644J37688J1376Q203R1956
4477b58609Q1241l1499j66018o1149J50118Q1688j81149k26943n3313J16187J43776
4466d05670M7432p5608J68044J54049J04077J62594j40885O4464L57359J63941
4456E99797J48743J60583J111J63291Q0583J80026K26618J32654M96682M16465
4446B606553N98595M87150N76339Q07724J110787J224168J253493J373086J490111
4437A1528006J396369J408141J148060J045983Q04424N25049M90773K23699M196
4428A8574700O7647K1673J52242J58742K67596M71003L36755K11734L9687n8836
$$ plain form
4418 20242943 19701486 18839787 17680032 16261989 14835057 13319521 11910389 10635398
4410 10635398 9433885 8594224 7481115 6544754 5993352 5272288 4902010 4631652 4214318
4401 4214318 4138161 3730445 3530672 3671652 3620753 3601389 3495211 3581296 3693970 3470030
4391 3470030 3503751 3606530 3511248 3680483 3893927 4002283 4042263 3884650 3946001 4041255
4381 4041255 4104348 4316963 4330265 4496770 4638285 4578302 4789119 4959001 4972586 5216023
4371 5216023 5405205 5386368 5460442 5528280 5736091 5956170 5872149 6004589 6204951 6124891
4361 6124891 6211455 6248144 6355625 6277035 6088115 6285834 6303085 6285085 6301668 6257955 6339624
4350 6339624 6287153 6170965 6222174 6405766 6381131 6604341 6843129 6708157 6549654 6395343
$$ packed form
4418B0242943n41457q61699j159755j418043j426932j515536j409132j274991
4410A0635398j201513q39661j113109r36361n51402p21064l70278k70358m17334
4401D214318p6157m07716j99773J40980n0899j9364j06178Q6085J12674k23940
4391C470030L3721J02779r5282J69235K13444J08356L9980j57613O1351R5254
4381D041255O3093K12615J3302J66505J41515n9983K10817J69882J3585K43437
4371E216023J89182j8837P4074O7838K07811K20079q4021J32440K00362q0060
4361F124891Q6564L6689J07481p8590j88920J97719J7251j8000J6583m3713Q1669
4350F339624n2471j16188N1209J83592k4635K23210K38788j34972j58503j54311
$$ plain form
4340 6395343 6266284 6247823 6166786 6284824 6356329 6277578 6330490 6204310 6138927 6225478 6127312
4329 6127312 6249996 6554598 6576171 6680473 6846319 7014493 7145227 7290196 7324001 7528973
4319 7528973 7662048 7871903 8161454 8353311 8585238 8654236 8832103 9181053 9335188 9623313
4309 9623313 10085582 10451302 10987795 11541277 11967727 12440382 12810255 13298279 14067875 14589965
4299 14589965 15086941 15979641 16598896 17272166 18087723 18740118 19423337 19845344 20173431
4290 20173431 20590146 20599693 20586643 20813064 21152118 21607379 21873141 22241417 22966211 23255231
4280 23255231 23519731 23983945 24280096 24601664 24776682 25107398 25461842 25681430 26073304
4271 26073304 26529192 27073681 27691609 28467018 29286870 30140470 31327255 32658648 34311293
$$ packed form
4340F395343j29059j8461q1037J18038P1505p8751N2912j26180o5383Q6551r8166
4329F127312J22684L04602K1573J04302J65846J68174J30734J44969L3805K04972
4319G528973J33075K09855K89551J91857K31927O8998J77867L48950J54135K88125
4309I623313M62269L65720N36493N53482M26450M72655L69873M88024P69596N22090
4299A4589965M96976Q92700O19255O73270Q15557O52395O83219M22007L28087
4290B0173431M16715R547j3050K26421L39054M55261K65762L68276P24794K89020
4280B3255231K64500M64214K96151L21568J75018L30716L54444K19588L91874
4271B6073304M55888N44489O17928P75409Q19852Q53600J186785J331393J652645
$$ plain form
4262 34311293 36011261 37846975 39747360 41570124 43511684 45903344 48344437 50886224
4254 50886224 53345227 55709323 58553158 61495003 64449594 67802753 71184855 74752061
4246 74752061 78659460 82381389 86323121 90337329 94283626 98503211 102418006 106154987
4238 106154987 110017269 113789853 117729849 121515599 125116884 129177639 133003686 136636763
4230 136636763 140380049 143833152 147141140 150265117 152994846 155709500 158000982 159685417
4222 159685417 161070637 161961747 162753079 163456726 164013046 164465535 164854459 164946894 165016184
4213 165016184 164795596 163900611 162712641 161018945 158946432 156563199 153659471 150904725
4205 150904725 148025249 144929602 142044858 139125027 135967886 132795269 129667450 126499163
$$ packed form
4262C4311293J699968J835714J900385J822764J941560K391660K441093K541787
4254E0886224K459003K364096K843835K941845K954591L353159L382102L567206
4246G4752061L907399L721929L941732M014208L946297M219585L914795L736981
4238A06154987L862282L772584L939996L785750L601285M060755L826047L633077
4230A36636763L743286L453103L307988L123977K729729K714654K291482J684435
4222A59685417J385220Q91110P91332P03647N56320M52489L88924R2435O9290
4213A65016184k20588q94985j187970j693696k072513k383233k903728k754746
4205A50904725k879476l095647k884744k919831l157141l172617l127819l168287
$$ plain form
4197 126499163 123101755 119559207 115832763 112230584 108467426 104853301 101248006 97814223
4189 97814223 94657455 91623853 88827347 85991171 83272204 80706678 78395996 76186975
4181 76186975 74291078 72465623 70878389 69262518 67687989 66449461 65408952 64562561
4173 64562561 63817518 63338921 63063795 62908774 62928715 63206680 63713975 64617773 65820590
4164 65820590 67412037 69384521 71802010 74921986 78690500 83272204 88668941 95038706
4156 95038706 102929903 112611701 124391898 138621226 155297912 174915903 197713426
4149 197713426 223407343 251721833 282307790 314292395 346811648 378813780 409279608
4142 409279608 437223914 461336443 481428531 497337863 508479689 515005140 517370623
$$ packed form
4197A26499163l397408l542548l726444l602179l763158l614125l605295l433783
4189I7814223l156768l033602k796506k836176k718967k565526k310682k209021
4181G6186975j895897j825455j587234j615871j574529j238528j040509q46391
4173F4562561p45043m78597k75126j55021J9941K77965N07295R03798J202817
4164F5820590J591447J972484K417489L119976L768514M581704N396737O369765
4156I5038706P891197R681798J1780197J4229328J6676686J9617991K2797523
4149A97713426K5693917K8314490L0585957L1984605L2519253L2002132L0465828
4142D09279608K7944306K4112529K0092088J5909332J1141826O525451K365483
$$ plain form
4135 517370623 516800512 514026117 509473627 503976559 497689384 490407517 482410059 473195387
4127 473195387 462299313 449309814 433981768 416371047 396610034 374817161 351369013
4120 351369013 327266850 302813825 278546607 255180347 233380504 213342400 195106458
4113 195106458 179190589 165366829 153331760 142928656 133887575 126102243 119473542
4106 119473542 113423248 107982800 103108865 98657324 94326941 90083819 86031679 82179469
4098 82179469 78544970 75094681 71944263 69304677 67074333 65090925 63184743 61518170
4090 61518170 60286007 59306965 58233405 57101784 56072757 55130472 54426240 53521145 52644716
4081 52644716 51743347 50910400 50409770 49623849 48889592 48515385 48155467 47951498 47846213
$$ packed form
4135E17370623n70111k774395m552490n497068o287175p281867p997458r214672
4127D73195387j0896074j2989499j5328046j7610721j9761013k1792873k3448148
4120C51369013k4102163k4453025k4267218k3366260k1799843k0038104j8235942
4113A95106458j5915869j3823760j2035069j0403104r041081p785332o628701
4106A19473542o050294n440448m873935m451541m330383m243122m052140l852210
4098H2179469l634499l450289l150418k639586k230344j983408j906182j666573
4090F1518170j232163r79042j073560j131621j029027r42285p04232r05095q76429
4081E2644716r01369q32947n00630p85921p34257l74207l59918k03969j05285
$$ plain form
4072 47846213 47734163 47464153 47139992 46727595 46282050 45782019 44993299 44098854 43264181
4063 43264181 42525286 41633285 40665862 39938727 39157339 38603848 38193267 37636372 37161926
4054 37161926 36624952 36169795 36099923 35794353 35504215 35359588 35211409 34899603 34314159 33774721
4044 33774721 33210280 32631710 31973824 31510878 31209897 31019512 30786700 30498472 30496449 30306235
4034 30306235 30113136 30060344 29897727 29670118 29624113 29729315 29729386 29619148 29587167 29748082 29753329
4023 29753329 29766827 29942781 29976370 30272400 30683777 30887328 31138384 31043395 30913021 30993778
4013 30993778 30669343 30336958 29854154 29378072 29265406 29067225 28753240 28504402 28277450
4004 28277450 27959239 27513546 26842934 26110046 25465794 24770777 24030799 23186542 22470169
$$ packed form
4072D7846213j12050k70010l24161m12397m45545n00031p88720q94445q34673
4063D3264181p38895q92001r67423p27135p81388n53491m10581n56895m74446
4054C7161926n36974m55157o9872l05570k90138j44627j48179l11806n85444n39438
4044C3774721n64441n78570o57886m62946l00981j90385k32812k88228k023j90214
4034C0306235j93099n2792j62617k27609m6005J05202P1j10238l1981J60915N247
4023B9753329J3498J75954L3589K96030M11377K03551K51056r4989j30374Q0757
4013C0993778l24435l32385m82804m76082j12666j98181l13985k48838k26952
4004B8277450l18211m45693o70612p32888o44252o95017p39978q44257p16373
$$ plain form
3995 22470169 21740831 20952660 20230698 19477140 18702360 18109602 17556138 17029242 16520175
3986 16520175 16119689 15847324 15598505 15001787 14602417 14578063 14216654 13867814 13767455 13642979
3976 13642979 13464534 13342208 13293524 13252952 13137548 13181777 13332128 13488090 13451895 13401929
3966 13401929 13636318 13831877 13943981 14195414 14368088 14498036 14522939 14618515 14684446 14583257
3956 14583257 14474603 14475608 14617006 14786388 15021222 15278373 15523336 15867878 15913390 15875326
3946 15875326 15632889 15145340 14573804 14030311 13434773 12986947 12406600 12118993 11829163
3937 11829163 11728734 11829161 11781038 11828553 11710773 11928136 12230913 12230352 12359947 12579329
3927 12579329 12856005 13299478 13622359 14057472 14808052 15357297 15857832 16749727 17726410
$$ packed form
3995B2470169p29338p88171p21962p53558p74780n92758n53464n26896n09067
3986A6520175m00486k72365k48819n96718l99370k4354l61409l48840j00359j24476
3976A3642979j78445j22326m8684m0572j15404M4229J50351J55962l6195m9966
3966A3401929K34389J95559J12104K51433J72674J29948K4903R5576O5931j01189
3956A4583257j08654J005J41398J69382K34834K57151K44963L44542M5512l8064
3946A5875326k42437m87549n71536n43493n95538m47826n80347k87607k89830
3937A1829163j00429J00427m8123M7515j17780K17363L02777n61J29595K19382
3927A2579329K76676M43473L22881M35113P50580N49245N00535Q91895R76683
$$ plain form
3918 17726410 18814731 19805772 20571171 21453444 22450596 23192756 24009339 24873362 25864658
3909 25864658 27104633 28018103 29156234 30258106 30973495 31896947 32855435 33785781 34881008
3900 34881008 35742765 37007618 38350099 39528129 41142701 42681979 44037195 45535244
3892 45535244 46902823 48191334 49275782 49989377 51046593 52122173 53092434 54273573
3884 54273573 55477403 56940341 58824288 60641888 62837509 65014970 67011688 69497213
3876 69497213 71985367 74350723 77232983 80196334 83716180 87748516 92000592 96911030
3868 96911030 102405304 108405090 115395365 123161962 132164135 142640262 154285679 167635835
3860 167635835 182953294 199818607 218431386 238213800 258719263 279931651 300876140
$$ packed form
3918A7726410J088321R91041P65399Q82273R97152P42160Q16583Q64023R91296
3909B5864658J239975R13470J138131J101872P15389R23452R58488R30346J095227
3900C4881008Q61757J264853J342481J178030J614572J539278J355216J498049
3892D5535244J367579J288511J084448P13595J057216J075580R70261J181139
3884E4273573J203830J462938J883947J817600K195621K177461J996718K485525
3876F9497213K488154K365356K882260K963351L519846M032336M252076M910438
3868I6911030N494274N999786O990275P766597R002173J0476127J1645417J3350156
3860A67635835J5317459J6865313J8612779J9782414K0505463K1212388K0944489
$$ plain form
3853 300876140 321219867 340196048 356854382 371316216 383974472 395020829 405408431
3846 405408431 415754210 427285994 440231194 454092378 468681479 483081852 495777166
3839 495777166 505863680 511987023 513295797 509669699 500693511 487488430 471266157 452819443
3831 452819443 433711375 415035768 397222146 381040030 366047349 351979910 338640198
3824 338640198 325180224 311128403 295771576 278790630 260409372 240649995 220558694
3817 220558694 200907165 181942939 164593886 149355182 135887684 124425250 114406540
3810 114406540 105740413 98596719 92133876 86435226 81553108 77202087 73330499 70010381
3802 70010381 66889036 64291830 62184009 60132488 58304718 56683216 55206995 53773034
$$ packed form
3853C00876140K0343727J8976181J6658334J4461834J2658256J1046357J0387602
3846D05408431J0345779J1531784J2945200J3861184J4589101J4400373J2695314
3839D95777166J0086514O123343J308774l626098q976188j3205081j6222273j8446714
3831D52819443j9108068j8675607j7813622j6182116j4992681j4067439j3339712
3824C38640198j3459974j4051821j5356827j6980946j8381258j9759377k0091301
3817B20558694j9651529j8964226j7349053j5238704j3467498j1462434j0018710
3810A14406540q666127p143694o462843n698650m882118m351021l871588l320118
3802G0010381l121345k597206k107821k051521j827770j621502j476221j433961
$$ plain form
3794 53773034 52480230 51240071 49942992 48931976 47947050 47059375 46211384 45191588 44347400
3785 44347400 43484692 42624368 41643801 40733199 39960720 39018188 38143100 37320501 36296227
3776 36296227 35164046 33991960 32980918 32139676 31202518 30237571 29453129 28814919 28105567
3767 28105567 27320992 26708599 26002214 25185522 24589844 23919854 23260573 22745713 22333113
3758 22333113 21817316 21185131 20623067 20239858 19841104 19317208 18630529 18300468 18087974
3749 18087974 17718447 17420061 17108557 17104889 17050567 16757862 16499904 16247095 16044036 15726441
3739 15726441 15252892 14975493 14499066 14113421 14068338 13718393 13522130 13393198 13179875 13081227
3729 13081227 12751437 12270217 12144578 11878508 11545011 11411738 11043087 11036956 10881696 10521881
$$ packed form
3794E3773034j292804j240159j297079j011016r84926q87675q47991j019796q44188
3785D4347400q62708q60324r80567r10602p72479r42532q75088q22599j024274
3776C6296227j132181j172086j011042q41242r37158r64947p84442o38210p09352
3767B8105567p84575o12393p06385q16692n95678o69990o59281n14860m12600
3758B2333113n15797o32185n62064l83209l98754n23896o86679l30061k12494
3749A8087974l69527k98386l11504l668n4322k92705k57958k52809k03059l17595
3739A5726441m73549k77399m76427l85645m5083l49945j96263j28932k13323r8648
3729A3081227l29790m81220j25639k66070l33497j33273l68651o131j55260l59815
$$ plain form
3719 10521881 10494126 10253866 10025508 10009995 9963252 9782618 9453739 9137401 9100235 9001825
3709 9001825 8752700 8648787 8783091 8803143 8642848 8423177 8170675 7861296 7623649 7598781
3699 7598781 7445807 7134907 7018360 7076971 7212284 7085778 6769919 6819851 6773078 6437374
3689 6437374 6333422 6280964 6343582 6238359 5998103 6050923 5903651 5639509 5565086 5389539
3679 5389539 5226514 5199586 5186927 5276604 5114999 4791299 4876624 4973199 4938443 4933076 4884031
3668 4884031 4832653 4672797 4573890 4604718 4632763 4503170 4385048 4193824 3995275 3917989
3658 3917989 3728156 3717844 3874066 3874065 3835773 3709192 3678199 3732336 3735610 3857391 3837586 3696209
3646 3696209 3786797 3757776 3764624 3645813 3643715 3814028 3955249 3901351 3682247 3662406 3686299
$$ packed form
3719A0521881k7755k40260k28358j5513m6743j80634l28879l16338l7166r8410
3709I001825k49125j03913J34304K0052j60295k19671k52502l09379k37647k4868
3699G598781j52974l10900j16547N8611J35313j26506l15859M9932m6773l35704
3689F437374j03952n2458O2618j05223k40256N2820j47272k64142p4423j75547
3679E389539j63025k6928j2659Q9677j61605l23700Q5325R6575l4756n367m9045
3668D884031n1378j59856r8907L0828K8045j29593j18122j91224j98549p7286
3658C917989j89833j0312J56222jl8292j26581l0993N4137L274J21781j9805j41377
3646C696209R0588k9021O848j18811k098J70313J41221n3898k19104j9841K3893
$$ plain form
3635 3686299 3667159 3583981 3626725 3708763 3596013 3618520 3805684 3920521 3912916 3915540 3978527
3624 3978527 3911803 3757179 3588809 3523063 3612581 3648617 3526127 3331570 3291631 3351833 3304014
3613 3304014 3379977 3275759 3172034 3084139 3021676 2972927 2877059 2864214 2924756 2955032 2995666
3602 2995666 2928750 2826693 2740490 2597282 2436113 2503341 2556281 2354895 2311525 2223570 2217640
3591 2217640 2428168 2355155 2228967 2265823 2080850 2059739 1974812 2060904 2091769 2114567 2208827
3580 2208827 2166606 1997973 2007253 2082734 2054903 2122329 2236818 2304030 2212936 2281448 2543734
3569 2543734 2834832 2811883 2879478 3101798 3042019 2963379 3033275 3156039 3176315 3177588 3435730
3558 3435730 3583778 3578698 3692448 3856791 4042436 4050469 3880238 3849969 3835710 3786089 3966456
$$ packed form
3635C686299j9140q3178M2744Q2038j12750K2507J87164J14837p605K624O2987
3624C978527o6724j54624j68370o5746Q9518L6036j22490j94557l9939O0202m7819
3613C304014P5963j04218j03725q7895o2463m8749r5868j2845O0542L0276M0634
3602B995666o6916j02057q6203j43208j61169O7228N2940k01386m3370q7955n930
3591B217640K10528p3013j26188L6856j84973k1111q4927Q6092L0865K2798R4260
3580B208827m2221j68633R280P5481k7831O7426J14489O7212r1094O8512K62286
3569B543734K91098k2949O7595K22320n9779p8640O9896J22764K0276J273K58142
3558C435730J48048n080J13750J64343J85645Q033j70231l0269j4259m9621J80367
$$ plain form
3547 3966456 4074025 4084098 3956872 3853995 3815446 3771996 3710221 3511397 3517528 3426688 3297548
3536 3297548 3455197 3222743 3084642 2958812 3021325 3032593 2628950 2592516 2664235 2505886
3526 2505886 2474022 2438715 2263278 2152958 1937609 1966468 2037876 1884241 1761743 1849814
3516 1849814 1867910 1825420 1720809 1637036 1723893 1641908 1647254 1799954 1618783 1529919 1546682
3505 1546682 1644907 1673016 1466596 1491201 1651164 1425398 1506911 1749763 1744165 1580072 1467803
3494 1467803 1506936 1662060 1621695 1571091 1604664 1638434 1592475 1561629 1567812 1492779 1399503
3483 1399503 1559741 1633337 1585308 1548659 1561686 1607236 1614700 1642577 1588281 1607348 1604268 1617709
3471 1617709 1591859 1601473 1722213 1726098 1658265 1645197 1493829 1439686 1444875 1455755 1637533
$$ packed form
3547C966456J07569J0073j27226j02877l8549m3450o1775j98824O131r0840j29140
3536C297548J57649k32454j38101j25830O2513J1268m03643l6434P1719j58349
3526B505886l1864l5307j75437j10320k15349K8859P1408j53635j22498Q8071
3516A849814J8096m2490j04611q3773Q6857q1985N346J52700j81171q8864J6763
3505A546682R8225K8109k06420K4605J59963k25766Q1513K42852n598j64093j12269
3494A467803L9133J55124m0365n0604L3573L3770m5959l0846O183p5033r3276
3483A399503J60238P3596m8029l6649J3027M5550P464K7877n4296J9067l080J3441
3471A617709k5850R614J20740L885o7833j3068j51368n4143N189J0880J81778
$$ plain form
3460 1637533 1763294 1717941 1837620 1947336 1967703 2055739 1988980 1975496 1976901 1908310 1952475
3449 1952475 1849685 1683329 1791950 1831090 1920603 2025979 2042741 2159670 2023647 1861892
3439 1861892 1991402 1874103 1711130 1713705 1694703 1512075 1445942 1495323 1532380 1571926 1375910
3428 1375910 1360642 1151097 1052016 1032218 982005 1059314 1206149 1138286 1197518 1054884 1000660
3417 1000660 1165415 1207796 1191350 1155498 1131047 1294972 1171383 1024299 1124183 1171978 1264788
3406 1264788 1155772 889901 656268 662965 725477 733985 751117 777131 862848 827631 786384
3395 786384 840759 750828 771640 701685 566984 513079 557802 703114 958885 1015148 712282
3384 712282 611082 459983 343746 322639 397302 442704 400638 375607 410947 418483 282490
$$ packed form
3460A637533J25761m5353J19679J09716K0367Q8036o6759j3484J405o8591M4165
3449A952475j02790j66356J08621L9140Q9513J05376J6762J16929j36023j61755
3439A861892J29510j17299j62973K575j9002j82628o6133M9381L7057L9546j96016
3428A375910j5268k09545r9081j9798n0213P7309J46835o7863N9232j42634n4224
3417A000660J64755M2381j6446l5852k4451J63925j23589j47084R9884M7795R2810
3406A264788j09016k65871k33633O697O2512Q508J7132K6014Q5717l5217m1247
3395G86384N4375q9931K0812o9955j34701n3905M4723J45312K55771N6263l02866
3384G12282j01200j51099j16237k1107P4663M5402m2066k5031L5340P536j35993
$$ plain form
3373 282490 267852 262843 197683 223327 238785 272679 438191 490150 611940 565174 545743
3362 545743 456986 342762 301114 112674 77994 283763 365800 242884 298953 447174 406019
3351 406019 356319 298962 273286 270982 258661 285149 298375 406307 641566 713737 759588
3340 759588 657354 522632 761431 618974 491860 501716 647024 890686 830359 826953 899822
3329 899822 901176 824048 865401 829154 799479 712318 672685 661386 532636 573395 531689 485661
3317 485661 633589 806358 822847 786138 725832 725160 767823 591566 550803 703783 633977
3306 633977 525969 403506 457675 682650 578161 408824 224867 399836 544124 518331
3296 518331 391808 528628 723096 827797 765308 543899 498630 410043 345589 331606 185693
$$ packed form
3373B82490j4638n009o5160K5644J5458L3894J65512N1959J21790m6766j9431
3362E45743q8757j14224m1648j88440l4680K05769Q2037j22916N6069J48221m1155
3351D06019m9700n7357k5676k304j2321K6488J3226J07932K35259P2171M5851
3340G59588j02234j34722K38799j42457j27114R856J45308K43662o0327l406P2869
3329H99822J354p7128M1353l6247k9675q7161l9633j1299j28750M0759m1706m6028
3317D85661J47928J72769J6489l6709o0306o72M2663j76257m0763J52980o9806
3306F33977j08008j22463N4169K24975j04489j69337j83957J74969J44288k5793
3296E18331j26523J36820J94468J04701o2489k21409m5269q8587o4454j3983j45913
$$ plain form
3285 185693 193673 370629 379560 402600 346705 303913 223628 77183 48023 174412 270886
3274 270886 287048 335934 443178 465576 267339 215578 250153 110028 105926 172372 173901
3263 173901 219397 301245 478486 469697 343737 298863 141898 61922 112441 211019 461063
3252 461063 451765 343699 414080 387397 443937 374323 191965 318708 445878 393588 408413
3241 408413 419051 687402 843187 698347 643253 431400 314004 413313 435661 625483
3231 625483 655992 558153 597466 535850 339392 363179 354559 443469 594243 643473 737970
3220 737970 664577 496532 661323 761624 684774 525232 380696 534670 586732 491639
3210 491639 637935 913184 976078 1074347 1011099 907843 787510 706276 831189 911211 739207
$$ packed form
3285A85693P980J76956Q931K3040n5895m2792q0285j46445k9160J26389R6474
3274B70886J6162M8886J07244K2398j98237n1761L4575j40125m102O6446J529
3263A73901M5496Q1848J77241q789j25960m4874j56965p9976N0519R8578K50044
3252D61063r298j08066P0381k6683N6540o9614j82358J26743J27170n2290J4825
3241D08413J0638K68351J55785j44840n5094k11853j17396R9309K2348J89822
3231F25483L0509r7839L9313o1616j96458K3787q620Q8910J50774M9230R4497
3220G37970p3393j68045J64791J00301p6850j59542j44536J53974N2062r5093
3210D91639J46296K75249O2894R8269o3248j03256j20333q1234J24913Q0022j72004
$$ plain form
3199 739207 670364 739331 736922 846308 955730 904411 714290 454935 483710 830940 578816
3188 578816 526307 595062 616605 706966 602158 520198 525185 511812 531600 547404 454668 360427
3176 360427 317189 349575 566472 661553 731959 690084 643386 660900 604084 612263 553296 418508
3164 418508 522651 539252 385487 526217 428974 346315 526454 558913 320882 268827 326628
3153 326628 494790 476113 394969 528220 449833 513350 610470 614654 521660 355729 426368
3142 426368 442863 281046 237049 422596 506189 501327 438146 449985 370728 284389 404489
3131 404489 507802 371723 411880 464974 496672 402230 351639 445184 437699 187353 216750
3120 216750 305846 291521 339729 514687 682136 733063 613208 599165 595077 484055 467164
$$ packed form
3199G39207o8843O8967k409J09386J09422n1319j90121k59355K8775L47230k52124
3188E78816n2509O8755K1543R0361j04808q1960M987j3373J9788J5804r2736r4241
3176C60427m3238L2386K16897R5081P0406m1875m6698J7514n6816Q179n8967j34788
3164D18508J04143J6601j53765J40730r7243q2659J80139L2459k38031n2055N7801
3153C26628J68162j8677q1144J33251p8387O3517R7120M184r2994j65931P0639
3142D26368J6495j61817m3997J85547Q3593m862o3181J1839p9257q6339J20100
3131D04489J03313j36079M0157N3094L1698r4442n0591R3545p485k50346K9397
3120B16750Q9096j4325M8208J74958J67449N0927j19855j4043m088j11022j6891
$$ plain form
3109 467164 550002 484697 264709 136394 318000 490779 469121 506225 358762 315548 467632
3098 467632 387133 214358 250393 337149 507934 605062 632094 671870 633114 601586 693816
3087 693816 596824 519454 391958 390824 491747 520811 611145 743578 663042 450785 269472
3076 269472 276471 396886 447638 484324 632938 694240 730977 701724 654153 664271 681512
3065 681512 630560 446063 236589 224034 278380 309686 253574 318378 188299 233855 248375
3054 248375 205851 212409 -25637 -97028 171697 294121 317592 226518 152264 177256 -96979
3043 -96979 -105789 -132382 -253113 -169713 6617 157280 151623 79004 139111 221549 177235 124613
3031 124613 69032 -14888 -110910 -298036 -300649 -217385 -77064 -45228 -108715 -230674 -224392
$$ packed form
3109D67164Q2838o5305k19988j28315J81606J72779k1658L7104j47463m3214J52084
3098D67632q0499j72775L6035Q6756J70785R7128K7032L9776l8756l1528R2230
3087F93816r6992p7370j27496j134J00923K9064R0334J32433q0536k12257j81313
3076B69472O999J20415N0752L6686J48614O1302L6737k9253m7571J0118J7241
3065F81512n0952j84497k09474j2555N4346L1306n6112O4804j30079M5556J4520
3054B48375m2524O558k38046p1391K68725J22424K3471r1074p4254K4992k74235
3043i6979q810k6593j20731Q3400J76330J50663n657p2619O0107Q2438m4314n2622
3031A24613n5581q3920r6022j87126k613Q3264J40321L1836o3487j21959O282
$$ plain form
3020 -224392 -336005 -306614 -266850 -152383 5124 4395 58478 128798 204936 186812 175986
3009 175986 92124 -94941 -295767 -187352 -247215 -471986 -326656 -231865 -252007 -169234 -231926
2998 -231926 -248855 -269007 -208803 -73518 -142815 -218017 -148082 -115782 4127 95391 9296
2987 9296 48517 -24864 -75790 -55394 -303629 -411700 -211066 -168166 -64253 -98875 -259945
2976 -259945 -27633 97761 46938 81422 -81681 -242593 -151554 -121535 -121318 -159475 -228793
2965 -228793 -223594 -90581 -212015 -185010 -70412 -53053 28986 -94132 -58833 -76686 -280039
2954 -280039 -119168 3115 -69870 61387 10457 -4982 -38852 -165283 -105485 -123629 -351027
2943 -351027 -279178 -290053 -323472 -255870 -191917 -110309 -122943 -190211 19020 52574 -260918
$$ packed form
3020b24392j11613K9391L9764J14467J57507p29N4083P0320P6138j8124j0826
3009A75986q3862j87065k00826J08415n9863k24771J45330R4791k0142Q2773o2692
2998b31926j6929k0152O0204J35285o9297p5202O9935L2300J19909R1264q6095
2987I296L9221p3381n0926K0396k48235j08071K00634M2900J03913l4622j61070
2976b59945K32312J25394n0823L4484j63103j60912R1039L0019K17l8157o9318
2965b28793N199J33013j21434K7005J14598J7359Q2039j23118L5299j7853k03353
2954b80039J60871J22283p2985J31257n0930j5439l3870j26431N9798j8144k27398
2943c51027P1849j0875l3419O7602O3953Q1608j2634o7268K09231L3554l13492
$$ plain form
2932 -260918 -182557 -79533 -77447 -42033 -274362 -116772 -60998 -190488 -33406 21314 -161435
2921 -161435 -190253 -307842 -429673 -513657 -652590 -536990 -418362 -327020 -280515 -201971 -185219
2910 -185219 -155711 -276095 -381539 -329926 -338001 -306453 -296534 -276853 -169621 -284572 -272385
2899 -272385 -222801 -329775 -367320 -307524 -390990 -410566 -351521 -302631 -217927 -295950 -248648
2888 -248648 -234035 -195232 -188492 -192059 -174095 -195584 -97846 -160774 -55743 -55215 -112836 -81401
2876 -81401 20715 16819 -102341 -225308 -176291 -134200 -80469 -136675 -165899 -119533 -76265
2865 -76265 74579 -48476 -172195 -62453 20848 -74869 -62205 -118539 -157851 -107249 -117353
2854 -117353 -105285 -157010 -196437 -315003 -160643 -24257 -79849 -215057 -105617 -36416 -72764
$$ packed form
2932b60918P8361J03024K086L5414k32329J57590N5774j29490J57082N4720j82749
2921a61435k8818j17589j21831q3984j38933J15600J18628R1342M6505P8544J6752
2910a85219K9508j20384j05444N1613q075L1548R919J9681J07232j14951J2187
2899b72385M9584j06974l7545N9796q3466j9576N9045M8890Q4704p8023M7302
2888b48648J4613L8803O740l567J7964k1489R7738o2928J05031N28n7621L1435
2876h1401J02116l896j19160j22967M9017M2091N3731n6206k9224M6366M3268
2865g6265J50844j23055j23719J09742Q3301r5717J2664n6334l9312N0602j0104
2854a17353J2068n1725l9427j18566J54360J36386n5592j35208J09440O9201l6348
$$ plain form
2843 -72764 -89671 -236544 -354930 -260106 -381890 -373811 -360135 -552216 -501036 -413424 -350781
2832 -350781 -337950 -279512 -196880 -250845 -282908 -122528 -137914 -185668 -214230 -63052 52148
2821 52148 -49728 -344434 -305987 -363482 -471188 -345398 -478802 -489038 -304432 -393129 -327607
2810 -327607 -402056 -445559 -209133 -303431 -358971 -226121 -186437 26701 -87905 -295004 -54966
2799 -54966 -94774 -147201 -148918 -341303 -328887 -355407 -487918 -473467 -420550 -343064 -167909
2788 -167909 -204615 -257794 -279274 -291179 -289855 -294423 -505720 -311681 -335235 -427988 -253021
2777 -253021 -364398 -151982 -194268 -340530 -243147 -303295 -363572 -225516 -210478 -199000 -306253
2766 -306253 -441905 -365566 -320311 -320112 -542649 -607224 -405762 -239703 -224684 -301992 -313997
$$ packed form
2843g2764j6907j46873j18386R4824j21784Q079J3676j92081N1180Q7612O2643
2832c50781J2831N8438Q2632n3965l2063J60380j5386m7754k8562J51178J15200
2821E2148j01876k94706L8447n7495j07706J25790j33404j0236J84606q8697O5522
2810c27607p4449m3503K36426r4298n5540J32850L9684K13138j14606k07099K40038
2799e4966l9808n2427j717j92385J2416k6520j32511J4451N2917P7486J75155
2788a67909l6706n3179k1480j1905J324m568k11297J94039k3554r2753J74967
2777b53021j11377K12416m2286j46262R7383o0148o0277J38056J5038J1478j07253
2766c06253j35652P6339M5255J99k22537o4575K01462J66059J5019p7308j2005
$$ plain form
2755 -313997 -368152 -322695 -421360 -585590 -305682 -274482 -132122 24036 -155422 11158
2745 11158 90962 11135 -82077 -290283 -301914 -254723 -421961 -254810 -247621 -306605 -145288
2734 -145288 -243850 -148519 -117424 -362687 -418895 -232530 -200404 -125508 -145522 -215683 -35015
2723 -35015 -53746 -110354 -161215 -138357 -207136 -312728 -402231 -478968 -440786 -321506 -326071 -502843
2711 -502843 -462420 -336835 -371341 -371796 -496519 -487980 -292085 -290515 -383870 -450149 -439249 -343866
2699 -343866 -320937 -372674 -489065 -522685 -496035 -426623 -402955 -459154 -607058 -372483 -239459
2688 -239459 -289199 -400911 -347868 -146604 -39881 -210088 -293363 -351276 -472700 -506509 -421213
2677 -421213 -441025 -519871 -295716 -75102 -148121 -352299 -386085 -401524 -350980 -414553 -581076
$$ packed form
2755c13997n4155M5457r8665j64230K79908L1200J42360J56158j79458J66580
2745A1158P9804p9827r3212k08206j1631M7191j67238J67151P189n8984J61317
2734a45288r8562R5331L1095k45263n6208J86365L2126P4896k0014p0161J80668
2723c5015j8731n6608n0861K2858o8779j05592q9503p6737L8182J19280m565j76772
2711e02843M0423J25585l4506m55j24723Q539J95895J570r3355o6279J0900R5383
2699c43866K2929n1737j16391l3620K6650O9412K3668n6199j47904K34575J33024
2688b39459m9740j11712N3043K01264J06723j70207q3275n7913j21424l3809Q5296
2677d21213j9812p8846K24155K20614p3019k04178l3786j5439N0544o3573j66523
$$ plain form
2666 -581076 -631831 -592754 -599866 -358084 -247913 -266054 -242906 -270979 -405391 -590093 -670528
2655 -670528 -352487 -369045 -482671 -396767 -321580 -233512 -400218 -546292 -572751 -631204 -652152
2644 -652152 -528513 -489317 -696553 -696363 -591429 -528392 -392084 -349345 -330399 -247343 -241763
2633 -241763 -231638 -239665 -287207 -61513 31029 -136924 -257220 -386074 -253236 -246233 -311184
2622 -311184 -220999 -249729 -215580 -244898 -142914 -270495 -434041 -157761 -101248 -269274 -410785
2611 -410785 -338787 -169733 -90776 47152 183623 67718 -26739 -125981 -33811 -155771 -393626
2600 -393626 -149639 -103157 -263565 -438035 -569604 -521764 -502601 -381700 -374420 -381321 -308751
2589 -308751 -134122 112581 90202 213054 440248 471948 230603 -27740 56994 85858
$$ packed form
2666e81076n0755L9077p112K41782J10171j8141K3148k8073j34412j84702q0435
2655f70528L18041j6558j13626Q5904P5187Q8068j66706j46074k6459n8453k0948
2644f52152J23639L9196k07236J90J04934O3037J36308M2739J8946Q3056N580
2633b41763J0125q027m7542K25694R2542j67953j20296j28854J32838P003o4951
2622c11184R0185k8730L4149k9318J01984j27581j63546K76280N6513j68026j41511
2611d10785P1998J69054P8957J37928J36471j15905r4457r9242R2170j21960k37855
2600c93626K43987M6482j60408j74470j31569M7840J9163J20901P280o901P2570
2589c08751J74629K46703k2379J22852K27194L1700k41345k58343Q4734K8864
$$ plain form
2579 85858 -55200 -124416 -239924 -359598 -345515 -386656 -277270 -344518 -553095 -371431 -302506
2568 -302506 -344876 -276798 -266108 -158610 -104021 -81508 -153070 -313210 -280479 -209225 -328296
2557 -328296 -461046 -467920 -340202 -244546 -451194 -518581 -305272 -370206 -527631 -395173 -412751
2546 -412751 -455099 -346421 -192279 -147974 -466688 -460730 -264614 -320083 -331109 -387627 -379027
2535 -379027 -248514 -318293 -529616 -296061 -405957 -361776 -242059 -287282 -349256 -395687 -361336
2524 -361336 -223442 -412875 -608784 -448096 -430261 -585160 -638121 -560880 -372685 -326448
2514 -326448 -297362 -212105 -331794 -473721 -524129 -406999 -357688 -503265 -520636 -228622 -39703
2503 -39703 -18230 -54049 -141891 -71663 -201590 -495640 -563173 -543043 -476301 -334920 -116707
$$ packed form
2579H5858j41058o9216j15508j19674J4083m1141J09386o7248k08577J81664O8925
2568c02506m2370O8078J0690J07498N4589K2513p1562j60140L2731P1254j19071
2557c28296j32750o874J27718R5656k06648o7387K13309o4934j57425J32458j7578
2546d12751m2348J08678J54142M4305l18714N958J96116n5469j1026n6518Q600
2535c79027J30513o9779k11323K33555j09896M4181J19717m5223o1974m6431L4351
2524c61336J37894j89433j95909J60688J7835j54899n2961P7241J88195M6237
2514c26448K9086Q5257j19689j41927n0408J17130M9311j45577j7371K92014J88919
2503c9703K1473l5819q7842P0228j29927k94050o7533K0130O6742J41381K18213
$$ plain form
2492 -116707 -187045 -282702 -146488 -137642 -329333 -485840 -331525 -203038 -304361 -299965 -319807
2481 -319807 -205320 -25296 -33904 -195053 -86503 -78959 -70212 15713 -115798 -115994 -116868 -182353
2469 -182353 -245066 -358663 -446160 -301459 -249639 -159441 -110283 48398 158434 2104 58957
2458 58957 -27831 -188163 -234155 -94891 -41370 15252 -65276 -37724 35588 -193513 -397750
2447 -397750 -414328 -521179 -422275 -224071 -232472 -301964 -247650 8184 -30402 -210329 -203383
2436 -203383 -199345 -40401 -65376 -143122 -128579 -110772 -109782 -112185 -153614 -161072 -248147 -166935
2424 -166935 -274086 -462709 -506638 -458074 -299791 -308530 -288828 -201256 -271288 -284642 -310549
2413 -310549 -326212 -201420 -253517 -139888 -25767 -213723 -352090 -205496 -44144 9808
$$ packed form
2492a16707p0338r5657J36214Q846j91691j56507J54315J28487j01323M396j9842
2481c19807J14487J80024q608j61149J08550P544Q747Q5925j31511j96q74o5485
2469a82353o2713j13597q7497J44701N1820R0198M9158J58681J10036j56330N6853
2458E8957q6788j60332m5992J39264N3521N6622q0528K7552P3312k29101k04237
2447c97750j6578j06851R8904J98204q401o9492N4314K55834l8586j79927O946
2436b03383M038J58944k4975p7746J4543J7807R90k403m1429p458q7075Q1212
2424a66935j07151j88623m3929M8564J58283q739J9702Q7572p0032j3354k5907
2413c10549j5663J24792n2097J13629J14121j87956j38367J46594J61352N3952
$$ plain form
2403 9808 -23954 -29781 131412 126439 11825 74172 73015 338 -72847 44912 -11785 141342
2391 141342 217886 400372 356236 327815 309015 394436 503520 323749 337033 431955 455333
2380 455333 564618 652560 610945 580404 690635 853577 805130 853673 1062311 1050709 1007110
2369 1007110 1069945 1009089 1199321 1140446 1139871 1354460 1261937 1212245 1463230 1590021 1758143
2358 1758143 1685311 1771329 2064193 2207444 2406971 2731827 2857702 3070848 3197559 3370495
2348 3370495 3558414 3445650 3677056 3861659 3818563 3840153 3991460 4258912 4580210 4712247
2338 4712247 5278519 6026717 6663048 7409880 8313085 9303688 10323511 11107822 12122905
2329 12122905 13293857 14597745 16430287 19169709 22748214 28074325 34911312 43710205
$$ packed form
2403I808l3762n827J61193m973j14614O2347j157p2677p3185J17759n6697J53127
2391A41342P6544J82486m4136k8421j8800Q5421J09084j79771J3284R4922K3378
2380D55333J09285Q7942m1615l0541J10231J62942m8447M8543K08638j1602m3599
2369A007110O2835o0856J90232n8875n75K14589r2523m9692K50985J26791J68122
2358A758143p2832Q6018K92864J43251J99527L24856J25875K13146J26711J72936
2348C370495J87919j12764K31406J84603m3096K1590J51307K67452L21298J32037
2338D712247N66272P48198O36331P46832R03205R90603J019823P84311J015083
2329A2122905J170952J303888J832542K739422L578505N326111O836987Q798893
$$ plain form
2321 43710205 53151945 64974261 79621506 95468586 105230108 106429475 104708624 101022120
2313 101022120 90757687 74748032 61247065 50620970 41712488 33483877 27243471
2306 27243471 22923958 20065945 17869422 16126622 14590224 13152063 11738053 10585373
2298 10585373 9383940 8250116 7357150 6535796 5969988 5432016 4986698 4961199 4726892
2289 4726892 4565055 4451282 4361150 4295083 4037666 3660835 3554579 3420845 3078133 3013401
2279 3013401 2870213 2907867 3043597 2859113 2679727 2491642 2266593 2439705 2572654 2460061
2269 2460061 2436198 2322837 2476621 2401870 2055870 2058584 1919434 1841883 1914132 1726086 1653274
2258 1653274 1643778 1601329 1786426 1527278 1314581 1358186 1274423 1253339 1101625 964463 977479
$$ packed form
2321D3710205R441740J1822316J4647245J5847080R761522J199367j720851l686504
2313A01022120j0264433j6009655j3500967j0626095q908482q228611o240406
2306B7243471m319513k858013k196523j742800j536398j438161j414010j152680
2298A0585373j201433j133824q92966q21354n65808n37972m45318k5499k34307
2289D726892j61837j13773r0132o6067k57417l76831j06256j33734l42712o4732
2279C013401j43188L7654J35730j84484j79386j88085k25049J73112J32949j12593
2269B460061k3863j13361J53784p4751l46000K714j39150p7551P2249j88046p2812
2258A653274r496m2449J85097k59148k12697M3605q3763k1084j51714j37162J3016
$$ plain form
2247 977479 876520 985018 1144663 1017071 846488 843030 795948 771219 571976 384217
2237 384217 514984 482769 360061 492906 493224 394352 331729 195841 191678 233715 242414 440040
2225 440040 371322 361946 455292 361578 247478 122006 184928 317807 272151 169670 230388
2214 230388 121944 38680 113522 15619 8812 27742 91069 206053 71312 -26082 11625
2203 11625 -121049 -191426 -229571 -243942 -230130 -159273 -147103 49000 229785 112557 -41747
2192 -41747 -48800 -26789 -22973 -152996 -240825 -268118 -239262 -113455 -128256 -293812 -181496
2181 -181496 -65439 -119641 -204483 -310291 -259362 -128650 -147144 -50304 65714 35643 -69949
2170 -69949 -163561 -209038 -205997 -338166 -421534 -361461 -524411 -503985 -543613 -437353 -286299
$$ packed form
2247I77479j00959J08498J59645j27592j70583l458m7082k4729j99243j87759
2237C84217J30767l2215j22708J32845L18r8872o2623j35888m163M2037Q699J97626
2225D40040o8718r376R3346r3714j14100j25472O2922J32879m5656j02481O0718
2214B30388j08444q3264P4842r7903o807J8930O3327J14984j34741r7394L7707
2203A1625j32674p0377l8145j4371J3812P0857J2170J96103J80785j17228j54304
2192d1747p053K2011L816j30023q7829k7293K8856J25807j4801j65556J12316
2181a81496J16057n4202q4842j05808N0929J30712j8494R6840J16018l0071j05592
2170f9949r3612m5477L041j32169q3368O0073j62950K0426l9628J06260J51054
$$ plain form
2159 -286299 -277293 -342244 -328942 -400697 -483851 -296840 -99566 -65682 -173740 -183669 -239382
2148 -239382 -318154 -358893 -384293 -480538 -606796 -587678 -629027 -618125 -566884 -481069 -249514
2137 -249514 -316684 -416065 -373584 -303965 -284582 -405195 -519092 -410711 -448220 -512153 -357094
2126 -357094 -514958 -625806 -487034 -501547 -658040 -682496 -719118 -544450 -706248 -732407
2116 -732407 -579537 -472451 -189873 -203658 -333459 -344534 -402539 -578512 -560677 -746460
2106 -746460 -739870 -465666 -410320 -230424 -334691 -519668 -487561 -563073 -488971 -641154 -692426
2095 -692426 -622040 -502545 -611399 -682765 -564224 -613029 -375845 -302034 -256009 -214241 -378998
2084 -378998 -476605 -353652 -492427 -546043 -610865 -594978 -539899 -615234 -481750 -435008 -542087
$$ packed form
2159b86299R006o4951J3302p1755q3154J87011J97274L3884j08058r929n5713
2148b39382p8772m0739k5400r6245j26258J9118m1349J0902N1241Q5815K31555
2137b49514o7170r9381M2481O9619J9383j20613j13897J08381l7509o3933J55059
2126c57094j57864j10848J38772j4513j56493k4456l6622J74668j61798k6159
2116g32407J52870J07086K82578j3785j29801j1075n8005j75973J7835j85783
2106g46460O590K74204N5346J79896j04267j84977L2107p5512P4102j52183n1272
2095f92426P0386J19495j08854p1366J18541m8805K37184P3811M6025M1768j64757
2084c78998r7607J22953j38775n3616o4822J5887N5079p5335J33484M6742j07079
$$ plain form
2073 -542087 -534777 -643573 -759870 -696090 -700154 -669059 -522780 -570025 -439520 -339622 -486198
2062 -486198 -619337 -556071 -405181 -373281 -565228 -501552 -378697 -535669 -467256 -385776 -293832
2051 -293832 -102573 -151380 26202 -43561 -371044 -155233 -6620 -123829 -179939 -329716
2041 -329716 -452054 -302551 -354555 -204641 -328061 -516596 -520060 -566583 -606190 -723823 -796351
2030 -796351 -539892 -407727 -552628 -483744 -547639 -564359 -580464 -675359 -570468 -549664 -564066
2019 -564066 -530330 -569887 -608100 -528964 -443438 -368069 -425090 -644850 -709824 -786583 -764358
2008 -764358 -673707 -704049 -538360 -408941 -486633 -463959 -466500 -505354 -559130 -635133 -687611
1997 -687611 -688521 -645160 -595654 -505057 -478031 -473588 -543878 -336481 -452077 -601001 -701731
$$ packed form
2073e42087P310j08796j16297O3780m064L1095J46279m7245J30505R9898j46576
2062d86198j33139O3266J50890L1900j91947O3676J22855j56972O8413Q1480R1944
2051b93832J91259m8807J77582o9763l27483K15811J48613j17209n6110j49777
2041c29716j22338J49503n2004J49914j23420j88535l464m6523l9607j17633p2528
2030g96351K56459J32165j44901O8884o3895j6720j6105r4895J04891K0804j4402
2019e64066L3736l9557l8213P9136Q5526P5369n7021k19760o4974p6759K2225
2008g64358R0651l0342J65689J29419p7692K2674k541l8854n3776p6003n2478
1997f87611r10M3361M9506R0597K7026M443p0290K07397j15596j48924j00730
$$ plain form
1986 -701731 -690019 -559465 -487700 -469200 -393983 -479306 -487650 -503905 -577427 -580855 -507913 -351103
1974 -351103 -456748 -520290 -557236 -541087 -622906 -569393 -615031 -636185 -486590 -426752 -526184
1963 -526184 -509457 -453315 -610077 -558006 -694320 -773699 -736335 -836333 -673736 -665165 -640733
1952 -640733 -612734 -720696 -683968 -743171 -732262 -491806 -529443 -612796 -557452 -633014 -600326
1941 -600326 -712989 -810789 -770105 -833132 -890420 -837097 -631549 -618014 -523537 -585843 -503361
1930 -503361 -432326 -609253 -714400 -764578 -819097 -703734 -640460 -601296 -488039 -575176 -520918
1919 -520918 -492619 -587843 -658203 -601870 -682299 -761865 -765765 -696466 -448838 -436829 -617854
1908 -617854 -687109 -646337 -715831 -850731 -878960 -734469 -756196 -685963 -561113 -620702 -610292
$$ packed form
1986g01731J1712J30554P1765J8500P5217q5323q344j6255p3522l428P2942J56810
1974c51103j05645o3542l6946J6149q1819N3513m5638k1154J49595N9838r9432
1963e26184J6727N6142j56762N2071j36314p9379L7364r9998J62597Q571K4432
1952f40733K7999j07962L6728n9203J0909K40456l7637q3353N5344p5562L2688
1941f00326j12663r7800M0684o3027n7288N3323K05548J3535R4477o2306Q2482
1930e03361P1035j76927j05147n0178n4519J15363O3274L9164J13257q7137N4258
1919e20918K8299r5224p0360N6333q0429p9566l900O9299K47628J2009j81025
1908f17854o9255M0772o9494j34900k8229J44491k1727P0233J24850n9589J0410
$$ plain form
1897 -610292 -763760 -786049 -553192 -590925 -599656 -477392 -420559 -481638 -369717 -320701 -306812
1886 -306812 -368483 -593178 -628459 -682700 -689501 -445187 -396944 -391389 -435233 -481794 -432775 -622958
1874 -622958 -793455 -636576 -491372 -530287 -473650 -681689 -621960 -559733 -515266 -381336 -578973
1863 -578973 -609448 -519010 -417094 -415654 -595064 -579293 -542615 -689273 -867295 -853067 -958434
1852 -958434 -851048 -795783 -835856 -723473 -842798 -774627 -703978 -918640 -880072 -779018 -794901
1841 -794901 -803877 -821052 -811479 -792296 -712253 -569331 -606388 -684831 -740181 -889930 -1026363
1830 -1026363 -951980 -928641 -857116 -722590 -765732 -821515 -863812 -844987 -793548 -780122 -808350
1819 -808350 -775199 -705530 -601841 -538703 -457349 -498391 -591791 -480620 -633610 -936997 -858760
$$ packed form
1897f10292j53468k2289K32857l7733q731J22264N6833o1079J11921M9016J3889
1886c06812o1671k24695l5281n4241o801K44314M8243N555m3844m6561M9019j90183
1874f22958j70497J56879J45204l8915N6637k08039N9729O2227M4467J33930j97637
1863e78973l0475R0438J01916J440j79410J5771L6678j46658j78022J4228j05367
1852i58434J07386N5265m0073J12383j19325O8171P0649k14662L8568J01054j5883
1841g94901q976j7175R573J9183Q0043J42922l7057p8443n5350j49749j36433
1830a026363P4383K3339P1525J34526m3142n5783m2297J8825N1439J3426k8228
1819h08350L3151O9669J03689O3138Q1354m1042r3400J11171j52990l03387P8237
$$ plain form
1808 -858760 -785808 -593337 -401927 -357076 -379294 -440481 -511818 -707002 -703893 -664487 -627808
1797 -627808 -417816 -317110 -372162 -329069 -266045 -291751 -516919 -675429 -772306 -747564 -656329
1786 -656329 -730246 -584379 -485305 -342688 -269485 -283735 -497003 -496466 -413743 -362008 -473249
1775 -473249 -526564 -470034 -359041 -287306 -354976 -520762 -666732 -768047 -812208 -852721 -882443
1764 -882443 -1004252 -858742 -684243 -768438 -738706 -708114 -566850 -534560 -608457 -636453 -598178
1753 -598178 -647981 -593470 -653146 -744461 -707322 -761861 -799234 -825384 -899052 -735420 -773448
1742 -773448 -825375 -917974 -1046844 -1057180 -1007598 -955130 -809966 -857944 -649533 -456317 -527366
1731 -527366 -608031 -528426 -350800 -460674 -802951 -903744 -780529 -737694 -715782 -655995 -602861
$$ packed form
1808h58760P2952J92471J91410M4851k2218o1187p1337j95184L109L9406L6679
1797f27808K09992J00706n5052M3093O3024k5706k25168j58510r6877K4742R1235
1786f56329p3917J45867R9074J42617P3203j4250k13268N37Q2723N1735j11241
1775d73249n3315N6530J10993P1735o7670j65786j45970j01315m4161m0513k9722
1764h82443j21809J45510J74499q4195K9732L0592J41264L2290p3897k7996L8275
1753e98178m9803N4511n9676r1315L7139n4539l7373k6150p3668J63632l8028
1742g73448n1927r2599j28870j0336M9582N2468J45164m7978K08411J93216p1049
1731e27366q0665P9605J77626j09874l42277j00793J23215M2835K1912N9787N3134
$$ plain form
1720 -602861 -588009 -510051 -703565 -883036 -1042044 -1114415 -891892 -645029 -500337 -410546
1710 -410546 -337330 -344631 -371830 -450780 -506931 -766031 -719467 -507364 -554519 -519363 -609514
1699 -609514 -550850 -313782 -337641 -700187 -707537 -630021 -480493 -340574 -566724 -723382 -686062
1688 -686062 -603286 -550152 -564548 -800895 -713083 -709067 -704301 -690493 -729492 -658192 -750859 -785244
1676 -785244 -562999 -587464 -675407 -628363 -704396 -675574 -635619 -607665 -655556 -683913 -699226
1665 -699226 -876795 -887352 -842552 -848905 -881902 -793698 -650507 -611906 -771424 -969764 -841825
1654 -841825 -728922 -821045 -944289 -786842 -683573 -406915 -365649 -477654 -616176 -506083
1644 -506083 -425458 -525208 -624523 -837703 -718334 -590906 -624759 -694250 -797859 -889485 -685115
$$ packed form
1720f02861J4852P7958j93514j79471j59008p2371K22523K46863J44692Q9791
1710d10546P3216p301k7199p8950n6151k59100M6564K12103m7155L5156r0151
1699f09514N8664K37068k3859l62546p350P7516J49528J39919k26150j56658L7320
1688f86062Q2776N3134j4396k36347Q7812M016M766J3808l8999P1300r2667l4385
1676g85244K22245k4465q7943M7044p6033K8822L9955K7954m7891k8357j5313
1665f99226j77569j0557M4800o353l2997Q8204J43191L8601j59518j98340J27939
1654h41825J12903r2123j23244J57447J03269K76658M1266j12005j38522J10093
1644e06083Q0625r9750r9315k13180J19369J27428l3853o9491j03609r1626K04370
$$ plain form
1633 -685115 -623339 -800126 -744086 -805211 -659635 -441021 -395492 -505562 -562152 -430098 -391501
1622 -391501 -529412 -576739 -636341 -798365 -874509 -869258 -691498 -602844 -754144 -763326 -707752
1611 -707752 -614794 -634638 -649994 -721909 -669157 -557564 -558529 -607482 -744004 -713131 -608835
1600 -608835 -641798 -638369 -650964 -725379 -706748 -753255 -762670 -804009 -798775 -603773 -353037 -308721
1588 -308721 -295022 -512327 -741338 -733929 -772585 -891467 -999584 -1050672 -936786 -733017 -737353
1577 -737353 -737529 -799098 -789049 -645245 -721799 -832907 -960388 -928631 -615576 -504098 -703536
1566 -703536 -732565 -875405 -766030 -750226 -907837 -952519 -886983 -852549 -833323 -917304 -780089
1555 -780089 -653084 -874398 -688658 -581851 -632204 -594520 -625416 -631615 -675897 -845008 -666150
$$ packed form
1633f85115O1776j76787N6040o1125J45576K18614M5529j10070n6590J32054L8597
1622c91501j37911m7327n9602j62024p6144N251J77760Q8654j51300r182N5574
1611g07752R2958j9844j5356p1915N2752J11593r65m8953j36522L0873J04296
1600f08835l2963L429j2595p4415J8631m6507r415m1339N234J95002K50736M4316
1588c08721J3699k17305k29011P409l8656j18882j08117n1088J13886K03769m336
1577g37353j76o1569J0049J43804p6554j11108j27481L1757L13055J11478j99438
1566g03536k9029j42840J09375J5804j57611m4682O5536L4434J9226q3981J37215
1555g80089J27005k21314J85740J06807n0353L7684l0896o199m4282j69111J78858
$$ plain form
1544 -666150 -780038 -875264 -813136 -867583 -705599 -622778 -677792 -572687 -503296 -698116 -709375
1533 -709375 -687732 -743491 -559897 -373019 -307413 -333209 -365424 -424415 -478426 -614120 -751883
1522 -751883 -788304 -795383 -799138 -723208 -639954 -556191 -415718 -320256 -343196 -500660 -607670
1511 -607670 -620536 -574017 -549115 -530032 -523674 -446887 -373496 -367633 -529334 -633179 -772552
1500 -772552 -921427 -973960 -981477 -977234 -950551 -843256 -771718 -674946 -575411 -805037 -880865
1489 -880865 -916980 -799584 -724324 -714502 -671796 -632899 -708944 -784742 -907120 -1021289 -906358
1478 -906358 -822352 -747047 -706246 -782866 -798261 -917910 -832983 -738273 -710419 -803779 -755299
1467 -755299 -715124 -710595 -729358 -770402 -804666 -953941 -926386 -892434 -925063 -932931 -815835 -645387
$$ packed form
1544f66150j13888r5226O2128n4447J61984Q2821n5014J05105O9391j94820j1259
1533g09375K1643n5759J83594J86878O5606k5796l2215n8991n4011j35694j37763
1522g51883l6421p079l755P5930Q3254Q3763J40473R5462k2940j57464j07010
1511f07670j2866M6519K4902J9083O358P6787P3391N863j61701j03845j39373
1500g72552j48875n2533p517M243K6683J07295P1538R6772R9535k29626p5828
1489h80865l6115J17396P5260R822M2706L8897p6045p5798j22378j14169J14931
1478i06358Q4006P5305M0801p6620j5395j19649Q4927R4710K7854r3360M8480
1467g55299M0175M529j8763m1044l4264j49275K7555L3952l2629p868J17096J70448
$$ plain form
1455 -645387 -544392 -616745 -715690 -730767 -627000 -664922 -583461 -654885 -634402 -694819 -642863
1444 -642863 -732018 -799371 -888821 -770036 -666164 -913176 -973986 -764241 -772620 -729870 -635051
1433 -635051 -308210 -210732 -455967 -619671 -579228 -647713 -666965 -668750 -589078 -375430 -420857
1422 -420857 -479300 -540347 -811386 -813221 -759493 -905694 -906862 -910246 -701395 -623977 -593786 -438103
1410 -438103 -434337 -573530 -529257 -585519 -689930 -732884 -790750 -662936 -501109 -527209 -533236
1399 -533236 -659460 -708067 -723720 -765722 -829274 -909099 -839084 -743714 -661086 -845414 -894428
1388 -894428 -721157 -679398 -617543 -739426 -685235 -769661 -685246 -575068 -572815 -704623 -775460
1377 -775460 -730233 -819987 -834511 -650945 -556183 -715647 -755535 -787518 -804187 -996688 -1084158
$$ packed form
1455f45387J00995p2353r8945j5077J03767l7922Q1461p1424K0483o0417N1956
1444f42863q9155o7353q9450J18785J03872k47012o0810K09745q379M2750R4819
1433f35051L26841R7478k45235j63704M0443o8485j9252j785P9672K13648m5427
1422d20857n8443o1047k71039j835N3728j46201j168l384K08851P7418L0191J55683
1410d38103L766j39193M4273n6262j04411m2954n7866J27814J61827k6100o027
1399e33236j26224m8607j5653m2002o3552p9825P0015R5370Q2628j84328m9014
1388h94428J73271M1759O1855j21883N4191q4426Q4415J10178K253j31808p0837
1377g75460M5227q9754j4524J83566R4762j59464l9888l1983j6669j92501q7470
$$ plain form
1366 -1084158 -872551 -815763 -764071 -662885 -716857 -763973 -699225 -626998 -659189 -739430 -752373
1355 -752373 -607503 -704776 -727057 -667302 -648362 -730530 -725860 -630441 -517133 -572098 -712017
1344 -712017 -712373 -787490 -753087 -904916 -893062 -710707 -725215 -542464 -618111 -823813 -844952
1333 -844952 -800555 -819027 -737842 -740847 -559491 -333167 -397678 -381279 -534832 -668068 -689507
1322 -689507 -720519 -694432 -628537 -881929 -826264 -786093 -841809 -842525 -821119 -817188 -810433 -679544
1310 -679544 -488949 -490112 -615365 -481057 -498970 -508515 -659094 -786372 -675857 -609248 -608200
1299 -608200 -750200 -928492 -929093 -824729 -736019 -697327 -630961 -553690 -671587 -721618 -740708
1288 -740708 -686437 -848357 -917696 -889789 -1038612 -848734 -755307 -906485 -831085 -820560 -811047
$$ packed form
1366a084158K11607N6788N1692J01186n3972m7116O4748P2227l2191q0241j2943
1355g52373J44870r7273k2281N9755J8940q2168M670R5419J13308n4965j39919
1344g12017l56p5117L4403j51829J1854J82355j4508J82751p5647k05702k1139
1333h44952M4397j8472Q1185l005J81356K26324o4511J6399j53553j33236k1439
1322f89507l1012K6087O5895k53392N5665M0171n5716p16K1406L931O755J30889
1310f79544J90595j163j25253J34308j7913r545j50579j27278J10515O6609J048
1299f08200j42000j78292o01J04364Q8710L8692O6366P7271j17897n0031j9090
1288g40708N4271j61920o9339K7907j48823J89878R3427j51178P5400J0525R513
$$ plain form
1277 -811047 -809234 -1007751 -1031500 -850101 -706910 -586027 -642031 -734914 -605075 -510939 -613485
1266 -613485 -647428 -718334 -912492 -1001528 -1043902 -994370 -1029928 -1065010 -824075 -641635 -587724
1255 -587724 -595700 -615535 -482678 -481888 -538830 -432851 -531095 -749872 -781662 -685960 -534595
1244 -534595 -590568 -657926 -479815 -559638 -730799 -692031 -706038 -771212 -813189 -789797 -705738
1233 -705738 -768074 -761031 -541893 -510973 -550836 -501437 -671570 -627735 -627948 -675754 -432012 -471442
1221 -471442 -619897 -717882 -616869 -626234 -737296 -716667 -604461 -897175 -1050394 -1048953 -1010872
1210 -1010872 -1050288 -973756 -737317 -598335 -642045 -715396 -729374 -785317 -765319 -655512 -530107
1199 -530107 -437849 -449019 -513941 -430268 -628551 -798862 -824654 -797806 -820830 -951976 -830312
$$ packed form
1277h11047J813j98517k3749J81399J43191J20883n6004r2883J29839R4136j02546
1266f13485l3943p0906j94158q9036m2374M9532l5558l5082K40935J82440N3911
1255e87724p976j9835J32857P90n6942J05979r8244k18777l1790R5702J51365
1244e34595n5973o7358J78111p9823j71161L8768j4007o5174m1977K3392Q4059
1233g05738o2336P043K19138L0920l9863M9399j70133M3835k13m7806K43742l9430
1221d71442j48455r7985J01013r365j11062K0629J12206k92714j53219J441L8081
1210a010872l9416P6532K36439J38982m3710p3351j3978n5943J9998J09807J25405
1199e30107R2258j1170o4922Q3673j98283j70311k5792K6848k3024j31146J21664
$$ plain form
1188 -830312 -702281 -714663 -618256 -561525 -636978 -656380 -711750 -669631 -572384 -490972 -537318
$$ packed form
1188h30312J28031j2382R6407N6731p5453j9402n5370M2119R7247Q1412m6346
$$ [...]
##END NTUPLES=NMR SPECTRUM
##END=
