##TITLE=1H_DE-80H_X3
 200.13MHz, d2o
 8 sc
 
 19ns.26.2.2025
##JCAMPDX= 6.0         $$ Bruker NMR JCAMP-DX V2.0
##DATA TYPE= NMR SPECTRUM
##DATA CLASS= NTUPLES
##ORIGIN= UXNMR, Bruker Analytische Messtechnik GmbH
##OWNER= pz
$$ XWIN-NMR		Version 3.5
$$ Wed Apr 22 11:09:49 2026 Russian Standard Time (UT+4h)  Yarkov@DPX200
##.OBSERVE FREQUENCY= 200.1313
##.OBSERVE NUCLEUS= ^1H
##.ACQUISITION MODE= SIMULTANEOUS
##.ACQUISITION SCHEME= undefined
##.AVERAGES= 8
##.DIGITISER RES= 18
##SPECTROMETER/DATA SYSTEM= spect
##.PULSE SEQUENCE= zg30
##.SOLVENT NAME= DMSO
##.SHIFT REFERENCE= (INTERNAL, DMSO, 0, 15.4946)
##AUDIT TRAIL= $$ (NUMBER, WHEN, WHO, WHERE, WHAT)
$$ ##TITLE= Audit trail, XWIN-NMR		Version 3.5
$$ ##JCAMPDX= 5.01
$$ ##ORIGIN= Bruker BioSpin GmbH
$$ ##OWNER= Yarkov
$$ C:/Bruker/XWIN-NMR/data/yarkov2/nmr/H-C/1/pdata/1/auditp.txt
$$ ##AUDIT TRAIL=  $$ (NUMBER, WHEN, WHO, WHERE, WHAT)
(   1,<2026-04-22 11:08:51.10 +0400>,<Yarkov>,<DPX200>,
      <created by zg, POWCHK disabled, PULCHK disabled
       configuration hash MD5:
       00 E9 B6 7A A2 85 ED C7 34 08 36 98 17 FE 4E 26
       data hash MD5: 16K
       48 34 E5 06 26 2C FF 53 E5 37 87 CA 45 0D FD 91>)
(   2,<2026-04-22 11:08:58.73 +0400>,<Yarkov>,<DPX200>,
      <Start of raw data processing
       efp BC_mod = 2 LB = 0.25 FT_mod = 6 PKNL = 1 PHC0 = -5308.116 PHC1 = 11.42193 SI = 16K 
       data hash MD5: 16K
       3B 2E 32 50 65 C2 1B 49 13 C9 7B 5D AE AF 25 6F>)
(   3,<2026-04-22 11:09:14.48 +0400>,<Yarkov>,<DPX200>,
      <pk PHC0 = 3 PHC1 = 0 
       data hash MD5: 16K
       AB BE 85 05 3E E4 6D BD 84 D1 5B DA 8D CC EF 81>)
$$ ##END=
$$ 
$$ hash MD5
$$ 5E 7B 6B F5 AE 0D 6B A9 40 A0 8B FB AF 71 71 7A
##$RELAX= 
##$RELAX= 
##$RELAX= 
##$RELAX= 
##$RELAX= 
##$RELAX= 
$$ Bruker specific parameters
$$ --------------------------
##$DU= <C:/Bruker/XWIN-NMR>
##$EXPNO= 1
##$NAME= <H-C>
##$PROCNO= 1
##$TYPE= <nmr>
##$USER= <yarkov2>
##$AMP= (0..31)
100 100 100 100 100 100 100 100 100 100 100 100 100 100 100 100 100 100 
100 100 100 100 100 100 100 100 100 100 100 100 100 100 
##$AQSEQ= 0
##$AQ_mod= 1
##$AUNM= <au_zg>
##$AUTOPOS= <>
##$BF1= 200.13
##$BF2= 200.13
##$BF3= 200.13
##$BF4= 200.13
##$BF5= 200.13
##$BF6= 200.13
##$BF7= 200.13
##$BF8= 200.13
##$BYTORDA= 1
##$CFDGTYP= 0
##$CFRGTYP= 5
##$CHEMSTR= <none>
##$CNST= (0..31)
1 1 145 1 1 1 1 1 1 1 1 1 1 1 1 1 1 1 1 1 1 1 1 1 1 1 1 1 1 1 1 1 
##$CPDPRG= <>
##$CPDPRG1= <>
##$CPDPRG2= <>
##$CPDPRG3= <>
##$CPDPRG4= <mlev>
##$CPDPRG5= <mlev>
##$CPDPRG6= <mlev>
##$CPDPRG7= <mlev>
##$CPDPRG8= <mlev>
##$CPDPRGB= <>
##$CPDPRGT= <>
##$D= (0..31)
0 0.7 0 0 0 0 0 0 0 0 0 0.03 0 0 0 0 0 0 0 0 0 0 0 0 0 0 0 0 0 0 0 0 
##$DATE= 1776841730
##$DBL= (0..7)
120 120 120 120 120 120 120 120 
##$DBP= (0..7)
150 150 150 150 150 150 150 150 
##$DBP07= 0
##$DBPNAM0= <>
##$DBPNAM1= <>
##$DBPNAM2= <>
##$DBPNAM3= <>
##$DBPNAM4= <>
##$DBPNAM5= <>
##$DBPNAM6= <>
##$DBPNAM7= <>
##$DBPOAL= (0..7)
0.5 0.5 0.5 0.5 0.5 0.5 0.5 0.5 
##$DBPOFFS= (0..7)
0 0 0 0 0 0 0 0 
$$ [...]
##$SUBNAM2= <"">
##$SUBNAM3= <"">
##$SUBNAM4= <"">
##$SUBNAM5= <"">
##$SUBNAM6= <"">
##$SUBNAM7= <"">
##$SUBNAM8= <"">
##$SUBNAM9= <"">
##$SW= 18.0517328524113
##$SWIBOX= (0..15)
0 0 2 0 0 0 0 0 0 0 0 0 0 0 0 0 
##$SW_h= 3612.71676300578
##$TD= 16384
##$TD0= 1
##$TE= 0
##$TE2= 300
##$TE3= 300
##$TEG= 300
##$TL= (0..7)
0 120 120 120 120 120 120 120 
##$TP= (0..7)
150 150 150 150 150 150 150 150 
##$TP07= 0
##$TPNAME0= <>
##$TPNAME1= <>
##$TPNAME2= <>
##$TPNAME3= <>
##$TPNAME4= <>
##$TPNAME5= <>
##$TPNAME6= <>
##$TPNAME7= <>
##$TPOAL= (0..7)
0.5 0.5 0.5 0.5 0.5 0.5 0.5 0.5 
##$TPOFFS= (0..7)
0 0 0 0 0 0 0 0 
##$TUNHIN= 0
##$TUNHOUT= 0
##$TUNXOUT= 0
##$USERA1= <user>
##$USERA2= <user>
##$USERA3= <user>
##$USERA4= <user>
##$USERA5= <user>
##$V9= 5
##$VALIST= <valist>
##$VCLIST= <CCCCCCCCCCCCCCC>
##$VD= 0
##$VDLIST= <DDDDDDDDDDDDDDD>
##$VPLIST= <PPPPPPPPPPPPPPP>
##$VTLIST= <TTTTTTTTTTTTTTT>
##$WBST= 1024
##$WBSW= 4
##$XGAIN= (0..3)
0 0 0 0 
##$XL= 0
##$YL= 0
##$YMAX_a= 721355
##$YMIN_a= -785743
##$ZGOPTNS= <>
##$ZL1= 120
##$ZL2= 120
##$ZL3= 120
##$ZL4= 120
##$ABSF1= 0
##$ABSF2= 0
##$ABSG= 0
##$ABSL= 0
##$ALPHA= 0
##$AQORDER= 0
##$ASSFAC= 0
##$ASSFACI= 0
##$ASSFACX= 0
##$ASSWID= 0
##$AUNMP= <proc_1d>
##$AZFE= 0.1
##$AZFW= 0.1
##$BCFW= 0
##$BC_mod= 2
##$BYTORDP= 0
##$COROFFS= 0
##$CY= -3
##$DATMOD= 1
##$DC= 0
##$DFILT= <>
##$DTYPP= 0
##$F1P= 0
##$F2P= 0
##$FCOR= 1
##$FTSIZE= 16384
##$FT_mod= 6
##$GAMMA= 0
##$GB= 0
##$INTBC= 1
##$INTSCL= 3.241238e-09
##$ISEN= 128
##$LB= 0.25
##$LEV0= 0
##$LPBIN= 0
##$MAXI= 10000
##$MC2= 0
##$MEAN= 0
##$ME_mod= 0
##$MI= 1.114404
##$NCOEF= 0
##$NC_proc= -4
##$NLEV= 6
##$NOISF1= 3.799351
##$NOISF2= 2.8
##$NSP= 0
##$NTH_PI= 0
##$NZP= 0
##$OFFSET= 15.49457
##$PC= 1
##$PHC0= -5305.116
##$PHC1= 11.42193
##$PH_mod= 1
##$PKNL= yes
##$PPARMOD= 0
##$PSCAL= 0
##$PSIGN= 0
##$REVERSE= no
##$SF= 200.130005429547
##$SI= 16384
##$SIGF1= 3
##$SIGF2= 2
##$SINO= 0.751879
##$SIOLD= 32768
##$SREGLST= <19F.Aceton>
##$SSB= 0
##$STSI= 16384
##$STSR= 0
##$SW_p= 3612.71676300578
##$SYMM= 0
##$S_DEV= 0
##$TDeff= 16384
##$TDoff= 0
##$TI= <>
##$TILT= no
##$TM1= 0
##$TM2= 0
##$TOPLEV= 0
##$USERP1= <user>
##$USERP2= <user>
##$USERP3= <user>
##$USERP4= <user>
##$USERP5= <user>
##$WDW= 1
##$XDIM= 16384
##$YMAX_p= 314613996
##$YMIN_p= -996110
$$ End of Bruker specific parameters
$$ ---------------------------------
##NTUPLES= NMR SPECTRUM
##VAR_NAME=  FREQUENCY,     SPECTRUM/REAL,   SPECTRUM/IMAG
##SYMBOL=    X,             R,               I
##VAR_TYPE=  INDEPENDENT,   DEPENDENT,       DEPENDENT
##VAR_FORM=  AFFN,          ASDF,            ASDF
##VAR_DIM=   16384,         16384,           16384
##UNITS=     HZ,            ARBITRARY UNITS, ARBITRARY UNITS
##FACTOR=    0.220516191357247, 1,           1
##FIRST=     3100.92833388817, 0,            0
##LAST=      -511.788429117611, 0,           0
##MIN=       -511.788429117611, -996110,     0
##MAX=       3100.92833388817, 314613996,    0
$$ Real data points
##PAGE= N=1
##DATA TABLE= (X++(R..R)), XYDATA
$$ [...]
6312f2037m7366N1195K376L875J5673K2919l0679Q0016k7861K4210L9307m8885
$$ -62037 -109403 -58208 -55832 -51957 -36284 -13365 -44044 35972 8111 32321 71628 22743
6300B2743l601j5014K6729K2414j8514l4701j2753K8468n0748j5526n176K5481
$$ 22743 19142 4128 30857 53271 34757 56 -12697 15771 -34977 -50503 -55679 -30198
6288c0198J7789p8542q469l2991M6736k7195K9609o287j6593j0579j5992L4950
$$ -30198 -12409 -90951 -99420 -132411 -85675 -112870 -83261 -89548 -106141 -116720 -132712 -97762
6276i7762Q445k1297J2055j4902O0186j7174n775m8017J08015k8303K0948K615
$$ -97762 -89317 -110614 -98559 -113461 -53275 -70449 -76224 -124241 -16226 -44529 -23581 -20966
6264b0966P447L7400o0128j4442K4550L0350j7622j4482j6088M7786P959n4691
$$ -20966 -13519 23881 -36247 -50689 -26139 4211 -13411 -27893 -43981 3805 11764 -42927
6252d2927J286L7600J4064O122n0358L3084l5796q42p005J1830L4813m7698p8222
$$ -42927 -41641 -4041 10023 16145 -34213 -1129 -36925 -37767 -44772 -32942 1871 -45827 -124049
6239a24049K8379K1410M4193l4656k9532n6837N2450l1161M0066j754J7932j9
$$ -124049 -95670 -74260 -30067 -64723 -94255 -151092 -98642 -129803 -89737 -91491 -73559 -73578
6227g3578l3002J96L7036j1898K2491M231K8432Q217l0317o897J2556J2970L0199
$$ -73578 -106580 -106384 -69348 -81246 -58755 -54524 -26092 -17875 -48192 -55089 -42533 -29563 636
6214F36l0549j1239O2451n1028K1974j5975j2802O1336m3827l7808K7519p715
$$ 636 -29913 -41152 21299 -29729 -7755 -23730 -36532 24804 -19023 -56831 -29312 -37027
6202c7027J9576J85o5828P853J8882Q029K7001o6732N552J3424q76q000J2672
$$ -37027 -17451 -17266 -83094 -75241 -56359 -48330 -21329 -88061 -82509 -69085 -69961 -77961 -65289
6189f5289n5265M3767J7850J2291k6315j0172k5390M9674M137M8853k1212l7228
$$ -65289 -120554 -76787 -58937 -46646 -72961 -83133 -108523 -58849 -54712 -5859 -27071 -64299
6177f4299M4575m2531n772N472K8844O1955L718o6367j9755l375p030Q889j6503
$$ -64299 -19724 -62255 -68027 -62555 -33711 28244 31962 -34405 -54160 -57535 -64565 -55676 -72179
6164g2179L8590J8069J835o6568m115J0653J9409J0077j9619n726J9100J3767
$$ -72179 -33589 -15520 -13685 -80253 -84368 -73715 -54306 -44229 -63848 -69574 -50474 -36707
6152c6707m565J3081m4795O796K6256M8768J4025j7088o8392J4376L4264k8974
$$ -36707 -41272 -28191 -72986 -66190 -39934 8834 22859 5771 -62621 -48245 -13981 -42955
6140d2955K4779l3251M7903J9306n3135l8046K3899k6095L2412j0970O779M6725
$$ -42955 -18176 -51427 -3524 15782 -37353 -75399 -51500 -77595 -45183 -56153 -49374 -2649
6128b649l6406n3247J4030K025M4844P860j2507L150m869l3841R258M2714q603
$$ -2649 -39055 -92302 -78272 -76247 -31403 -23543 -36050 -32900 -37769 -71610 -62352 -19638 -28241
6115b8241J9449j8239K981Q273k7076k7409N208L9287O750J4483m4734j1383K2595
$$ -28241 -8792 -27031 -24050 -15777 -42853 -70262 -65054 -25767 -19017 -4534 -49268 -60651 -38056
6102c8056k7161K0033R436J7726j6147j2744j9247K2661K1805k842r263k0882
$$ -38056 -65217 -45184 -35748 -18022 -34169 -46913 -66160 -43499 -21694 -24536 -33799 -54681
6090e4681K3543J1691l3623J0850k5234O7946k0095J568m2530J0003M544N2496
$$ -54681 -31138 -19447 -53070 -42220 -67454 492 -19603 -18035 -60565 -50562 -46018 6478
6078F478k7340n3754M2430O547j8865M5013M245q23j5897m1002O556M7385J488
$$ 6478 -20862 -74616 -32186 -25639 -44504 509 4754 3931 -11966 -52968 -46412 973 2461
6065B461P760m407J875L1753k4706j5981N952k1484L6791k6108O384k1746Q04
$$ 2461 10221 5814 7689 39442 14736 -1245 4707 -16777 20014 -6094 290 -21456 -20652
6052b0652l7540K2724L75k2240K3662p8518J6988m2973K1257k3770K986O522L7834
$$ -20652 -58192 -35468 -35093 -57333 -33671 -112189 -95201 -138174 -116917 -140687 -137701 -131179 -93345
6039i3345P191J2320K8090m0262J5459J579O7172L4207r468l5690k3973R7029
$$ -93345 -86154 -73834 -45744 -86006 -70547 -68968 -1796 32411 22943 -12747 -36720 60309
6027F0309J8245K649o2400L945L3203M0851o1385l8564j4463L137L4492l5209
$$ 60309 78554 81203 18803 22748 55951 96802 35417 -3147 -17610 -14473 20019 -15190
6015a5190j3711j8100J436j3480Q977l0999K3068M520o483k5980K455l002Q024
$$ -15190 -28901 -47001 -45565 -59045 -50068 -81067 -57999 -53479 -59962 -85942 -83487 -86489 -78465
6002g8465p142M1210L9311m1165K9237l2110k1788K7420J507J5059M9174j07728
$$ -78465 -85607 -44397 -5086 -46251 -17014 -49124 -70912 -43492 -41985 -26926 22248 -85480
5990h5480k3698P2327J7219O0803k5327p4004N1239N684l1511L8734L076o688
$$ -85480 -109178 -36851 -19632 41171 15844 -58160 -6921 -1237 -32748 5986 9062 2374
5978B374P5132j3086k3130m58k8058K4768J4704l789M560j9630m9425j0727j1667
$$ 2374 77506 64420 41290 40832 12774 37542 52246 48457 53017 33387 -16038 -26765 -38432
5965c8432J2052L059K9088k99k6087k8058l5437M5087K9369j0237J4759K2051
$$ -38432 -26380 -23321 5767 5468 -20619 -48677 -84114 -39027 -9658 -19895 -5136 16915
5953A6915J76L0426n4732K3202N7735Q294L7048l1554l2515K3001J2385O084K9051
$$ 16915 17091 47517 -7215 15987 73722 82016 119064 87510 54995 77996 90381 96465 125516
5940A25516j2425K0640P7671k5802R7419O3646P7881K66133L13005K95755K00816
$$ 125516 113091 133731 211402 185600 283019 346665 424546 690679 1003684 1299439 1500255
5929A500255k0129j66472k25319k45748j96040j32207j29220o9030r3609K0817
$$ 1500255 1480126 1313654 1088335 842587 646547 514340 385120 316090 222481 243298
5919B43298o4488n1572K1039q3898m014K3643m057r251J6539p9128J7834M766
$$ 243298 178810 127238 148277 64379 60365 84008 79951 70700 87239 8111 25945 30711
5907C0711m6305P3419k9767k9582N2635m4698j2234J1733p150L7506O9572p0947
$$ 30711 -15594 57825 28058 -1524 51111 6413 -5821 5912 -1238 36268 105840 34893
5895C4893k2356j9746k6536K923L3044l9999k1450L3716l4864r334K7946k7247
$$ 34893 12537 -7209 -33745 -30822 2222 -37777 -59227 -25511 -60375 -69709 -41763 -69010
5883f9010J6745N7064m8352L7466j2078m3261N2183j8931L1179N9551r905j5636
$$ -69010 -52265 4799 -43553 -6087 -18165 -61426 -9243 -28174 3005 62556 52651 37015
5871C7015J3161n0807O1432L2289m5704K7148o0718J4525L5035k9602p179N09
$$ 37015 50176 -631 60801 93090 47386 74534 13816 28341 63376 33774 26595 27104
5859B7104J2849J5006m9284m2298P963l5571L4529j3063l1829L6818m6349p92
$$ 27104 39953 54959 5675 -36623 -28660 -64231 -29702 -42765 -74594 -37776 -84125 -84917
5847h4917K5576m2128M6961l8893o440K9265j8971J6459M1562j9978L0136N480
$$ -84917 -59341 -101469 -54508 -93401 -99841 -70576 -89547 -73088 -31526 -51504 -21368 -15888
5835a5888m9105R9555Q534n315M0152j6061L6910L6987o9690J2089R516N0821
$$ -15888 -64993 34562 43096 37781 77933 61872 98782 135769 66079 78168 87684 138505
5823A38505K8317n3943n2289L7494j6036k7130n930l6662L7014p1926J9257o9932
$$ 138505 166822 112879 60590 98084 82048 54918 48988 12326 49340 -22586 -3329 -73261
5811g3261J5425K3431n2417J2715J7510l9163q068O4930L237R2649m0934j0897
$$ -73261 -57836 -34405 -86822 -74107 -56597 -95760 -103828 -38898 -35661 56988 16054 5157
5799E157N6936k0227P690K1966j5948P6210J2665m7677j6857K4853N6136L958
$$ 5157 62093 41866 49556 71522 55574 131784 144449 96772 79915 104768 160904 164862
5787A64862l7882j9088K631Q414L0319n4981P275O61m4048N1352l9217p588K1607
$$ 164862 126980 107892 110523 118937 149256 94275 101550 102211 58163 109515 70298 62710 84317
5774H4317k3059J9689L4237o0065p9M7565q163O1669j2710k4523P0377K2215K3522
$$ 84317 61258 80947 115184 55119 55040 102605 94442 156111 143401 118878 189255 211470 234992
5761B34992L2334m514L6775J4771K7661r380N7137K3328N2149j6049M6555j3526
$$ 234992 267326 262812 299587 314358 342019 332639 389776 413104 465253 449204 495759 482233
5749D82233J00075J13593J11113J82049L19962N17558R72801J276403J320682
$$ 482233 582308 695901 807014 989063 1309025 1826583 2799384 4075787 5396469
5740E396469R24483o24899j181257j038411q80346o35151l98093l14865j89412
$$ 5396469 6320952 5696053 4514796 3476385 2596039 1960888 1562795 1247930 1058518
5731A058518k43774j96628r8201p7078n0849n6554r4029l6381m240l485O776n0122
$$ 1058518 814744 618116 519915 442837 391988 335434 241405 205024 200784 197299 204075 153953
5719A53953R866J5611n912J6628k1946l4730P8587j4199j003j8942l6312L7533
$$ 153953 163819 179430 173518 190146 168200 133470 212057 197858 196855 177913 141601 179134
5707A79134k9326J365m4027J9642L7682K6580n3189k696k0630O723M6140k1823
$$ 179134 149808 151173 107146 126788 164470 191050 137861 135165 114535 121258 167398 145575
5695A45575j7146M572n613J0076J1261k4037J5052L2076j8402K188j8147k6806
$$ 145575 128429 133001 127388 137464 148725 124688 139740 171816 153414 155602 137455 110649
5683A10649O968J8656p754m4437k5481N005K8399L9772m0479j377j360m6787N2100
$$ 110649 117617 136273 128519 84082 58601 63606 92005 131777 91298 89921 88561 41774 93874
5670I3874j0083K7893j9350J5786n1073L5987k3703L1016N0287k1797q98j9695
$$ 93874 83791 111684 92334 108120 57047 93034 69331 100347 150634 128837 127939 108244
5658A08244j0756r7J5294K546L0097L3451j5177k2411l9937K0752j916K8513P494
$$ 108244 97488 97391 112685 115231 145328 178779 163602 141191 101254 122006 120090 148603 156097
5645A56097j256o228k4471j5356j366O0796m255K6092l1295j1788m6136K0130
$$ 156097 154841 148613 124142 108786 107420 168216 163961 190053 158758 146970 100834 120964
5633A20964n762J1104M1609k5763j0104m960K495J3423K5194K5636k1220L1968
$$ 120964 115202 126306 167915 142152 132048 127088 129583 143006 168200 193836 172616 204584
5621B04584n4294N1036K7751j8588k039j7790O217M4233K9417k726N736j3671
$$ 204584 150290 201326 229077 210489 208450 190660 196877 241110 270527 267801 273537 259866
5609B59866k4358M3970l4897j2353L6167M2329j1712O918k6577p7884Q2968k9319
$$ 259866 235508 279478 244581 232228 268395 310724 299012 305930 279353 201469 284437 255118
5597B55118N6265N113J8258m0937M324l5692r457P2285K7259l303K9247o7687
$$ 255118 311383 316496 334754 293817 298141 262449 252992 325277 352536 349233 378480 310793
5585C10793k7918J317J5158O2077M4384n8978L2134K046k2036J3339K0657O7285
$$ 310793 282875 284192 299350 361427 405811 346833 378967 381013 358977 372316 392973 460258
5573D60258P6299j6875j8993r640N3339L5855K9593L2002L7211L6980k4520K0398
$$ 460258 536557 519682 500689 491049 544388 580243 609836 641838 679049 716029 691509 711907
5561G11907j4119O3654N83q969L5224L918J1422j6650m390L2340K0572K8977j9708
$$ 711907 697788 761442 762025 753056 788280 792198 803620 786970 782580 814920 835492 864469 844761
5548H44761J4006Q5L2622k1124R5039l7188J5935L3275J4135M4911N1795j2686
$$ 844761 858767 858852 891474 870350 965389 928201 944136 977411 991546 1036457 1088252 1075566
5536A075566O9722L5198J3090M6313J4337O4852P4246O2841j420Q1074L5581Q6638
$$ 1075566 1145288 1180486 1193576 1239889 1254226 1319078 1393324 1456165 1454745 1535819 1571400 1658038
5524A658038R9425J08366O2929J14701L4096Q7024J47140J31535J67143J88585
$$ 1658038 1757463 1865829 1928758 2043459 2077555 2164579 2311719 2443254 2610397 2798982
5514B798982J14000J46783J64962J48386K09471K85175J77910K23653L25677K66218
$$ 2798982 2912982 3059765 3224727 3373113 3582584 3867759 4045669 4269322 4594999 4861217
5504D861217L22560L53754L50429M83288M79353N22497N99017O76727P74897Q58994
$$ 4861217 5183777 5537531 5887960 6371248 6850601 7373098 7972115 8648842 9423739 10282733
5494A0282733R97308J114725J217096J295117J377983J353908J308932J081978
$$ 10282733 11280041 12394766 13611862 14906979 16284962 17638870 18947802 20029780
5486B0029780Q54076N09609R7737k50119o39027r78079j109981j268790j297496
$$ 20029780 20883856 21393465 21491202 21241083 20602056 19623977 18513996 17245206 15947710
5477A5947710j259699j266376j218147j050928j041238q60059p91005p39369o53377
$$ 15947710 14688011 13421635 12203488 11152560 10111322 9251263 8460258 7720889 7067512
5468G067512n43150n40522m35524m16376k93773l16005k51364k96301k19707k23138
$$ 7067512 6524362 5983840 5548316 5131940 4838167 4522162 4270798 3974497 3754790 3531652
5458C531652j85364j45691j49647j37380j57480r9893j36972j28519j25244p4381
$$ 3531652 3346288 3200597 3050950 2913570 2756090 2656197 2519225 2390706 2265462 2191081
5448B191081n2581p8686j35421j05653o5835m0836j03996p6390n1832j3229o5320
$$ 2191081 2138500 2059814 1924393 1818740 1752905 1712069 1608073 1531683 1479851 1466622 1401302
5437A401302k6564j05184k8589l4386n8721k2934m8146n976o8984N580R396l3621
$$ 1401302 1374738 1269554 1240965 1206579 1147858 1124924 1076778 1070802 1001818 1007398 1016794 983173
5425I83173m1817p1790J8371P631p3899n0232P557O469r202o5760m8042M1398
$$ 983173 941356 869566 887937 895568 821669 771437 778994 785463 776261 710501 662459 703857
5413G03857o100j9360q0429l3360M7863q4535j647m4245K4177K8896l1175m4459
$$ 703857 697757 678397 597968 564608 612471 527936 526289 482044 506221 535117 503942 459483
5401D59483P698j2583p6174L946J9610L134O637o7911k7004K0714J4712J306K5728
$$ 459483 467181 454598 378424 382370 401980 405114 411751 343840 316836 337550 352262 353568 379296
5388C79296j664O52j7968o2383J3582K297N4128J0473k3263K5849j02229P2631
$$ 379296 377632 378284 360316 297933 311515 313812 367940 378413 355150 380999 278770 351401
5376C51401k6190O3837j3118l7306l0372J3939p603l9665J7248m799N7831m659
$$ 351401 325211 389048 375930 338624 308252 322191 314588 274923 292171 287372 345203 340544
5364C40544q0855j9527J8445K1635j2243k6608o9899L1283N5420n8595j5262p2250
$$ 340544 259689 240162 258607 280242 267999 241391 171492 202775 258195 199600 184338 112088
5352A12088O9274K8345J7291o2603l1500M8404n3483N2371o9235k0168L0922N6717
$$ 112088 181362 209707 226998 164395 132895 181299 127816 180187 110952 90784 121706 178423
5340A78423o937N162l7126l148J04409n3821j0667l3404m4311Q3969O397k3835
$$ 178423 171486 176648 139522 136374 240783 186962 176295 142891 98580 182549 188946 165111
5328A65111k2978L3801J0666j5533j5925m9037M5057k7673J7927p5653P958J2668
$$ 165111 142133 175934 186600 171067 155142 106105 151162 123489 141416 65763 73721 86389
5316H6389L1109K8242k9594j0572Q075Q343L980j9335k5461J2553K4998k994K4304
$$ 86389 117498 145740 116146 105574 113649 121992 125972 106637 81176 93729 118727 115733 140037
5303A40037o7060J0987O6578m7274J3154j0448k6519N8833o1842k4981O129K8642
$$ 140037 72977 83964 150542 103268 116422 105974 79455 138288 76446 51465 57594 86236
5291H6236n9933O4527o920J9195R205l6859j9407Q980J4982l1284K7743K7405
$$ 86236 26303 90830 83910 103105 112310 75451 56044 65024 80006 48722 76465 103870
5279A03870m3014J5165m5658J282M4783N626j9950L8402m8250o431K7248o6108
$$ 103870 60856 76021 30363 31645 76428 82054 62104 100506 52256 45825 73073 6965
5267F965L1418L6323J721N6340l2002n6448J8276M3511r695L6648l4187K18J7718
$$ 6965 38383 74706 76427 132767 100765 44317 62593 106104 96409 133057 98870 99088 116806
5254A16806j4169m7152J3563L8777O2489k0656k515n9805K1307N9373k646M5596
$$ 116806 102637 55485 69048 107825 170314 149658 147143 87338 108645 168018 165372 210968
5242B10968k8484L1743N372J3682k8823L8962R914N1036Q047l1218l3986K7183
$$ 210968 182484 214227 219599 233281 204458 243420 253334 304370 312417 281199 247213 274396
5230B74396K5860R0597K8942J58187J86666L53745M98363Q23824R82623R04033
$$ 274396 300256 390853 419795 577982 764648 1118393 1616756 2440580 3423203 4327236
5220D327236J81539p69227q43408p26074n05529l48002k66755j50733j67239o9812
$$ 4327236 4508775 3739548 2896140 2170066 1664537 1316535 1049780 899047 731808 661996
5210F61996j87660p9362r8626n0435K298m6885o0266q158l4685k8674K5464j6195
$$ 661996 474336 394974 296348 245913 248211 201326 141060 132902 98217 69543 95007 78812
5198G8812K332N9085j06518r17p958M6638J8928J1971k2844J0928K5942l3702
$$ 78812 81144 140229 33711 32794 24836 71474 90402 102373 79529 90457 116399 82697
5186H2697p391L5403M96p096j8071j0459R286j44n8666J3476J9555k3922J4241
$$ 82697 75306 110709 111205 104109 86038 75579 84865 84721 26055 39531 59086 35164 49405
5173D9405j2596k2877K9710k5392k7358M1391K8021l7386M982r397M169N7697
$$ 49405 36809 13932 43642 18250 -9108 32283 60304 22918 27900 18503 22672 80369
5161H0369j06607J9713K4740M8616p1593r562m9818P0455L8028m5253j5636K3744
$$ 80369 -26238 -6525 18215 66831 -4762 -14324 -64142 6313 44341 -912 -16548 7196
5149G196q24M4220k5465k0263J688R66J7013J3104j6101P128K1607j3152n170
$$ 7196 6372 50592 25127 4864 6552 7518 24531 37635 21534 28662 50269 37117 31947
5136C1947k6010j2725O3184J1365o2516l7893J1252j9390K1574m4259m857O7186
$$ 31947 5937 -6788 56396 67761 5245 -32648 -21396 -40786 -19212 -63471 -68328 -1142
5124a142p753k49l0204n84K8396L5957L1447p716R132j8407K2557K9864J818l7689
$$ -1142 -8895 -9144 -39348 -39932 -11536 24421 55868 48152 57284 38877 61434 91298 93116 55427
5110E5427M8342m931L842l5002j3114j0497L3684o2815k2059L699j3885j4139
$$ 55427 103769 98838 102680 67678 54564 44067 77751 14936 -7123 -3424 -17309 -31448
5098c1448J211m1494N2549J0194n4452K5139n2613P735M3749n5J5735L460k1338
$$ -31448 -30237 -71731 -19182 -8988 -63440 -38301 -90914 -83179 -39430 -39485 -23750 -20290 -41628
5085d1628O4740j7919j281O142k1184N4588K2154m8082p155j7025o79K8725J3574
$$ -41628 23112 5193 3912 10054 -11130 43458 65612 17530 10375 -6650 -7329 21396 34970
5072C4970n973L3291r3252K0516L4608p226j9628O247l5622O6356j790p3978M2200
$$ 34970 28997 62288 -30964 -10448 24160 16934 -2694 3553 -32069 34287 32497 -41481 719
5059G19M437K7862L158k6964j967J1783Q272l5878J0489J2882k8906o709n9569
$$ 719 5156 33018 36176 9212 7245 19028 27300 -8578 1911 14793 -14113 -20822 -80391
5046h0391M3214J8679q149m885J060k338J0384J9251R917K2308o1812M042N0242
$$ -80391 -37177 -18498 -26647 -31532 -30472 -32810 -22426 -3175 6742 29050 -32762 -28720 21522
5033B1522m322K1211l8142o496L1181K9160m5091j9732K0387q262L9689p9622
$$ 21522 17200 38411 269 -6227 24954 54114 9023 -10709 9678 1416 41105 -38517
5021c8517l50q002P075K8629j1089k1985m859K0933J0336o1931J6431K7847L6729
$$ -38517 -38867 -46869 -39794 -11165 -22254 -44239 -49098 -28165 -17829 -79760 -63329 -35482 1247
5008A247k4285j992n2920J10472j8350j2757J2063r454L4627M4409m2449L9432
$$ 1247 -23038 -25030 -77950 32522 14172 1415 13478 4024 38651 83060 40611 80043
4996H0043M7396L1181k7404O8595n7339k342k4580m1270N0444l6384p8493m1461
$$ 80043 127439 158620 131216 199811 142472 140130 115550 74280 124724 88340 9847 -31614
4984c1614R5533j5583N224l1979o6682O3975M286r9519O3798j1608j1369m0349
$$ -31614 63919 48336 53560 21581 -45101 18874 23160 -76359 -12561 -24169 -35538 -75887
4972g5887M130o8478R8566q4963N1076K7315l113m762l1315O544O4965P261K0039
$$ -75887 -71757 -140235 -41669 -126632 -75556 -48241 -51354 -56116 -87431 -80887 -15922 -8661 11378
4959A1378k7178L3145J1530k1671J3990L9927L1231n609q20j10998Q5951k6949
$$ 11378 -15800 17345 28875 7204 21194 61121 92352 86743 85923 -25075 60876 33927
4947C3927O502K8753o3107J0287R587o6070K058K9027n8180Q6043j7462n4916
$$ 33927 40429 69182 6075 16362 25949 -40121 -38063 -9036 -67216 18827 1365 -53551
4935e3551N0125q0471N9997K8788m9214J1014m327M495K7531J6604l3922J0837
$$ -53551 -3426 -83897 -23900 4888 -44326 -33312 -37639 -33144 -5613 10991 -22931 -12094
4923a2094o529k3573L1209k0175L0017J4199p741r008n2646K6327K178N9983l1488
$$ -12094 -18623 -42196 -10987 -31162 -1145 13054 5313 -3695 -56341 -30014 -27836 32147 659
4910F59K8521j6165K9091j4257j92K1063J8019J8273k2408m7901M9667q1176P9430
$$ 659 29180 13015 42106 27849 27657 48720 66739 85012 62604 14703 64370 -16806 62624
4897F2624n5186K9139l1472M199o584j5328L3590n528j177K1965P897n0981J2079
$$ 62624 7438 36577 5105 9304 2720 -12608 20982 15454 14277 36242 44139 -6842 5237
4884E237o775m578O1066k368p758M4051r6203K0641k6950P7095J486r977o0455
$$ 5237 -1538 -6116 54950 52582 44824 88875 -7328 13313 -13637 63458 64944 54967 -5488
4871e488N0430m1534k117J015L5754O387k2717o4748Q4808l7709O4106k4875O7544
$$ -5488 44942 3408 1291 2306 38060 44447 21730 -43018 41790 4081 68187 43312 110856
4858A10856J6626N3815q2745P7237R698P9521r2924n2814J280L0934o9806K5438
$$ 110856 127482 181297 98552 175789 185487 265008 172084 119270 120550 151484 81678 107116
4846A07116K37K5381J905r1479L7071M707L1568j0148R099k4521P3394m4467K7068
$$ 107116 107353 132734 134639 43160 80231 84938 116506 106358 115457 90936 164330 119863 146931
4833A46931L2326J0676K7905J9007J1841J07282m8573j2707l276P0343Q785J01578
$$ 146931 179257 189933 217838 236845 248686 355968 307395 294688 291412 361755 370540 472118
4821D72118N9734J50813L08798M90133P35206R12168R36463K97365o86421q33751
$$ 472118 531852 682665 991463 1481596 2216802 3128970 4065433 4362798 3676377 2842626
4811B842626p58149m38922m05903k39322j78815j79860j03741n361j30878o9043
$$ 2842626 2084477 1645555 1239652 1000330 821515 641655 537914 532553 401675 332632
4801C32632n7936r0990N9042n5301n1516J3887m4745l5889K0186p6450M0079R024
$$ 332632 274696 183706 242748 187447 135931 149818 105073 69184 89370 12920 52999 62023
4789F2023J9803K2173k2333m7238j746J7584O0653P219r6741O890J5387J5259
$$ 62023 81826 103999 81666 34428 32682 50266 110919 118138 21397 28287 43674 58933
4777E8933M7257n5273J3497P7771m1604j1072m3586q931N9964R791p4343N928
$$ 58933 106190 50917 64414 142185 100581 89509 45923 36992 96956 106747 32404 38332
4765C8332k7590M0779Q533k8702k7293j7900L3003J915k0466j4876J983L1264
$$ 38332 10742 51521 60054 31352 4059 -13841 19162 21077 611 -14265 -12282 18982
4753A8982J8276j4263k2049K2880R55L3441k935k9975J1460K3982k3214J1844
$$ 18982 37258 22995 946 23826 24781 58222 55287 25312 36772 60754 37540 49384
4741D9384o8704m1877P5071K4412k4452m2723n7263K335M7237K1034l3966K1261
$$ 49384 -19320 -61197 13874 38286 13834 -28889 -86152 -83817 -36580 -15546 -49512 -28251
4729b8251K7129j7381p599j2170o628J00477k1302k1937J5887o3243K7887L2348
$$ -28251 -1122 -18503 -26102 -38272 -44900 55577 34275 12338 28225 -35018 -7131 25217
4717B5217k228L2923m3773r372L6797K3163l0918P863k7177L6035M4233q2833
$$ 25217 22989 55912 12139 2767 39564 62727 31809 39672 12495 48530 92763 9930
4705I930J7335j6312L2397j3789J3466q3231Q9040m1334N7392n0579l3806M5623
$$ 9930 27265 10953 43350 29561 43027 -40204 48836 7502 64894 14315 -19491 26132
4693B6132L2735l2731J9560p1600J4368K9290P1250k4944j9628k4403L3862N660
$$ 26132 58867 26136 45696 -25904 -11536 17754 89004 64060 44432 20029 53891 59551
4681E9551l736K915J8218J1842l6835l5609N311K2023Q3371j4696M199q7469Q787
$$ 59551 55815 58730 76948 88790 51955 16346 21657 43680 127051 112355 116554 29085 37872
4668C7872k770K3992L0506l415M024j8309J393l3533n00J4031N2050K1002k6803
$$ 37872 35102 59094 89600 86185 90209 71900 73293 39760 39260 53291 105341 126343 99540
4655I9540q1999K2060n726Q9156o0025L9411N121L3218n2473K779M58L6510j869
$$ 99540 17541 39601 33875 123031 63006 102417 107538 140756 88283 91062 91520 128030 126161
4642A26161k9518L8829j5931K9149j8548q577O2776K4215m426O806M5236P5294
$$ 126161 96643 135472 119541 148690 130142 121565 184341 208556 204130 210936 256172 331466
4630C31466J00053J69001K06029K39572Q5023j13500j56369j89742m3398j13852
$$ 331466 431519 600520 806549 1046121 1131144 1017644 861275 671533 628135 514283
4620E14283l9093o1854j3342m8985N0241K0671M0651N3382O0765R3936J06925
$$ 514283 475190 413336 399994 351009 401250 421921 462572 515954 576719 670655 777580
4609G77580N2598O6743L8503P8280M9995J08359Q4750K14376J87023N9824o943
$$ 777580 830178 896921 935424 1013704 1063699 1172058 1256808 1471184 1658207 1718031 1711088
4598A711088j02104K3309J00981J40183J29670J15235P2551p9781j27413k19851
$$ 1711088 1608984 1632293 1733274 1873457 2003127 2118362 2190913 2111132 1983719 1763868
4588A763868n8253n436K6975J5782o2204n8333j25695j62079j22512o6177q2392
$$ 1763868 1705615 1700179 1727154 1742936 1680732 1622399 1496704 1334625 1212113 1145936 1063544
4577A063544k5080j06872p3078m7407j01734p0437n2657j22359j0971j74717J4216
$$ 1063544 1038464 931592 858514 811107 709373 638936 586279 463920 452949 278232 292448
4566B92448M6850j4021k2628k0392m2968L5232m8267m4902R2965L5540m265Q586
$$ 292448 339298 325277 302649 282257 239289 274521 226254 181352 274317 309857 305592 314178
4554C14178j00075K6874L4370k7181K2391K5654o244k5240m6562l9430P1454K4936
$$ 314178 214103 240977 275347 248166 270557 296211 289967 264727 218165 178735 250189 275125
4542B75125l6301k7413m2836J3934n9998K3392n0688K767L4832o3187K2827j8852
$$ 275125 238824 211411 168575 182509 122511 145903 95215 97982 132814 69627 92454 73602
4530G3602M474k7475N1959k0424K8577m1586j5755Q8545p271L6588j7503J3876
$$ 73602 78076 50601 102560 82136 110713 69127 53372 141917 134646 171234 153731 167607
4518A67607N090j0031j2962J3040K1619m655J8631k8915j9284r78j7931L8747
$$ 167607 172697 162666 149704 162744 184363 179708 198339 169424 150140 149162 131231 169978
4506A69978l2366J2573k5814m4972j9107q762L8817L7764p551l2060k7782j9689
$$ 169978 137612 150185 124371 79399 60292 51530 90347 128111 120560 88500 60718 41029
4494D1029M040K7904J1618J4982l3690J72Q980k9154N6374l5911L7388N975J5309
$$ 41029 45069 72973 84591 99573 65883 66055 75035 45881 102255 66344 103732 109707 125016
4481A25016K099q598k6186j6190N7998j8322K6246j3995l1361J4452L287K2958
$$ 125016 127115 118517 92331 76141 134139 115817 142063 128068 96707 111159 114446 137404
4469A37404n4892P3022n5695L1072j628l7681r550K6871K2368p597r51m5363R908
$$ 137404 82512 155534 99839 130911 129283 91602 82052 108923 131291 123694 122743 77380 87288
4456H7288O9668n8347J2502k2922M345k500j7902Q788K5922N4799q1874J5313
$$ 87288 156956 98609 111111 88189 92534 90034 72132 80920 106842 161641 79767 95080
4444I5080m5221R181O0577M7585k9635k9552K2448m0331P4905L8595q2594P6374
$$ 95080 49859 59040 119617 167202 137567 108015 130463 90132 165037 203632 121038 197412
4432A97412k1131K0027q785k7268m5234J04470J8j0944J2625o4157K6312Q677
$$ 197412 176281 196308 187523 160255 115021 219491 219509 208565 221190 157033 183345 192022
4420A92022m8146K0148J5146N2091l8602J2712q4793J9015K0098L3975K4324K0281
$$ 192022 143876 164024 179170 231261 192659 205371 120578 139593 159691 193666 217990 238271
4408B38271q973l6237m2614j7985M7606P8142j951M592l5970q5213N8547N049
$$ 238271 229298 193061 150447 132462 180068 258210 256259 260851 224881 139668 198215 203264
4396B03264Q9057J8181l4904k7440K2419j1622M5459o563K5749N1706k2146P112
$$ 203264 292321 310502 275598 248158 270577 258955 304414 297851 323600 375306 353160 360272
4384C60272J5620n2090K8276K4587L3798K8456J243m5298m488N0910O652M9244
$$ 360272 375892 323802 352078 376665 410463 438919 440162 394864 390376 441286 447938 497182
4372D97182K1690j5242Q5217k8527J6281j0841J11870M0080N7629P12N154N1901
$$ 497182 518872 503630 588847 560320 576601 565760 677630 717710 775339 776051 781205 833106
4360H33106N1890O8800R1627J20651P7362J85243K38150L78538P43990Q66745
$$ 833106 884996 953796 1045423 1166074 1243436 1428679 1666829 2045367 2789357 3656102
4350C656102J086311R32941L57977n36506p87468q02854p06465n23139m18703
$$ 3656102 4742413 5675354 6033331 5496825 4709357 3906503 3200038 2676899 2258196
4341B258196k78852j95101j96597j43686r6947q7448q0108o7484l4074k927M0909
$$ 2258196 1979344 1784243 1587646 1443960 1347013 1259565 1179457 1111973 1077899 1074972 1115881
4330A115881j9221k717m1376J0612j0189P0516L2639L7535P1953K1114O8901R3669
$$ 1115881 1096660 1093943 1052567 1063179 1052990 1123506 1156145 1193680 1265633 1286747 1355648 1449317
4318A449317N4875J26131J26316J30852N9295J63821J13550J34096J07463J01357
$$ 1449317 1504192 1630323 1756639 1887491 1946786 2110607 2224157 2358253 2465716 2567073
4308B567073J19330J90098J42033J49740K51324K72704M20223M42086L77688M91016
$$ 2567073 2686403 2876501 3018534 3168274 3419598 3692302 4112525 4554611 4932299 5423315
4298E423315L95211L48451K85205K26114J19853K11859R3748J86510L47184M58277
$$ 5423315 5818526 6166977 6452182 6678296 6798149 7010008 7103756 7290266 7637450 8095727
4288H095727O87753Q03277R03770J004893R10114P05071M86445J70600q1194j85765
$$ 8095727 8783480 9586757 10490527 11495420 12405534 13110605 13597050 13767650 13686456 13500691
4278A3500691l06642j68936k8119J72877M95687P62278R66266J076504J024493
$$ 13500691 13194049 13025113 12996994 13169871 13665558 14427836 15394102 16470606 17495099
4269A7495099P80657N39185L2075l56537o98173p74271o53682m94900k04299O7866
$$ 17495099 18275756 18814941 18847016 18490479 17792306 17018035 16364353 15869453 15665154 15733020
4259A5733020L20269M38734M05338L96629K99554L0457k97869n98051q67841r25930
$$ 15733020 16053289 16492023 16897361 17293990 17593544 17624001 17326132 16728081 15860240 14934310
4249A4934310r41969q68240o44597l84056j55324L9792J61754J67182J15833r8534
$$ 14934310 13992341 13124101 12479504 12095448 11940124 11979916 12141670 12308852 12424685 12326151
4239A2326151k88618m37013n72463n71085n74710n81039l43969k09495l6037M7931
$$ 12326151 12037533 11600520 11028057 10456972 9882262 9301223 8957254 8747759 8711722 8759653
4229H759653J41145J34698L4019j46052l49923m33247m63594m14255m06003l21213
$$ 8759653 8900798 9035496 9069515 8923463 8573540 8140293 7676699 7262444 6856441 6535228
4219F535228l04390j67961p6766Q3525P2950K5721j6440j89683k02092l35778
$$ 6535228 6230838 6062877 5986111 6069636 6142586 6168307 6151867 5962184 5760092 5424314
4209E424314m07570l72910l39874k66940k19241k05629j79449j1834q4097m4030
$$ 5424314 5016744 4643834 4303960 4037020 3817779 3612150 3432701 3420867 3336770 3292740
4199C292740j05847j60862j17070j89212k62876k27783j60462j79924r1736j60887
$$ 3292740 3186893 3026031 2908961 2719749 2456873 2229090 2068628 1888704 1796968 1636081
4189A636081j33491k4345q5452k8488l2311o9142m0306l3613n3710p3279j03457
$$ 1636081 1502590 1478245 1392793 1364305 1331994 1262852 1222546 1188933 1135223 1061944 958487
4178I58487j7755L2498k9533m3261o8575n5338o46j7322N132l7824O263n4833
$$ 958487 940732 973230 943697 900436 831861 776523 775877 758555 763687 725863 732126 677293
4166F77293k4983m6612l6666k426L5289m0115K0522l3122n1947L2672Q157l970
$$ 677293 652310 605698 569032 566606 601895 561780 582302 549180 497233 529905 538062 534092
4154E34092O0470l7096J8947r346m3253j6265M7158k4338M2440n0259k8825R3288
$$ 534092 594562 557466 576413 567067 523814 507549 554707 530369 572809 522550 493725 587013
4142E87013l6791k3149l1742j8485L8565K2840r3869K1496q882J6228J2901k9692
$$ 587013 550222 527073 495331 476846 515411 538251 444382 465878 456996 473224 486125 456433
4130D56433J3709K5642k7053J5437O272J6651N4014n398J018K3275k3009R8697
$$ 456433 470142 495784 468731 484168 490440 507091 561105 555707 556725 580000 556991 655688
4118F55688K3328L4426p573K5848J2968J00961l4932P9504J6441R6114P4513J0472
$$ 655688 679016 713442 705869 731717 744685 845646 810714 890218 906659 1002773 1077286 1087758
4106A087758P449O7057P9146Q6798K2118K65J031j2369l8913p292l5511r108n8235
$$ 1087758 1095207 1162264 1241410 1328208 1350326 1350591 1351622 1339253 1300340 1293048 1257537 1248429 1190194
4093A190194o1886p4419r0866l9255o1177q738l5450j3490n4821J4162m3005o95
$$ 1190194 1128308 1053889 963023 923768 862591 853853 818403 804913 750092 764254 721249 720554
4081G20554J0372O569M9350q978k8974J1473j3537N2095M7125r523L8822L1057
$$ 720554 730926 737495 786845 777867 748893 760366 746829 798924 846049 836526 875348 906405
4069I06405p782P3865m3390M4704M5499L3936K6298N7054j301M9412j8546J7547
$$ 906405 898623 972488 929098 973802 1019301 1053237 1079535 1136589 1135288 1184700 1166154 1183701
4057A183701K9176L4776K1445N8016k7205J3602L2687m6783L5470K6278L9067
$$ 1183701 1212877 1247653 1269098 1327114 1299909 1313511 1346198 1299415 1334885 1361163 1400230
4046A400230M9536l2987l9907J06985m256L6569K7064Q500O2052o429l6787K7891
$$ 1400230 1449766 1416779 1376872 1483857 1479601 1516170 1543234 1551734 1613786 1607357 1570570 1598461
4034A598461P5904K5172M8177j1617J2006O8903J0097K4576N8253J0136P3663
$$ 1598461 1674365 1699537 1747714 1736097 1748103 1817006 1827103 1851679 1909932 1920068 1993731
4023A993731P6686M2646J48523M9786M7367J12942N5349J27568P3018M2170J47995
$$ 1993731 2070417 2113063 2261586 2311372 2358739 2471681 2527030 2654598 2727616 2769786 2917781
4012B917781J08371R1522J01356J10519J95909J88420J56450K03794K31024K54866
$$ 2917781 3026152 3117674 3219030 3329549 3525458 3713878 3870328 4074122 4305146 4560012
4002D560012K42469K73286L83809L84222M36966M38243M73418O01768O89716P50703
$$ 4560012 4802481 5075767 5459576 5843798 6280764 6719007 7192425 7794193 8483909 9234612
3992I234612Q58378J106878J258133J600096J794704K187824K556473K949537
$$ 9234612 10092990 11199868 12458001 14058097 15852801 18040625 20597098 23546635
3984B3546635L253279L547769L585099L515757L134814K559104J957218J215148
$$ 23546635 26799914 30347683 33932782 37448539 40583353 43142457 45099675 46314823
3976D6314823M98110j42852o66848r07030j027906r02814o13261k41584K08043
$$ 46314823 46812933 46670081 46003233 45096203 44068297 43165483 42552222 42310638 42518681
3967D2518681M05250M91556K95646L6749m86574r80616j677126k129691k606501
$$ 42518681 42923931 43415487 43711133 43747882 43261308 42280692 40603566 38473875 35867374
3958C5867374k967458l168525l194609l017608k773651k487515k151137j837010
$$ 35867374 32899916 29731391 26536782 23519174 20745523 18258008 16106871 14269861
3950A4269861j577265j357116j154074r19202o53894n99003m86706m11337m59717
$$ 14269861 12692596 11335480 10181406 9262204 8608310 8009307 7522601 7111264 6651547
3941F651547m57397m81002m15962k87617k08112k30508j96130j66636r9751l8101
$$ 6651547 6194150 5713148 5297186 5009569 4801457 4570949 4374819 4208183 4108432 4070331
3931D070331r9288j20040o7363l6109m8890j1014k3521q953J970p1163k3839J8802
$$ 4070331 3971043 3851003 3783640 3747531 3698641 3687627 3664106 3655153 3657123 3585960 3562121 3580923
3919C580923m4252j2448K7267l1618R6846Q2892P5614J20927j3089k35823p6900
$$ 3580923 3536671 3524223 3551490 3519872 3616718 3699610 3775224 3896151 3883062 3647239 3570339
3908C570339j35167p0098o8250j44119n6661J0261J4312M58n503n0540L0594J9587
$$ 3570339 3435172 3365074 3296824 3152705 3096044 3106305 3120617 3121075 3115572 3065032 3095626 3115213
3896C115213O5792M3337N1826J08744O6513Q2642O2975K9756R8152O7946O8038
$$ 3115213 3181005 3224342 3276168 3384912 3451425 3534067 3597042 3626798 3724950 3792896 3860934
3885C860934M6602K1702L1949O2472R3641R3366J77125J29891J86671K00735J99990
$$ 3860934 3907536 3929238 3961187 4023659 4117300 4210666 4387791 4517682 4704353 4905088 5105078
3874E105078K04900K39102J65609J38019Q5402N1453r09m357p2694j07191j03656
$$ 5105078 5309978 5549080 5714689 5852708 5938110 5989563 5988654 5984297 5911603 5804412 5700756
3863E700756j32294o9670j14478o9473p2835m837k0554J11756R818Q4873J15791
$$ 5700756 5568462 5498792 5384314 5314841 5242006 5237169 5216615 5328371 5338189 5423062 5538853
3852E538853J63324K53388J91643J78741K20144K43717L48936L96571L76990M30331
$$ 5538853 5702177 5955565 6147208 6325949 6546093 6789810 7138746 7535317 7912307 8342638
3842H342638M97956M89031O02109O35259O57218Q32590Q65237R85059J029385
$$ 8342638 8840594 9329625 9931734 10566993 11224211 12056801 12922038 13907097 14936482
3833A4936482J072242J236655J441906J614807J870670K175865K421565K957751
$$ 14936482 16008724 17245379 18687285 20302092 22172762 24348627 26770192 29727943
3825B9727943L475648M126348M920701N783005O729713P680193Q678599R622573
$$ 29727943 33203591 37329939 42250640 48033645 54763358 62443551 71122150 80744723
3817H0744723J0460851J0911255J0695095R782400Q132349N775896K985028m3038
$$ 80744723 91205574 102116829 112811924 122594324 130726673 136502569 139487597 139444559
3809A39444559l020887n755879q043815r849432j0913858j1331550j1070525j0290431
$$ 139444559 136423672 130667793 122623978 112774546 101860688 90529138 79458613 69168182
3801F9168182r241503q064813p024182n988769n040593m259271l563454l012455
$$ 69168182 59926679 51861866 44837684 38848915 33808322 29549051 25985597 22973142
3793B2973142k579243k124519j800782j487747j233889j045691r07076p26363
$$ 22973142 20393899 18269380 16468598 14980851 13746962 12701271 11794195 11067832
3785A1067832o69410m90881m42654m30103m22910l66026k69893k29237k11334
$$ 11067832 10398422 9907541 9464887 9034784 8611874 8245848 7975955 7746718 7535384
3776G535384l26323k15308k59758k07207k01883q3537j62542j03704j46232p8498
$$ 7535384 7209061 6993753 6733995 6526788 6324905 6241368 6078826 5975122 5828890 5750392
3766E750392o6542K815r924P6091Q1194L2531Q1038J2538O9793Q5180K0902l1226
$$ 5750392 5683850 5686665 5676741 5752832 5834026 5866557 5947595 5960133 6029926 6115106 6136008 6104782
3754F104782n3397j83091k48406k83316l16465k12465k19043k55865k97600k27513
$$ 6104782 6051385 5868294 5619888 5336572 5020107 4807642 4588599 4332734 4035134 3807621
3744C807621j92679j48247j57812k16103j47931r8008j56435r8447j55991j42421
$$ 3807621 3614942 3466695 3308883 3092780 2944849 2846841 2690406 2591959 2435968 2293547
3734B293547o4876n3455n967j2180k9762p6427L6068q032L1234o732k6261j9513
$$ 2293547 2228671 2175216 2169249 2157069 2127307 2050880 2086948 2078916 2110150 2103418 2077157 2057644
3722B057644R9081k5670L0496J22l9535K9815M2798m0527O7466j5150l0274l9875
$$ 2057644 2156725 2131055 2161551 2161673 2122138 2151953 2194751 2154224 2221690 2206540 2176266 2136391
3710B136391l3612J3259J2170M812o0477M0620k0704K1838J0967k9122J9105K6559
$$ 2136391 2102779 2116038 2128208 2133020 2072543 2113163 2092459 2114297 2125264 2096142 2115247 2141806
3698B141806K203O311K1446k7715J3758L355M4572L4721J9787m7823K6409O8157
$$ 2141806 2144009 2150320 2171766 2144051 2157809 2161164 2205736 2240457 2260244 2212421 2238830 2306987
3686B306987J767j1274k1004n0531Q2423j3368k8794R989o5046K372P6368Q888
$$ 2306987 2308754 2297480 2276476 2225945 2308368 2295000 2266206 2276195 2211149 2213521 2289889 2298777
3674B298777R384J0783l5742N7607J04023N1756J9375K9132q858M9203K2404J2793
$$ 2298777 2308161 2318944 2283202 2340809 2444832 2496588 2515963 2545095 2536237 2585440 2607844 2620637
3662B620637O9758N3506l220J5477j5354Q1514O4481P6961L6389J03229O9613
$$ 2620637 2690395 2743901 2740681 2756158 2740804 2822318 2886799 2963760 3000149 3103378 3172991
3651C172991R5547R4710J30991J10277K18259J93540J24250K25527J49455K59637
$$ 3172991 3268538 3363248 3494239 3604516 3822775 4016315 4140565 4366092 4515547 4775184
3641D775184L64411K81512K82310L99860M52278N55000O89331O50466R02435J063127
$$ 4775184 5139595 5421107 5703417 6103277 6555555 7110555 7799886 8450352 9352787 10415914
3631A0415914J192628J310903J357451J216300J243871J020135R04975P39534
$$ 10415914 11608542 12919445 14276896 15493196 16737067 17757202 18662177 19401711
3623A9401711N27714L54959L14765K64483L30145M95122N66868P73049Q49835
$$ 19401711 19929425 20284384 20599149 20863632 21193777 21688899 22255767 23028816 23878651
3614B3878651Q59048P35025O85828M62759K51503L2995j64529l98096n58387r09837
$$ 23878651 24737699 25472724 26158552 26621311 26872814 26905809 26741280 26343184 25784797 24874960
3604B4874960j018043j091227j027698j013434q86534r03731p25035o53701n74290
$$ 24874960 23856917 22765690 21737992 20724558 19838024 18934293 18209258 17555557 16981267
3595A6981267n14265m78794m78628n25952n86724o73893p10003p60046p26445
$$ 16981267 16467002 15988208 15509580 14983628 14396904 13723011 13013008 12252962 11526517
3586A1526517o37287n50750m00032m00547k90275k13866p6118J145L9131M5998
$$ 11526517 10889230 10338480 9938448 9537901 9247626 9033760 8957642 8958787 8997918 9043916
3576I043916J14668J72954K72804L77924M07013M91491O06007P52669R27319J145008
$$ 9043916 9158584 9331538 9604342 9982266 10389279 10880770 11486777 12239446 13166765 14311773
3566A4311773J338977J638114J785490J978208K013727K063106J922596J809802
$$ 14311773 15650750 17288864 19074354 21052562 23066289 25129395 27051991 28861793
3558B8861793J602815J572732J395919J417349J271675J143552R59466P67679
$$ 28861793 30464608 32037340 33433259 34850608 36122283 37265835 38225301 38992980
3550C8992980N56925L59172J78845n9814j10871k49485l20093l97765m15703l85123
$$ 38992980 39549905 39909077 40087922 40028108 39917237 39667752 39347659 38949894 38534191 38149068
3540C8149068l73817n30757p63552j009667j353360j504932j726062j805993j810313
$$ 38149068 37775251 37244494 36480942 35471275 34117915 32612983 30886921 29080928 27270615
3531B7270615j750011j628202j357475j130536q59809o80330m79500k03824j657
$$ 27270615 25520604 23892402 22534927 21404391 20544582 19864252 19384752 19180928 19179271
3522A9179271J85511L23649N06042O61598Q98306J083833J371211J577982J718914
$$ 19179271 19364782 19688431 20194473 20856071 21754377 22838210 24209421 25787403 27506317
3513B7506317J839526K012636K021807K085954K003864J884042J767206J498574
$$ 27506317 29345843 31358479 33380286 35466240 37470104 39354146 41121352 42619926
3505D2619926J217166J073068Q41925O83055N81723M23533M25588M00914L59062
$$ 42619926 43837092 44910160 45752085 46435140 47016863 47440396 47865984 48266898 48625960
3496D8625960K08608J68534J0609j14641l07605n44179n97521p35462p62827q01739
$$ 48625960 48834568 49003102 49013711 48899070 48591465 48047286 47449765 46714303 45951476 45149737
3486D5149737p48805p47836n58719l94841k41922j52393j23418n6926J07741K69171
$$ 45149737 44400932 43653096 43094377 42699536 42457614 42305221 42181803 42124877 42232618 42501789
3476D2501789M49730O11714R55369J277313J619093J880219K050473K210434K159177
$$ 42501789 42951519 43563233 44518602 45795915 47415008 49295227 51345700 53556134 55715311
3467E5715311J943898J552636J092481M24794j04792p12126j095158j406420j507163
$$ 55715311 57659209 59211845 60304326 60729120 60624328 59912202 58817044 57410624 55903461
3458E5903461j449211j173531r51508o51684l55459j50135R5076K10669L60981
$$ 55903461 54454250 53280719 52329211 51677527 51322068 51171933 51267009 51477678 51838659
3449E1838659M70896N54357M47328M48598P7811J1882k25590m78914p19916r14013
$$ 51838659 52309555 52863912 53311240 53759838 53837649 53849531 53623941 53145027 52425111 51511098
3439E1511098j051715j061996j125131j211320j187662j237074j140669j034524
$$ 51511098 50459383 49397387 48272256 47060936 45873274 44636200 43495531 42461007
3431D2461007r49587q44109p54594q12434r16649j052392j196996j330032j329325
$$ 42461007 41511420 40667311 39912717 39100283 38183634 37131242 35934246 34604214 33274889
3422C3274889j428094j454272j436585j532577j494341j418422j352290j301814
$$ 33274889 31846795 30392523 28955938 27423361 25929020 24510598 23158308 21856494
3414B1856494j164350j102892j012712r00348r64745p51281o79954n70482n10487
$$ 21856494 20692144 19589252 18576540 17676192 16711447 15960166 15280212 14709730 14199243
3405A4199243m55713m38923k19352j99806j08846r2986p6748m3529M5405k9420
$$ 14199243 13743530 13304607 13085255 12885449 12776603 12683617 12606869 12563340 12608745 12579325
3395A2579325P8394K5445J22928J64732K73004L63462M45002O46454Q49546J193706
$$ 12579325 12657719 12683164 12806092 12970824 13243828 13607290 14052292 14698746 15548292 16741998
3385A6741998J447447J680858J921805K031193J939185J618401J321690J178332
$$ 16741998 18189445 19870303 21792108 23823301 25762486 27380887 28702577 29880909
3377B9880909J255524J478799J589987J811552J622959J268640O31987O4425l04441
$$ 29880909 31136433 32615232 34205219 36016771 37639730 38908370 39540357 39604782 39300341
3368C9300341l72736l22758n4967J77733K29056M03402M52372N30165O42168N26333
$$ 39300341 38927605 38604847 38549880 38727613 38956669 39360071 39812443 40342608 40984776 41511109
3358D1511109N03177K31189l2184o29062j172156j627271j965082k185537k438782
$$ 41511109 42014286 42245475 42213291 41584229 40412073 38784802 36819720 34634183 32195401
3349C2195401k603766k574141k513192k451493k255193k009453j824537j485065
$$ 32195401 29591635 27017494 24504302 22052809 19797616 17788163 15963626 14478561
3341A4478561j364188j159761r17480q04924o40512m97009l99811l32022k29375
$$ 14478561 13114373 11954612 11037132 10232208 9591696 9094687 8694876 8362854 8133479
3332H133479k79155p1753k3535q9316J3387m1525P5719J21337M7241J78955K88904
$$ 8133479 7854324 7782571 7759036 7669720 7683107 7641582 7717301 7838638 7885879 8064834 8353738
3321H353738L53305L56720M56926N81591P95346R49832J082321J308061J536514
$$ 8353738 8707043 9063763 9520689 10102280 10897626 11847458 12929779 14237840 15774354
3312A5774354J768522J859931J999507J975873J903424J706476J362152R90967
$$ 15774354 17542876 19402807 21402314 23378187 25281611 26988087 28350239 29341206
3304B9341206M89509R443n48579r81759j383251j747890j964836k144827k021369
$$ 29341206 29830715 29840158 29291579 28309820 26926569 25178679 23213843 21069016 19047647
3295A9047647j950202j842588j633697j488130j331554j195176j105792r43087
$$ 19047647 17097445 15254857 13621160 12133030 10801476 9606300 8500508 7557421
3287G557421o97314o24080m95216m43885l39442l20663k45744k67174j02078o5834
$$ 7557421 6860107 6236027 5740811 5296926 4957484 4636821 4391077 4123903 4021825 3955991
3277C955991q9133j76592r9827j74973m5573o3986j01040Q387m8883q6453n7668
$$ 3955991 3866858 3690266 3590439 3415466 3369893 3305907 3204867 3213254 3164371 3077918 3020250
3266C020250o6955p2271K6159o1209o8035n3744m9461o9242k2472k1859K1730
$$ 3020250 2953295 2881024 2907183 2845974 2777939 2724195 2674734 2605492 2583020 2561161 2582891
3255B582891j7276k2167j5550p0571m2389p9222K2307O8749L6255J138n2817r695
$$ 2582891 2565615 2543448 2527898 2457327 2414938 2335716 2358023 2426772 2463027 2464165 2411348 2401653
3243B401653Q1418P007j4161N0440l6114l957m6446q0111k1533j8924j5968J2809
$$ 2401653 2483071 2490078 2475917 2526357 2490243 2486286 2439840 2359729 2338196 2319272 2303304 2316113
3231B316113m9132l2369q4955m5213j3967k873p4166j2355m487O6344K6706L9745
$$ 2316113 2266981 2234612 2149657 2104444 2090477 2087604 2013438 2001083 1996596 2062940 2089646 2129391
3219B129391N2052Q6393N1156J0423j0605Q3700P6052N9177Q4562K8506J24337
$$ 2129391 2181443 2267836 2318992 2329415 2318810 2402510 2478562 2537739 2622301 2650807 2775144
3208B775144N9555O9876P5485Q0218o646N9036j735m7866J8141j28006M6578R0986
$$ 2775144 2834699 2904575 2980060 3060278 3053632 3112668 3110933 3063067 3081208 2953202 2999780 3090766
3196C090766O6299N5721P7608J12961J98339J52634j2771P4258K9428R1880Q8938
$$ 3090766 3157065 3212786 3290394 3403355 3601694 3754328 3741557 3815815 3845243 3937123 4026061
3185D026061P9288J49994J90672K02592J69903J84631K11470J69236J93117R7060
$$ 4026061 4105349 4255343 4446015 4648607 4818510 5003141 5214611 5383847 5576964 5674024
3175E674024Q7737O58M2255J2795R1925P2042P6801J70601K17144K24804K23206
$$ 5674024 5761761 5762419 5804674 5817469 5909394 5981436 6058237 6228838 6445982 6670786 6893992
3164F893992J16403J87192K13137K09930K20126K41417L13222L87309L61514M12792
$$ 6893992 7010395 7197587 7410724 7620654 7840780 8082197 8395419 8782728 9144242 9557034
3154I557034N53982N45389P03863N93508O42982O46218N35412M80541K99902L01132
$$ 9557034 10111016 10656405 11360268 11953776 12596758 13242976 13778388 14258929 14558831 14859963
3144A4859963K34329K88574K61346K76146L34543L10800L26421L68574M40613
$$ 14859963 15094292 15382866 15644212 15920358 16254901 16565701 16892122 17260696 17701309
3135A7701309M13215N39213N74632O62548P46402Q11448Q66307J097477J278003
$$ 17701309 18114524 18653737 19228369 19890917 20637319 21448767 22315074 23412551 24690554
3126B4690554J555096J869612K244593K706340L380704L823276M176740L858707
$$ 24690554 26245650 28115262 30359855 33066195 36446899 40270175 44446915 48305622
3118D8305622K500220J222053Q63365J036881J568403K242776L197297M428776
$$ 48305622 50805842 52027895 52891260 53928141 55496544 57739320 60936617 65365393
3110F5365393O028538Q203083J1338064J5731229K1761839K9357919L7193021
$$ 65365393 71393931 79597014 90935078 106666307 128428146 157786065 194979086
3103A94979086M2259275M0507823K8723058Q144754j3959462k8929757l4758483
$$ 194979086 237238361 277746184 306469242 314613996 300654534 271724777 236966294
3096B36966294l3908813k9723358k4422608j9513467j5522641j2519281j0405094
$$ 236966294 203057481 173334123 148911515 129398048 113875407 101356126 90951032
3089I0951032q751363p533271o228600n014093l691444k343777q60262J000274
$$ 90951032 82199669 74666398 68437798 63423705 59732261 57388484 56528222 57528496
3081E7528496L448304O692712J0782110J4966579J7402311J5736956Q639052k258368
$$ 57528496 60976800 67669512 78451622 93418201 110820512 126557468 135196520 132938152
3073A32938152j1261979j5487165j5532756j3737082j1239041r016769p129911
$$ 132938152 121676173 106189008 90656252 76919170 65680129 56663360 49533449
3066D9533449n814255m910009m239431l866802l275717k862053k354732j931984
$$ 49533449 43719194 38809185 34569754 30702952 27427235 24565182 22210450 20278466
3058B0278466j615673j347333j096957j006196r11998p87510p24176n47910n31838
$$ 20278466 18662793 17315460 16218503 15212307 14300309 13512799 12788623 12240713 11708875
3049A1708875m55772m35867l92960l96460l85237l58906l56974k89751k61747
$$ 11708875 11253103 10817236 10424276 10027816 9642579 9283673 8926699 8636948 8375201
3040H375201k72139l03602k80697l28273k68372k24948k24167j69180k53475k21195
$$ 8375201 8103062 7799460 7518763 7190490 6922118 6697170 6473003 6303823 6050348 5829153
3030E829153k53662k21803k95121k72011k60893k18498j54550j56906p5705J7652
$$ 5829153 5575491 5353688 5058567 4786556 4525663 4307165 4152615 3995709 3920004 3937656
3020C937656L3624J1969n1827j4697m7475m5570m5865n6333j01368j16696j55487
$$ 3937656 3971280 3983249 3931422 3916725 3869250 3823680 3777815 3721482 3620114 3503418 3347931
3009C347931l7283J2278K3218k1712r7380n7733j11170k20056j91464j72255p9842
$$ 3347931 3310648 3322926 3346144 3324432 3227052 3169319 3058149 2838093 2646629 2474374 2394532
2998B394532k6877j16260n7576J14L6416K3316M8490J8735J07918Q79l2125m8280
$$ 2394532 2367655 2251395 2193819 2193933 2230349 2253665 2302155 2320890 2428808 2429687 2397562 2349282
2986B349282l5041n714R138l6085M385j1602j8501K883k615o3718o9967j42870
$$ 2349282 2314241 2308527 2317665 2281580 2285965 2274363 2255862 2258745 2256130 2192412 2122445 1979575
2974A979575n1444p6067j24680j04305n2799j6476R68q2049k2205q941J0531j0940
$$ 1979575 1928131 1852064 1727384 1623079 1570280 1553804 1554772 1472723 1450518 1441577 1452108 1441168
2962A441168p3566o6247L7322q598O125J6282J3562M7836M4890l2395K8074k8264
$$ 1441168 1367602 1301355 1338677 1330079 1336204 1352486 1366048 1413884 1458774 1426379 1454453 1426189
2950A426189k3215k6585r3617o1452o4149o6057j2046J1514o044o427m1356o9817
$$ 1426189 1402974 1376389 1282772 1221320 1157171 1091114 1079068 1090582 1084538 1078111 1036755 966938
2938I66938k7694p0441n9452K8705M5339L6282j1696k5200l1521R5157k7710N7346
$$ 966938 939244 868803 809351 838056 883395 919677 907981 882781 851260 946417 918707 976053
2926I76053l4224k4984j9080j9262o7061M699L3900l6350L0385k1759n6055O1900
$$ 976053 941829 916845 897765 878503 811442 816141 850041 813691 844076 822317 766262 828162
2914H28162k3605j7230l2189p3010q9599p268l0012k3634O2840p9015r09o2652
$$ 828162 804557 787327 755138 682128 592529 585261 555249 531615 594455 515440 514531 451879
2902D51879n7956k9808l4686j2127q997L8767o5016O4069Q577J9701Q6522q966
$$ 451879 393923 364115 329429 317302 308305 347072 282056 346125 354702 374403 460925 451959
2890D51959L7491J5113P096l8133K5451m2895M8814k4949j4770J82j2592l3826
$$ 451959 489450 504563 511659 473526 498977 456082 504896 479947 465177 465359 452767 418941
2878D18941P200l7205m458l4040k7315m7895K2316J7809L3147N3002n2913N6714
$$ 418941 426141 388936 384478 350438 323123 275228 297544 315353 348500 401502 348589 405303
2866D05303Q208M9902l8479k489R765L4811k2337l7998l8038Q516k0404k0878
$$ 405303 413511 463413 424934 422445 432210 467021 444684 406686 368648 377164 356760 335882
2854C35882l0751m5513n1097m578n3864J7601k6150m4510K471Q282K5067K015
$$ 335882 305131 259618 208521 203943 150079 167680 141530 97020 99491 107773 132840 134855
2842A34855L2369K7421J24143J5584j8770o14J9560M1576L6310o5378O43O5900
$$ 134855 167224 194645 318788 334372 315602 314988 334548 376124 412434 347056 347699 413599
2830D13599k3314p308K1519K1358J05991O6757m707P4199N8341J14820J96690
$$ 413599 390285 382977 404496 425854 531845 598602 593895 668094 726435 841255 1037945
2819A037945J45483J36696Q8350J0763o1432r4240k04487r4330j24575k3923m2834
$$ 1037945 1183428 1320124 1408474 1419237 1357805 1263565 1059078 964748 840173 816250 773416
2808G73416j10805l9682p352J2233n7537j2180j05326O5288k385O975l2530j6934
$$ 773416 662611 622929 615577 627810 570273 558093 452767 518055 515670 522645 490115 473181
2796D73181J9173Q3318K4849R3885j5594K6532q3279o5439j33372j3534n1672
$$ 473181 492354 575672 600521 694406 678812 705344 622065 556626 423254 409720 358048
2785C58048j782n5602l9839J1067m5686L3010l7753P004j9655J6865J5405J8783
$$ 358048 356266 300664 260825 271892 226206 259216 221463 228467 208812 225677 241082 259865
2773B59865p754n0151J3213L7808J15k171k964K0338q425L7732q1211L6007L3368
$$ 259865 252111 201960 215173 252981 253096 250925 247961 268299 259874 297606 216395 252402 285770
2760B85770P9239K2171k354n8358k695l1603J0821K0408O300l1275L2049p4558
$$ 285770 365009 387180 384826 326468 323773 292170 302991 323399 329699 298424 330473 255915
2748B55915K2914k0128J196J981j2551k0645J36k8010K7673j8894j9759J0274
$$ 255915 278829 258701 259897 261878 249327 228682 228818 200808 228481 209587 189828 200102
2736B00102J421K7116l9372K8256k728M7038k9439o141k4814J0425j2343q73L2523
$$ 200102 201523 228639 189267 217523 214795 261833 232394 226253 201439 211864 199521 198648 231171
2723B31171k4534n724k6623L5481J1687P29l5536l7606L9482l4141N839J155l1018
$$ 231171 206637 200913 174290 209771 221458 222187 186651 149045 188527 154386 160225 161380 130362
2710A30362L2240m5035q45k4714q507k3748N364o283M6827J5531o2271j2111J0431
$$ 130362 162602 117567 116722 92008 83501 59753 65117 58834 105661 121192 58921 46810 57241
2697E7241R223K8910o0821N0538k0375K9016k7596J9951r447M4348Q773n2241
$$ 57241 66464 95374 34553 85091 64716 93732 66136 86087 76640 120988 129761 77520
2685G7520O7560p2818M1600J4523N321N1028k3472l7288l5341k4929K7134J0392
$$ 77520 145080 72262 113862 128385 133706 184734 161262 123974 88633 63704 90838 101230
2673A01230Q663o3728M7065j14908P9291j7644N5552m8657L0606j7746j255K2628
$$ 101230 109893 46165 93230 -21678 57613 39969 95521 46864 77470 59724 58469 81097
2661H1097n2573N6073J5095J6465J7913l4688o104l9982L6088m885O2281j3995
$$ 81097 28524 84597 99692 116157 134070 99382 93278 53296 89384 84499 146780 132785
2649A32785j6484K7664o6771m772L2132J0464k6112N33m7425M8862j2695k3341
$$ 132785 116301 143965 77194 72422 104554 115018 88906 89439 42014 90876 78181 54840
2637E4840Q34j643J7338L0683p5917J6088J0081L4984L0873l0040l7074P19l998
$$ 54840 55674 54031 71369 102052 26135 42223 52304 87288 118161 88121 51047 51766 47768
2624D7768L3565K607j6356j5048M448m807N1513l9782M4190K337o8190j2416l3588
$$ 47768 81333 83940 67584 52536 56984 52177 103690 63908 108098 110435 42245 29829 -3759
2611c759N4299M4366m669k0057J7830m751J7653Q814j1669N6809n684j2274l372
$$ -3759 50540 94906 90237 70180 88010 83259 100912 109726 98057 154866 149182 136908 133536
2598A33536m3323n920N162K8512q689j0238n0960K5843K0679k3737p991n413N4275
$$ 133536 90213 84293 89455 117967 109278 99040 48080 73923 94602 70865 62874 57461 111736
2585A11736K3460k4517K5506J0087N6794k5514J6812N731j984j5550o4209o0348
$$ 111736 135196 110679 136185 146272 203066 177552 194364 200095 198111 182561 118352 58004
2573E8004N9682k0187J8809p553k4955J6248k445m7733O7084P148R98n5652k7999
$$ 58004 117686 97499 116308 108755 83800 100048 97603 49870 116954 124102 125100 69448 41449
2560D1449K1618k3898k611n7369L2106M7572L17q3309M1810K7745N198L3806j5050
$$ 41449 63067 39169 36558 -20811 11295 58867 59184 -24125 17685 45430 50628 84434 69384
2547F9384L545K1845l0632M5279N4064n1204j2737P343j7170P0660r9132l1060
$$ 69384 72929 94774 64142 109421 163485 112281 99544 106887 89717 160377 61245 30185
2535C0185K7272J8190k9992K694p6320N0707P948j8592L1213o837L4960j4832
$$ 30185 57457 75647 45655 48349 -27971 22736 30684 12092 43305 36468 71428 56596
2523E6596k2472k3649J3053N5493J8775j672j9843j3191K6299K818L7328n0864
$$ 56596 34124 10475 23528 79021 97796 96124 76281 63090 89389 92207 129535 78671
2511G8671N441j4167N8962j2268j1629p4094M0772J9989L149k4464o4340K8925
$$ 78671 84112 69945 128907 116639 105010 30916 71688 91677 94826 70362 6022 34947
2499C4947j205N5177p4753l199J1171N5388j5717k5092m7437O7957j4278M7447
$$ 34947 33742 88919 14166 10967 22138 77526 61809 36717 -10720 57237 42959 90406
2487I0406m8709l8235K8215J0886O402O5044m1656L1659k8674K6866K1876J2939
$$ 90406 41697 3462 31677 42563 48965 114009 72353 104012 75338 102204 124080 137019
2475A37019n6959O3029L8352j4733m5495l1186O9170J2477j8154o6310M4866L4325
$$ 137019 80060 143089 181441 166708 121213 90027 159197 171674 153520 87210 132076 166401
2463A66401k8940j5438p6800L4746J6905m085j7822j8033J94l9050L0832l2911
$$ 166401 137461 122023 45223 79969 96874 92789 74967 56934 57128 18078 48910 15999
2451A5999O2118o8585L1993J2987N3657j21415j53K3817J09462M5748r8508j8511
$$ 15999 78117 9532 41525 54512 108169 -13246 -13399 10418 119880 165628 67120 48609
2439D8609O276K2869N621j6067L0383Q5451N601o1846K4963k8777O0031m5137
$$ 48609 54885 77754 83375 67308 97691 183142 188743 126897 151860 123083 183114 137977
2427A37977N3333j5427o509l3591k2203J7875L150m2918l770N9665k1044l0236
$$ 137977 191310 175883 169374 135783 113580 131455 134605 91687 87917 147582 126538 96302
2415I6302o8039q430Q3298K8974n757k9646q164N4223J0659J0038L9023K1495
$$ 96302 28263 19833 103131 132105 126348 96702 88538 142761 153420 163458 202481 223976
2403B23976k0165L7269n3476k181K8236o091K2300J6274m8242o111J9032M3250
$$ 223976 203811 241080 187604 185423 213659 207568 229868 246142 197900 191789 210821 254071
2391B54071M6952J1861m7012k4794J3577j1105k1007k7548k1915N9406l3098m6991
$$ 254071 301023 312884 265872 241078 254655 243550 222543 194995 173080 232486 199388 152397
2379A52397m79M5379R630O1978n4027O11L8665k0146L0883j1022L216K0522N4209
$$ 152397 151918 197297 206927 268905 214878 215489 254154 234008 264891 253869 257085 277607 331816
2366C31816j5856m775j2963m307K418N1914J1293o622j8341N1460o394M7727q6915
$$ 331816 315960 311185 298222 293915 296333 348247 359540 352918 334577 386037 379643 427370 340455
2353C40455M6052N3625L1728j1544J8774m7569N8183Q4054j7970N0259J8771K3631
$$ 340455 386507 440132 471860 460316 479090 431521 489704 573758 555788 606047 624818 648449
2341F48449R2055J3705O6972R6715P4719J40563R8534P7356J04888J95595K41407
$$ 648449 740504 754209 821181 917896 992615 1133178 1231712 1309068 1413956 1609551 1850958
2330A850958L07132J52615L6453q2107n2900Q667L0317K61355M66504P00596J002681
$$ 1850958 2158090 2310705 2347158 2265051 2212151 2220818 2251135 2512490 2978994 3679590 4682271
2319D682271J613076K747943M559028N882239O198527L414148l603826n388039
$$ 4682271 6295347 9043290 13602318 19484557 25683084 29097232 25493406 20105367
2311B0105367m502106l647978k595072j998470j342522j040252q60284o86172
$$ 20105367 15603261 11955283 9360211 7361741 6019219 4978967 4118683 3432511
2303C432511m86763l70592k06716j96224j57023k21280j74373k40516j45698k01418
$$ 3432511 2945748 2575156 2368440 2172216 2015193 1793913 1619540 1379024 1233326 1031908
2293A031908q9042r9040n3283p1767O0219j3305O771k9796p0002l1972m2666m1356
$$ 1031908 942866 843826 790543 718776 778995 765690 772461 742665 672663 640691 598025 556669
2281E56669r126K2961l9433k0036m5937l6327j5233k8924l1359J3992q031j1605
$$ 556669 547543 570504 531071 511035 465098 428771 413538 384614 353255 367247 359216 347611
2269C47611R705K3408n921K4990l6307j6020r686N398l8785J5664K0589k0455
$$ 347611 357316 380724 374803 399793 363486 347466 337780 343178 304393 320057 340646 320191
2257C20191o169p9156l9483L8369l3520P78k745k7835J3488k6478m6680K8431
$$ 320191 314022 234866 195383 233752 200232 201010 198265 170430 183918 157440 110760 139191
2245A39191K0115j0926K5098o9853K659j9419k2287j6362M6128Q178K0006m1626
$$ 139191 159306 148380 173478 103625 106284 86865 64578 48216 94344 102522 122528 80902
2233H0902n096L1743L6822j0592k4088j4276N8164o5166L7975o1684k4351O6698
$$ 80902 75806 107549 144371 133779 109691 95415 153579 88413 126388 64704 40353 107051
2221A07051o932j9081N1087l7848J3107M8110q7156M3787l5285P004L8625m135
$$ 107051 100119 81038 132125 94277 107384 155494 68338 112125 76840 83844 122469 118334
2209A18334m6348M489M1106L2284J6589n5471l7916P0082N7075k7405r8752R808
$$ 118334 71986 76475 117581 149865 166454 110983 73067 143149 200224 172819 74067 83875
2197H3875j0808J9515J5580n5326M0364Q0979p5407j5112k5841k2544O1933K374
$$ 83875 73067 92582 108162 52836 93200 174179 98772 83660 57819 35275 97208 99582
2185I9582o8676N6576o7614L3401L1527k0505J917P643M8598m479k1416p4394
$$ 99582 30906 87482 19868 53269 84796 64291 66208 73851 122449 117970 96554 22160
2173B2160K9548L7371N4004o7385r289L0272K8020R355m6253n8555N8301P437
$$ 22160 51708 89079 143083 75698 66409 96681 124701 134056 87803 29248 87549 94986
2161I4986j2262m3310k8914k7585M1483j3038j4922J4572l0286N4883l6864l5243
$$ 94986 82724 39414 10500 -17085 24398 11360 -3562 11010 -19276 35607 -1257 -36500
2149c6500j7515P814Q2815o043j9420l2251J5001O9058J8260n9841J2013J2741
$$ -36500 -54015 -46201 36614 30571 11151 -21100 -6099 62959 81219 21378 33391 46132
2137D6132J9511K9651m9995L8792j757l0835M1174m9802M2142m081J3665k4845
$$ 46132 65643 95294 45299 84091 82334 51499 92673 42871 85013 80932 94597 69752
2125F9752J3088k5693k6059L682k2387N2835n6056J8322L419Q85r235l5187n203
$$ 69752 82840 57147 31088 34770 12383 65218 9162 27484 30903 31788 22553 -12634 -17837
2112a7837J9111L3024l0407J2413m6669J1452K6352K483R924l7075K9642k6813
$$ -17837 1274 34298 3891 16304 -30365 -18913 7439 9922 19846 -17229 12413 -14400
2100a4400J6691J5494k9773N678M9201q791L4076k0458l0296M4170j4077J9565
$$ -14400 2291 17785 -11988 -6310 42891 34100 68176 47718 17422 61592 47515 67080
2088F7080O115o4187N1424K2724K515n4657L724j370M3829k2916m9767j0741K4813
$$ 67080 73195 9008 60432 83156 85671 31014 34738 33368 77197 54281 4514 -6227 18586
2075A8586O465l7175K3736M898L4385k8079m8962n972K9320J1016j7374L5928
$$ 18586 25051 -12124 11612 16510 50895 22816 -26146 -32118 -2798 8218 -9156 26772
2063B6772m1368L0075j6026K5642N2869l3632j1655P704k0815L0982J4455o1872
$$ 26772 -14596 15479 -547 25095 77964 44332 32677 40381 19566 50548 65003 3131
2051C131M3701J5009j0934J5286j1314P9094L527m1750j9119J6888j6149J700
$$ 3131 46832 61841 50907 66193 54879 133973 137500 95750 76631 93519 77370 79070
2039G9070m7878J9282k8038Q093m675K7413K4612j1191m3845j4564K8990j6005
$$ 79070 31192 50474 22436 30529 25854 53267 77879 66688 22843 8279 37269 21264
2027B1264L9171j8369l6306L0682l9864k124J9458p38k53J1285k3272k1964O106
$$ 21264 60435 42066 5760 36442 -3422 -5546 13912 13174 12921 24206 934 -21030 -14924
2014a4924N374N276L006k6991k1754M0659J8674O043j1380l9329K1241N3001n9490
$$ -14924 -9550 -4274 -1268 -28259 -50013 -9354 9320 15363 3983 -35346 -14105 38896 -20594
2001b0594N7237m373P28K969P662o0129M8421J8379J2774m2759j3167k9894N5024
$$ -20594 36643 32270 32998 35967 43629 -16500 31921 50300 63074 20315 7148 -22746 32278
1988C2278J2527K814l4492j6209n5356K6076R497k4262J7195K8823m1681L0869
$$ 32278 44805 47619 13127 -3082 -58438 -32362 -22865 -47127 -29932 -1109 -42790 -11921
1976a1921j6875k6986O8395k279k6629K6984l1085J7956N2226m9416j0637J4243
$$ -11921 -28796 -55782 12613 10334 -16295 10689 -20396 -2440 49786 370 -10267 3976
1964C976L996J6579L7331k1672K5572l9842l4254r666N0511L188m896K202k0881
$$ 3976 7972 24551 61882 40210 65782 25940 -8314 -17980 32531 35719 30823 33025 12144
1951A2144k358M6293m1884M0403m725l9642m6057Q618Q975Q6965m850o9263k1107
$$ 12144 9786 56079 14195 54598 49873 10231 -35826 -27208 -18233 68732 63882 -5381 -26488
1938b6488j5868j3106J6785L6852J4036j546q0179J4900k0758L9772J8489M8926
$$ -26488 -42356 -55462 -38677 -1825 12211 10665 -69514 -54614 -75372 -35600 -17111 31815
1926C1815k4804J4859m8544j3136J435P9867K2029n778k7820k8655M4966j3597
$$ 31815 7011 21870 -26674 -39810 -38375 41492 63521 57743 29923 1268 46234 32637
1914C2637j3864L6742K9688j172p192p3697J8067L2929l3109L232k1048J6834
$$ 32637 18773 55515 85203 84031 76839 3142 21209 54138 21029 24261 3213 20047
1902B0047L288j8473k6367j3851M4459j3256J5079j2402l6033K1056j228L382
$$ 20047 23335 4862 -21505 -35356 9103 -4153 10926 -1476 -37509 -16453 -17681 -14299
1890a4299K0663L0517n0139J3746O749j9906K1236J2562r726l261J2267o3925
$$ -14299 6364 36881 -13258 488 7237 -12669 8567 21129 11403 8142 20409 -43516
1878d3516Q0426j6300J8543r626j3087l0926L6156l4903J5786K7076J6766l3986
$$ -43516 36910 20610 39153 29527 16440 -14486 21670 -13233 2553 29629 46395 12409
1866A2409k0315m0418J8917M3447j0117j2699j9509l4263J612J7491k4125J5478
$$ 12409 -7906 -48324 -29407 14040 3923 -8776 -28285 -62548 -60936 -43445 -67570 -52092
1854e2092J5778j4974j8043N030J4215N9546M0985m9649K1750k911o469M7597
$$ -52092 -36314 -51288 -69331 -64301 -50086 9460 50445 796 22546 19635 13166 60763
1842F0763m2212J0321M7710j8950j7420o7918k7615P4900K8393k8094j9546j5989
$$ 60763 18551 28872 76582 57632 40212 -27706 -55321 19579 47972 19878 332 -15657
1830a5657m2774p18P31L6248M4449N3132n4219K5210l3208l0248M9025K1168M1096
$$ -15657 -58431 -59149 -58418 -22170 22279 75411 21192 46402 13194 -17054 31971 53139 94235
1817I4235J960n9374l4891N7580q416l1981j9296J4866J3634k8492r5985k5902
$$ 94235 96195 36821 1930 59510 51094 19113 -183 14683 28317 -175 -96160 -122062
1805a22062N3763P805J7688l0428k276N9793k4100k8101p647N3196j63K5302R009
$$ -122062 -68299 -60494 -42806 -73234 -75510 -15717 -39817 -67918 -75565 -22369 -22532 2770 11779
1792A1779J4943l064J5152m3950L7790K6491j3602M8107q910j6267N30j02439
$$ 11779 26722 23658 38810 -5140 32650 59141 45539 93646 84736 68469 68999 -33440
1780c3440J3999N4444k713K377k5324r253M3087k5707o3540L1951M467N1787J5975
$$ -33440 -19441 35003 32290 34667 9343 90 43177 17470 -46070 -14119 -9652 42135 58110
1767E8110q7436L5376N447l7647M4053k4214J8487K2229j9424m0785L0996q1502
$$ 58110 -29326 6050 11497 -26150 17903 -6311 12176 34405 14981 -25804 5192 -76310
1755g6310N961R234K0034K9000l4922j0764p169J646J5523J6136L8504K2132n272
$$ -76310 -70349 -61115 -41081 -12081 -47003 -57767 -64936 -63290 -47767 -31631 6873 29005 23733
1742B3733r6896J1078l071R7610K649l3264J4344l1001l7K1088n3151N922K3576
$$ 23733 -73163 -62085 -65156 32454 35103 1839 16183 -14818 -14855 6233 -46918 -40996 -17420
1729a7420k5007J744L7790n0597O9042k866Q047Q903k0034K099M2872J1093p116
$$ -17420 -42427 -40683 -2893 -53490 15552 12686 20733 29636 9602 11701 54573 65666 58550
1716E8550J487l0454L7771j0940l1888L2965r43J6221J2392n9011l2439p137k8943
$$ 58550 60037 29583 67354 56414 24526 57491 56548 72769 85161 26150 -6289 -13426 -42369
1703d2369J7426O143k4857K2263l6061l5346l9733N7320J7406O4271k0396k4664
$$ -42369 -24943 -18800 -43657 -21394 -57455 -92801 -132534 -75214 -57808 6463 -13933 -38597
1691c8597j2007o2992K293Q3348L5332J6407N4899j02233l0460p544K5693Q3160
$$ -38597 -50604 -113596 -111303 -27955 7377 23784 78683 -23550 -54010 -61554 -35861 47299
1679D7299K1557j8048m1193k1370n3174K7567J8179M7231M9996k6615p5314n165
$$ 47299 68856 50808 9615 -11755 -64929 -37362 -19183 28048 78044 51429 -23885 -29050
1667b9050j0181M3251M663l054M3581j1852j310l4588J7469K776n127L523J5439
$$ -29050 -39231 4020 8683 5629 49210 37358 36048 1460 18929 21705 16578 20101 35540
1654C5540k9238j4586k2507Q173j7119K6109o295r462K8944k2169q702K5270k2953
$$ 35540 6302 -8284 -30791 -22618 -39737 -13628 -19923 -29385 -441 -22610 -31312 -6042 -28995
1641b8995K6613K7698p3099M1910M027K596j107O985j7719L1195n4058j1395Q284
$$ -28995 -2382 25316 -47783 -5873 -1846 750 -357 6628 -11091 20104 -33954 -45349 -37065
1628c7065K8215k7310K075n5529L8491K877O9366K250J190l3358k3567k2505L3412
$$ -37065 -8850 -36160 -34085 -89614 -51123 -48246 21120 23370 24560 -8798 -32365 -54870 -21458
1615b1458L7308K8726j7213l4499k6032P0274k9933N4083j2655p189J4566p9712
$$ -21458 15850 44576 27363 -7136 -33168 37106 7173 61256 48601 41412 55978 -23734
1603b3734j0874M3909M3130m78k8265n4368J1555N05J7594N7439q160n9202o978
$$ -23734 -34608 9301 52431 51953 23688 -30680 -19125 -18620 -1026 56413 48253 -10949 -17927
1590a7927n7717M2250O157L9390l2401P5777p5620Q549j8105K3886O6694j6993
$$ -17927 -75644 -33394 -27237 12153 -20248 55529 -20091 -11542 -29647 -5761 60933 43940
1578D3940l3918K0643j5625m3043j2951r507M1571N5540m231n6458m0848j7435
$$ 43940 10022 30665 15040 -28003 -40954 -50461 -8890 46650 42419 -14039 -54887 -72322
1566g2322K9496K3114m869k4207K9236l6299K5078J067r611M3210J6547J5126
$$ -72322 -42826 -19712 -24581 -48788 -19552 -55851 -30773 -29706 -39317 3893 20440 35566
1554C5566j0368k8606J223K2389N976J5769j3821J7539J3199j7929j9072n734
$$ 35566 25198 -3408 -2185 20204 26180 41949 28128 45667 58866 40937 21865 16131
1542A6131K6540n647j6515l2837K6757k244K532m0436j2073R895J1807K5893j4679
$$ 16131 42671 37024 20509 -12328 14429 12185 14717 -25719 -37792 -27897 -16090 9803 -4876
1529d876l2121j8483N3939k2409M3307n8743N302M9719k3854l830J5450n6346
$$ -4876 -36997 -55480 -1541 -23950 19357 -39386 -34084 15635 -8219 -12049 3401 -52945
1517e2945N5256k7415k7866l07N7275o1242J7955m3335K9055L8648Q988j2358
$$ -52945 2311 -25104 -52970 -53277 3998 -57244 -39289 -82624 -53569 -14921 -5933 -18291
1505a8291n605p729n785j815K8392Q126M1065m639j1035j2880K610m6897P4839
$$ -18291 -23896 -31625 -37410 -39225 -10833 -2707 38358 33719 22684 9804 12414 -34483 40356
1492D0356P0106n6941M084p1011m3320N4666N737m1189O4522l3799k3307L0666
$$ 40356 110462 53521 57605 -13406 -56726 -2060 3677 -37512 27010 -6789 -30096 570
1480E70l3322O121M3835j3692R80k5786J3804p039r40k3331q65M6647K4066j3634
$$ 570 -32752 -26631 17204 3512 4492 -21294 -7490 -14529 -15469 -38800 -39665 6982 31048 17414
1466A7414L502n3877L1972L03n129o3592M7232r581L6663l125l4028k5124J9519
$$ 17414 20916 -32961 -989 -686 -5815 -69407 -22175 -31756 4907 1782 -32246 -57370 -37851
1453c7851N0984j6299N9291n0794j1842k693k1072K9908J9739K3892j7988J7879
$$ -37851 13133 -3166 56125 5331 -6511 -9204 -30276 -368 19371 43263 25275 43154
1441D3154q0310j4338K3988m0052M6669k2262m243P591k5823l8645L2803K8898
$$ 43154 -37156 -51494 -27506 -67558 -20889 -43151 -47394 -39803 -65626 -104271 -71468 -42570
1429d2570J0556M7341q8813P7969j6459N6210n646q510m1029K2418J1312M5580
$$ -42570 -32014 15327 -73486 4483 -11976 44234 38588 30078 -10951 11467 22779 68359
1417F8359j1223l4254n7000N957j3274O7611m2700O537j092N407l0239k1864L8189
$$ 68359 57136 22882 -34118 -28161 -41435 26176 -16524 -9987 -11079 -5672 -35911 -57775 -19586
1404a9586p322M7505j6342k755J0229O24j2846M996J6843l8577M1618j2375k5576
$$ -19586 -26908 20597 4255 1500 11729 12353 -493 4503 21346 -17231 24387 12012 -13564
1391a3564K5991l3760K825J9437k2204k2873M7689m8514K5030m9711k5879l3637
$$ -13564 12427 -21333 -18508 929 -21275 -44148 3541 -44973 -19943 -69654 -95533 -129170
1379a29170J02441Q242L9371o4348Q10j4382O9835k9886K8005J2663q395R602
$$ -129170 -26729 -18487 20884 -43464 -42654 -57036 12799 -17087 10918 23581 15186 24788
1367B4788J1584m6177j2993p191J5412J7099j1358k8383J9418k9060m968j2272
$$ 24788 36372 -9805 -22798 -29989 -14577 2522 -8836 -37219 -17801 -46861 -51829 -64101
1355f4101J670J7697K9419M4207k8704J7419l4472l580N445K5065J9535M7533
$$ -64101 -62431 -44734 -15315 28892 188 17607 -16865 -20445 -15000 10065 29600 77133
1343G7133l3834k3454o0907j6927J4355P8600k0511j4664l2052k7955q822M106
$$ 77133 43299 19845 -41062 -57989 -43634 34966 14455 -209 -32261 -60216 -69038 -64932
1331f4932j030N8827K9234q171j8070l8416Q94K2273L8936M3347j7824n2633O581
$$ -64932 -65962 -7135 22099 13928 -4142 -42558 -41664 -19391 19545 62892 45068 -7565 -984
1318i84l3355L9680l557P984k6778r602k9538K9231j3112J6820K374l1875k2061
$$ -984 -34339 5341 1784 9768 -17010 -26612 -56150 -26919 -40031 -23211 -20837 -52712 -74773
1305g4773N541m50L3042K457J2416rJ4726r658K4966j7608J5744J3241K1011K3809
$$ -74773 -69232 -69682 -36640 -34183 -21767 -21776 -7050 -16708 8258 -9350 6394 19635 40646 64455
1291F4455r552k9576L779K0017M495L877j5093Q245p706k8026o9178Q659J2556
$$ 64455 54903 25327 29106 49123 53618 57495 42402 50647 42941 14915 -54263 -45604 -33048
1278c3048L3528O325J1186n5455k1651m2623N9982N9693L5524m2850l7130k3116
$$ -33048 480 6805 17991 -37464 -59115 -101738 -41756 17937 53461 10611 -26519 -49635
1266d9635q95L2372j3281M6314r703j9725q146m6531N2131j3488j9250l844P5462
$$ -49635 -50530 -18158 -31439 14875 5172 -14553 -22699 -69230 -17099 -30587 -49837 -53681 21781
1253B1781r1585L1043m2281J156O7351J973q562K7155k2889m102K1638k9361K9828
$$ 21781 -69804 -38761 -81042 -79886 -12535 -10562 -19124 8031 -14858 -18960 2678 -26683 3145
1240C145N1978j1183o306L136l6377K7744l7770K1327J0060j0048k6112l8820
$$ 3145 55123 43940 37634 40770 4393 32137 -5633 15694 25754 15706 -10406 -49226
1228d9226j646L9605N389J8267k542l5192l593O017k2056Q3413k8332k4068K2894
$$ -49226 -50872 -11267 -5878 12389 9847 -25345 -28938 -22921 -44977 38436 10104 -13964 8930
1215H930l0960K6642K5911n0755P347J7765k2871M032r133k8155N7449j4673j0357
$$ 8930 -22030 4612 30523 -20232 -12885 4880 -17991 -13959 -23092 -51247 6202 -8471 -18828
1202a8828L3221j3690p675k0874M817j3499M1738j9115l6764L4057K0112R673
$$ -18828 14393 703 -6972 -27846 -23029 -36528 5210 -13905 -50669 -16612 3500 13173
1190A3173n9176L4627M274L2264m9227l1615L6794L3811J1763m7135M688k435
$$ 13173 -46003 -11376 -7102 25162 -24065 -55680 -18886 14925 26688 -20447 -15759 -18194
1178a8194p159K112O886K6470L2567l0889m0762O021R483K1067M9943k7636j0625
$$ -18194 -25353 -23241 -16355 10115 42682 11793 -28969 -22948 -13465 7602 57545 29909 19284
1165A9284n1122n1069Q3847K2818R987k6415p252J2384J1497p0237m9516P8229
$$ 19284 -31838 -82907 940 23758 33745 7330 78 12462 23959 -46278 -95794 -17565
1153a7565M1094J6929o6863l5067N731k666J9719K6451J6683J6597n1685J6279
$$ -17565 23529 40458 -26405 -61472 -55741 -58407 -38688 -12237 4446 21043 -30642 -14363
1141a4363j5246j3427O04N6429R290J9563n7788j2790K1700j4558Q047l2063K0836
$$ -14363 -29609 -43036 -42432 13997 23287 42850 -14938 -27728 -6028 -20586 -12539 -44602 -23766
1128b3766L8018l5078k1238m5844L7083M5112j3443j7220j169O203M0716J468
$$ -23766 14252 -20826 -42064 -87908 -50825 -5713 -19156 -36376 -37545 -31342 9374 10842
1116A0842o4465J8585k5597N7669M8176l5429M869j2071j3946N5310j9777o8795
$$ 10842 -53623 -35038 -60635 -2966 45210 9781 14650 2579 -11367 43943 24166 -44629
1104d4629K0814K2161O30J6649r2834M909N849q639M0657J1749j2212M4625l6807
$$ -44629 -23815 -1654 -1024 15625 -77209 -72300 -66451 -75090 -34433 -22684 -34896 9729 -27078
1091b7078l6854R43k301M8127M3955Q735k3991p393J5298L248O411K5170k195
$$ -27078 -63932 -62989 -65290 -17163 26792 35527 11536 4143 19441 22689 29100 54270 52075
1078E2075j5691o638o7172k5293n906J7704Q4351m8564l8206k944J6481K0877
$$ 52075 36384 29746 -37426 -62719 -68625 -50921 33430 -15134 -53340 -56284 -39803 -18926
1066a8926K0419p4022j9540N3986R434M0999l7088l3211L3370k8779K5030J2002
$$ -18926 1493 -72529 -92069 -38083 -28649 12350 -24738 -57949 -24579 -53358 -28328 -16326
1054a6326J455J9861j200j4956p505P010l7320M2328N39K1232j6156k2196r08
$$ -16326 -14871 4990 3790 -11166 -18671 -11661 -48981 -6653 -6114 15118 -1038 -23234 -24142
1041b4142J4632k9907j1229O7174J4789j4886j7362l5110M6468p535k287J3874
$$ -24142 -9510 -39417 -50646 16528 31317 16431 -931 -36041 10427 2892 605 14479
1029A4479R113K5169p435n7350l0404J6638R951K4055J9058m3408k5395l2894
$$ 14479 23592 48761 41326 -16024 -46428 -29790 -19839 4216 23274 -20134 -45529 -78423
1017g8423K2156L8615J831k1678o0384J2280Q450K81K8959L493K6125o999q648
$$ -78423 -56267 -17652 -15821 -37499 -97883 -85603 -77153 -76872 -47913 -44420 -18295 -25294 -33942
1004c3942L769K1521k3122J481M0622J4697K0251o5350J2559j737K8908N355R107
$$ -33942 -30173 -8652 -31774 -30293 10329 25026 45277 -20073 -7514 -9251 19657 25012 34119
991C4119j3299K603k481j2072K0705J0707l2897k3418J2488j7453r2j4840j0238
$$ 34119 20820 23423 20942 8870 29575 40282 7385 -16033 -3545 -20998 -21090 -35930 -46168
978d6168L1481M856o7252J1127J568q027M9098r564j0693r834q064m8172P7378
$$ -46168 -14687 -9831 -77083 -65956 -64388 -72415 -23317 -32881 -43574 -53408 -61472 -109644 -32266
965c2266j671K2772N674n0858L3720m620M3085k319K5922k1108p292N780L0753
$$ -32266 -33937 -11165 -5491 -56349 -22629 -27249 15836 13517 39439 18331 11039 16819 47572
952D7572j1518l0931K5866j2641N4585n3991n3055K3407j8185K2827M2893l6179
$$ 47572 36054 5123 30989 18348 72933 18942 -34113 -10706 -28891 -6064 36829 650
940F50j5637P601n9962k534N2399j3841J3275o028n5360O745j5225K2529K5282
$$ 650 -14987 -7386 -67348 -69882 -17483 -31324 -18049 -24077 -79437 -72692 -87917 -65388 -40106
927d0106J3456Q73k3486K747m1426J5131N7496J6359K0766o352o9196K36L4364
$$ -40106 -26650 -25777 -49263 -46516 -87942 -72811 -15315 1044 21810 15458 -53738 -53502 -19138
914a9138k64O4403l9966o9499M0235j057J3990j701j2892J7196K8719j1862n793
$$ -19138 -19402 45001 5035 -64464 -24229 -25286 -11296 -12997 -25889 -8693 20026 8164 2371
901B371l955Q863N860k5409k7543K1104p674O2670q7711K1491o108k45j2126J5844
$$ 2371 -1584 7279 13139 -12270 -39813 -18709 -26383 36287 -51424 -29933 -36041 -36286 -48412 -32568
887c2568l5550L3218J1717l3833N3364l1677j7464J1116n177N8903J6512l0796
$$ -32568 -68118 -34900 -23183 -57016 -3652 -35329 -52793 -41677 -46854 12049 28561 -2235
875b235o806Q6J742k5585o697O6984M1422k3142o9781q5405P6129O1359L6414
$$ -2235 -9041 -8955 -7213 -32798 -39495 27489 68911 45769 -24012 -109417 -33288 28071 64485
862F4485m0395L336m7284m871m6801K8783M4459K4308q2068n086l4036J6516n261
$$ 64485 24090 27426 -19858 -24729 -71530 -42747 1712 26020 -56048 -61134 -95170 -78654 -83915
849h3915M0769j7911M3785k6043m5751K9539L9354l2159L3652J8693K5604l075
$$ -83915 -43146 -61057 -17272 -43315 -89066 -59527 -20173 -52332 -18680 13 25617 22542
837B2542m7642k0272N9554K0975J560k6835k3665L7485k2483n421l71K2916R151
$$ 22542 -25100 -45372 14182 35157 36717 9882 -13783 23702 1219 -4202 -4573 18343 27494
824B7494M94l7763j6617l0006L514M6863r648K3425j2005o4453l2132J5992N2479
$$ 27494 27988 -9775 -26392 -56398 -52884 -6021 -15669 7756 -4249 -68702 -100834 -84842 -32363
811c2363J4002J1886n8285N59k198r220L6845M3240J3853n675r504q908N425J3485
$$ -32363 -18361 -6475 -64760 -64201 -66399 -75619 -38774 4466 18319 12644 3140 -5768 -343 13142
797A3142K304J2209j7663M091j0436m2522j6681R540M2137p255R892m3035o516
$$ 13142 15446 27655 9992 14083 3647 -38875 -55556 -46016 -3879 -11134 -1242 -44277 -50793
784e0793m239J1463L6373q51J3646k2911k0819J5330M5344l5748L7696k8686K1794
$$ -50793 -55032 -43569 -7196 -8047 5599 -17312 -38131 -22801 22543 -13205 24491 -4195 17599
771A7599J4745k4632k1560P4476k7273K7345o4610l0287k995K9771L5053P81k0815
$$ 17599 32344 7712 -13848 60628 33355 60700 -3910 -34197 -37192 -7421 27632 28413 7598
758G598k7984k5101m247l490M3975J0803K3622n8086L722l5628k4028L4378K7351
$$ 7598 -20386 -45487 -49734 -53224 -9249 1554 25176 -32910 -29188 -64816 -88844 -54466 -27115
745b7115J3221k0958k2633l6416N1862k7807p636M7726L5684J740j2282p0173
$$ -27115 -13894 -34852 -57485 -93901 -42039 -69846 -77482 -29756 5928 7668 -4614 -74787
733g4787r996O1440M4242k5446Q02l1484M6464p519J5441k5051L8779j8435R801
$$ -74787 -84783 -23343 20899 -4547 -3745 -35229 11235 3716 19157 -5894 32885 14450 24251
720B4251m7933k4084K1225L2491m304K80l4114l0100q794L6746L0169M43k543
$$ 24251 -23682 -47766 -26541 5950 1646 1926 -32188 -62288 -71082 -34336 -4167 -3724 -6267
707f267o3636k1105J680O595L6124L0252j676Q296o3187p43K2902O0683K3039
$$ -6267 -69903 -91008 -89328 -82733 -46609 -16357 -18033 -9737 -72924 -73667 -50765 9918 32957
694C2957j8499j2510J4524p3434q634j7329M4663P9864J883n8384j7923n3602
$$ 32957 14458 1948 16472 -56962 -65596 -82925 -38262 41602 43485 -14899 -32822 -86424
682h6424K9402L6458k807K9853K9945n0455j0503j1312k9905M7491L1102M005
$$ -86424 -57022 -20564 -23371 6482 36427 -14028 -24531 -35843 -65748 -18257 12845 16850
670A6850K0289k7767k5149l1848K001L7966N00J9054j5032M189R820l6849k7424
$$ 16850 37139 9372 -15777 -47625 -45624 -7658 -7158 11896 -3136 1053 10873 -25976 -53400
657e3400M8455k8993M558k4592K3922L0798j4378o9289j0057J2825N6617j418
$$ -53400 -4945 -33938 -29380 -53972 -30050 748 -13630 -82919 -92976 -80151 -23534 -24952
645b4952J6646k4543K676l3210n062P347J9463L4101J5486J394R539k2746n6377
$$ -24952 -8306 -32849 -30173 -63383 -68445 -61098 -41635 -7534 7952 9346 18885 -3861 -60238
632f0238J5977L5158M7960J992o6523J3140k8132k120k5243L5305M0049P1797
$$ -60238 -44261 -9103 38857 40849 -25674 -12534 -40666 -42786 -68029 -32724 7325 79122
620G9122l8800j02281r872K6852M7378K1036k5425m870N5507o7350o1682J8075
$$ 79122 40322 -61959 -71831 -44979 2399 23435 -1990 -6860 48647 -18703 -80385 -62310
608f2310L1916N6113J5839q3234k2387j3545L5512k2261L2886k2220J1672q632
$$ -62310 -30394 25719 41558 -41676 -64063 -77608 -42096 -64357 -31471 -53691 -42019 -50651
596e0651n515p695M9275k3127n667K3822l6725q340M7304r775O6926j8883r6811
$$ -50651 -56166 -63861 -14586 -37713 -43380 -19558 -56283 -64623 -17319 -27094 39832 20949 -75862
583g5862J7958M3830K6076O898l5066J5045P9008k8740j04695K1931J6159P8827
$$ -75862 -57904 -14074 12002 18900 -16166 -1121 77887 49147 -55548 -33617 -17458 61369
571F1369k0671n5383j689K6826l1295o7252L2756L0412L3101j8150k7467m8111
$$ 61369 40698 -14685 -16374 10452 -20843 -88095 -55339 -24927 8174 -9976 -37443 -85554
559h5554K126j7013L2105Q5451J6405l2087n1333j7082O0946R57j338J8089O2031
$$ -85554 -83428 -100441 -68336 17115 33520 1433 -49900 -66982 -6036 -5079 -6417 11672 73703
546G3703m170n4505m0479L5065N4249n588q7003J2284K4118J4314m4682l9477
$$ 73703 69533 15028 -25451 9614 63863 58275 -28728 -16444 7674 21988 -22694 -62171
534f2171M502L3399j7768m7802L6084o570J2176k4246l9535L405P279K9639M6607
$$ -62171 -57669 -24270 -42038 -89840 -53756 -60326 -48150 -72396 -111931 -108526 -101247 -71608 -25001
521b5001O6553n0192K3792o9149L8076K4105j5827O933O0588k4537J122n2971
$$ -25001 41552 -8640 15152 -53997 -15921 8184 -7643 -710 59878 35341 36463 -16508
509a6508k6281O7551n195K915o427j8430k3423j2734l8270L9182J8523L6553k2712
$$ -16508 -42789 24762 19567 22482 16055 -2375 -25798 -38532 -76802 -37620 -19097 17456 -5256
496e256k9047j7682l466J7501L8187j0850K4434m3191J5866j4064m520j0309J139
$$ -5256 -34303 -51985 -55451 -37950 237 -10613 13821 -29370 -13504 -27568 -32088 -42397 -41258
483d1258K8563R426k4201j7986r644j575K1679J8535k7184J9584k3051N1124j490
$$ -41258 -12695 -3269 -27470 -45456 -55100 -56675 -34996 -16461 -43645 -24061 -47112 4012 2522
470B522p698Q948N543j862j5030k4228L6565K3513l827n2474J1316o0934Q6826
$$ 2522 -5176 3772 9315 7453 -7577 -31805 4760 28273 24446 -28028 -16712 -77646 9180
457I180o2815M4181Q890k9988K0916l0015m0303m568M0027k5924J39968q3172
$$ 9180 -53635 -9454 -564 -30552 -9636 -39651 -79954 -84522 -44495 -70419 69549 -13623
445a3623l1704J7245R15N2688M014n3217M4370M689j5814n0334K2377N195O2223
$$ -13623 -45327 -28082 -27167 25521 29535 -23682 20688 25377 9563 -40771 -18394 -13199 49024
432D9024n3591j314k0286M1013j6601l8790K2765O699m9504O7467o3472N402J8972
$$ 49024 -4567 -5881 -26167 14846 -1755 -40545 -17780 -11081 -60585 6882 -56590 -51188 -32216
419c2216m4028K6643N1332n8868K2130O353k4821K9718n6498p365L0932K8321
$$ -32216 -76244 -49601 1731 -57137 -35007 -28654 -53475 -23757 -80255 -87620 -56688 -28367
407b8367J3609l6922J9360J1599m9221M9525j9915L602Q1584m5525r207M8674
$$ -28367 -14758 -51680 -32320 -20721 -69942 -20417 -40332 -36730 44854 -671 -9878 38796
395C8796p9379J7963N7725m870J2711O344q1101P5279q1745j6148k3259M5075
$$ 38796 -40583 -22620 35105 30235 42946 49290 -31811 43468 -38277 -54425 -77684 -32609
383c2609n774J3740p6606N268O0289N204j8929m009L8377j7732j6247N2414n4132
$$ -32609 -38383 -24643 -101249 -95981 -35692 -30488 -49417 -53426 -15049 -32781 -49028 3386 -50746
370e0746P6560l6181l140O2102J2058m5267J8545O371m653M639r3764L0162J2176
$$ -50746 25814 -10367 -13507 48595 60653 15386 33931 40302 35649 40288 -53476 -23314 -11138
357a1138J7104o2142L25K4543L247n5084L046p981N2547l252r3056K2765M1916
$$ -11138 5966 -56176 -55851 -31308 -28061 -83145 -80099 -88080 -35533 -38785 -131841 -109076 -67160
344f7160k8791P4893k5493J189L7255l4839k6986O7250l1185M6029J5771l2044
$$ -67160 -95951 -21058 -46551 -45362 -8107 -42946 -69932 -2682 -33867 12162 27933 -4111
332d111K1820P256n3087M4364K1888L2368n1679j8783j2109K0164j0055K2100
$$ -4111 17709 24965 -28122 16242 38130 70498 18819 36 -12073 8091 -1964 20136
320B0136j7232J7332k6749n8766N6141k8483M8179K8688o3077j0579l805j9535
$$ 20136 2904 20236 -6513 -65279 -9138 -37621 10558 39246 -23831 -34410 -38215 -57750
308e7750j3023K7911K058M0302j7753n8844k7746K2044N4394j4316p75L189j1071
$$ -57750 -70773 -42862 -40804 -502 -18255 -77099 -104845 -82801 -28407 -42723 -43498 -40309 -51380
295e1380r808m5339K9200K3768L1446j1180K8135j3507J548k1251k8356P7079
$$ -51380 -61188 -106527 -77327 -53559 -22113 -33293 -5158 -18665 -17117 -38368 -66724 10355
283A0355K9791n952n5576p52P880k5611Q779O2107j4593N6376j01517l8623M3725
$$ 10355 40146 34194 -21382 -22134 -14254 -39865 -31086 31021 16428 72804 -28713 -67336 -23611
270b3611L2762m3343N8521o1593M9583m552r4933M0415N1494l0125J0459k0293
$$ -23611 9151 -34192 24329 -37264 12319 7767 -87166 -46751 4743 -25382 -14923 -35216
258c5216J3294o75m1316n4091Q3145K519o43m0377j750M6226O99k0692L9072o195
$$ -35216 -21922 -22597 -63913 -118004 -34859 -32340 -32983 -73360 -75110 -28884 -28185 -48877 -9805 -16000
244a6000M1409n6513l6721K2492L0945K6248p395l9568K7016M513m3472N6488
$$ -16000 25409 -31104 -67825 -45333 -14388 11860 4465 -35103 -8087 -3574 -47046 9442
232I442O921j444k5152r917k7209J1990P553P031M352L0152r0386M78q431L6817
$$ 9442 16363 14919 -10233 -20150 -47359 -35369 -27816 -20785 -16433 13719 -76667 -76189 -84620 -47803
218d7803M919K0618o4866J4317K5412m3091O1223O06N534L9655N273n9995K0233
$$ -47803 -42884 -22266 -87132 -72815 -47403 -90494 -29271 -28665 -23131 16524 21797 -38198 -17965
205a7965k8600N7526K1564o0500N9910j230L095j2058j8809n0358O3632m7582
$$ -17965 -46565 10961 32525 -27975 31935 30705 33800 21742 2933 -47425 16207 -31375
193c1375M3271l0053m0848j3340k4104p976N5438q267o883M1159m5315k1839Q14
$$ -31375 11896 -18157 -59005 -72345 -96449 -104425 -48987 -57254 -64137 -22978 -68293 -90132 -89318
180h9318l541P4705J223m8863j2906j939N7560j587K398j9122K1009j4914m472
$$ -89318 -92859 -18154 -16931 -65794 -78700 -80639 -23079 -24666 -22268 -41390 -20381 -35295 -39767
167c9767k9030L7526Q615k3202m462m3342L2992M5876L537j772l130k4553N222
$$ -39767 -68797 -31271 -22656 -45858 -50320 -93662 -60670 -14794 -11257 -13029 -16159 -40712 -35490
154c5490J4992J326R733J2094l730k2680p501m4087N3331J8510P928l9743j8485
$$ -35490 -20498 -19172 -9439 2655 -1075 -23755 -31256 -75343 -22012 -3502 4426 -35317 -53802
141e3802k5728L0535J1666m0260O2936m1733K6125R18k1930l8002N1897k0509
$$ -53802 -79530 -48995 -37329 -77589 -14653 -56386 -30261 -29343 -51273 -89275 -37378 -57887
129e7887J0808J2574j8913j1300j844k0910J9760l2216K0531L943j6836p279l8752
$$ -57887 -47079 -34505 -53418 -64718 -66562 -87472 -67712 -99928 -79397 -75454 -92290 -99569 -138321
116a38321J2784K8790J8929p86J6677j7018Q133J8769l0713N6324L675K729m54
$$ -138321 -125537 -96747 -77818 -78604 -61927 -78945 -70812 -52043 -82756 -26432 -22757 -20028 -20482
103b0482m6998J3629M904K1903K4298j7388l8413j2063m832K6670K146k2094j4496
$$ -20482 -67480 -53851 -48947 -27044 -2746 -20134 -58547 -70610 -75442 -48772 -46626 -68720 -83216
90h3216j9488j1226L8500l3753L1946k7317J6971j5560J2037k2113J411J6953
$$ -83216 -102704 -113930 -75430 -109183 -77237 -104554 -87583 -103143 -91106 -113219 -111808 -94855
78i4855r304K9387m3345J5197J0659n58j0301j7595K5873k2326P370L030j826
$$ -94855 -104159 -74772 -118117 -102920 -92261 -92819 -103120 -120715 -94842 -117168 -109798 -106768 -108594
65a08594L252O530k9606K4058J7280k7667N9301k3311k4017J6370k6517K7503
$$ -108594 -105342 -98812 -128418 -104360 -87080 -114747 -55446 -78757 -102774 -86404 -112921 -85418
53h5418L0212k1954j6091J4883K5888N699m6979k6521m792L4161k322O438k3935
$$ -85418 -55206 -77160 -93251 -78368 -52480 -46781 -93760 -120281 -125073 -90912 -93234 -86796 -110731
40a10731J2736j5580k1685P930n59K8587L031r115l638k2921J0464m618L4832
$$ -110731 -97995 -113575 -135260 -127330 -127889 -99302 -96271 -105386 -109024 -131945 -121481 -126099 -91267
27i1267o734J6887k5832k9159L3L99J2403J5186K5280o9672N147j7552p979L5073
$$ -91267 -98001 -81114 -106946 -136105 -136072 -135673 -123270 -108084 -82804 -152476 -147329 -164881 -172860 -137787
13a37787k0377o788K4009J253L257P054l0322K389K4082k2654K0091k6568J1055
$$ -137787 -158164 -164952 -140943 -139690 -136433 -129379 -159701 -157312 -133230 -155884 -135793 -162361 -151306
0a51306
$$ -151306
$$ Imaginary data points
##PAGE= N=2
##DATA TABLE= (X++(I..I)), XYDATA
16383h02541j5130K7927L6855l499K853j9075J6111J8512K3495m662M9440n465
$$ -802541 -817671 -789744 -752889 -756388 -753535 -772610 -756499 -737987 -714492 -719154 -669714 -675179
16371f75179K1438j0949j4820J2763L2673q39K196J0404J6898n990J0403R325
$$ -675179 -653741 -664690 -679510 -666747 -634074 -634913 -632717 -622313 -605415 -611405 -601002 -591677
16359e91677j4816k1072M4571K5599K3452j6624m3116L1481J0392J8062K3690
$$ -591677 -606493 -627565 -582994 -557395 -533943 -550567 -593683 -562202 -551810 -533748 -510058
16348e10058L9766k1427N6537n1335K6438K6716K5030L9278J8703j8044J5676
$$ -510058 -470292 -491719 -435182 -486517 -460079 -433363 -408333 -369055 -350352 -368396 -352720
16337c52720j4166L7454K6334K5467J6658Q069l897L0013k9757Q394K6410j8210
$$ -352720 -366886 -329432 -303098 -277631 -260973 -252904 -256801 -226788 -256545 -248151 -221741 -239951
16325b39951K8942m0538j722M9343j5979k2984K2528m1453M6515K5488k4309J4797
$$ -239951 -211009 -251547 -253269 -203926 -219905 -242889 -220361 -261814 -215299 -189811 -214120 -199323
16313a99323J3299l339J4734J1422L823K6803j7072K7553J8265J6441L81l8887
$$ -199323 -186024 -189363 -174629 -163207 -159384 -132581 -149653 -122100 -103835 -87394 -87013 -125900
16301a25900M9330J565K0272N595J438N290M6556m9320M230K8651P459N2745J048
$$ -125900 -76570 -75005 -54733 -49138 -47700 -42410 4146 -45174 -40944 -12293 -4834 47911 48959
16288D8959j1817N3519l0955K5744j0660K8496M2294j129l385j9472j6633K5848
$$ 48959 37142 90661 59706 85450 74790 103286 145580 144451 141066 121594 104961 130809
16276A30809K2898j7461N0587m9682J9940J6520l4695J7439k117k5298N9473J9723
$$ 130809 153707 136246 186833 137151 157091 173611 138916 156355 154238 128940 188413 208136
16264B08136m7356K2473n493K4020O4037j4910j4195L0074p082L8906j7993J9576
$$ 208136 160780 183253 177760 201780 265817 250907 236712 266786 259704 298610 280617 300193
16252C00193J8281J3575m0124q827j888L7458k214j2194q477J3218J6411j8898
$$ 300193 318474 332049 291925 283098 281210 318668 316454 304260 295783 309001 325412 306514
16240C06514K529J7192j3598M1939n870j4395O5079l8856P624L1559p97K1680
$$ 306514 309043 326235 312637 354576 348706 334311 399390 360534 368158 399717 398920 420600
16228D20600j6755M622Q523K4895l4672M564K9295J8168L5527o6745J5017m132
$$ 420600 403845 408467 416990 441885 407213 411777 441072 459240 494767 428022 443039 438907
16216D38907N9882m4697J3135k4796o011R934j0752J4182L1142J9089m5197K9651
$$ 438907 498789 454092 467227 442431 436420 446354 435602 449784 480926 500015 454818 484469
16204D84469j3176l0175R2868l5772j5153K5690l1800K3169J8257o959O159J5545
$$ 484469 471293 441118 533986 498214 483061 508751 476951 500120 518377 511418 517577 533122
16192E33122j1691M4543j9122k1781L9454j3381J4077J5326j6749q141L1214N9691
$$ 533122 521431 565974 546852 525071 564525 551144 565221 580547 563798 555657 586871 646562
16180F46562k0683M3698p2412P051J2182L9785l2233O595K5288l3807o25m2508
$$ 646562 625879 669577 597165 604216 616398 656183 623950 630545 655833 622026 621401 578893
16168E78893J9258J6898J8103l9956J9813l3299p45m667J3747J3778K2381l8647
$$ 578893 598151 615049 633152 593196 613009 579710 578965 574298 588045 601823 624204 585557
16156E85557K5980m003J773P440O175L2973p084l9479r816o69P2851J3875j9014
$$ 585557 611537 607534 609307 616747 622922 655895 648811 609332 599516 598847 671698 685573 666559
16143F66559k2929K3246l200L8898n6363l791M1507K181J6835k6461l2709M0345
$$ 666559 643630 666876 663676 702574 646211 642420 683927 686108 702943 676482 643773 684118
16131F84118l257N493M4697k4951k0596J8251p615J5537J0060o5684O1624k5075
$$ 684118 680861 686354 731051 706100 685504 703755 696140 711677 721737 656053 717677 692602
16119F92602J8081k1977m913j9896Q6190o5230j3882m5969Q06R780K2077l7464
$$ 692602 710683 688706 683793 663897 750087 684857 670975 625006 625812 635592 657669 620205
16107F20205J9865L182l915l5398j2018K2574L4113N7850l1944l1386M396J4129
$$ 620205 640070 643252 639337 603939 591921 614495 648608 706458 674514 643128 647524 661653
16095F61653J5344P0173l5890L2028j07n289j827K8780p1835R6181p860j2705
$$ 661653 676997 747170 711280 743308 743201 737912 736085 764865 693030 789211 781351 768646
16083G68646N255p2425K4212Q0254Q59n8397k010m0768M5594K7771q0121j1236
$$ 768646 773901 701476 725688 805942 806801 748404 746394 705626 751220 778991 698870 687634
16071F87634J398K8297p2360L9082k0792K0018J9102m0844N280J5262O810j910
$$ 687634 689032 717329 644969 684051 663259 683277 702379 661535 666815 682077 688887 686977
16059F86977K1339m2299p44J5402p831N5447l0766k8732N2320r309K6948j6485
$$ 686977 708316 666017 665273 680675 672844 728291 697525 668793 721113 711804 738752 722267
16047G22267j3709J9840N2287m0392M7351j6955M9767q745j7985j0726L1667n395
$$ 722267 708558 728398 780685 740293 787644 770689 820456 811711 793726 783000 814667 809272
16035H09272K7101n9783M215o508p0425K5199l26j7430L416m0625k7579K3231
$$ 809272 836373 776590 780805 774297 703872 729071 728745 711315 714731 674106 646527 669758
16023F69758l6599M9195M0208p2283K1038j8741O758O7159m8640j2204P1778k0503
$$ 669758 633159 682354 722562 650279 671317 652576 659334 726493 677853 665649 737427 716924
16011G16924L22L5964n6042K1055J0939L1464K8934l5634k0068J2388J3760L6201
$$ 716924 717246 753210 697168 718223 729162 760626 789560 753926 733858 746246 760006 796207
15999G96207j7206K2444j0254K4203m2058l444o5137J02942j945k7385M610n3703
$$ 796207 779001 801445 791191 815394 773336 769892 704755 807697 805752 778367 782977 729274
15987G29274K7461m4629k3363J255O5178l7164L287m6841m5830L0850k149J2463
$$ 729274 756735 712106 688743 689998 755176 718012 721299 674458 628628 659478 657329 669792
$$ [...]
##END NTUPLES=NMR SPECTRUM
##END=
