##TITLE=1H_DE-80H_X3
 200.13MHz, d2o
 8 sc
 
 19ns.26.2.2025
##JCAMPDX= 6.0         $$ Bruker NMR JCAMP-DX V2.0
##DATA TYPE= NMR SPECTRUM
##DATA CLASS= NTUPLES
##ORIGIN= UXNMR, Bruker Analytische Messtechnik GmbH
##OWNER= pz
$$ XWIN-NMR		Version 3.5
$$ Mon Apr 20 10:48:37 2026 Russian Standard Time (UT+4h)  Yarkov@DPX200
##.OBSERVE FREQUENCY= 200.1313
##.OBSERVE NUCLEUS= ^1H
##.ACQUISITION MODE= SIMULTANEOUS
##.ACQUISITION SCHEME= undefined
##.AVERAGES= 8
##.DIGITISER RES= 18
##SPECTROMETER/DATA SYSTEM= spect
##.PULSE SEQUENCE= zg30
##.SOLVENT NAME= DMSO
##.SHIFT REFERENCE= (INTERNAL, DMSO, 0, 15.5166)
##AUDIT TRAIL= $$ (NUMBER, WHEN, WHO, WHERE, WHAT)
$$ ##TITLE= Audit trail, XWIN-NMR		Version 3.5
$$ ##JCAMPDX= 5.01
$$ ##ORIGIN= Bruker BioSpin GmbH
$$ ##OWNER= Yarkov
$$ C:/Bruker/XWIN-NMR/data/yarkov2/nmr/H-C/1/pdata/1/auditp.txt
$$ ##AUDIT TRAIL=  $$ (NUMBER, WHEN, WHO, WHERE, WHAT)
(   1,<2026-04-20 10:47:54.14 +0400>,<Yarkov>,<DPX200>,
      <created by zg, POWCHK disabled, PULCHK disabled
       configuration hash MD5:
       00 E9 B6 7A A2 85 ED C7 34 08 36 98 17 FE 4E 26
       data hash MD5: 16K
       73 54 3D 55 20 52 7F 28 63 ED 20 8B E4 B0 E6 1C>)
(   2,<2026-04-20 10:48:00.32 +0400>,<Yarkov>,<DPX200>,
      <Start of raw data processing
       efp BC_mod = 2 LB = 0.25 FT_mod = 6 PKNL = 1 PHC0 = -5302.316 PHC1 = 11.42193 SI = 16K 
       data hash MD5: 16K
       8E D1 17 41 3B 7F 5A 25 7C DC 6F 8A 02 33 0B 29>)
$$ ##END=
$$ 
$$ hash MD5
$$ F7 81 F6 85 CF FF 9D 60 5F DA B2 10 B7 2F F3 4A
##$RELAX= 
##$RELAX= 
##$RELAX= 
##$RELAX= 
##$RELAX= 
##$RELAX= 
$$ Bruker specific parameters
$$ --------------------------
##$DU= <C:/Bruker/XWIN-NMR>
##$EXPNO= 1
##$NAME= <H-C>
##$PROCNO= 1
##$TYPE= <nmr>
##$USER= <yarkov2>
##$AMP= (0..31)
100 100 100 100 100 100 100 100 100 100 100 100 100 100 100 100 100 100 
100 100 100 100 100 100 100 100 100 100 100 100 100 100 
##$AQSEQ= 0
##$AQ_mod= 1
##$AUNM= <au_zg>
##$AUTOPOS= <>
##$BF1= 200.13
##$BF2= 200.13
##$BF3= 200.13
##$BF4= 200.13
##$BF5= 200.13
##$BF6= 200.13
##$BF7= 200.13
##$BF8= 200.13
##$BYTORDA= 1
##$CFDGTYP= 0
##$CFRGTYP= 5
##$CHEMSTR= <none>
##$CNST= (0..31)
1 1 145 1 1 1 1 1 1 1 1 1 1 1 1 1 1 1 1 1 1 1 1 1 1 1 1 1 1 1 1 1 
##$CPDPRG= <>
##$CPDPRG1= <>
##$CPDPRG2= <>
##$CPDPRG3= <>
##$CPDPRG4= <mlev>
##$CPDPRG5= <mlev>
##$CPDPRG6= <mlev>
##$CPDPRG7= <mlev>
##$CPDPRG8= <mlev>
##$CPDPRGB= <>
##$CPDPRGT= <>
##$D= (0..31)
0 0.7 0 0 0 0 0 0 0 0 0 0.03 0 0 0 0 0 0 0 0 0 0 0 0 0 0 0 0 0 0 0 0 
##$DATE= 1776667673
##$DBL= (0..7)
120 120 120 120 120 120 120 120 
##$DBP= (0..7)
150 150 150 150 150 150 150 150 
##$DBP07= 0
##$DBPNAM0= <>
##$DBPNAM1= <>
##$DBPNAM2= <>
##$DBPNAM3= <>
##$DBPNAM4= <>
##$DBPNAM5= <>
##$DBPNAM6= <>
##$DBPNAM7= <>
##$DBPOAL= (0..7)
0.5 0.5 0.5 0.5 0.5 0.5 0.5 0.5 
##$DBPOFFS= (0..7)
0 0 0 0 0 0 0 0 
##$DE= 6
##$DECBNUC= <off>
##$DECIM= 32
##$DECNUC= <off>
##$DECSTAT= 4
##$DIGMOD= 1
##$DIGTYP= 9
##$DL= (0..7)
0 120 120 120 120 120 120 120 
##$DP= (0..7)
$$ [...]
##$SUBNAM2= <"">
##$SUBNAM3= <"">
##$SUBNAM4= <"">
##$SUBNAM5= <"">
##$SUBNAM6= <"">
##$SUBNAM7= <"">
##$SUBNAM8= <"">
##$SUBNAM9= <"">
##$SW= 18.0517328524113
##$SWIBOX= (0..15)
0 0 2 0 0 0 0 0 0 0 0 0 0 0 0 0 
##$SW_h= 3612.71676300578
##$TD= 16384
##$TD0= 1
##$TE= 0
##$TE2= 300
##$TE3= 300
##$TEG= 300
##$TL= (0..7)
0 120 120 120 120 120 120 120 
##$TP= (0..7)
150 150 150 150 150 150 150 150 
##$TP07= 0
##$TPNAME0= <>
##$TPNAME1= <>
##$TPNAME2= <>
##$TPNAME3= <>
##$TPNAME4= <>
##$TPNAME5= <>
##$TPNAME6= <>
##$TPNAME7= <>
##$TPOAL= (0..7)
0.5 0.5 0.5 0.5 0.5 0.5 0.5 0.5 
##$TPOFFS= (0..7)
0 0 0 0 0 0 0 0 
##$TUNHIN= 0
##$TUNHOUT= 0
##$TUNXOUT= 0
##$USERA1= <user>
##$USERA2= <user>
##$USERA3= <user>
##$USERA4= <user>
##$USERA5= <user>
##$V9= 5
##$VALIST= <valist>
##$VCLIST= <CCCCCCCCCCCCCCC>
##$VD= 0
##$VDLIST= <DDDDDDDDDDDDDDD>
##$VPLIST= <PPPPPPPPPPPPPPP>
##$VTLIST= <TTTTTTTTTTTTTTT>
##$WBST= 1024
##$WBSW= 4
##$XGAIN= (0..3)
0 0 0 0 
##$XL= 0
##$YL= 0
##$YMAX_a= 138491
##$YMIN_a= -102089
##$ZGOPTNS= <>
##$ZL1= 120
##$ZL2= 120
##$ZL3= 120
##$ZL4= 120
##$ABSF1= 0
##$ABSF2= 0
##$ABSG= 0
##$ABSL= 0
##$ALPHA= 0
##$AQORDER= 0
##$ASSFAC= 0
##$ASSFACI= 0
##$ASSFACX= 0
##$ASSWID= 0
##$AUNMP= <proc_1d>
##$AZFE= 0.1
##$AZFW= 0.1
##$BCFW= 0
##$BC_mod= 2
##$BYTORDP= 0
##$COROFFS= 0
##$CY= -3
##$DATMOD= 1
##$DC= 0
##$DFILT= <>
##$DTYPP= 0
##$F1P= 0
##$F2P= 0
##$FCOR= 1
##$FTSIZE= 16384
##$FT_mod= 6
##$GAMMA= 0
##$GB= 0
##$INTBC= 1
##$INTSCL= 3.241238e-09
##$ISEN= 128
##$LB= 0.25
##$LEV0= 0
##$LPBIN= 0
##$MAXI= 10000
##$MC2= 0
##$MEAN= 0
##$ME_mod= 0
##$MI= 1.114404
##$NCOEF= 0
##$NC_proc= -8
##$NLEV= 6
##$NOISF1= 3.799351
##$NOISF2= 2.8
##$NSP= 0
##$NTH_PI= 0
##$NZP= 0
##$OFFSET= 15.51661
##$PC= 1
##$PHC0= -5302.316
##$PHC1= 11.42193
##$PH_mod= 1
##$PKNL= yes
##$PPARMOD= 0
##$PSCAL= 0
##$PSIGN= 0
##$REVERSE= no
##$SF= 200.130001018019
##$SI= 16384
##$SIGF1= 3
##$SIGF2= 2
##$SINO= 0.751879
##$SIOLD= 32768
##$SREGLST= <19F.Aceton>
##$SSB= 0
##$STSI= 16384
##$STSR= 0
##$SW_p= 3612.71676300578
##$SYMM= 0
##$S_DEV= 0
##$TDeff= 16384
##$TDoff= 0
##$TI= <>
##$TILT= no
##$TM1= 0
##$TM2= 0
##$TOPLEV= 0
##$USERP1= <user>
##$USERP2= <user>
##$USERP3= <user>
##$USERP4= <user>
##$USERP5= <user>
##$WDW= 1
##$XDIM= 16384
##$YMAX_p= 400911664
##$YMIN_p= -4701837
$$ End of Bruker specific parameters
$$ ---------------------------------
##NTUPLES= NMR SPECTRUM
##VAR_NAME=  FREQUENCY,     SPECTRUM/REAL,   SPECTRUM/IMAG
##SYMBOL=    X,             R,               I
##VAR_TYPE=  INDEPENDENT,   DEPENDENT,       DEPENDENT
##VAR_FORM=  AFFN,          ASDF,            ASDF
##VAR_DIM=   16384,         16384,           16384
##UNITS=     HZ,            ARBITRARY UNITS, ARBITRARY UNITS
##FACTOR=    0.220516191357247, 1,           1
##FIRST=     3105.3392042289, 0,             0
##LAST=      -507.377558776883, 0,           0
##MIN=       -507.377558776883, -4701837,    0
##MAX=       3105.3392042289, 400911664,     0
$$ Real data points
##PAGE= N=1
##DATA TABLE= (X++(R..R)), XYDATA
$$ [...]
13115A91587J36539j516867k3683O02376J090586K53810o38373p68982J00452
$$ 191587 328126 -1188741 -1212424 -610048 480538 734348 95975 -673007 -572555
13106e72555l66583K125J145666j4699j025045N50840l05712q30275J212510J413899
$$ -572555 -939138 -937013 208653 193954 -831091 -280251 -585963 -1416238 -203728 1210171
13096A210171O49630M66843p22491j534130l1356J121551m28306j19073Q43056
$$ 1210171 1859801 2326644 1604153 70023 38667 1160218 731912 612839 1455895
13087A455895j21294k582755k669024K623798J145295o42213r50906O26583N27263
$$ 1455895 1334601 -1248154 -3917178 -1293380 -148085 -790298 -1741204 -1114621 -587358
13078e87358L88390q66545m34058J314382j98618o90907m42920J702150M82884
$$ -587358 -198968 -1065513 -1499571 -185189 -383807 -1074714 -1517634 184516 667400
13069F67400j998084l569n8202J63608j138263J048212J266307O1057Q68677r3819
$$ 667400 -1330684 -1334253 -1392455 -1228847 -2367110 -1318898 -52591 8466 877143 783324
13059G83324n8494n44391j84354j077745J142745L35314P55628j203573p86862
$$ 783324 724830 180439 -3915 -1081660 61085 396399 1152027 -51546 -838408
13050h38408l76122o97205l53630J028393K293013q22390j84243p8558l34631
$$ -838408 -1214530 -1911735 -2265365 -1236972 1056041 233651 49408 -29150 -363781
13041c63781n35685N44948J047429j46003k44916p45076l05691J340191n73805
$$ -363781 -899466 -354518 692911 546908 301992 -443084 -748775 591416 17611
13032A7611o53468j75419o37827n51984R01230J135663J958316J71545n54218
$$ 17611 -635857 -811276 -1449103 -2001087 -1099857 35806 1994122 2165667 1611449
13023A611449j68404k81791o63909p23326J712439j880606k72151M82957j119642
$$ 1611449 1443045 1161254 497345 -225981 1486458 -394148 -666299 -183342 -1302984
13014a302984l21600J368039J762321k66684J555484J55644j365254p21218j475198
$$ -1302984 -1624584 -256545 1505776 1239092 2794576 2950220 1584966 863748 -611450
13005f11450N12047L55092O36300j246260j053775K12143j28346K64916J90092
$$ -611450 -99403 255689 891989 -354271 -1408046 -1195903 -1324249 -1059333 -869241
12996h69241O71300j049698n51138J112120k84932j035574K250635J010860j409960
$$ -869241 -197941 -1247639 -1798777 -686657 -971589 -2007163 243472 1254332 -155628
12987a55628j637493P32383J089004Q77271R35875k09830k450544M55457j148258
$$ -155628 -1793121 -1060738 28266 905537 1841412 1631582 -818962 -363505 -1511763
12978a511763q06595J259553M96828L70934q40494N92488j507074o63978P85852
$$ -1511763 -2318358 -1058805 -561977 -191043 -1031537 -439049 -1946123 -2610101 -1824249
12969a824249L13460P92674K272772p12414L74511M50290q72861j817146L04981
$$ -1824249 -1510789 -718115 1554657 842243 1216754 1667044 794183 -1022963 -717982
12960g17982Q62033K27872j086622j925614K81525J049232J818216j784585k46867
$$ -717982 144051 371923 -714699 -2640313 -2358788 -1309556 508660 -1275925 -1522792
12951a522792J535585P04290J565357r35348l07912J23691J177185q57439k602878
$$ -1522792 12793 717083 2282440 1347092 1039180 1162871 2340056 1482617 -1120261
12942a120261J898970Q26996n65261j841526L21988J3456K78494j019252m36668
$$ -1120261 778709 1605705 1040444 -801082 -479094 -465638 -187144 -1206396 -1643064
12933a643064J194623K84744N17867L35813l89789j176491n25706l47356J578431
$$ -1643064 -448441 -163697 354170 689983 300194 -876297 -1402003 -1749359 -170928
12924a70928Q23232j236537l62491J262754L44630j154704N44928n49357p51967
$$ -170928 652304 -584233 -946724 316030 660660 -494044 50884 -498473 -1250440
12915a250440J219742J85412o95244r6849J440116r29575j147068L31431Q40752
$$ -1250440 -30698 154714 -540530 -637379 802737 -126838 -1273906 -942475 -101723
12906a01723J180353R25783k075349o64319j217311K57309K052248j14078O2063
$$ -101723 1078630 2004413 -70936 -735255 -1952566 -1695257 356991 242913 304976
12897C04976j021602J171427L33831r46657n79351k33312J015725j289501j53027
$$ 304976 -716626 454801 788632 -158025 -737376 -970688 45037 -1244464 -1397491
12888a397491J0503M12471P09977j21901N61146j141114j06978K6422J27516J403698
$$ -1397491 -1386988 -974517 -264540 -386441 174705 -966409 -1073387 -1046965 -919449 484249
12878D84249n05498K49413o74706q19298M92698j892468M96980K166040Q17049
$$ 484249 -21249 228164 -446542 -1265840 -773142 -2665610 -2168630 -2590 814459
12869H14459o11447j081082j191765K137404J436309q89398o48325J295705Q9345
$$ 814459 203012 -878070 -2069835 67569 1503878 614480 -33845 1261860 1351205
12860A351205j043461k01006q14497m75079r44331N64500K0259R01791J107224
$$ 1351205 307744 106738 -707759 -1182838 -2127169 -1562669 -1542410 -640619 466605
12851D66605J83180N31153r65844O39308l22708k62645M16115q29751l65736j321713
$$ 466605 649785 1180938 215094 854402 531694 269049 685164 -144587 -510323 -1832036
12841a832036M24746J334060K230272j322949j325813O32697K7543k48952j556613
$$ -1832036 -1407290 -73230 2157042 834093 -491720 140977 168520 -80432 -1637045
12832a637045N32662k73200J92427p7336j28878O18131J553416J524746o97663
$$ -1637045 -1104383 -1377583 -1185156 -1262492 -1391370 -773239 780177 2304923 1607260
12823A607260j698388o89514l2361q42491q45629J890280j02039j201044P72060
$$ 1607260 -91128 -780642 -813003 -1655494 -2501123 -610843 -712882 -1913926 -1141866
12814a141866M79736R89863q59342M46763k80038j306770j251791L38201J367619
$$ -1141866 -662130 327733 -531609 -84846 -364884 -1671654 -2923445 -2585244 -1217625
12805a217625N85055M43632n15047Q18232P42549J23657J54660O72054m34045
$$ -1217625 -632570 -188938 -703985 114247 856796 980453 1135113 1807167 1373122
12796A373122j155198N45937j36641J29652j064366j14111n89220N26725J493346
$$ 1373122 217924 763861 627220 756872 -307494 -421605 -1010825 -484100 1009246
12787A009246j692810k02646M93655J10335j254378J97320J187146J11543M81225
$$ 1009246 -683564 -886210 -392555 -282220 -1536598 -1339278 -152132 -40589 440636
12778D40636O46441j152792P68900o86595j244716M42295n6541n92470J50666
$$ 440636 1087077 -65715 703185 16590 -1228126 -785831 -842372 -1434842 -1284176
12769a284176k6682O67339J481587p78948R11669m03382j316852L42032k27627
$$ -1284176 -1310858 -643519 838068 59120 970789 567407 -749445 -407413 -635040
12760f35040J12056N97519J96021q57108n60060J06761L91378J157431L84790
$$ -635040 -522984 74535 270556 -586552 -1146612 -1039851 -648473 508958 893748
12751H93748P9423m96044o08650j392246N21017j52659K48858J429435j066785
$$ 893748 973171 477127 -131523 -1523769 -1002752 -1155411 -906553 522882 -543903
12742e43903q03990m69658M46119J455918q34556k04496O28156J017702M72452
$$ -543903 -1347893 -1817551 -1371432 84486 -750070 -954566 -326410 691292 1163744
12733A163744K81186o89189J25655M91631j682840r39980K05247Q2756L94265
$$ 1163744 1444930 755741 881396 1373027 -309813 -1249793 -1044546 -961790 -567525
12724e67525n117j70622K75960J17283O73195J083131n86769k38391p65999l24418
$$ -567525 -572642 -743264 -467304 -350021 323174 1406305 819536 581145 -184854 -509272
12714e09272Q11348j504999j023005Q90246K070253j344495p37522J053810J094001
$$ -509272 302076 -1202923 -2225928 -1335682 734571 -609924 -1347446 -293636 800365
12705H00365M19231q50483j381080r23377j99609M81362O75974K08192k67748
$$ 800365 1219596 369113 -1011967 -1935344 -2134953 -1653591 -977617 -769425 -1037173
12696a037173K71394k14765j78474J464963K6363M54648r11400l50352J158881
$$ -1037173 -765779 -980544 -1159018 305945 332308 786956 -124444 -474796 684085
12687F84085j303854o3424J799433j26839k275670K00545P53202K84O98374O69620
$$ 684085 -619769 -683193 1116240 989401 -1286269 -1085724 -332522 -332238 366136 1035756
12677A035756Q1282o14177k211o64168N57499J688551q34676j267166J159448
$$ 1035756 1117038 502861 500650 -163518 393981 2082532 1247856 -19310 1140138
12668A140138n93367k177926Q6170J2213n65276M79478O4723o83348R26500K616343
$$ 1140138 546771 -1631155 -1544985 -1532772 -2098048 -1618570 -1553847 -2237195 -1310695 1305648
12658A305648m70302j039116P64308j14490k58775l29017M22976k32121l15973
$$ 1305648 835346 -203770 560538 446048 187273 -141744 281232 49111 -266862
12649b66862o10476N249l02853J346739N07688m97050m8647j615182j02709M27693
$$ -266862 -877338 -872089 -1174942 171797 679485 182435 133788 -1481394 -1584103 -1156410
12639a156410Q32155K33611K04904L12001o29075J52171K29489R20872j855476
$$ -1156410 -324255 -90644 114260 426261 -202814 -50643 178846 1099718 -755758
12630g55758L41343N70946j686372Q2398J040336M48826n82505k24663j239842
$$ -755758 -414415 156531 -1529841 -1447443 -407107 41719 -540786 -765449 -2005291
12621b005291J272746J703201j712621j4987R35145m55514j412661O90134p49311
$$ -2005291 -732545 970656 -741965 -756952 178193 -277321 -1689982 -999848 -1749159
12612a749159k7809L214125p1703j255827l98644J463077m46606K8524o04327
$$ -1749159 -1776968 1437157 1365454 109627 -289017 1174060 727454 755978 151651
12603A51651j43410N2516l01854r13554o32502J459749j009171k56795O78064
$$ 151651 8241 60757 -241097 -1154651 -1787153 -327404 -1336575 -1593370 -915306
12594i15306j030725J19404J770925Q34806J77791k52902M68282J22834j251644
$$ -915306 -1946031 -1826627 -55702 779104 956895 703993 1172275 1295109 43465
12585D3465k45813L20761r17206M80091K402022q19017j785980N91899p03917
$$ 43465 -202348 118413 -798793 -318702 2083320 1264303 -521677 70222 -633695
12576f33695n31473N35978r53895j13710Q00176K25286j058915J178363K44265
$$ -633695 -1165168 -629190 -1583085 -1696795 -896619 -671333 -1730248 -551885 -307620
12567c07620l01026J986835r6304j552014P7228J382809O79j12957j076564j869404
$$ -307620 -608646 1378189 1281885 -270129 -192901 1189908 1190587 1077630 1066 -1868338
12557a868338O11173j40939P21939j09784K176811k03973k437137L31531j153345
$$ -1868338 -1257165 -1398104 -676165 -785949 1390862 1186889 -1250248 -918717 -2072062
12548b072062Q0229J424394O44202O31551K00523l48574J19822L88821Q56326
$$ -2072062 -1991833 -567439 76763 708314 908837 560263 680085 1068906 1925232
12539A925232j439260p49825R30490P80516k000177p35550J084006M72365N20439
$$ 1925232 485972 -263853 666637 1447153 -553024 -1288574 -204568 267797 788236
12530G88236r95334r74987J21261j073541p30505n6882J516916O91055K3917M54089
$$ 788236 -207098 -1182085 -1060824 -2134365 -2864870 -2921752 -1404836 -713781 -689864 -235775
12520b35775j278104P05616M07407J883194R24048j042645j280752M97899n56987
$$ -235775 -1513879 -808263 -400856 1482338 2406386 1363741 82989 580888 23901
12511B3901j859828Q54451Q67039K9397O00612m14936o63768O69643k05263m80290
$$ 23901 -1835927 -981476 -114437 -85040 515572 100636 -563132 106511 -98752 -579042
12501e79042n58089O03614j63528M41882M51007K21320O05676J159354j363325
$$ -579042 -1137131 -533517 -697045 -255163 195844 417164 1022840 2182194 818869
12492H18869k289377J065130j060493K84545K34439L93508J77694o79836j005522
$$ 818869 -1470508 -405378 -1465871 -1181326 -946887 -553379 -375685 -1055521 -2061043
12483b061043j136074K264167J643246O83251J19859j60630j35386j606310k69683
$$ -2061043 -3197117 -932950 710296 1393547 1513406 1352776 1217390 -388920 -658603
12474f58603L54340o07985P63525J047776j67350k344666L97280j61449O12550
$$ -658603 -304263 -912248 -148723 899053 731703 -1612963 -1215683 -1377132 -764582
12465g64582J347612n68011j018424J080648L03182p66898J036655n48206N53960
$$ -764582 583030 15019 -1003405 77243 380425 -386473 650182 101976 655936
12456F55936M77452r03246l29002j624772J480998J484089o49278j844123n36609
$$ 655936 1133388 230142 -98860 -1723632 -242634 1241455 592177 -1251946 -1788555
12447a788555J83554L30537N02458j161949R15678J164376q0835j711570L12377
$$ -1788555 -1605001 -1274464 -772006 -1933955 -1018277 146099 65264 -1646306 -1333929
12438a333929J129757J579598O53215j304765k01281p36067M1075N70483M52282
$$ -1333929 -204172 1375426 2028641 723876 522595 -213472 -172397 398086 850368
12429H50368j122380K21063N03526k030361j36130r79118R56676P30347L51168
$$ 850368 -272012 -50949 452577 -1577784 -1713914 -2693032 -1736356 -1006009 -654841
12420f54841J75968O27167N49287M21418O69084r26478L80165l21596j329601
$$ -654841 -478873 148294 697581 1118999 1788083 861605 1241770 920174 -409427
12411d09427m53666l28507j105629Q75584J759420L20448q52432j111925J294199
$$ -409427 -863093 -1191600 -2297229 -1421645 337775 658223 -194209 -1306134 -11935
12402a1935n18764q3413J58407J48955j037706j249504P65692l78281P73234J731984
$$ -11935 -530699 -614112 -455705 -306750 -1344456 -2593960 -1828268 -2206549 -1433315 298669
12392B98669R093q11703p68529n14899O65119J594909K20849k143001M77499l41624
$$ 298669 307762 -503941 -1272470 -1787369 -1122250 472659 693508 -1449493 -971994 -1313618
12382a313618K64107o46114J595262K73845J72193J207930k277997q80582N35740
$$ -1313618 -1049511 -1695625 -100363 173482 345675 1553605 -724392 -1604974 -1069234
12373a069234J440595k65081j3711L98311N19931o33958P464J160069o5062j291145
$$ -1069234 371361 106280 92569 490880 1010811 376853 384317 1544386 1479324 188179
12363A88179N1524M00608k201787R28444J385977L44320M07789j489999j281838
$$ 188179 239703 640311 -1561476 -633032 752945 1097265 1505054 15055 -1266783
12354a266783q19627K111981o14367l12053P04473Q08074Q62842j218806j119079
$$ -1266783 -2086410 25571 -588796 -900849 -196376 611698 1474540 255734 -863345
12345h63345P70170J764920j117256j9860o72592n1690l30732k23388j537038
$$ -863345 -93175 1671745 554489 534629 -137963 -189653 -520385 -743773 -2280811
12336b280811P03272J687507r10693J404983J41030N34425j640813m0105O20480
$$ -2280811 -1577539 109968 -800725 604258 745288 1279713 -361100 -401205 219275
12327B19275k625834O89797J333574N21006q59361p21108P21881j194810J800920
$$ 219275 -2406559 -1716762 -383188 137818 -721543 -1442651 -720770 -1915580 -114660
12318a14660R6530m66305J164154j15021K93950L84526J84961p55897p30332J220206
$$ -114660 -18130 -484435 679719 564698 858648 1243174 1428135 672238 -58094 1162112
12308A162112j053564o23064j328369Q55824K467293j613010j011724N4617K93694
$$ 1162112 108548 -514516 -1842885 -987061 1480232 -132778 -1144502 -1089885 -796191
12299g96191J646230L89754j062099K43517J130184K31469l949281K04573J117264
$$ -796191 850039 1239793 177694 421211 1551395 1782864 -2166417 -1961844 -844580
12290h44580J342293j359681n80121J656054o91907Q52247M45205r02760j008217
$$ -844580 497713 -861968 -1442089 213965 -477942 374305 819510 -83250 -1091467
12281a091467q82685L12928j65637N37754P05782o90443K297291M29272o17611
$$ -1091467 -1974152 -1661224 -1826861 -1289107 -583325 -1273768 1023523 1452795 835184
12272H35184q30758R29240O87282k138314m17462O6954n42141P89799n52980j30303
$$ 835184 4426 933666 1620948 -517366 -934828 -867874 -1410015 -620216 -1173196 -1303499
12262a303499Q11908J038696R80099J57894N68161j172786J75776j366274j557761
$$ -1303499 -491591 547105 1527204 1685098 2253259 1080473 1256249 -110025 -1667786
12253a667786R24848j242555P70144k57869q47445o0139N77660K785383J00557
$$ -1667786 -742938 -1985493 -1215349 -1473218 -2320663 -2380802 -1803142 982241 1082798
12244A082798k29036r42513J86110j47173j329651M74835J445432M1708q8727
$$ 1082798 853762 -88751 97359 -49814 -1379465 -904630 540802 582510 493783
12235D93783o46676R79270J38592m82691k81958p59152L2107r89124J359254R58156
$$ 493783 -152893 826377 964969 482278 200320 -558832 -526725 -1515849 -156595 801561
12225H01561J77773n76554o46989J739353j036730j308937J491553j53840q27563
$$ 801561 979334 402780 -244209 1495144 458414 -850523 641030 487190 -340373
12216c40373j360590j289450J18774K436977R81486l54478J250296R75352j555087
$$ -340373 -1700963 -2990413 -2871639 -434662 546824 192346 1442642 2417994 862907
12207H62907m92755R39066l33941j617342j701432Q01748j096378N69881J231461
$$ 862907 370152 1309218 975277 -642065 -2343497 -1541749 -2638127 -2068246 -836785
12198h36785M14256J147576n06960q84563R2192K119621p57517j557466K380659
$$ -836785 -422529 725047 218087 -666476 -574284 1545337 787820 -769646 1611013
12189A611013j00495j584284j666321Q63980J189568M20605j118860r94227P85818
$$ 1611013 1510518 -73766 -1740087 -876107 313461 734066 -384794 -1379021 -593203
12180e93203M21873q80567o07230R04186M66596q22762q89320K608151j007513
$$ -593203 -171330 -1051897 -1659127 -754941 -288345 -1111107 -2000427 607724 -399789
12171c99789O55985J6474j241636m43442j493204K295963R85867k26273R1787
$$ -399789 256196 272670 -968966 -1412408 -2905612 -609649 376218 149945 241732
12162B41732R1047J134466j681071Q32148p97376j97185J032558J38261k14653
$$ 241732 332779 1467245 -213826 618322 -179054 -376239 656319 794580 579927
12153E79927q5548J207144j816380o11732j657787O30636J842955M97083N01632
$$ 579927 494379 1701523 -114857 -726589 -2384376 -1753740 89215 586298 1087930
12144A087930j70353j082152j050645N55352l00986J47212J094893N307l57281
$$ 1087930 917577 -164575 -1215220 -659868 -960854 -813642 281251 286558 -70723
12135g0723j429631k84531k21896J287965j76247j61333J612209l54790M50812
$$ -70723 -1500354 -1784885 -2006781 -718816 -895063 -1056396 555813 201023 651835
12126F51835k04023R85125J34616j004152j085218n71451J223045J84558k1552
$$ 651835 447812 1432937 1567553 563401 -521817 -1093268 129777 314335 292783
12117B92783P05287q47400k52592P29430j79848R03577J458901m33355j803643
$$ 292783 998070 150670 -101922 627508 447660 1351237 2810138 2376783 573140
12108E73140j460798N48778k08011j91494Q74558n01358r53626q64800P70803
$$ 573140 -887658 -338880 -546891 -738385 136173 -365185 -1318811 -2183611 -1412808
12099a412808M47018L13216j576746L85879K044303L04591m12356K62610K125819
$$ -1412808 -965790 -652574 -2229320 -1843441 200862 505453 93097 355707 2481526
12090B481526j131789j483674m47311m1427J214944m30123n39323m4197j524972
$$ 2481526 1349737 -133937 -581248 -622675 592269 162146 -377177 -421374 -1946346
12081a946346N80162N37797p6228n36751J051553Q27684p77892j019501O57417
$$ -1946346 -1366184 -828387 -904615 -1441366 -389813 437871 -340021 -1359522 -702105
12072g02105J104663k83582j734150N73571L50934Q01902J112843l4027j220653
$$ -702105 402558 118976 -1615174 -1041603 -690669 111233 1224076 1190049 -30604
12063c0604j45970Q60275k039855l80175n45299J325978L64555r1972M8406n75875
$$ -30604 -176574 683701 -1356154 -1736329 -2281628 -955650 -591095 -683067 -634661 -1210536
12053a210536J023812p38197l42954J239900M32894k72927o8103J06295j214843
$$ -1210536 -186724 -924921 -1267875 -27975 404919 131992 63889 170184 -1044659
12044a044659J41405J146095j91405L99365J942117j186457j170301M89234j043628
$$ -1044659 -903254 242841 51436 450801 2392918 1206461 36160 525394 -518234
12035e18234n32111n0197K11918j53413Q07560r23144m86477K090770J370852
$$ -518234 -1050345 -1100542 -888624 -1042037 -234477 -1157621 -1644098 446672 1817524
12026A817524r00901m6818P01119k261219p3974R89906l9104o62098r72078K66226
$$ 1817524 916623 869805 1570924 -690295 -764269 225637 186533 -475565 -1447643 -1181417
12016a181417n5424j73525J883733M10774L31630j215092j316716j141127R93582
$$ -1181417 -1236841 -1410366 473367 884141 1215771 679 -1316037 -2457164 -1463582
12007a463582J731751n93374K69622J537662l041500j400364J484173R54934Q68690
$$ -1463582 268169 -325205 -55583 1482079 -1559421 -2959785 -1475612 -520678 348012
11998C48012p28542P58431j495367k63088k31567j00610Q84451N3874J04956j708933
$$ 348012 -380530 377901 -1117466 -1380554 -1612121 -1712731 -828280 -774406 -669450 -2378383
11988b378383P65528J205324K05604k84152J80277J040393j910818n40873R03544
$$ -2378383 -1612855 -407531 -201927 -486079 -305802 734591 -1176227 -1717100 -813556
11979h13556K253146O03312j642382K5804j710680r98984J498751K08284q6836
$$ -813556 1439590 2042902 400520 426324 -1284356 -2283340 -784589 -576305 -663141
11970f63141n76936j14225J324087O79930L9027n06252J468882J249649k379159
$$ -663141 -1240077 -1354302 -30215 649715 688742 182490 1651372 2901021 521862
11961E21862j651212J496445J017721o70648j339440j52579k509454O21208K117323
$$ 521862 -1129350 367095 1384816 714168 -625272 -777851 -3287305 -2666097 -548774
11952e48774p99602m81907J109307M16945p49103R87285r16383N73080J125329
$$ -548774 -1348376 -1830283 -720976 -304031 -1053134 -65849 -982232 -409152 716177
11943G16177J59148o13335n87417p2123Q48721L61682n21374m17766j340309J54625
$$ 716177 875325 261990 -325427 -397550 451171 812853 291479 -126287 -1466596 -1311971
11933a311971r12190Q32892K57562o59789R74211j578355j87538k076744Q03008
$$ -1311971 -2224161 -1391269 -1133707 -1793496 -819285 -2397640 -2585178 -4661922 -3858914
11924c858914J536498K195209J012776j943205J884754R54987j298637l81577
$$ -3858914 -2322416 -127207 885569 -1057636 827118 1782105 483468 101891
11916A01891J144827q44333k005426k35664K310j52548p44081K61967K032161
$$ 101891 1246718 402385 -1603041 -1838705 -1836395 -1988943 -2733024 -2471057 -438896
11907d38896R37202j32309k61802M27314J742987m33475j937619K70618j92156
$$ -438896 498306 365997 104195 531509 2274496 1841021 -96598 174020 -18136
11898a8136j417693o84850J121189O44607o29897K534766j22735r21524n17232
$$ -18136 -1435829 -2120679 -999490 -354883 -984780 1549986 1427251 505727 -11505
11889a1505p03152Q74619M503n3630j620507q65402J989163k85407q82665l43197
$$ -11505 -714657 159962 164465 110835 -1509672 -2375074 -385911 -671318 -1553983 -1897180
11879a897180J555846J495349r87963j264843P35544R22473q96212j570527J297159
$$ -1897180 -341334 1154015 166052 -1098791 -363247 559226 -336986 -1907513 -610354
11870f10354N38606L91706o37414p4839M17291j462376j2658j99271J019864j608298
$$ -610354 -71748 319958 -317456 -392295 24996 -1437380 -1450038 -1649309 -629445 -2237743
11860b237743n57295J089230J019953J715905r88671j529061P33015k88613N5377
$$ -2237743 -2795038 -1705808 -685855 1030050 41379 -1487682 -754667 -1043280 -987903
11851i87903J76059P69251Q00044L42932m87245j531466L54053K208457k169627
$$ -987903 -811844 -42593 757451 1100383 613138 -918328 -564275 1644182 -525445
11842e25445J17467J433601l15737j974283O02228J953215q99860j09116k58459
$$ -525445 -407978 1025623 709886 -1264397 -662169 1291046 391186 282070 23611
11833B3611N95970n19616k04664L27757m73619P95199j074029n57753M49070K64870
$$ 23611 619581 99965 -104699 223058 -250561 544638 -529391 -1087144 -638074 -373204
11823c73204R7130K53092J684445j152079p14379M65880p03128r60469L12201
$$ -373204 -276074 -22982 1661463 509384 -204995 260885 -442243 -1402712 -1090511
11814a090511m85498J22316M39167K21933L19155l00121K180008j013845q30926
$$ -1090511 -1576009 -1453693 -1014526 -792593 -473438 -773559 1406449 392604 -438322
11805d38322j25085O27957J61140o55941K13095j269926Q43680l9085l53558J345653
$$ -438322 -563407 64550 225690 -430251 -217156 -1487082 -643402 -682487 -1036045 309608
11795C09608J047815r65077q09546L78377l14537J237737M5852p3571p63129p48029
$$ 309608 1357423 392346 -417200 -38823 -353360 884377 930229 856658 93529 -654500
11785f54500j90467o1439j026438Q67005J171176l17541J030349p97656N37521
$$ -654500 -844967 -906406 -1932844 -1065839 105337 -212204 818145 20489 558010
11776E58010j038061K75127L28149p19405n36229j39176K246534J09710k807856
$$ 558010 -480051 -204924 123225 -596180 -1132409 -1271585 974949 1084659 -1723197
11767a723197Q26415m2632n66045P43992O78591J010540J214383M72283k019026
$$ -1723197 -896782 -939414 -1505459 -761467 -82876 927664 2142047 2614330 595304
11758E95304j289324Q48869K22107l17493O77281j338121r01273Q52097O94570
$$ 595304 -694020 154849 376956 59463 736744 -601377 -1502650 -650553 44017
11749D4017j359538r38942J065196M41634O10890o95446o92287L00834R26353
$$ 44017 -1315521 -2254463 -1189267 -747633 -136743 -832189 -1524476 -1223642 -297289
11740b97289J145062j302506n00054M35735K553178j122120j976778J223233L48376
$$ -297289 847773 -454733 -954787 -519052 2034126 912006 -1064772 158461 506837
11731E06837o23110p71358m80136m32105N85915N28337m30057j67324J147311
$$ 506837 -116273 -887631 -1367767 -1799872 -1213957 -685620 -1115677 -1283001 -135690
11722a35690n98646J196250J07879l64060q19581Q14556K06738p14775N10229
$$ -135690 -734336 461914 569793 205733 -613848 200708 407446 -307329 202900
11713B02900O65109R26534M9942j7345n90778m75830m36250L21692R4931j910849
$$ 202900 868009 1794543 1844485 1827140 1236362 760532 324282 645974 740905 -1169944
11703a169944r86523K7656N55268p74222O0249Q47572J50442J487059M87240k89838
$$ -1169944 -2156467 -2128811 -1573543 -2347765 -2287516 -1439944 -1289502 197557 684797 394959
11693C94959j474099J814597N58576n30165j147607l39762N44052o16033k10464
$$ 394959 -1079140 735457 1294033 763868 -383739 -723501 -179449 -795482 -1005946
11684a005946j151782K86828J011734J393027p51087l82607M51079j87091R63916
$$ -1005946 -2157728 -1870900 -859166 533861 -217226 -599833 -148754 -335845 628071
11675F28071M33380l53662k00115J361758j721376j966864L01017R30215M53141
$$ 628071 1061451 707789 507674 1869432 148056 -1818808 -1517791 -587576 -134435
11666a34435p2415J88691q82821L55903o3209J304836R29539j266552J325735
$$ -134435 -206850 -18159 -900980 -545077 -608286 696550 1626089 359537 1685272
11657A685272n04916j667453K30147J252994l83639q35408L57335j192139j728443
$$ 1685272 1180356 -487097 -256950 996044 612405 -223003 134332 -1057807 -2786250
11648b786250J380586R84211J151700k52565q84463o44712L98591J335650K13431
$$ -2786250 -1405664 -421453 730247 477682 -406781 -1051493 -652902 682748 896179
11639H96179J477918J46189q43801k148168Q20737N38005r19366O78806N43115
$$ 896179 2374097 2520286 1676485 -471683 349054 887059 -32307 646499 1189614
11630A189614j984999k042617J052371R58094l84178Q30441K17218J189984K91815
$$ 1189614 -795385 -2838002 -1785631 -827537 -1211715 -381274 -164056 1025928 1317743
11621A317743j28667j524076K99869k65389j645207r90805L20546J455475m42382
$$ 1317743 1189076 -335000 -35131 -300520 -1945727 -2936532 -2615986 -1160511 -1602893
11612a602893L61555P9078J359998J056096R3836J135763J69814P0927j277549
$$ -1602893 -1241338 -1162260 197738 1253834 1347670 2483433 2653247 2724174 1446625
11603A446625k257774m78196j11237j354014j947241Q02939J406051J569415J117613
$$ 1446625 -811149 -1289345 -1400582 -2754596 -4701837 -3898898 -2492847 -923432 194181
11594A94181J397336n46903K70721J204863j99038J43441r01521M8376R77495
$$ 194181 1591517 1044614 1315335 2520198 2321160 2464601 1563080 1611456 2588951
11585B588951j527280r85155p73079o90665L00827j307864O07454o25877L14909
$$ 2588951 1061671 76516 -696563 -1387228 -1086401 -2394265 -1786811 -2412688 -2097779
11576b097779J796120L67079l2272j125349Q53424q77557j09408j97137R05681
$$ -2097779 -301659 65420 33148 -1092201 -238777 -1116334 -1225742 -1422879 -517198
11567e17198J628262q69766r77897j126471R53729M23750P10898J625135j791599
$$ -517198 1111064 241298 -736599 -1863070 -909341 -485591 225307 1850442 58843
11558E8843n85733j463036M29126P08419n20557M35355q99510N57769N19235J284612
$$ 58843 -526890 -1989926 -1560800 -852381 -1372938 -937583 -1837093 -1279324 -760089 524523
11548E24523N0977m84704j09018n27246q39984M51590J208006j12351M85721k26897
$$ 524523 575500 90796 -18222 -545468 -1385452 -933862 274144 161793 647514 420617
11538D20617p35966m63073R50144J573391j705813L70057j20311j739385p33547
$$ 420617 -315349 -778422 171722 1745113 39300 409357 289046 -1450339 -2183886
11529b183886j17428O11961J098330J263617O8012l23606M3298Q83094q17640
$$ -2183886 -2301314 -1689353 -591023 672594 740606 417000 460298 1343392 525752
11520E25752Q33482J348085j465979o26479K43256j008995r66688j365930J218028
$$ 525752 1359234 2707319 1241340 614861 858117 -150878 -1117566 -2483496 -1265468
11511a265468j057549J017652P23184n90707K740722m20311j023705o0530Q40390
$$ -1265468 -2323017 -1305365 -582181 -1172888 1567834 1147523 123818 63288 903678
11502I03678p25826p60940Q80556N92079r50161q3239r01916j056509R08594O28974
$$ 903678 177852 -583088 297468 889547 -60614 -143853 -1045769 -2102278 -1193684 -564710
11492e64710m25171J207371J007893j253801P63815Q68443j421480j539106m3137
$$ -564710 -989881 217490 1225383 -28418 735397 1603840 182360 -1356746 -1399883
11483a399883J679807j788409L98579q49566K12876J827568j127253m77281j258381
$$ -1399883 279924 -1508485 -1109906 -1959472 -1746596 80972 -1046281 -1523562 -2781943
11474b781943K619210R83963j651088N63598O10416k47574j349107L17349R18221
$$ -2781943 -162733 821230 -829858 -266260 344156 96582 -1252525 -935176 -16955
11465a6955N1475N03679J49053p68943Q2369r61368j55152J826376O82032j053082
$$ -16955 34520 538199 687252 -81691 678 -960690 -1115842 710534 1392566 339484
11455C39484l20437J026488j98642j093266n20136q8773O8684p76809Q15383M59669
$$ 339484 19047 1045535 846893 -246373 -766509 -855282 -786598 -1563407 -748024 -288355
11445b88355J162957l24153M09692K06543j232592L92159j44365K78723P10684
$$ -288355 874602 550449 960141 1166684 -65908 326251 181886 460609 1171293
11436A171293j083271j457563o60132O86867N10735o99272R00873O49650j72306
$$ 1171293 88022 -1369541 -2029673 -1342806 -832071 -1531343 -630470 19180 -153126
11427a53126l68674M16861L62150K10474j938650J04619J024683J589934j143394
$$ -153126 -521800 -104939 257211 467685 -1470965 -1366346 -341663 1248271 104877
11418A04877J17316L28492k76702q50472q10780J096750j94127M53293k40159
$$ 104877 222193 550685 273983 -576489 -1387269 -290519 -484646 -31353 -271512
11409b71512n90702q2239o6325O08469R6071K478621k263317j336742O1883k84593
$$ -271512 -862214 -944453 -1010778 -402309 -306238 2172383 -90934 -1427676 -1365793 -1650386
11399a650386Q67843k18040L25901N03905M73600j981991N33922J666544J006503
$$ -1650386 -782543 -1000583 -674682 -170777 302823 -1679168 -1145246 521298 1527801
11390A527801O9100j90133j015053q479p40826q00857K128139K15223j932933
$$ 1527801 1596901 1406768 391715 383236 -357590 -1158447 969692 1184915 -748018
11381g48018n53323L63079O43597K01901o58431L70355J104635r98862j633065
$$ -748018 -1301341 -938262 -294665 -92764 -751195 -380840 723795 -275067 -1908132
11372a908132n60274J783704J669774j27366j354277L7427N82897L4001N73445
$$ -1908132 -2468406 -684702 985072 857706 -496571 -459144 123753 157754 731199
11363G31199k41000J252181Q42565j730960p12085p48667O06703o80817n23626
$$ 731199 490199 1742380 2584945 853985 141900 -606767 -64 -680881 -1204507
11354a204507O86484q99135p85736k26173K316298l55155p9942J968543r11334
$$ -1204507 -518023 -1417158 -2202894 -2429067 -112769 -467924 -547866 1420677 509343
11345E09343n78827O91860r85058J012124K369995j673095k327617M8097m03077
$$ 509343 -69484 622376 -362682 649442 3019437 1346342 -981275 -933178 -1336255
11336a336255j465105Q43475N70407L86845k5395p26015N4587l19103J099341
$$ -1336255 -2801360 -1957885 -1387478 -1000633 -1026028 -1752043 -1697456 -2016559 -917218
11327i17218P52653k15490Q80962o4096j862637o64705K360324l71960j332496
$$ -917218 -164565 -380055 500907 436811 -1425826 -2090531 269793 -102167 -1434663
11318a434663Q10730N46176P48048o73954j75437P64360r19630m3552q28302k91145
$$ -1434663 -623933 -77757 670291 -3663 -179100 585260 -334370 -377922 -1206224 -1497369
11308a497369K97498P16930J096745j386528j371936l1812O49202J499486m6633
$$ -1497369 -1199871 -482941 613804 -772724 -2144660 -2176472 -1527270 -27784 -74417
11299g4417L83786M66257j762210R19852n97071j223455J369589N82438q86425
$$ -74417 309369 775626 -986584 -66732 -663803 -1887258 -517669 64769 -821656
11290h21656l57441J053609m18070M95288P62273p81856m52846K27692J566670
$$ -821656 -1179097 -125488 -543558 -48270 714003 -67853 -520699 -293007 1273663
11281A273663j05129J410296j565588j845597J971439j542876L06490k16483O01114
$$ 1273663 1168534 2578830 1013242 -832355 1139084 -403792 -97302 -313785 287329
11272B87329Q08292j104154J76959n61624J300246k78795r05256K33561l99902
$$ 287329 1095621 -8533 168426 -393198 907048 628253 -277003 -43442 -443344
11263d43344k73688o60718o79996O77442J279283q8989q40630j35351J208293
$$ -443344 -717032 -1377750 -2057746 -1380304 -101021 -190010 -1030640 -1165991 42302
11254D2302J53573l87021N98532m63771o09271m61291L56918j192333J49107M65478
$$ 42302 195875 -191146 407386 -56385 -665656 -1126947 -770029 -1962362 -1813255 -1347777
11244a347777Q48578l51928m41227k2479J22424J637076q61910j112960Q2644
$$ -1347777 -499199 -851127 -1292354 -1314833 -1192409 444667 -417243 -1530203 -1447559
11235a447559Q97718O49395l09903r59094P89232R85914J483628k69117k007204
$$ -1447559 -549841 99554 -210349 -1169443 -380211 605703 2089331 1820214 -186990
11226a86990j17732j525849J764164J90737k285429O83706J051318J776276p27932
$$ -186990 -304722 -1830571 -66407 124330 -2161099 -1477393 -426075 1350201 622269
11217F22269l94488J152076J54863Q39422q54983k262511l79672m44458Q56712
$$ 622269 227781 1379857 1534720 2374142 1519159 -743352 -1123024 -1567482 -710770
11208g10770J189659k75215k132822Q21666K102330r99908K74201j13909P8781
$$ -710770 478889 203674 -1929148 -1107482 994848 -5060 269141 155232 234013
11199B34013J063364L72226k553693k647704K907743J91253m05978n87557j253464
$$ 234013 1297377 1669603 -884090 -3531794 -624051 -432798 -838776 -1426333 -2679797
11190b679797J605084J305960j309637q60038J251333J127849q20617k60762J197607
$$ -2679797 -1074713 231247 -1078390 -1938428 -687095 440754 -379863 -640625 556982
11181E56982l02795K35469M00846p60633n99423r1945m98209k0739j94242K90681
$$ 556982 254187 489656 890502 129869 -469554 -561499 -1059708 -1080447 -1274689 -984008
11171i84008n3378J588165l35354j249027J480736N69294n13047p93807o43600
$$ -984008 -1037386 550779 215425 -1033602 447134 1016428 503381 -290426 -934026
11162i34026j6060R94952Q06975p35525j192496J780577N49731k206326r05954
$$ -934026 -950086 44866 851841 116316 -1076180 704397 1254128 -952198 -1858152
11153a858152Q45300M27431L20667k78950j661328K79734J070425o87752Q43156
$$ -1858152 -1012852 -585421 -264754 -543704 -2205032 -1925298 -854873 -1542625 -699469
11144f99469L92808L68964q3428J936890j133046j104525N32607j807294J332160
$$ -699469 -306661 62303 -21125 1915765 782719 -321806 210801 -1596493 -264333
11135b64333j042713n71290J116466P03909J093396J08441J10405o67885j321261
$$ -264333 -1307046 -1878336 -761870 -57961 1035435 1143876 1254281 586396 -734865
11126g34865k29832j89470N72920m13448n65225l72556J18673J64410q88034J013320
$$ -734865 -964697 -1154167 -581247 -994695 -1559920 -1932476 -1813803 -1649393 -2537427 -1524107
11116a524107K673646L66388j200485j419740K49327O27417J535675j368226j47161
$$ -1524107 1149539 1515927 315442 -1104298 -854971 -227554 1308121 -60105 -207266
11107b07266J198425k280782K52826J332518k15035M65245N67769j553121j449692
$$ -207266 991159 -1289623 -1036797 295721 80686 545931 1113700 -439421 -1889113
11098a889113l78722O41947J273509K151178J93909k75738N10804n01668j555420
$$ -1889113 -2267835 -1625888 -352379 1798799 1992708 1716970 2227774 1726106 170686
11089A70686l2430P0634j8663j602108o05947j92691M71599k09653m30697J992775
$$ 170686 138256 208890 190227 -1411881 -2017828 -2210519 -1738920 -1948573 -2379270 -386495
11079c86495N37084P67883p80592m51829N19835N04876p42000j173830L42958
$$ -386495 150589 918472 137880 -313949 205886 710762 -31238 -1205068 -862110
11070h62110J053647p40573N83628l37231J528935M01371k351196q08713l06709
$$ -862110 191537 -549036 34592 -302639 1226296 1627667 -723529 -1532242 -1838951
11061a838951k7799n86594J897609R89226n31423J236022j505528J036229N89597
$$ -1838951 -1866750 -2453344 -555735 433491 -97932 1138090 -367438 668791 1258388
11052A258388q90506r54016l01181J026885j091552j314849L02749J945684n63260
$$ 1258388 367882 -586134 -887315 139570 -951982 -2266831 -1964082 -18398 -581658
11043e81658n8033O2580J085973o31235q62563l89732P95085P94965m83027q93396
$$ -581658 -639691 -577111 508862 -122373 -984936 -1374668 -579583 215382 -267645 -1161041
11033a161041j41653N39317O62568M28231M97937j571562r66063l52679R44760
$$ -1161041 -1302694 -763377 -100809 327422 825359 -746203 -1712266 -2064945 -1120185
11024a120185R4356k11994J942192p73985k66223J58873Q11074J450094j115937
$$ -1120185 -1025829 -1237823 704369 -69616 -335839 -176966 634108 2084202 968265
11015I68265k661476L9253P45704J330817j650595m14214N27628J021861n48054
$$ 968265 -1693211 -1653958 -908254 422563 -1228032 -1642246 -1114618 -92757 -640811
11006f40811k56516P31335j047809j68174q89067j244644R03139J630841J395710
$$ -640811 -897327 -165992 -1213801 -1381975 -2271042 -3515686 -2612547 -981706 414004
10997D14004O23657l3392n93576J437266j62331k387602j045470O19252j29402
$$ 414004 1037661 1004269 410693 1847959 1685628 -701974 -1747444 -1128192 -1257594
10988a257594R2690L62921k394150L04192O98555J212599l47524Q35731J389617
$$ -1257594 -1164904 -801983 -3196133 -2891941 -2193386 -980787 -1328311 -492580 897037
10979H97037M00700p69334r11354n11610J369936N93869p46927n01466L47771
$$ 897037 1297737 528403 -382951 -894561 475375 1069244 322317 -179149 168622
10970A68622P1142P26899j26681j811272j508016O07692R2220K80629l31478l35164
$$ 168622 239764 966663 839982 -971290 -2479306 -1871614 -1779394 -1498765 -1830243 -2165407
10960b165407O18751J485054L83888j615976Q17214P05635J71865L35072N76971
$$ -2165407 -1546656 -61602 322286 -1293690 -476476 229159 401024 736096 1313067
10951A313067n30639J010270L50095k434214n74184J205624k80225j422620n6324
$$ 1313067 782428 1792698 2142793 -291421 -865605 340019 59794 -1362826 -1419150
10942a419150m34364p91898N23464M9492k78653K04154R46518J089206J520702
$$ -1419150 -1853514 -2645412 -2121948 -2072456 -2351109 -2146955 -1200437 -111231 1409471
10933A409471j091005j84327M7562j189337O67266j44583J231030l27612k601153
$$ 1409471 318466 134139 181701 -1007636 -340370 -484953 746077 418465 -2182688
10924b182688M89710L20308M02646j105899J594726J557138p97447n98149K17880
$$ -2182688 -1692978 -1372670 -970024 -2075923 -481197 1075941 278494 -319655 -101775
10915a01775R74508j046906m03365j297882K42359m24897M65093R75795J241465
$$ -101775 872733 -174173 -577538 -1875420 -1633061 -2057958 -1592865 -617070 624395
10906F24395J040690j491711O3573M3994q3553J98189l78014m98388N68207r10538
$$ 624395 1665085 173374 236947 280941 197388 395577 17563 -480825 87382 -823156
10896h23156j725396o3366J117150L73449O41149L70638k78888r19046o41992
$$ -823156 -2548552 -2611918 -1494768 -1121319 -480170 -109532 -388420 -1307466 -1949458
10887a949458J119171J413811R69123j341915Q69409P97313n87876n68853j055729
$$ -1949458 -830287 583524 1552647 210732 1080141 1877454 1289578 720725 -335004
10878c35004L129175j929893p88976j159273J59772J721584o87429J75071j45039
$$ -335004 2794171 864278 75302 -1083971 -924199 797385 109956 285027 139988
10869A39988K124314N18343j384633P94911p70019k17250J081806K03396j440070
$$ 139988 2264302 2782645 1398012 2192923 1422904 1205654 2287460 2490856 1050786
10860A050786j356896R26888L86116J166385n326l43042r67549K14717J45113
$$ 1050786 -306110 620778 1006894 2173279 2167953 1824911 857362 1072079 1217192
10851A217192j209127J584953J384350j736249p50622j344260P66835J071643
$$ 1217192 8065 1593018 2977368 1241119 490497 -853763 -86928 984715
10843I84715O61314o09172L77548m6058q62295M87672J348868j009470j473619
$$ 984715 1646029 1036857 1414405 1368347 506052 993724 2342592 1333122 -140497
10834a40497J153393J04767l23176j161916K28105J583853j8915q99325q07361
$$ -140497 1012896 1117663 794487 -367429 -139324 1444529 1425614 526289 -281072
10825b81072j69133N58841J90414l28610n17432J78341n9331L57325J30048j54010
$$ -281072 -450205 108636 299050 -29560 -546992 -368651 -427982 -70657 59391 -94619
10815i4619K71671O27775K53547r25653p06870O71321O3548L83363p0514k090521
$$ -94619 177052 804827 1058374 132721 -574149 97172 160720 544083 473569 -1616952
10805a616952j031495K002493O90739j129896J049723O96691j332058o11733K04178
$$ -1616952 -2648447 -645954 44785 -1085111 -35388 661303 -670755 -1282488 -1078310
10796a078310K45466O03477o11941K44459m41689O30059j323247o08259P95203
$$ -1078310 -832844 -229367 -841308 -596849 -1038538 -408479 -1731726 -2339985 -1544782
10787a544782j055261K00249o91620J972932J462808r41054J30681P7558J579269
$$ -1544782 -2600043 -2399794 -3091414 -1118482 344326 -596728 -466047 -388489 1190780
10778A190780m51409j018162r22521k33372K58301M62755O77907j150196R02736
$$ 1190780 739371 -278791 -1201312 -1434684 -1176383 -713628 -35721 -1185917 -283181
10769b83181n39905j4070J733911p04946j19784l73409j46852N89354j572256
$$ -283181 -823086 -837156 896755 191809 72025 -301384 -448236 141118 -1431138
10760a431138P24999l7973o7496k87210P21528N66893J05647J656318p88405m72800
$$ -1431138 -706139 -744112 -811608 -1098818 -377290 189603 295250 1951568 1163163 690363
10750F90363J11704j438518j092739R91705j297435r29812K206873j121363L77937
$$ 690363 802067 -636451 -1729190 -737485 -2034920 -2964732 -757859 -1879222 -1501285
10741a501285M18941R4646K35687J119333m25739J98994J046334q49657J284426
$$ -1501285 -1082344 -987698 -752011 367322 -58417 140577 1186911 337254 1621680
10732A621680j568628j383519K85093J52502j282123O03436J669805P63531q30229
$$ 1621680 53052 -1330467 -1045374 -892872 -2174995 -1571559 98246 861777 31548
10723C1548j411162j031058J485700K09697q3042j156150J26351K220516j187138
$$ 31548 -1379614 -2410672 -924972 -715275 -798317 -1954467 -1828116 392400 -794738
10714g94738k66259J143729Q26874j541001L87556j98746j012351R66678k42424
$$ -794738 -1060997 82732 909606 -631395 -243839 -442585 -1454936 -488258 -730682
10705g30682M22286q37756o15470m14533J374118P84307m78372l87839j037610
$$ -730682 -308396 -1146152 -1761622 -2176155 -802037 -17730 -496102 -883941 -1921551
10696a921551J863528k22334j439043n76639J032039J839013N39629q47973n48675
$$ -1921551 -58023 -280357 -1719400 -2296039 -1264000 575013 1114642 266669 -282006
10687b82006L42933J809503p18054p75521o39540J352565m53710j459420N93404
$$ -282006 60927 1870430 1152376 376855 -262685 1089880 636170 -823250 -229846
10678b29846j854066R65368k36300j30418n03170M16816L85355j435516j46839
$$ -229846 -2083912 -1118544 -1354844 -1485262 -1988432 -1571616 -1186261 -2621777 -2768616
10669b768616J97393J277318N76374J093130R61816j4420j281872N79799P73150
$$ -2768616 -2571223 -1293905 -717531 375599 1337415 1322995 41123 620922 1394072
10660A394072m60763O1317j152528j662951K83239J141458p88401M25701p2530
$$ 1394072 933309 994626 -157902 -1820853 -1537614 -396156 -1184557 -758856 -831386
10651h31386o39665r42386J208867J071891l79262K307081o05153k26961l24113
$$ -831386 -1471051 -2413437 -1204570 -132679 -511941 1795140 1189987 963026 638913
10642F38913j394411P91615j056575J56241k54890k85252j79538P11512P83287
$$ 638913 -755498 36117 -1020458 -864217 -1119107 -1404359 -1583897 -872385 -89098
10633h9098n14407O98355L26542o60778N56105p1125j279320l78260K27836p39470
$$ -89098 -603505 94850 421392 -239386 316719 245594 -1033726 -1411986 -1184150 -1923620
10623a923620P16156N87020n03897L69370R44826R63391q38186J64559J90399
$$ -1923620 -1207464 -620444 -1124341 -754971 189855 1153246 315060 479619 670018
10614F70018k35974j155562L88606m33830o83262J458297N44366q25627j509123
$$ 670018 434044 -721518 -332912 -766742 -1450004 8293 552659 -272968 -1782091
10605a782091l8038K92985K9579k37341r60945J504547r27204O09800K093512
$$ -1782091 -1820129 -1527144 -1497565 -1734906 -2695851 -1191304 -2118508 -1508708 584804
10596E84804n07778J060420P77186n35020q26837j270347R92144j046223J181318
$$ 584804 77026 1137446 1914632 1379612 552775 -717572 274572 -771651 409667
10587D09667R50895m47278L93287j125543J855554K4771O16162N52688J0760j161083
$$ 409667 1360562 913284 1306571 181028 2036582 2061353 2677515 3230203 3240963 2079880
10577B079880q36250o18736K00844K59630o48050q67021J302667m31662j170960
$$ 2079880 1243630 624894 825738 1085368 437318 -429703 872964 441302 -729658
10568g29658J127508L50398J17776q03788j4263O0959L77101m13671j153344R8287
$$ -729658 397850 748248 866024 62236 47973 108932 486033 72362 -1080982 -982695
10558i82695j060785n23930J218092L96596J036196J814300O7743j50896O89675
$$ -982695 -2043480 -2567410 -1349318 -952722 83474 1897774 1965517 1814621 2504296
10549B504296L35482k40854l73697N43860m01891j32373r20892K06866j73904
$$ 2504296 2839778 2598924 2225227 2769087 2367196 2234823 1313931 1520797 1346893
10540A346893m27128M59762k68876K46168J377584J689174r83431q57064j4070
$$ 1346893 919765 1379527 1110651 1356819 2734403 4423577 3440146 2583082 2569012
10531B569012l887r97844k27207L16939j4903K247652O71100j751001m30653K56347
$$ 2569012 2565125 1567281 1340074 1657013 1642110 3889762 4560862 2809861 2379208 2635555
10521B635555q93401o38450K266845R27908N5900o13475J22107j40153l82962
$$ 2635555 1742154 1103704 3370549 4298457 4354357 3740882 3862989 3722836 3339874
10512C339874J495902R8679P3279o80589K163998L37117j207488M78515j082850
$$ 3339874 4835776 4934455 5007734 4327145 6491143 6828260 5620772 6099287 5016437
10503E016437p39130J49824m05116R59888J460093M13885j68557j71464r23096
$$ 5016437 4277307 4427131 4022015 4981903 6441996 6855881 6687324 6515860 5592764
10494E592764K05741R17795r09061m74778J381757J542019j850303K48482j9741
$$ 5592764 5798505 6716300 5807239 5332461 6714218 8256237 6405934 6654416 6634675
10485F634675O19280K535824J030109P88547J398779j70629L24239J38640q0538
$$ 6634675 7253955 9789779 10819888 11608435 13007214 12836585 13160824 13299464 13218926
10476A3218926L18383J505023K327234j17793J020273J655247J763747J008894
$$ 13218926 13537309 15042332 17369566 17251773 18272046 19927293 21691040 22699934
10468B2699934J313614J839946K843549M32988J038269M451248L413317K409234
$$ 22699934 24013548 25853494 28697043 29130031 30168300 34619548 38032865 40442099
10460D0442099L417722N797629O531349O196028R695622R113092J3159872J7517866
$$ 40442099 43859821 49657450 56188799 62384827 72080449 81193541 94353413 111871279
10452A11871279K1039859K5527400L0678654L3577204K8090260J9912143J4174525
$$ 111871279 132911138 158438538 189117192 222694396 250784656 270696799 284871324
10445B84871324J3209255J7076573K2612278K4154486J9426496M376574q039431
$$ 284871324 298080579 315157152 337769430 361923916 381350412 385726986 377687555
10438C77687555j6031984j8988953k1997196k2763490k2136862j9700860j9192688
$$ 377687555 361655571 342666618 320669422 297905932 275769070 256068210 236875522
10431B36875522j6421922r307117j639942L125534P298193R036773J1953813J0509649
$$ 236875522 220453600 211146483 209506541 212632075 219930268 228967041 240920854 251430503
10423B51430503J2483942J9501276K5587699L0631833K8508281K2194696J0122436
$$ 251430503 263914445 283415721 309003420 339635253 368143534 390338230 400460666
10416D00460666M50998n465574q632791p990515p498287j5470864k6826779l6836822
$$ 400460666 400911664 395446090 386813299 378822784 371324497 355853633 329026854 292190032
10408B92190032l6222315l3939915l2892180k7911088k0825490j6881412j3665081
$$ 292190032 255967717 222027802 189135622 161224534 140399044 123517632 109852551
10401A09852551j0923885p466000o801898p754002o968125m160413n309760n397910
$$ 109852551 98928666 91462666 84660768 76906766 69938641 65778228 60468468 55070558
10393E5070558k104967j581393j494793l339434l856338p12181P59739j968386
$$ 55070558 52965591 51384198 49889405 46549971 42693633 41981452 42741191 40772805
10385D0772805k549540j256912p40556k310044j851675j938772m67304q57605
$$ 40772805 38223265 36966353 36225797 33915753 32064078 30125306 29658002 28800397
10377B8800397r63915l57660j516117j137507j1217k354498p7475Q15443n77885
$$ 28800397 27836482 27478822 25962705 24825198 24813981 22459483 22382008 23197451 22619566
10368B2619566j655816J27617L79640j543644j278453j92103J633372l87779m10304
$$ 22619566 20963750 21091367 21471007 19927363 18648910 18456807 20090179 19702400 19292096
10359A9292096j794129M71569j379987j526337j388184n50541N90908m22742K37721
$$ 19292096 17497967 17969536 16589549 15063212 13675028 13124487 13715395 13292653 13530374
10350A3530374m30953o52490n4448l75332l87649m56910m27413j66623L89064
$$ 13530374 13099421 12446931 12392483 12017151 11629502 11172592 10745179 10578556 10967620
10341A0967620j575924K00197J479766O35766m15363j483328M52264J414036L67598
$$ 10967620 9391696 9591893 11071659 11707425 11292062 9808734 10260998 11675034 12042632
10332A2042632m46896o63292r03772M78968j663137o30642l88720K860183R7347
$$ 12042632 11595736 10932444 10028672 10507640 8844503 8213861 7825141 10685324 10782671
10323A0782671p16006o941n50643k06653j207874j083119Q14317J699388j300091
$$ 10782671 10066665 10059724 9509081 9302428 8094554 7011435 7825752 9525140 8225049
10314H225049j99212l04481M57146l63428J54385M44557r34846o32252j647185
$$ 8225049 8025837 7721356 8178502 7815074 7969459 8414016 7479170 6846918 5199733
10305E199733o23905j33692N73811n12233r01535J284278J75842r00750J83311
$$ 5199733 4575828 4442136 5015947 4503714 3602179 4886457 5062299 4161549 4344860
10296D344860J995685M57690k02739q59108k88465o54970Q95122o1797l04657
$$ 4344860 6340545 6798235 6595496 5736388 5447923 4792953 5688075 5626278 5321621
10287E321621K93630N09486j266545j730416J594577k674324Q00071J616759J926764
$$ 5321621 5615251 6124737 4858192 3127776 4722353 2048029 2848100 4464859 6391623
10278F391623j064814j362400J296494o99083r99910n01700J552407J095754j470168
$$ 6391623 5326809 3964409 5260903 4561820 3561910 3060210 4612617 5708371 4238203
10269D238203k218531N571J491038J251848o56833J74052M63318j115085p25761
$$ 4238203 2019672 2025243 3516281 4768129 4111296 4285348 4748666 3633581 2907820
10260B907820Q27123Q87174J07808O67271K60449L5027J12972j125417J02385
$$ 2907820 3734943 4622117 4729925 5397196 5657645 5692672 5805644 4680227 4782612
10251D782612N68510p27993o50058j198430l58062P03295N04031N60597j467481
$$ 4782612 5351122 4623129 3973071 2774641 2416579 3119874 3623905 4184502 2717021
10242B717021J701003Q04556j878600q00245Q54602J131582j318580M02698m62817
$$ 2717021 4418024 5222580 3343980 2543735 3398337 4529919 3211339 3614037 3151220
10233C151220n59915K68323M93065J99610l17016J550215L58333j682983k091784
$$ 3151220 2591305 2859628 3352693 3552303 3235287 4785502 5143835 3460852 1369068
10224A369068j260665R60568J074815R56635P28026J75209N11687o9247L79267
$$ 1369068 108403 1068971 2143786 3100421 3828447 4003656 4515343 4446096 4825363
10215D825363L20193P50218j411334j39245P11719p77771j143643P88186J270449
$$ 4825363 5145556 5895774 4484440 4345195 5056914 4279143 3135500 3923686 5194135
10206E194135k74761j013427p09432l42210O05253K29298j119309q0358J066979
$$ 5194135 4919374 3905947 3196515 2854305 3459558 3688856 2569547 2489189 3556168
10197C556168J483250j553378k33487K148076J883694j060883p25567r96034n58149
$$ 3556168 5039418 3486040 3252553 5400629 7284323 6223440 5497873 4501839 3943690
10188C943690o68109k406630j49984J851110J09130J070885K172598J138524j492532
$$ 3943690 3275581 868951 718967 2570077 2679207 3750092 5922690 7061214 5568682
10179E568682p0849K398338r6651l96219L8246l55842M28353k67718p27588L35978
$$ 5568682 5497833 7896171 7799520 7403301 7441547 7085705 7514058 7246340 6518752 6854730
10169F854730Q77400J928286N10192P23832J675623O64135J508170J331281Q25972
$$ 6854730 7732130 9660416 10170608 10894440 12570063 13234198 14742368 16073649 16899621
10160A6899621K695536K928827L996200M220288R698100Q145077N447212M074186
$$ 16899621 19595157 22523984 26520184 30740472 40438572 48583649 54030861 58105047
10152E8105047J409209K295848N861113R112418R917679O545955j271462n497814
$$ 58105047 59514256 61810104 67671217 76783635 86701314 93247269 91975807 86477993
10144H6477993o287651n275801l690256m06076k308213m326545m260222n566249
$$ 86477993 80190342 74914541 71224285 70818209 68509996 64183451 59923229 54356980
10136E4356980p442441n060942k082648k128635j548605k78553J882325J513385
$$ 54356980 46914539 41853597 39770949 37642314 36093709 35815156 37697481 39210866
10128C9210866m25184J838537K482617M280344N556256P004638J1751362J2754953
$$ 39210866 38785682 40624219 43106836 47387180 52943436 59948074 71699436 84454389
10120H4454389J3113801J2839638J0292009J0186431P638854J0072332J6204716
$$ 84454389 97568190 110407828 120699837 130886268 138525122 148597454 164802170
10113A64802170J9583915J7668403N454282n460468j4167737j5564491j2569335
$$ 164802170 184386085 202054488 207508770 202048302 187880565 172316074 159746739
10106A59746739r919405p741683o434155q918386j4557284j3283445j3124142
$$ 159746739 149827334 142085651 135651496 126733110 112175826 98892381 85768239
10099H5768239j2874908j0633056p234817l485178m830634k771355j114177p0400
$$ 85768239 72893331 62260275 55025458 51540280 46709646 43938291 42824114 42753714
10091D2753714N34427J939951K240307L255068P045371O396996P241678Q772719
$$ 42753714 43288141 45228092 47468399 50723467 57768838 64165834 71407512 80180231
10083H0180231P216090L367769J356330K566043M783607J0185849J1230385N997496
$$ 80180231 87396321 90764090 92120420 94686463 99470070 109655919 120886304 126883800
10075A26883800j016019p263016r693897q400390m485649m050590l789010n721178
$$ 126883800 125867781 118604765 108910868 100510478 96024829 91974239 88185229 82464051
10067H2464051q459651r868586j1239950p530105m208909k544071l327106m164207
$$ 82464051 74004400 64135814 52895864 45365759 41156850 38612779 35285673 31121466
10059C1121466k630205k298160k156913o73317N26631q07431k118488j577552
$$ 31121466 28491261 26193101 24036188 23362871 23889502 23082071 20963583 19386031
10051A9386031k783952k169362R45514N65865O00220r1755j066493j442639m06576
$$ 19386031 16602079 14432717 15378231 15944096 16544316 16452561 15386068 13943429 13536853
10042A3536853Q46364r86282r7872j224276j754398M13905k14345K61308K7699
$$ 13536853 14383217 13396935 13299063 12074787 10320389 10734294 10519949 10781257 10808956
10033A0808956j99041K84826r81539j484355L7147J308876J120647J309623j258719
$$ 10808956 10609915 10894741 9913202 8428847 8465994 9774870 10895517 12205140 10946421
10024A0946421k135478L5937J42889J951725l9652l29118R12570n84215r03353
$$ 10946421 8810943 8846880 8989769 10941494 10901842 10572724 11485294 10901079 9997726
10015I997726q37698n7760J380581q72725p13811n99550l13202R92219j84270
$$ 9997726 9160028 9102268 10482849 9610124 8896313 8296763 7983561 8975780 8791510
10006H791510J339121o38936j722930J95199J324706M71852n65579j278168Q3696
$$ 8791510 10130631 9491695 7768765 7963964 9288670 9760522 9194943 7916775 8000471
9997H000471l60148Q90843o09275j735671l8968N26126o24831k048374K378980
$$ 8000471 7640323 8531166 7921891 6186220 6147252 6673378 6048547 4000173 6379153
9988F379153R79160P96028k15748j610712J177011N95359m12317K3368J56515
$$ 6379153 7358313 8154341 7938593 6327881 7504892 8100251 7687934 7711302 7867817
9979G867817j523899j155832j57863o50185J52410m33078L54536M89646j180652
$$ 7867817 6343918 5188086 5030223 4380038 4532448 4099370 4453906 4943552 3762900
9970C762900q42375M15338N41881J461461K31819q28686j209792L75855N20707
$$ 3762900 2920525 3335863 3877744 5339205 5571024 4742338 3532546 3908401 4429108
9961D429108o54238l66366j440637P15836R11616j329863P89310J932028N67134
$$ 4429108 3774870 3408504 1967867 2683703 3595319 2265456 3054766 4986794 5553928
9952E553928J4220o49909L51094l07681M17274J444641j028003k021164k53067
$$ 5553928 5568148 4918239 5269333 4961652 5378926 6823567 5795564 3774400 3521333
9943C521333p55101l88894J171741K11336j28370K154813k84687j074225n8199
$$ 3521333 2766232 2377338 3549079 3760415 3632045 5786858 5502171 4427946 4369747
9934D369747q35955r2658M65225m73911j832857r2412P48662r2905p96121K2150
$$ 4369747 3533792 3441134 3906359 3432448 1599591 1507179 2255841 2162936 1366815 1388965
9924A388965J74669P70370l27579M19072J49466q05948N62444j99803J120182
$$ 1388965 1563634 2334004 2006425 2425497 2574963 1769015 2331459 2131656 3251838
9915C251838q08614P2050J162093J41118j053170r82550J278531j156213M6916
$$ 3251838 2443224 2515274 3677367 3818485 2765315 1782765 3061296 1905083 1951999
9906A951999J597472q71915J064695j57305Q3340k23592m83373Q48949J51961
$$ 1951999 3549471 2677556 3742251 3584946 3668286 3444694 2961321 3810270 3962231
9897C962231n22290q68524O36926k003180p3091K89933J47450J213524J43838
$$ 3962231 3439941 2571417 3208343 1205163 1132072 1422005 1569455 2782979 2926817
9888B926817P9363j051530k58835J46278Q89646J742719l94321k380106M9461
$$ 2926817 3006180 1954650 1695815 1842093 2731739 4474458 4080137 1700031 1749492
9879A749492P3101J78187j06092R49611J299197k584079N21551P57649r32902
$$ 1749492 1822593 2000780 1894688 2844299 4143496 1559417 2080968 2838617 1905715
9870A905715Q03519J538048m88874o07828L26636O75322Q91517l17824j421558
$$ 1905715 2709234 4247282 3758408 3150580 3477216 4152538 5044055 4726231 3304673
9861C304673n10767j58406o83931l83143J8047P77060P36044k24744j763450J33008
$$ 3304673 2793906 2635500 1951569 1568426 1586473 2363533 3099577 2874833 1111383 1244391
9851A244391r90913J077929K586955k0813k75502L88064q4983j480889J197038
$$ 1244391 253478 1331407 3918362 3897549 3622047 4010111 3925128 2444239 3641277
9842C641277N83833j426756j8657J098137J69977o04403K89798O18940K315957
$$ 3641277 4225110 2798354 2779697 3877834 4047811 3443408 3733206 4352146 6668103
9833F668103n30988q84027J13654O906J66134j723598Q28677j504472j409305
$$ 6668103 6137115 5253088 5366742 5373648 5539782 3816184 4644861 3140389 1731084
9824A731084Q91217j111718j79399R47117J072084O40657J41525p33952K15384
$$ 1731084 2622301 1510583 1331184 2278301 3350385 3991042 4132567 3398615 3613999
9815C613999K72242k202377J6572R19923N9200j631449J038431K68668j230795
$$ 3613999 3886241 1683864 1700436 2620359 2679559 1048110 2086541 2355209 1124414
9806A124414J329752l7693J031393O78262j100209N20245J235477q90352N06123
$$ 1124414 2454166 2416473 3447866 4126128 3025919 3546164 4781641 3891289 4397412
9797D397412J691193k8552k50010M70638J24873r44341K26245o77097p89261P64526
$$ 4397412 6088605 6060053 5810043 6280681 6405554 5461213 5687458 5010361 4221100 4985626
9787D985626j60915k39772k237101j44681K124414O36344k81763p32695L02664
$$ 4985626 4824711 4584939 2347838 2203157 4327571 4963915 4682152 3949457 4252121
9778D252121N22199P27384j5293o80897p33250m43968l58046R87788n03314n4639
$$ 4252121 4774320 5501704 5486411 4805514 4072264 3628296 3270250 4258038 3754724 3700085
9768C700085K459177J114000l64380p85769L19785P0254j127941P33898J71831
$$ 3700085 6159262 7273262 6908882 6123113 6442898 6513152 5385211 6119109 6290940
9759F290940p65159m01960l38147p6393j11889q54988n48038J494704r36116r93508
$$ 6290940 5525781 5123821 4785674 4709281 4597392 3742404 3194366 4689070 3752954 2759446
9749B759446O14281J102891O75171q45011P4199o33664P11510R37165k83830m69132
$$ 2759446 3373727 4476618 5151789 4306778 4380977 3747313 4458823 5395988 5112158 4643026
9739D643026j486342K418990Q71532j614916L08360Q3571n64710R22566Q39655
$$ 4643026 3156684 5575674 6447206 4832290 5140650 5224221 4659511 5582077 6421732
9730F421732j05805R49773J182263O31413q13542n71490n96434P24519N25550
$$ 6421732 6315927 7265700 8447963 9079376 8265834 7694344 7097910 7822429 8347979
9721H347979j011255L40758p1182J107802m92407m36118K271497P16022j223553
$$ 8347979 7336724 7677482 7606300 8714102 8221695 7785577 10057074 10773096 9549543
9712I549543p6459J673880m34675J102951Q12742Q53428K23983M00545L65527
$$ 9549543 9473084 11146964 10712289 11815240 12627982 13481410 13705393 14105938 14471465
9703A4471465p19411J925271j95464Q59235o6731j79713J088588q53792j354341
$$ 14471465 13752054 15677325 15481861 16341096 16274365 16094652 17183240 16329448 14975107
9694A4975107P66804K683663j87753l39169J246345J437962J570907J279459J791477
$$ 14975107 15741911 18425574 18237821 17898652 19144997 20582959 22153866 23433325 25224802
9685B5224802Q64822K970885J881997P77513K134222Q39765L402966N692862L895251
$$ 25224802 26089624 29060509 30942506 31720019 33854241 34694006 38096972 43789834 47685085
9676D7685085L905821N431296Q607334J1057943J4354713K0320825K9911058L5152270
$$ 47685085 51590906 57022202 65629536 76687479 91042192 111363017 141274075 176426345
9668A76426345L7730718L4043440K0771496O227194m380672q478309j2384789
$$ 176426345 214157063 248200503 268971999 275199193 270818521 262340212 249955423
9661B49955423j3681011j5540989j6046550j7640412j9498012j7699126j4037277
$$ 249955423 236274412 220733423 204686873 187046461 167548449 149849323 135812046
9654A35812046r763965o812182m940367l786472R63662N288964P390698J0465146
$$ 135812046 126048081 119235899 114295532 110509060 111472722 116761686 124152384 134617530
9646A34617530J5454126J7919010K0319722K0457075J8119561J9968351J9734675
$$ 134617530 150071656 167990666 188310388 208767463 226887024 246855375 266590050
9639B66590050K2674513K3406675J9045167Q300254m13442L75281K364825L585832
$$ 266590050 289264563 312671238 331716405 340016659 339603217 339978498 342343323 345929155
9631C45929155l361508r677993j4723388k1022051k1303787k1020817j7312178
$$ 345929155 342567647 332889654 318166266 297144215 275840428 254819611 237507433
9624B37507433j9668611j8992273j8001388j7905950j5989192j3399998j0187364
$$ 237507433 217838822 198846549 180845161 162939211 146950019 133550021 123362657
9617A23362657p402290n252487k659310L64645L920690P834061Q345113J0953676
$$ 123362657 115960367 110707880 108048570 108413215 112333905 120167966 128513079 139466755
9609A39466755J3929525J3584539J1679702J2190170J3729901J4639305J4105550
$$ 139466755 153396280 166980819 178660521 190850691 204580592 219219897 233325447
9602B33325447R224864K50811j1023285k2579762k6886016k7794489k2449254
$$ 233325447 242550311 242801122 231777837 209198075 182312059 154517570 132068316
9595A32068316j8272395j7049391j1873424p994948p745003p244710n197763k290961
$$ 132068316 113795921 96746530 84873106 76878158 69133155 61888445 56690682 54399721
9587E4399721n061471k423537l237048l916436o25961j778676j017186m68314
$$ 54399721 49338250 46914713 43677665 39761229 39135268 37356592 36339406 35871092
9579C5871092N34248k831527k125859j121580j693324j232984j121253j011090
$$ 35871092 36405340 33573813 31447954 30326374 28633050 27400066 26278813 25267723
9571B5267723r18109k236269O71013j157592P94270R84847j502684L68371o98135
$$ 25267723 24349614 22113345 22784358 21626766 22421036 23405883 21903199 22271570 21573435
9562B1573435J127n56616J069263J027577q46678q34160j883012j025795N98288
$$ 21573435 21574562 21017946 22087209 23114786 22268108 21433948 19550936 18525141 19123429
9553A9123429l16120k94126k43797M78865j496405j626200R8535P60056N82007
$$ 19123429 18807309 18513183 18269386 18748251 17251846 15625646 15724181 16484237 17066244
9544A7066244L69940l24547j253172k30286P32593j814276L20482R92595l32781
$$ 17066244 17436184 17111637 15858465 15628179 16360772 14546496 14866978 15859573 15526792
9535A5526792o30735m9693j109139o43320J82953j10696j54914j369446K05824
$$ 15526792 14896057 14846364 13737225 13093905 13276858 13166162 13011248 11641802 11847626
9526A1847626l08100j17724J874766L81699j707148Q66175Q61978k071246m06217
$$ 11847626 11539526 11421802 13296568 13678267 11971119 12837294 13699272 11628026 11221809
9517A1221809P59434m61112N04829m6046k14232o38999O06753p18767n31539J922411
$$ 11221809 11981243 11520131 12024960 11978914 11764682 11125683 11732436 11013669 10482130 12404541
9507A2404541j305796r67372R747m21399j82447j368535K23764M82129j3266l90040
$$ 12404541 11098745 10131373 10141120 9719721 9537274 8168739 8392503 8874632 8861366 8471326
9497H471326j414914J432504O36806j061563K0214R27435o25043M97776O12885
$$ 8471326 7056412 8488916 9125722 8064159 8084373 9011808 8386765 8884541 9497426
9488I497426j217068J504470R64805k315293q07304K54020j452230n71022N99661
$$ 9497426 8280358 9784828 10749633 8434340 7627036 7881056 6428826 5857804 6457465
9479F457465J443853J142349K22726J09324J215248r55341q25811J485894j044899
$$ 6457465 7901318 9043667 9266393 9375717 10590965 9635624 8809813 10295707 9250808
9470I250808O518J18092j331678P48861m52407m27917j832154J203185K08537
$$ 9250808 9257326 9375418 8043740 8792601 8340194 7912277 6080123 7283308 7491845
9461G491845l68605M93630j48024j45192k01679M73614J092694p18433M7171l96230
$$ 7491845 7123240 7616870 7468846 7323654 7121975 7595589 8688283 7969850 8017021 7620791
9451G620791k70762J034885p50367j628014R9968J162480q37816k6162j758560
$$ 7620791 7350029 8384914 7634547 6006533 6106501 7268981 6431165 6405003 4646443
9442D646443K018922K463371p63670l4979L29628j061806N0666n27826j267196
$$ 4646443 6665365 9128736 8365066 8330087 8659715 7597909 7648575 7120749 5853553
9433E853553m35836J959505M26867N84101o97908j766101J65267J233504j064824
$$ 5853553 5417717 7377222 7804089 8388190 7690282 5924181 6089448 7322952 6258128
9424F258128o87873P48546L38397J305397l00795j773453n89285J603255K23822
$$ 6258128 5570255 6318801 6657198 7962595 7661800 5888347 5299062 6902317 7126139
9415G126139j565619n57092J388739R01342N98203j456883j298462j44222J800759
$$ 7126139 5560520 5003428 6392167 7293509 7891712 6434829 5136367 4992145 6792904
9406F792904n05407J044687K021754m39570q89314j022828p55094l09760N45142
$$ 6792904 6287497 7332184 9353938 8914368 8025054 7002226 6247132 5937372 6482514
9397F482514l00223Q1708O12060l18574k25713J304395N45858r61884j519133
$$ 6482514 6182291 6263999 6876059 6557485 6331772 7636167 8182025 7220141 5701008
9388E701008K20483j093858P57403J262442L03509N23070j103074j999763p43845
$$ 5701008 5921491 4827633 5585036 6847478 7150987 7674057 6570983 4571220 3827375
9379C827375J503925J148954N1057O65619j305729M18210p99299L61777J577937
$$ 3827375 5331300 6480254 6531311 7196930 5891201 6309411 5510112 5871889 7449826
9370G449826j298443j421840m95346Q84331j11480J413047P24419k65626N61386
$$ 7449826 6151383 4729543 4234197 5118528 5007048 6420095 7144514 6878888 7440274
9361G440274l28854l002215J047044J178126J560211o24379o64631R41896k175423
$$ 7440274 7111420 4109205 5156249 6334375 7894586 7270207 6605576 7547472 5372049
9352E372049J47806J16965J294381m52301k95151m7617j610662J386355j044069
$$ 5372049 5519855 5636820 6931201 6478900 6183749 6136132 4525470 5911825 4867756
9343D867756k92791R49006p06389J46739J86213K807792P63863m30850p95780
$$ 4867756 4574965 5523971 4817582 4964321 5150534 7958326 8722189 8291339 7495559
9334G495559l63616J406709l59086P86038j155039q67722l89464m17539J28869
$$ 7495559 7131943 8538652 8179566 8965604 7810565 6942843 6553379 6135840 6264709
9325F264709L02109O97190j398870j17806p85461L97423L77290k5416J455104
$$ 6264709 6566818 7264008 5865138 5747332 4961871 5359294 5736584 5711168 7166272
9316G166272N68608L91214j036595J571755M07031Q35954J010049n64287r85780
$$ 7166272 7734880 8126094 7089499 8661254 9068285 9904239 10914288 10350001 9364221
9307I364221p84534J613606p89502r97284m32458k68391l44867j063455j058694
$$ 9364221 8579687 10193293 9403791 8406507 7974049 7705658 7360791 6297336 5238642
9298E238642M39474P79175J848417J17837q44363Q87117J70220p50647k68850
$$ 5238642 5678116 6457291 8305708 8423545 7579182 8466299 8636519 7885872 7617022
9289G617022J601498p28962o68110j519948p26311Q27478J636940R89063m41232
$$ 7617022 9218520 8489558 7821448 6301500 5575189 6402667 8039607 9028670 8587438
9280H587438N93142K63759l5130k41282R25462J136544q15637Q3022m83594p35699
$$ 8587438 9180580 9444339 9409209 9167927 10093389 11229933 10414296 10497318 10013724 9278025
9270I278025j90218R26159j52646O94218J133559K08721j260015j729335n99809
$$ 9278025 9087807 10013966 9861320 10555538 11689097 11897818 10637803 8908468 8308659
9261H308659R8974j64253j046036O27359N34087J56745j205385p62016J050307
$$ 8308659 8407633 8243380 7197344 7824703 8358790 8515535 7310150 6548134 7598441
9252G598441O57542j268638J15275O18917J732036L63765m30562m67063J33931
$$ 7598441 8255983 6987345 7102620 7721537 9453573 9817338 9386776 8919713 9053644
9243I053644r23348j01132K006484j010804q95668Q14074M77534j261601M22748
$$ 9053644 8130296 8029164 10035648 9024844 8129176 8943250 9420784 8159183 8581931
9234H581931R5090j8055J217782M50071q36067q01445J485493j122663n20776
$$ 8581931 8677021 8658966 9876748 10326819 9490752 8689307 10174800 9052137 8531361
9225H531361j148246P64312r2099l60585J744684r01605j67191m51457N00186
$$ 8531361 7383115 8147427 8055328 7694743 9439427 8537822 8370631 7919174 8419360
9216H419360j214874p09183O66975K63640O52204m40375J036614j015747J172500
$$ 8419360 7204486 6495303 7162278 7425918 8078122 7637747 8674361 7658614 8831114
9207H831114P23213k137321Q65554L53348j072066j194868L80853n6117L96983
$$ 8831114 9554327 7417006 8282560 8635908 7563842 6368974 6749827 6693710 7090693
9198G090693J509988j184212j7464J600572L10918j346062l53794p24427K3072
$$ 7090693 8600681 7416469 7399005 8999577 9310495 7964433 7610639 6886212 6909284
9189F909284J446810m95999n16218J141364k42189k26610J059290J491848l69618
$$ 6909284 8356094 7860095 7343877 8485241 8243052 8016442 9075732 10567580 10197962
9180A0197962j925296J113915j052923N8265k00943j55898R92017O11283q37398
$$ 10197962 8272666 9386581 8333658 8391923 8190980 8035082 9027099 9638382 8800984
9171H800984r84980L384221J844132r13152j222941K68271J83668j949502p35774
$$ 8800984 7816004 11200225 13044357 12131205 10908264 11176535 11360203 9410701 8674927
9162H674927M37268j56739j165375J625417l73897j206914J48801p48764P34587
$$ 8674927 9112195 8955456 7790081 9415498 9041601 7834687 7983488 7234724 7969311
9153G969311J613998L25817j368167K05177O97386p99043N37878P85419p21946
$$ 7969311 9583309 9909126 8540959 8746136 9443522 8644479 9182357 9967776 9245830
9144I245830Q12584M22568k5943m36058J54212r4076M24234j366794j379542P39365
$$ 9245830 10058414 10480982 10455039 10018981 10173193 10079117 10503351 9136557 7757015 8496380
9134H496380J653748K543935m75278j645919M95801J025459j124591q36306J015118
$$ 8496380 10150128 12694063 12218785 10572866 11068667 12094126 10969535 10133229 11148347
9125A1148347J452748l05409L28198K2251n72076j39897j56050l03917K53732
$$ 11148347 12601095 12295686 12623884 12646135 12074059 11934162 11778112 11474195 11727927
9116A1727927n35881j440652o42382m57264p84909q2069N78629n99874j66486
$$ 11727927 11192046 9751394 9109012 8651748 7866839 7784770 8363399 7763525 7597039
9107G597039J293028N76061j018243J752887J478893j169579J19590j655411J204783
$$ 7597039 8890067 9466128 8447885 10200772 11679665 10510086 10629676 8974265 10179048
9098A0179048P36507L65338n11736r61312k31790R45584O31837n74785K71136
$$ 10179048 10915555 11280893 10769157 9807845 9576055 10521639 11153476 10578691 10849827
9089A0849827p47985R65023r28077j855981J007959J857830J303183j605143J9177
$$ 10849827 10101842 11066865 10138788 8282807 9290766 11148596 12451779 10846636 10865813
9080A0865813Q19415L70857J373778o68984J125854q4927r71708j121821O3128
$$ 10865813 11685228 12056085 13429863 12760879 13886733 13801806 12830098 11708277 11771405
9071A1771405p48820K700L7742J61883M04892q33791j63137K78997J020663K63231
$$ 11771405 11022585 11025285 11063027 11224910 11629802 10796011 10632874 10911871 11932534 12195765
9061A2195765j82539j140667l96787J505528l55736J72999J240421M80388J07514
$$ 12195765 12013226 10872559 10475772 11981300 11625564 11798563 13038984 13519372 13626886
9052A3626886j564566p02262P82730J195730O43921k25146o83387L49446o4747
$$ 13626886 12062320 11360058 12142788 13338518 13982439 13757293 13073906 13423352 13358605
9043A3358605j324008Q74243J02965N6680j28467q97112n6728O62637J318289
$$ 13358605 12034597 12908840 13011805 13068485 12940018 12042906 11986178 12648815 13967104
9034A3967104q78426p29456O76988J8589j096325Q74532J075448M02906j34359
$$ 13967104 13088678 12359222 13036210 13054799 11958474 12833006 13908454 14311360 14177001
9025A4177001q40257K631483k234733J35683J275256O9893R46834J06919q49043
$$ 14177001 13336744 15968227 13733494 13869177 15144433 15214326 16161160 16268079 15419036
9016A5419036q36858P75813r85213l59761Q51994n82824j23582J222619k16938
$$ 15419036 14582178 15357991 14372778 14013017 14865011 14282187 14158605 15381224 15164286
9007A5164286j489255M31247K62325k211566J019963L74055j80813n5903M87675
$$ 15164286 13675031 14106278 14368603 12157037 13177000 13551055 13370242 13314339 13802014
8998A3802014m29679k93049J87134J362019J97269O12206j11742J02200J497653
$$ 13802014 13372335 13079286 13266420 14628439 14825708 15437914 15326172 15428372 16926025
8989A6926025o78091j208352p49631o91640p30849J291422J212005q00885K71816
$$ 16926025 16247934 15039582 14289951 13598311 12867462 14158884 15370889 14570004 14841820
8980A4841820P88762N66380j181015j295427J904668J401547Q87223r72778q07641
$$ 14841820 15630582 16196962 15015947 13720520 15625188 17026735 17913958 16941180 16133539
8971A6133539k97363J62185n08875r89920Q83575L46511k48064o62527j98017
$$ 16133539 15836176 15998361 15489486 14499566 15383141 15729652 15481588 14819061 14621044
8962A4621044Q64852o32757J629529M3238p81601k99458N42014J063563J290640
$$ 14621044 15485896 14853139 16482668 16525906 15744305 15444847 15986861 17050424 18341064
8953A8341064K41482l442817l20087J286958p16708m60936J791382J302852M66125
$$ 18341064 18582546 15139729 14819642 16106600 15389892 14928956 16720338 18023190 18489315
8944A8489315J928530K44959J81411k7009k540286O85361j066020l86068l04668
$$ 18489315 20417845 20662804 20844215 20817206 18276920 18962281 17896261 17510193 17205525
8935A7205525M65636R78914j427535r62701J806525J557512j283971j175285M68622
$$ 17205525 17671161 18650075 17222540 16259839 18066364 19623876 18339905 17164620 17633242
8926A7633242r99254m43996n69995m60843j15483o8167P50183J396134Q02746
$$ 17633242 16633988 16189992 15619997 15159154 15043671 14975504 15725687 17121821 17924567
8917A7924567r85524L70538P8635r7473n08609r7015k37418R16417j30124J21786
$$ 17924567 16939043 17309581 17388216 17290743 16782134 16685119 16447701 17364118 17233994 17355780
8907A7355780N90242n79792L98126q34374j947546P44301J189994R85401r98265
$$ 17355780 17946022 17366230 17764356 16929982 14982436 15726737 16916731 17902132 16903867
8898A6903867N84021n41649R19413l60494l56764L11823l90054k72671k094635
$$ 16903867 17487888 16946239 17865652 17505158 17148394 17460217 17070163 16797492 14702857
8889A4702857n39561J493665J105313J506037Q1177j184633K54261J061806N91373
$$ 14702857 14163296 15656961 16762274 18268311 18349488 17164855 17419116 18480922 19072295
8880A9072295j813296K198056J721581k342388j584400O01477o82198Q40364R21111
$$ 19072295 17258999 19457055 21178636 18836248 17251848 17853325 17171127 18011491 18932602
8871A8932602O28573N6351P51658K29992l018899j176805P66902J827762r06700
$$ 18932602 19561175 19617526 20369184 20599176 17580277 16403472 17170374 18998136 18091436
8862A8091436j172656J252337J12553J110461R77180o65655r42788J004199j588839
$$ 18091436 16918780 18171117 18283670 19394131 20371311 19705656 18762868 19767067 18178228
8853A8178228j253298K090934R13052l05811J760645Q1804k923204j020247L215132
$$ 18178228 16924930 19015864 19928916 19623105 21383750 21465554 18542350 17522103 20737235
8844B0737235K001544n94396O51560J24266P13215k96044n56230j439509j51546
$$ 20737235 22738779 22144383 22795943 22920209 23633424 23337380 22781150 21341641 21190095
8835B1190095O65374j007373J026679l27907k320720J522503P74431j461614N12803
$$ 21190095 21855469 20848096 21874775 21546868 19226148 20748651 21523082 20061468 20574271
8826B0574271M74839o68040J109095P05160j786262N98935K047482k742962j518399
$$ 20574271 21049110 20381070 21490165 22195325 20409063 21007998 23055480 20312518 18794119
8817A8794119Q79402P70900J72986J081652J367496m014N97519j229520P92331
$$ 18794119 19673521 20444421 20617407 21699059 23066555 23062541 23660060 22430540 23222871
8808B3222871K461775J988076j725179o64080K042694j24879j144066o62789q78165
$$ 23222871 25684646 27672722 25947543 25283463 27326157 27201278 26057212 25394423 24516258
8799B4516258N30200j87466j264271j32716m99061j392082P92361P35681q5134
$$ 24516258 25046458 24858992 23594721 23462005 22962944 21570862 22363223 23098904 23013770
8790B3013770p95388N98155j598754O05197N69842r5134Q45014L43871O20709
$$ 23013770 22218382 22816537 21217783 21822980 22392822 22297688 23142702 23486573 24107282
8781B4107282k241196M30261J397135Q46325j075662O15439J419644j178735O15500
$$ 24107282 21866086 22296347 23693482 24539807 23464145 24079584 25499228 24320493 24935993
8772B4935993J183793j544712J474290j801601j732697R09747Q45481j348073
$$ 24935993 26119786 24575074 26049364 24247763 22515066 23424813 24270294 22922221
8764B2922221R249k43914N31980l94175L21472J342425R30000J393660j684414
$$ 22922221 22931470 22687556 23219536 22825361 23146833 24489258 25419258 26812918 25128504
8755B5128504P92886m36725j926739j933485O31238J088422j428688M93191Q35945
$$ 25128504 25921390 25484665 23557926 21624441 22255679 23344101 21915413 22408604 23244549
8746B3244549J345054K96919m90176n08907J81241N00783k492364P3661J316986
$$ 23244549 24589603 24886522 24396346 23887439 24068680 24569463 22077099 22150760 23467746
8737B3467746J05959N50386n6912L5394J02389j035442J714510J013157J547655
$$ 23467746 23573705 24124091 24067179 24102573 24204962 23169520 24884030 25897187 27444842
8728B7444842k43237j536745l61026K76895k7890k904839K016712J381224j435944
$$ 27444842 27201605 25664860 25303834 25580729 25552839 22648000 24664712 26045936 24609992
8719B4609992L35618M73310m25047O30286p21849J464634J257247j473659p73795
$$ 24609992 24945610 25418920 24993873 25624159 24902310 26366944 27624191 26150532 25376737
8710B5376737L59885J426855o90481j112642r05831j85777j359020j954095J551045
$$ 25376737 25736622 27163477 26472996 25360354 24454523 24268746 22909726 20955631 22506676
8701B2506676K571055J143854L4449O43553o236j26910j25595j034838L011390
$$ 22506676 25077731 26221585 26256034 26899587 26893351 26766441 26640846 25606008 28617398
8692B8617398m60340l660832R57638j55411k66588r57013L75013K654962M54724
$$ 28617398 28157058 24496226 25453864 25298453 25031865 24074852 24449865 27104827 27559551
8683B7559551j316878j919639J290229J149719k79265J83958m17907P75831l81004
$$ 27559551 26242673 24323034 25613263 26762982 26483717 26667675 26249768 27025599 26644595
8674B6644595p53980R43079M69577N31863p75780L45412p37276m33343J003817
$$ 26644595 25890615 26833694 27303271 27835134 27059354 27404766 26667490 26234147 27237964
8665B7237964Q04744J568501r97239k067406J446156M89567o43084r34030K74305
$$ 27237964 28042708 29611209 28613970 26546564 27992720 28482287 27839203 26905173 27179478
8656B7179478P95209l83322m84129p11152R82774P52953n20954M24005O70008
$$ 27179478 27974687 27591365 27107236 26396084 27378858 28131811 27610857 28034862 28704870
8647B8704870N27693r93381j89071L54037m65102J615044l45004o47123k59310
$$ 28704870 29232563 28239182 28050111 28404148 27939046 29554090 29209086 28561963 28302653
8638B8302653p30247P25797l03372R88763l35261m99968K13056N57810L32242
$$ 28302653 27572406 28298203 27994831 28983594 28648333 28148365 28361421 28919231 29251473
8629B9251473j430629J593177M50727p5263n00965n04145j86911k15182p778q58723
$$ 29251473 27820844 29414021 29864748 29789485 29288520 28784375 28597464 28382282 28374504 27515781
8619B7515781P52872J411112J41366m93085j9046m30899J165782k68336Q06536
$$ 27515781 28268653 29679765 29821131 29328046 29309000 28878101 30043883 29775547 30582083
8610C0582083O59372j837404k89377J342180o9313r8299o50381Q66337J344482
$$ 30582083 31241455 29404051 29114674 30456854 30387541 30289242 29638861 30505198 31849680
8601C1849680l11506l29760q44695M05854M31047O16140j150171J056362J27650
$$ 31849680 31538174 31208414 30363719 30769573 31200620 31816760 30666589 31722951 31850601
8592C1850601k56981q79988q06095L32977m84632p695l66968P12100l7313P51085
$$ 31850601 31593620 30713632 29907537 30240514 29755882 29748187 29381219 30093319 30056006 30807091
8582C0807091K212353j135694N02142J82070k37268l78703j0537j492661j05906
$$ 30807091 33019444 31883750 32385892 32567962 32330694 31951991 31941454 30448793 30342887
8573C0342887P00239j131882j181883k40349N37834O16791J121436N07528J809651
$$ 30342887 31043126 29911244 28729361 28489012 29026846 29643637 30765073 31272601 33082252
8564C3082252M06993K89392J73471k037033p56182J075158M8184L81464J72720
$$ 33082252 33489245 33778637 33952108 31915075 31158893 32234051 32282235 32663699 32836419
8555C2836419j190479J55438J461409j259808n52697O36601J618602n41740O84779
$$ 32836419 31645940 31801378 33262787 32002979 31450282 32086883 33705485 33163745 33848524
8546C3848524p08933m46514M80970o79368n90991j837135J298780J521090M94517
$$ 33848524 33139591 32693077 33174047 32494679 31903688 30066553 31365333 32886423 33380940
8537C3380940O37404J11934m04368j41952n38410j678719J319679L4122J48906
$$ 33380940 34018344 34130278 33725910 33583958 33045548 31366829 32686508 32720630 32869536
8528C2869536N90385j331096r29656m44795l78488m10085K595023Q91703q2982
$$ 32869536 33459921 32128825 31199169 30754374 30375886 29965801 32560824 33452527 33369545
8519C3369545N31822j214635j73511j45252j687652M10618J957403m5944j351965
$$ 33369545 33901367 32686732 32513221 32367969 30680317 31090935 33048338 33002394 31650429
8510C1650429J507323o14238Q05235J353851n8327j713801k305495Q69027J078084
$$ 31650429 33157752 32543514 33348749 34702600 34644273 32930472 30624977 31494004 32572088
8501C2572088O31983l62316M48139P14539j724415p45613q18922J630422K293890
$$ 32572088 33204071 32841755 33289894 34004433 32280018 31534405 30715483 32345905 34639795
8492C4639795o67849k20612j67449m7154O81858n40466m47052j4378J74520m13081
$$ 34639795 33971946 33751334 33583885 33536731 34218589 33678123 33231071 33216693 33391213 32978132
8482C2978132l57927J586297j058625J050603l67560L11119m65230p21015J169050
$$ 32978132 32620205 34206502 33147877 34198480 33830920 34142039 33676809 32955794 34124844
8473C4124844J4651J601340p55067l21997r90539j037485O96881M70292M52067
$$ 34124844 34139495 35740835 34985768 34663771 33673232 32635747 33332628 33802920 34254987
8464C4254987l13677o19696R17674m07694j690882M42422l75732l38216O15228
$$ 34254987 33941310 33321614 34239288 33831594 32140712 32583134 32207402 31869186 32484414
8455C2484414j09209R21258N58535J412061n76903o79044K71109j084426K4389
$$ 32484414 32375205 33296463 33854998 35267059 34690156 34011112 34282221 33197795 33222184
8446C3222184K28486j131872j72108l3374M93938Q58634n35018j236244N24770
$$ 33222184 33450670 32318798 32146690 32113316 32607254 33465888 32930870 31694626 32219396
8437C2219396J09705m50338K001817j632493m19936n74031J085132p43045q63255
$$ 32219396 32329101 31878763 33880580 32248087 31828151 31254120 32339252 31596207 30732952
8428C0732952J130634N87554R59443r63056l59970J011132n00508q6367J67959
$$ 30732952 31863586 32451140 33410583 32447527 32087557 33098689 32598181 32511814 32679773
8419C2679773j073639J600271R15287l20401j13119j208362j071670L5392Q61536
$$ 32679773 31606134 33206405 34121692 33801291 33688172 32479810 31408140 31443532 32305068
8410C2305068p16305j028538P20175j077606M20954L0794J81224J326414K8891
$$ 32305068 31588763 30560225 31280400 30202794 30623748 30654542 30835766 32162180 32191071
8401C2191071l67464m42947k29613M3409O58993p32938j71904j7699r73976l82747
$$ 32191071 31823607 31380660 31151047 31194456 31853449 31120511 30948607 30930908 29956932 29574185
8391B9574185M75727R11876L30570j235387J038599M11770j634960j281294Q77389
$$ 29574185 30049912 30961788 31292358 30056971 31095570 31507340 29872380 28591086 29468475
8382B9468475K080613j293717j214991J56678q69259K085213j360452M75652K151252
$$ 29468475 31549088 30255371 29040380 29197058 28327799 30413012 29052560 29528212 31679464
8373C1679464J68586j152932p26310K580043p37363j631289k77278N66437j595722
$$ 31679464 31848050 30695118 29968808 32548851 31811488 30180199 29902921 30469358 28873636
8364B8873636j666517R60187Q00868K96285L25555j074232n41379P96469M29051
$$ 28873636 27207119 28167306 28968174 29264459 29590014 28515782 27974403 28770872 29199923
8355B9199923j553867l25619K235104q54280j323076J615858n08089p79666p00527
$$ 29199923 27646056 27320437 29555541 28701261 27378185 28994043 28485954 27706288 27005761
8346B7005761K92363q03740P80219J232232r03151Q62267l81663k390631J384521
$$ 27005761 27298124 26494384 27274603 28506835 27603684 28465951 28084288 25693657 27078178
8337B7078178J795418j249137n19987J088923n01627k184500K90886J70192N78994
$$ 27078178 28873596 27624459 27104472 28193395 27691768 25507268 25798154 25968346 26547340
8328B6547340N52867p55671J098499N17324L47192l37058J045077n8974j695653
$$ 26547340 27100207 26344536 27443035 27960359 28307551 27970493 29015570 28956596 27260943
8319B7260943N24192j057682M47768K1472q13108R22014K82466l86101j907567
$$ 27260943 27785135 26727453 27175221 27196693 26383585 27305599 27588065 27201964 25294397
8310B5294397J71181J50988K58488k39935j085678R57920J681745r07726k82124
$$ 25294397 25465578 25616566 25875054 25635119 24549441 25507361 27189106 26281380 25999256
8301B5999256J183313m25227M18574j173122n49400l50589Q13107L7532l379319
$$ 25999256 27182569 26757342 27175916 26002794 25453394 25102805 25915912 25953444 22574125
8292B2574125O67735J25546j02345J3699J15975K81436o21213J735843j75388
$$ 22574125 23241860 23367406 23265061 23278760 23394735 23676171 23054958 24790801 24615413
8283B4615413J43500j701729K93784J057949o61858O34952l44524K037526l120
$$ 24615413 24758913 23057184 23350968 24408917 23747059 24382011 24037487 26075013 26071893
8274B6071893q75611j442842j144658K009014j024034m80240Q75547j188439J08015
$$ 26071893 25196282 23753440 22608782 24617796 23593762 23113522 23989069 22800630 22908645
8265B2908645J30503P61733J58070l52425p95207n35653K238397n21523k086793
$$ 22908645 23039148 23800881 23958951 23606526 22811319 22275666 24514063 23992540 21905747
8256B1905747J388858J255944q21690m47474l92861J973864P77025m20458k146549
$$ 21905747 23294605 24550549 23728859 23281385 22888524 24862388 25639413 25218955 23072406
8247B3072406M63941J571016k965819l094814K39201J174653k66761J934724N02564
$$ 23072406 23536347 25107363 22141544 19046730 19285931 20460584 20193823 22128547 22631111
8238B2631111p47152Q86257l34630J506015K07791m6079j572290l77686L34547
$$ 22631111 21883959 22770216 22435586 23941601 24149392 24103313 22531023 22153337 22487884
8229B2487884j850547o82981P80785J991130p3702j058726j574813J642446n98511
$$ 22487884 20637337 19954356 20735141 22726271 22652569 21593843 20019030 21661476 21062965
8220B1062965R05038j321210o04557M77672j664129J820168o49517j257559P92241
$$ 21062965 21968003 20646793 20042236 20519908 18855779 20675947 20026430 18768871 19561112
8211A9561112M43159Q0937l52749l242945L12893M208574J520485m000094L95857
$$ 19561112 20004271 20085208 19732459 16489514 16802407 21010981 22531466 18531372 18927229
8202A8927229R54144O16500J287563j919834R03822P53539k155236k701158o27643
$$ 18927229 19881373 20497873 21785436 19865602 20769424 21522963 19367727 16666569 16038926
8193A6038926k312800m727P193453p98817K00732J21770j29701K849781K98256
$$ 16038926 13726126 13721399 20914852 20116035 20316767 20438537 20308836 23158617 23456873
8184B3456873m78099l645339K711257N68409k768025l070044j856944R47271Q85695
$$ 23456873 22978774 19333435 22044692 22613101 19845076 16775032 14918088 15865359 16751054
8175A6751054Q98592K395483j557680J401587K495602j053723m11127J53801j018202
$$ 16751054 17649646 20045129 18487449 19889036 22384638 21330915 20919788 21073589 20055387
8166B0055387j873619n92404j935005J07585R14464J703815j519389k573930K091131
$$ 20055387 18181768 17589364 15654359 15761944 16676408 18380223 16860834 14286904 16378035
8157A6378035J563741N0587L276486P22253j334414r01731q15930k309956j353009
$$ 16378035 17941776 17992363 21268849 21991102 20656688 19754957 18939027 16629071 15276062
8148A5276062N36470j363407J708622Q90814k486743J380961N72481K63162J439246
$$ 15276062 15812532 14449125 16157747 17048561 14561818 15942779 16515260 16778422 18217668
8139A8217668n45887m58363P76134j292627j17176J295541k326457m17936O45538
$$ 18217668 17671781 17213418 17989552 16696925 16579749 17875290 15548833 15130897 15776435
8130A5776435J37801k633947L157217M67435j198219J240179r20972m16581P10676
$$ 15776435 15914236 13280289 16437506 16904941 15706722 16946901 16025929 15609348 16320024
8121A6320024r9389j183447J825651J816163j041784o10941K98336k016496n28839
$$ 16320024 16220635 15037188 16862839 18679002 17637218 17026277 17324613 15308117 14779278
8112A4779278l11824R154K55434K505719j170175P66931J084188j279811j238631
$$ 14779278 14467454 14476608 14732042 17237761 16067586 16834517 17918705 16638894 15400263
8103A5400263l29111J083266m22687q10526r61116K49309J612832k60461k284421
$$ 15400263 15071152 16154418 15731731 14921205 13960089 14209398 15822230 15561769 13277348
8094A3277348L0637Q47241N71858N77362L58179L2328O5667l96926q3146k146762
$$ 13277348 13307985 14155226 14727084 15304446 15662625 15694953 15760620 15363694 15280548 13133786
8084A3133786J081050J731086o59256j727293M55337J020426l87849k18706P432
$$ 13133786 14214836 15945922 15286666 13559373 14014710 15035136 14647287 14428581 14436013
8075A4436013j332562K7084J993220j294674n74467O68291O93163M10246N06530
$$ 14436013 13103451 13130535 15123755 13829081 13254614 13922905 14616068 15026314 15532844
8066A5532844p56817k008964P38400J298962J223169r90301j072239k04896j755867
$$ 15532844 14776027 12767063 13505463 14804425 16027594 15037293 13965054 13760158 12004291
8057A2004291K44379Q13929k71649q06581R02333N5249p56758R47866P00401J117061
$$ 12004291 12248670 13062599 12790950 11984369 12886702 12941951 12185193 13133059 13833460 14950521
8047A4950521j80596j718355j202704J312025R24931M05134r22140q08749M79352
$$ 14950521 14769925 13051570 11848866 13160891 14085822 14490956 13568816 12760067 13239419
8038A3239419N9193m14539J53931Q05251j49778l41923J84609r56332k32418k59939
$$ 13239419 13298612 12884073 13038004 13843255 13693477 13351554 13536163 12579831 12347413 12087474
8028A2087474O69923Q45128l17913P714j675236j02911K83614n2902j8624J123419
$$ 12087474 12757397 13602525 13284612 13292326 11617090 11514179 11797793 11744891 11726267 12849686
8018A2849686k92895j123860J432315J119319p25385J16062p74099R69086j495188
$$ 12849686 12556791 11432931 12865246 13984565 13259180 13375242 12601143 13570229 12075041
8009A2075041j007332J390915K99621p62297j190563n1928m90530J789236J939745
$$ 12075041 11067709 12458624 12758245 11995948 10805385 10753457 10262927 12052163 13991908
8000A3991908j570384j40788L01165O91406L8163M99800Q5412j215260p91079
$$ 13991908 12421524 12280736 12581901 13273307 13311470 13811270 13896682 12681422 11890343
7991A1890343o52233r23643j891460J171490J474483l73055r6080m05158j03831
$$ 11890343 11238110 10314467 8423007 9594497 11068980 10695925 10599845 10194687 10090856
7982A0090856J419510L57727j262832J320286J202281j40913j188374j792024
$$ 10090856 11510366 11868093 10605261 11925547 13127828 12986915 11798541 10006517
7974A0006517O96942J23552M97173j444084K18092p03673O89722J956299j277355
$$ 10006517 10703459 10827011 11324184 9880100 10098192 9394519 10084241 12040540 10763185
7965A0763185L96061K19999J24509l62732P40904N89459j787052O49705N50279
$$ 10763185 11159246 11379245 11503754 11141022 11881926 12471385 10684333 11334038 11884317
7956A1884317j944515m44164j84940J72803O13514J12932j12647N09707J705403
$$ 11884317 9939802 9495638 9310698 9483501 10097015 10209947 10097300 10607007 12312410
7947A2312410K52408q02347j152705k21858J549214j47529k109038l4042N7072
$$ 12312410 12564818 11762471 10609766 10387908 11937122 11789593 9680555 9646513 9703585
7938I703585K93061k58464m76287q91568K529468K353796k298699R0435Q6317
$$ 9703585 9996646 9738182 9261895 8370327 10899795 13253591 10954892 11045327 11131644
7929A1131644O66256k57434n03682n33176j197990N9053q14269m48558q65750
$$ 11131644 11797900 11540466 11036784 10503608 9305618 9364671 8550402 8101844 7236094
7920G236094J1180K585931n8659o43554P48076J440885o71747O41983M08349j846213
$$ 7236094 7247274 9833205 9774546 9130992 9879068 11319953 10648206 11290189 11698538 9852325
7910I852325q22343j69302q96519K81221J035157n15313n77874R21854j051792
$$ 9852325 9029982 8860680 7964161 8245382 9280539 8765226 8187352 9109206 8057414
7901H057414j940416K409020J799415r52548p46563J030238N07581n32067M1050
$$ 8057414 6116998 8526018 10325433 9372885 8626322 9656560 10164141 9632074 9673124
7892I673124p24018J318157J157916p63699n51398j318699L87850j706043l12320
$$ 9673124 8949106 10267263 11425179 10661480 10110082 8791383 9179233 7473190 7160870
7883G160870N0162l1685L42240M76485K70964N14038J009640m36629Q68205r09646
$$ 7160870 7211032 7179347 7521587 7998072 8269036 8783074 9792714 9356085 10224290 9314644
7873I314644j203852n63837J083497L02760j611935p721M60382J393714J74053
$$ 9314644 8110792 7546955 8630452 8933212 7321277 7313556 7773938 9167652 9341705
7864I341705p77115k46982Q38388P45263j095857K79319m79714o12802L22452
$$ 9341705 8564590 8317608 9155996 9901259 8805402 9084721 8605007 7992205 8314657
7855H314657J89182M78054o12003K063867j25346p05101l14786k963n39569n46989
$$ 8314657 8503839 8981893 8369890 10433757 10308411 9603310 9288524 9285561 8745992 8199003
7845H199003l07802m91319r03560o42104K411070K814842j600975j259614J115847
$$ 8199003 7891201 7399882 6496322 5854218 8265288 11080130 9479155 8219541 9335388
7836I335388j01854n18994j690675M91483N10774j107059r84415J329592R10975
$$ 9335388 9233534 8714540 7023865 7515348 8026122 6919063 5934648 7264240 8175215
7827H175215n26447l99211n39829R50171L01167K96419j264865N30104R40254
$$ 8175215 7648768 7249557 6709728 7659899 7961066 8257485 6992620 7522724 8462978
7818H462978p55598J00208k217852J098660J784251j418631K30874P50927j39919
$$ 8462978 7707380 7807588 5589736 6688396 8472647 7054016 7284890 8035817 7895898
7809G895898k21545l85443r96788K66152J318776m22281M25593J41269n49419
$$ 7895898 7674353 7288910 6292122 6558274 7877050 7454769 7880362 8021631 7472212
7800G472212n65266L85128o11773n99716J407511J075141m80398j03894j86488
$$ 7472212 6906946 7292074 6680301 6080585 7488096 8563237 8082839 7978945 7792457
7791G792457o16253r99315J354807J34903l47551K45603o98801M58132m2874k72525
$$ 7792457 7176204 6176889 7531696 7666599 7319048 7564651 6865850 7323982 7281108 7008583
7781G008583n51799m38485k45933k35281J127677J39051N05651m92105n8869L39915
$$ 7008583 6456784 6018299 5772366 5537085 6664762 6803813 7309464 6817359 6758490 7098405
7771G098405j249251m89183O97895J949065n67910J291008j572811r70517J675096
$$ 7098405 5849154 5359971 6057866 8006931 7439021 8730029 7157218 6186701 7861797
7762G861797m25674j22148p65791P01230Q28846o6617j577392m60350j59990r09789
$$ 7861797 7436123 7313975 6548184 7249414 8078260 8011643 6434251 5973901 5813911 4904122
$$ [...]
##END NTUPLES=NMR SPECTRUM
##END=
