##TITLE=1H_DE-80H_X3
 200.13MHz, d2o
 8 sc
 
 19ns.26.2.2025
##JCAMPDX= 6.0         $$ Bruker NMR JCAMP-DX V2.0
##DATA TYPE= NMR SPECTRUM
##DATA CLASS= NTUPLES
##ORIGIN= UXNMR, Bruker Analytische Messtechnik GmbH
##OWNER= pz
$$ XWIN-NMR		Version 3.5
$$ Wed Apr 22 10:58:29 2026 Russian Standard Time (UT+4h)  Yarkov@DPX200
##.OBSERVE FREQUENCY= 200.1313
##.OBSERVE NUCLEUS= ^1H
##.ACQUISITION MODE= SIMULTANEOUS
##.ACQUISITION SCHEME= undefined
##.AVERAGES= 8
##.DIGITISER RES= 18
##SPECTROMETER/DATA SYSTEM= spect
##.PULSE SEQUENCE= zg30
##.SOLVENT NAME= DMSO
##.SHIFT REFERENCE= (INTERNAL, DMSO, 0, 15.456)
##AUDIT TRAIL= $$ (NUMBER, WHEN, WHO, WHERE, WHAT)
$$ ##TITLE= Audit trail, XWIN-NMR		Version 3.5
$$ ##JCAMPDX= 5.01
$$ ##ORIGIN= Bruker BioSpin GmbH
$$ ##OWNER= Yarkov
$$ C:/Bruker/XWIN-NMR/data/yarkov2/nmr/H-C/1/pdata/1/auditp.txt
$$ ##AUDIT TRAIL=  $$ (NUMBER, WHEN, WHO, WHERE, WHAT)
(   1,<2026-04-22 10:57:20.78 +0400>,<Yarkov>,<DPX200>,
      <created by zg, POWCHK disabled, PULCHK disabled
       configuration hash MD5:
       00 E9 B6 7A A2 85 ED C7 34 08 36 98 17 FE 4E 26
       data hash MD5: 16K
       58 8A 5B 08 E1 29 C1 28 61 DB 71 8C 41 4D E4 27>)
(   2,<2026-04-22 10:57:40.06 +0400>,<Yarkov>,<DPX200>,
      <Start of raw data processing
       efp BC_mod = 2 LB = 0.25 FT_mod = 6 PKNL = 1 PHC0 = -5308.116 PHC1 = 11.42193 SI = 16K 
       data hash MD5: 16K
       68 D9 AE FA 3F 0A FA 58 78 0B 15 36 E7 50 A0 25>)
$$ ##END=
$$ 
$$ hash MD5
$$ D2 BD 8A 47 CF E8 4E F0 EA 1D 15 E2 16 89 D3 27
##$RELAX= 
##$RELAX= 
##$RELAX= 
##$RELAX= 
##$RELAX= 
##$RELAX= 
$$ Bruker specific parameters
$$ --------------------------
##$DU= <C:/Bruker/XWIN-NMR>
##$EXPNO= 1
##$NAME= <H-C>
##$PROCNO= 1
##$TYPE= <nmr>
##$USER= <yarkov2>
##$AMP= (0..31)
100 100 100 100 100 100 100 100 100 100 100 100 100 100 100 100 100 100 
100 100 100 100 100 100 100 100 100 100 100 100 100 100 
##$AQSEQ= 0
##$AQ_mod= 1
##$AUNM= <au_zg>
##$AUTOPOS= <>
##$BF1= 200.13
##$BF2= 200.13
##$BF3= 200.13
##$BF4= 200.13
##$BF5= 200.13
##$BF6= 200.13
##$BF7= 200.13
##$BF8= 200.13
##$BYTORDA= 1
##$CFDGTYP= 0
##$CFRGTYP= 5
##$CHEMSTR= <none>
##$CNST= (0..31)
1 1 145 1 1 1 1 1 1 1 1 1 1 1 1 1 1 1 1 1 1 1 1 1 1 1 1 1 1 1 1 1 
##$CPDPRG= <>
##$CPDPRG1= <>
##$CPDPRG2= <>
##$CPDPRG3= <>
##$CPDPRG4= <mlev>
##$CPDPRG5= <mlev>
##$CPDPRG6= <mlev>
##$CPDPRG7= <mlev>
##$CPDPRG8= <mlev>
##$CPDPRGB= <>
##$CPDPRGT= <>
##$D= (0..31)
0 0.7 0 0 0 0 0 0 0 0 0 0.03 0 0 0 0 0 0 0 0 0 0 0 0 0 0 0 0 0 0 0 0 
##$DATE= 1776841040
##$DBL= (0..7)
120 120 120 120 120 120 120 120 
##$DBP= (0..7)
150 150 150 150 150 150 150 150 
##$DBP07= 0
##$DBPNAM0= <>
##$DBPNAM1= <>
##$DBPNAM2= <>
##$DBPNAM3= <>
##$DBPNAM4= <>
##$DBPNAM5= <>
##$DBPNAM6= <>
##$DBPNAM7= <>
##$DBPOAL= (0..7)
0.5 0.5 0.5 0.5 0.5 0.5 0.5 0.5 
##$DBPOFFS= (0..7)
0 0 0 0 0 0 0 0 
##$DE= 6
##$DECBNUC= <off>
##$DECIM= 32
##$DECNUC= <off>
##$DECSTAT= 4
##$DIGMOD= 1
##$DIGTYP= 9
##$DL= (0..7)
0 120 120 120 120 120 120 120 
##$DP= (0..7)
$$ [...]
##$SUBNAM2= <"">
##$SUBNAM3= <"">
##$SUBNAM4= <"">
##$SUBNAM5= <"">
##$SUBNAM6= <"">
##$SUBNAM7= <"">
##$SUBNAM8= <"">
##$SUBNAM9= <"">
##$SW= 18.0517328524113
##$SWIBOX= (0..15)
0 0 2 0 0 0 0 0 0 0 0 0 0 0 0 0 
##$SW_h= 3612.71676300578
##$TD= 16384
##$TD0= 1
##$TE= 0
##$TE2= 300
##$TE3= 300
##$TEG= 300
##$TL= (0..7)
0 120 120 120 120 120 120 120 
##$TP= (0..7)
150 150 150 150 150 150 150 150 
##$TP07= 0
##$TPNAME0= <>
##$TPNAME1= <>
##$TPNAME2= <>
##$TPNAME3= <>
##$TPNAME4= <>
##$TPNAME5= <>
##$TPNAME6= <>
##$TPNAME7= <>
##$TPOAL= (0..7)
0.5 0.5 0.5 0.5 0.5 0.5 0.5 0.5 
##$TPOFFS= (0..7)
0 0 0 0 0 0 0 0 
##$TUNHIN= 0
##$TUNHOUT= 0
##$TUNXOUT= 0
##$USERA1= <user>
##$USERA2= <user>
##$USERA3= <user>
##$USERA4= <user>
##$USERA5= <user>
##$V9= 5
##$VALIST= <valist>
##$VCLIST= <CCCCCCCCCCCCCCC>
##$VD= 0
##$VDLIST= <DDDDDDDDDDDDDDD>
##$VPLIST= <PPPPPPPPPPPPPPP>
##$VTLIST= <TTTTTTTTTTTTTTT>
##$WBST= 1024
##$WBSW= 4
##$XGAIN= (0..3)
0 0 0 0 
##$XL= 0
##$YL= 0
##$YMAX_a= 113744
##$YMIN_a= -68598
##$ZGOPTNS= <>
##$ZL1= 120
##$ZL2= 120
##$ZL3= 120
##$ZL4= 120
##$ABSF1= 0
##$ABSF2= 0
##$ABSG= 0
##$ABSL= 0
##$ALPHA= 0
##$AQORDER= 0
##$ASSFAC= 0
##$ASSFACI= 0
##$ASSFACX= 0
##$ASSWID= 0
##$AUNMP= <proc_1d>
##$AZFE= 0.1
##$AZFW= 0.1
##$BCFW= 0
##$BC_mod= 2
##$BYTORDP= 0
##$COROFFS= 0
##$CY= -3
##$DATMOD= 1
##$DC= 0
##$DFILT= <>
##$DTYPP= 0
##$F1P= 0
##$F2P= 0
##$FCOR= 1
##$FTSIZE= 16384
##$FT_mod= 6
##$GAMMA= 0
##$GB= 0
##$INTBC= 1
##$INTSCL= 3.241238e-09
##$ISEN= 128
##$LB= 0.25
##$LEV0= 0
##$LPBIN= 0
##$MAXI= 10000
##$MC2= 0
##$MEAN= 0
##$ME_mod= 0
##$MI= 1.114404
##$NCOEF= 0
##$NC_proc= -8
##$NLEV= 6
##$NOISF1= 3.799351
##$NOISF2= 2.8
##$NSP= 0
##$NTH_PI= 0
##$NZP= 0
##$OFFSET= 15.45601
##$PC= 1
##$PHC0= -5308.116
##$PHC1= 11.42193
##$PH_mod= 1
##$PKNL= yes
##$PPARMOD= 0
##$PSCAL= 0
##$PSIGN= 0
##$REVERSE= no
##$SF= 200.130013145815
##$SI= 16384
##$SIGF1= 3
##$SIGF2= 2
##$SINO= 0.751879
##$SIOLD= 32768
##$SREGLST= <19F.Aceton>
##$SSB= 0
##$STSI= 16384
##$STSR= 0
##$SW_p= 3612.71676300578
##$SYMM= 0
##$S_DEV= 0
##$TDeff= 16384
##$TDoff= 0
##$TI= <>
##$TILT= no
##$TM1= 0
##$TM2= 0
##$TOPLEV= 0
##$USERP1= <user>
##$USERP2= <user>
##$USERP3= <user>
##$USERP4= <user>
##$USERP5= <user>
##$WDW= 1
##$XDIM= 16384
##$YMAX_p= 451910501
##$YMIN_p= -3611559
$$ End of Bruker specific parameters
$$ ---------------------------------
##NTUPLES= NMR SPECTRUM
##VAR_NAME=  FREQUENCY,     SPECTRUM/REAL,   SPECTRUM/IMAG
##SYMBOL=    X,             R,               I
##VAR_TYPE=  INDEPENDENT,   DEPENDENT,       DEPENDENT
##VAR_FORM=  AFFN,          ASDF,            ASDF
##VAR_DIM=   16384,         16384,           16384
##UNITS=     HZ,            ARBITRARY UNITS, ARBITRARY UNITS
##FACTOR=    0.220516191357247, 1,           1
##FIRST=     3093.2114574257, 0,             0
##LAST=      -519.505305580083, 0,           0
##MIN=       -519.505305580083, -3611559,    0
##MAX=       3093.2114574257, 451910501,     0
$$ Real data points
##PAGE= N=1
##DATA TABLE= (X++(R..R)), XYDATA
$$ [...]
5186B896485j958269L23234P38437q37889k42312J94230K04981j091408L61523
5177E89012K301999P4679q70943j16089j040041p33874J359678k13879j283608
5168F6934K50588J988678J31957j038057q54199o86681P37732J345797p59972
5159A182777j512420J489229l95462r10883O62911n43991J02241P87949l91455
5150D70896N72432K68244n53095K04328j179341J94646J884308p93243j480426
5141d11251M59607J138684L62931O43270m1957p42514m97440J456365q78849o53362
5131H35484P40960o00503p22853P79770J278643l29465j34451r00964N50636J182493
5121B679750l42138j403595k56397j1469O68577O96027o78595j230670j68161
$$ y = [2896485, 938216, 1261450, 1999887, 1161998, 919686, 1113916, 1318897, 227489, 589012, 2891011, 2965690, 2094747, 1978658, 938617, 204743, 1564421, 1350542, 66934, 317522, 2306200, 2438157, 1400100, 545901, -140780, 596952, 1942749, 1182777, -329643, 1159586, 764124, -146759, 516152, -27839, 74402, 862351, 470896, 1043328, 1311572, 758477, 962805, -216536, -21890, 1862418, 1069175, -411251, 48356, 1187040, 1549971, 2193241, 2151284, 1408770, 911330, 2367695, 1488846, 835484, 1576444, 975941, 253088, 1032858, 2311501, 1982036, 1847585, 946621, 1497257, 2679750, 2337612, 934017, 677620, 666151, 1334728, 2030755, 1352160, 121490, -46671]
5112d6671R27151o4347M05682K7854l69599L63016j265544k89004J344776j721773
5102f88459K97497J968125o23907k53612J281441j623424j301516N48178R66583
5093E70906o0529N86356J32180J26721J92532p46871n19791m09708J230825Q98329
5083B000950q41917r43299O9009L62296J022012J3609K00235o91865O16315Q42704
5073B650049k87307k751784l87646J285848L49364l00505L15920l06376J92925
5064G60488J540798P75185j171727j514068q87698j99654P20066K09422J335974
5055A568786k47898j007866J288413L63582q64360l43498n50493k34819J287515
5046A259362Q05121k267093n77438O39883J513201J319620q69961l088545j75857
$$ y = [-46671, 880480, 816133, 1221815, 1249669, 880070, 1243086, -22458, -311462, 1033314, -688459, -390962, 1577163, 953256, 699644, 1981085, 357661, -943855, -395677, 570906, 510377, 1096733, 1228913, 1355634, 1548166, 801295, 281504, -128204, 1102621, 2000950, 1159033, 215734, 284743, 647039, 1669051, 1682660, 1882895, 1191030, 1807345, 2650049, 2362742, -389042, -776688, 509160, 858524, 558019, 873939, 567563, 760488, 2301286, 3076471, 1904744, 390676, -497022, -696676, 23390, 232812, 1568786, 1320888, 313022, 1601435, 1965017, 1100657, 757159, 206666, -28153, 1259362, 2064483, -202610, -780048, -140165, 1373036, 2692656, 1822695, -1265850, -1441707]
5037a441707O34633J524990j36727n01288p9720k50296J049177J45265m86243
5028D58084j344633K76383J217131J001015j359341j154394J089600L06864L11380
5019H02089R20359k56374m47493M53484l21640M51488K0048m62182m33310j011605
5009b85136J428430O58139m68420M6236M00283j02756J47708N03474j253954n22181
4999E51823Q7090K51135o59380j10106O78642p40994J099809J69684l91952J221570
4989B157321J012448j414800J633013o2168j432718j329229p7691j05021j62232
4980B18923K63223p27292L69800P66597R20827Q2646q03192p00897n09784J311625
4970A192476j274280k87036N27190L20232J035992J481357j588717j873619j96582
$$ y = [-1441707, -807074, 717916, 581189, 79901, 181, -250115, 799062, 944327, 458084, -886549, -610166, 606965, 1607980, 248639, -905755, 183845, 490709, 802089, 1722448, 1466074, 1018581, 1472065, 1150425, 1601913, 1621961, 1159779, 726469, -285136, 1143294, 1801433, 1333013, 1379249, 1779532, 1676776, 1824484, 2327958, 1074004, 551823, 638913, 890048, 230668, 120562, 799204, 58210, 1158019, 1327703, 935751, 2157321, 3169769, 1754969, 3387982, 3325814, 1893096, 563867, 486176, 381155, 218923, 482146, -245146, 124654, 891251, 1812078, 1894724, 1091532, 390635, -119149, 1192476, -81804, -368840, 158350, 478582, 1514574, 2995931, 1407214, -466405, -662987]
4961f62987J700286J975914k082523p31958Q1125J291649j038678O29158j49145
4952A012841j590149J288578J254267q31257j165902L04830Q58400K0817k13749
4943I38676J13877K22434j34983K1657l0190J5714j336451N45840K3743J09392
4933D89709J198686P90961q52919l79947J146286p01472n92955P45177P8593k040271
4923a18152J192116J207454k550184Q1298K705846Q4427j123124M09620j275936
4914F13365P67699J58011j3783p35264j452752J332693J117950j691325P78301
4905H74895O0081J71391K79515L20078j93800J38241l0649k20658l39549j05373
4895I54172r60350P23212J273185K92806R20661J3066l32917p60754m06342j001348
$$ y = [-662987, 1037299, 3013213, 930690, 198732, 279857, 1571506, 532828, 1161986, 1012841, -577308, 711270, 1965537, 1134280, -31622, 273208, 1131608, 1152425, 938676, 1052553, 1274987, 1140004, 1161661, 1131471, 1147185, -189266, 356574, 380317, 489709, 1688395, 2479356, 1626437, 1246490, 2392776, 1691304, 1098349, 1843526, 1922119, -118152, 1073964, 2281418, -268766, -187468, 2518378, 2602805, 1479681, 1889301, 613365, 1381064, 1539075, 1525292, 790028, -662724, 669969, 1787919, 96594, 874895, 934976, 1106367, 1385882, 1705960, 1512160, 1650401, 1619752, 1399094, 1059545, 954172, -6178, 717034, 1990219, 2283025, 3203686, 3216752, 2883835, 2123081, 1716739, 715391]
4885G15391J260078J336288n08798l02779j1616m99321K26673J157839J44057
4876C517812r15248L97503O61690j210245k12559K517075Q52315o0249q86927
4867D661167K69315L16783O90402q5367J66697p97830K25308j07174r58731P78219
4857E158789J140731Q60211m9376J037349J125501l99502J259976K923258J907493
4848A4964430K782471M210387L949711J0418235J4417998J3579085O952421p709665
4840F3565073j2529633j0549274j1924767p848572l817472l819711k993086j358119
4832H724439k188392j533814m13300N69382n93229j95129R15475M3802k130428
4823C198806m4252j33684m36305J836039O4884k27476N332n00377K62411r70464
$$ y = [715391, 1975469, 3311757, 2802959, 2500180, 2488564, 1989243, 2215916, 3373755, 3517812, 2602564, 3000067, 3661757, 2451512, 2238953, 4756028, 5608343, 5548094, 4661167, 4930482, 5247265, 5937667, 5852300, 6018997, 5221167, 5446475, 5339301, 4380570, 5158789, 6299520, 7159731, 7110355, 8147704, 9273205, 8873703, 10133679, 13056937, 14964430, 17746901, 21957288, 25906999, 36325234, 50743232, 64322317, 71274738, 63565073, 51035440, 40486166, 28561399, 20712827, 16895355, 13075644, 10082558, 8724439, 6536047, 5002233, 4588933, 5158315, 4565086, 4369957, 5285432, 5329234, 3198806, 3154554, 3020870, 2584565, 4420604, 4485488, 4258012, 4263344, 3762967, 4025378, 3054914]
4813C054914L2849R49726q58242o12530J520127J63698r0323j70099j227278j010736
4803A752106n36723Q22422l66820o51784j13124R55215N63803p33024l68365N27370
4793A851076J56831o68715J172310o43081k224366k19535L16280R59171R51177
4784A651148l0914m7768m5891r42468J536581j683751q10177K52519R5033j40710
4774a66398R93343m28906m54391Q89197J251312J81114j568377R1516o61827j372571
4764a245988J141183M58283p66755O01881J795539J82007k19872j244427m61761
4755B40090p63043P4908J362240Q01318o14040r72460K246019m47894j403086
4746E24052R10713l01754j452005J206107P42198j430391n36311J120420K50175
$$ y = [3054914, 3087763, 4037489, 3179247, 2566717, 4086844, 4250542, 4160219, 3990120, 2762842, 1752106, 1215383, 2037805, 1670985, 1019201, 906077, 1861292, 2425095, 1692071, 1323706, 1851076, 2007907, 1339192, 2511502, 1868421, -355945, -575480, -259200, 699971, 1651148, 1620234, 1572466, 1526575, 584107, 2120688, 436937, -373240, -120721, -25688, -166398, 826945, 398039, -56352, 832845, 2084157, 2265271, 696894, 788410, 126583, -1245988, -104805, 353478, -413277, 188604, 1984143, 2166150, 1946278, 701851, 240090, -522953, -448045, 914195, 1715513, 1101473, 129013, 2375032, 1927138, 524052, 1434765, 1133011, -318994, 887113, 1629311, 198920, -337391, 783029, 1033204]
4737A033204J69918N53262j176663o75859o625R50538R18964m36061J00111k58560
4727A172229j338767k95787J450510k47666j019377J398341L33705j000424k99489
4718A53275R39627M1161N48318j47828k11288n40141r05724m82586L63201Q03078
4708E61093l79000J968012k36869j695288M51612M32963p84154J412130L53250
4699B083749j848778k66966O46974O504M78819K40941n49453Q27790N99440j055471
4689A163549r04592R46757K59179p93641J646330j298407J48530J026645j97941
4680A996409q28869k16675J92780P82541o72792l64505N77877K94403L31258m9218
4670B043209m13932L18026o6003o04900j69142M00055M04295p04265j84453J104576
$$ y = [1033204, 1203122, 1756384, 579721, -96138, -102763, 847775, 1766739, 1330678, 1430789, 1172229, -166538, -462325, 988185, 740519, -278858, 1119483, 1453188, 452764, 153275, 1092902, 1134063, 1682381, 1534553, 1323265, 783124, -122600, -605186, -241985, 561093, 182093, 2150105, 1913236, 217948, 669560, 1102523, 318369, 1730499, 2083749, 234971, -31995, 614979, 621483, 1100302, 1341243, 791790, 1619580, 2219020, 1163549, 258957, 1205714, 1464893, 671252, 2317582, 1019175, 1167705, 2194350, 1996409, 1167540, 950865, 1143645, 1926186, 1253394, 888889, 1466766, 1761169, 2092427, 2043209, 1629277, 1947303, 1881300, 1276400, 1107258, 1507313, 1911608, 1207343, 1022890, 2127466]
4660B127466n6027J30710p40415J05359Q42647j015145J73166l85756l86713L8429
4650H33721J537023n41963k39158n91111J071321P33912M46258l54277k91424
4641B604302k65833m03262Q61252J67664J28490Q96654J068137P69394P64336
4632F591134l6373m84149R70015L200253M426984L611999J588412r13687j808576
4623A7146012l700028j709699K3420j853277j021975P14950P71742r93013N76557
4614I954689J609925p69152K21886L187224J963806L71831J029919M37678M33934
4605A8441740J408317K152030Q04530K227210L876475K279369m06901k698366
4597B8084404j03984J290855P71662K231361L458856J181154j614459k137049
$$ y = [2127466, 2071439, 2202149, 1461734, 1567093, 2409740, 1394595, 1567761, 1182005, 795292, 833721, 2370744, 1828781, 1589623, 998512, 2069833, 2803745, 3250003, 2895726, 2604302, 2338469, 1935207, 2796459, 2964123, 3092613, 3989267, 5057404, 5826798, 6591134, 6554761, 6070612, 7040627, 10240880, 14667864, 18279863, 19868275, 18954588, 17146012, 13445984, 11736285, 11759705, 9906428, 8884453, 9599403, 10371145, 9378132, 9954689, 11564614, 10795462, 11017348, 14204572, 16168378, 16540209, 17570128, 18007806, 18441740, 19850057, 22002087, 22806617, 25033827, 28910302, 31189671, 30782770, 28084404, 27980420, 29271275, 30042937, 32274298, 35733154, 36914308, 35299849, 33162800]
4589C3162800k515651k088536r16139O78825N19628j080571j199330j725856k302512
4580B2532658k513216k280487q85157n38089k065627j77134m66251j283176j260860
4571A1062661k029552j699085j050908j362268m33255k2505o62957p25336M13463
4562C490258K47027o04705j47044J038337j106246l74996M82225j773994j229816
4553B1046J717961M0537M0205L03702j08738n95878m01204P58513J250779k149552
4543H77371j342281J955039p0742O8615P22625Q4051n95964L05124l465j655773
4533C44600k187610K477569J453358j089202K54156J573122j530549n15360J472579
4524B252663L3622j905025J034677m87013j412610J589881K478684j933799J28870
$$ y = [33162800, 30647149, 28558613, 27642474, 28321299, 28840927, 27760356, 26561026, 24835170, 22532658, 20019442, 17738955, 16853798, 16315709, 14250082, 14072948, 13606697, 12323521, 11062661, 9033109, 7334024, 6283116, 4920848, 4487593, 4465088, 3802131, 3076795, 3490258, 3737285, 3132580, 2985536, 4023873, 2917627, 2542631, 3024856, 1250862, 21046, 1739007, 1779544, 1819749, 2123451, 2014713, 1418835, 1017631, 1776144, 3026923, 877371, -464910, 1490129, 1419387, 1488002, 2210627, 2294678, 1698714, 2003838, 2000373, 344600, -1843010, 634559, 2087917, 998715, 1252871, 2825993, 1295444, 780084, 2252663, 2286285, 381260, 1415937, 928924, -483686, 1106195, 3584879, 1651080, 1779950]
4515A779950R05566j204433j123468n73224N06990J622639J672642k97229R26537
4506D215970r70254J7168r58737n89038O42909J000951j436955o62376j25956
4497A133682J25187J149722l37641n55284j13810m7691m33526m37849j88439J59670
4487D54021L63988M95224J12534j29645R2740o8444n34232L92386L16174q30289
4477F64457n42827N22139J50568Q87563R38208l78543j388732J169116m45170
4468A576779j640420J103883k08564j104037J393678J104672j196804k89541Q3455
4459H23101J34862j295695p33885N24345J52338j45542J498609n24761r55266
4450e21894Q4260M0803r97986L79387M40116K72349P74014Q99464q11923j009625
$$ y = [1779950, 2685516, 1481083, 357615, -215609, 291381, 1914020, 3586662, 3289433, 4215970, 3245716, 3262884, 2304147, 1715109, 2358018, 3358969, 1922014, 1259638, 1133682, 1258869, 2408591, 2070950, 1515666, 1401856, 1354165, 920639, 482790, 294351, 454021, 818009, 1313233, 1425767, 1296122, 1388862, 1320418, 786186, 1178572, 1494746, 664457, 121630, 643769, 794337, 1681900, 2620108, 2241565, 852833, 2021949, 1576779, -63641, 1040242, 831678, -272359, 1121319, 2225991, 1029187, 739646, 823101, 957963, -337732, -1071617, -547272, -394934, -540476, 958133, 433372, -521894, -437634, -396831, -1394817, -1015430, -575314, -302965, 471049, 1370513, 558590, -451035]
4440d51035K62321l70902n74398J707138l56312q06927J450366R56532q88499
4431I28284o70664Q33506J24711k40288m90246l6043j87043Q75939J98465j082824
4421B53797r9682J721248o168j184767j231195K90309P94215J29807K42622p4138
4411H36048l30408o21852J74203j000526l04427J172679k41264m8684N11532N89292
4401G36593j320321o44255R78704M36775k43187J123598n11687j088973M65398
4392f7355j33928L89071Q53144K84655R12150j043669n66815K011666l03315j812234
4382E23370P87555J067002R26291m93636n37224O96840O32376m02828p99272n94715
4372A805759N52601N3619p72455j184293l77460J015511J199748j485980j683
$$ y = [-451035, -188714, -559616, -1134014, 573124, 216812, -590115, 860251, 1816783, 928284, 257620, 1091126, 1215837, 975549, 485303, 449260, 262217, 1138156, 1336621, 253797, 154115, 1875363, 1869195, 684428, -546767, -256458, 537757, 667564, 910186, 836048, 505640, -116212, 57991, -942535, -1246962, -74283, -315547, -364231, 147301, 736593, -583728, -1227983, -249279, 187496, -55691, 1067907, 556220, -532753, -67355, -201283, 187788, 1040932, 1325587, 2237737, 1194068, 627253, 2638919, 2335604, 523370, 1310925, 2377927, 3304218, 2810582, 2273358, 2970198, 3602574, 3199746, 2400474, 1805759, 2358360, 2411979, 1639524, 455231, 77771, 1093282, 2293030, 807050, 805367]
4363H05367O52656n78911o07124J17320M50212k52362o50369J191813l47246j688172
4353i06816N35056L32304q72410R29584K101685q57940j563030R29806O64340
4344A292579n61264o69829j73758K64685P51275l84974L38310N32522q47987J412974
4334A954533O07903j057204M69434k4560o22110Q886p08259R57832q62415J67106
4324H91146J220795J53817j383175Q61179K17844o33267q08760O61237n47353
4315F33463L7391K11413k31076n46272J389550p85l56034R9239j042554m08956
4305b14621J296776N48039N1038p32885L57712M82592j331903n49193O9042n82135
4295f05538J931111R47913r62664o93767l82927R10836N61837j414219p55171
$$ y = [805367, 1458023, 879112, 271988, 389308, 839520, 587158, -63211, 1128602, 781356, -906816, -371760, -39456, -911866, 17718, 2119403, 1261463, -301567, 628239, 1292579, 731315, 61486, -112272, 152413, 903688, 518714, 857024, 1389546, 541559, 1954533, 2562436, 1505232, 1974666, 1950106, 1327996, 1336882, 628623, 1586455, 724040, 891146, 2111941, 2265758, 882583, 1743762, 1961606, 1328339, 519579, 1180816, 633463, 670854, 882267, 651191, 104919, 1494469, 1493684, 1137650, 1236889, 194335, -214621, 1082155, 1630194, 1681232, 948347, 1306059, 1788651, 456748, -92445, -23403, -605538, 1325573, 2273486, 1310822, 617055, 234128, 1144964, 1706801, 292582, -462589]
4286d62589J115919L39011R5671q7483l26913N21575N15324q03471q56677N9651
4276A10018J167889M57803j395632K74660J583640n25882j640683K45759L88946
4267F66518j343768O73321J311490j412345l12247J672942K36877j216663n02314
4258b26189K1773l36077L06520O06390Q49152j167350k2378K05152O27952n34113
4248C30832L11781M5221M93310n63608M99631p38921k82818Q2923O96884p59517
4238A15718k89644O75525J75247k79733L48469l65984P19319m5337r61787p18785
4228f26992n78167M5393J078642P93500K7976K1018K93580R21538k96151j118757
4218E61580p70707k44435R17638J338525j201016j758907J377985J625347M6794
$$ y = [-462589, 653330, 992341, 1088012, 1000529, 673616, 1195191, 1710515, 907044, 50367, 110018, 1277907, 1735710, 340078, 614738, 2198378, 1672496, 31813, 277572, 666518, -677250, -3929, 1307561, -104784, -417031, 1255911, 1492788, 276125, -226189, -204416, -540493, -233973, 372417, 1221569, 54219, 31841, 236993, 864945, 330832, 642613, 687834, 1181144, 617536, 1117167, 378246, 95428, 178351, 875235, 115718, -173926, 501599, 676846, 397113, 745582, 379598, 1098917, 1053580, 91793, -626992, -1205159, -1159766, -81124, 712376, 740352, 761370, 1054950, 1976488, 1680337, 561580, -209127, -453562, 464076, 1802601, 601585, -1157322, 220663, 1846010, 1892804]
4209A892804k91533R6955j305732n1202J543453j566374j542781Q30368J158306
4200G64264l78428J874427l54611j907109p61152O92494l44579L65471O85124
4191F35901j98783l43046J35461P5312r67246q0050J183668j52777j294623J071065
4181F4882Q93686j647561k96243R38740R4476J589067J814115l371617j601503
4172a521958K455129L08987q68016k79476N82414L24045J59874O17186q32842
4163I45343k28866K101746j43306k968942M33909m610p94158M68748N71719l31854
4153D9729J101844K22601N41813r90331j116678J369176o77686p73977Q83032
4144F09523j381293q96746K629405Q07832j679793J93001l62560m20109M94188
$$ y = [1892804, 1601271, 1698226, 392494, 341292, 1884745, 318371, -1224410, -394042, 764264, 385836, 2260263, 1905652, -1457, -762609, -70115, -414694, -49223, 635901, 437118, 94072, 229533, 304845, -662401, -742451, 441217, 288440, -1006183, 64882, 958568, -688993, -985236, -46496, 47980, 1637047, 3451162, 79545, -1521958, 933171, 1242158, 374142, 94666, 677080, 1001125, 1160999, 1778185, 945343, 716477, 2818223, 2674917, -294025, 139884, 135274, -658884, -190136, 381583, 49729, 1151573, 1374174, 1915987, 925656, -191022, 1178154, 500468, -273509, 609523, -771770, -1668516, 960889, 1768721, 88928, 281929, -80631, -500740, -6552]
4135f552J409982k00579m08146J195147l23943j731549l16576Q79055L08025o81986
4125A22878l10498K065620L9010N9622p07710q08026k05184Q09406P43567j709209
4115I9476j971088J875694J449331M73092m38781j544398n70897J145172Q57266
4106A374867N04425j388831j476066M33549K527234L29520j681361k86348L70025
4097G07014O94271O27030K86519j087971j76604K587050K98442j167855R99197
4088C767093J246285J105610J975608L70212o41394j314033r20445j163987j163347
4079C261602j44545k90229j56521n33031L53532j493444n16154J040282L59100
4070A880592j099802L57501m79377M35636J254073q25969p64686m3745Q37006
$$ y = [-6552, 1403430, 1202851, 794705, 1989852, 1665909, -65640, -382216, 496839, 804864, 122878, -187620, 1878000, 1917010, 1976632, 1268922, 460896, 255712, 1065118, 1808685, 99476, -1871612, 4082, 1453413, 1926505, 1487724, -56674, -627571, 517601, 1374867, 1879292, 490461, -985605, -552056, 1975178, 2304698, 623337, 336989, 707014, 1401285, 2028315, 2314834, 1226863, 1050259, 3637309, 3935751, 2767896, 3767093, 5013378, 6118988, 8094596, 8464808, 7823414, 6509381, 5588936, 4424949, 3261602, 3117057, 2826828, 2670307, 2137276, 2490808, 997364, 481210, 1521492, 1880592, 780790, 1138291, 658914, 1094550, 2348623, 1522654, 757968, 714223, 1551229]
4061A551229m60804m47978n51578J288479P93861l5107j213764p70850J817558
4052A971046j86447r46908l96616J551659J20939M44805r2870j615106k364J088020
4042A936158r13091K11756m47222q1910O14888n58639O45498j69723j548540J23295
4032a87530O94632J379499j662352l40959P7336k90652J338660K5283k284987
4023a251070J85426K477246p93909L22808J23279O5817j29548J25245j42762o29344
4013C53188j20868J594800j143654j166451K254951J174083q27627k31363N79153
4004B466212J49535J62370o25779k116732o06671K019460J842368j866205o95793
3995G28765R85996L83473n36187R07656j226912n08775R84757k24993j577909
$$ y = [1551229, 1090425, 642447, 90869, 1379348, 2173209, 2138102, 924338, 153488, 1971046, 1784599, 837691, 441075, 1992734, 2113673, 2558478, 2465608, 850502, 848138, 1936158, 1023067, 1234823, 787601, 705691, 1320579, 761940, 1407438, 1237715, -310825, -187530, 507102, 1886601, 224249, -116710, -39374, -330026, 1008634, 1033917, -1251070, -1065644, 1411602, 617693, 940501, 1063780, 1129597, 1000049, 1125294, 982532, 353188, 232320, 1827120, 683466, -482985, 1771966, 2946049, 2118422, 1887059, 2466212, 2615747, 2778117, 2152338, 35606, -571065, 1448395, 3290763, 1424558, 728765, 1714761, 2098234, 1562047, 2469703, 1242791, 734016, 1718773, 1493780, -84129]
3986h4129o09794J205806m27326M63288J694359O80230n16867p0054j576075R78606
3976A738044J058383O9603Q51180L09133L263669L105351l65108k04522J327510
3967A1153243k014414k028321j611233j181462p11153m17736r46121j200018J131573
3958B174358J817175r94767k113968Q32891J561818J699666N1906j942782q46211
3949B240086K71354L10807j258117q2859K138519O99900O72809J108458J106060
3940G207017J914523K810043J1619k749462k359381j854537k109508j578746N29286
3931A820854L85777k17832l89456J9335j463691j463628O31748J387939m6295
3922F64751n22658J052501r3586p45043J07963R71347j336108N43362P85073p83606
$$ y = [-84129, -693923, 511883, 84557, 547845, 2242204, 2922434, 2405567, 2335513, 759438, 1738044, 2796427, 2866030, 3717210, 4026343, 7290012, 10395363, 10030255, 9825733, 11153243, 9138829, 7110508, 5499275, 4317813, 3606660, 3188924, 2242803, 1042785, 2174358, 3991533, 2996766, 882798, 1715689, 3277507, 4977173, 5029079, 3086297, 2240086, 2511440, 2822247, 1564130, 1481271, 3619790, 4319690, 4992499, 6100957, 7207017, 9121540, 11931583, 11943202, 9193740, 6834359, 4979822, 2870314, 1291568, 1820854, 2206631, 1988799, 1599343, 1618678, 154987, -1308641, -676893, 711046, 664751, 142093, 1194594, 1101008, 355965, 463928, 1435275, 99167, 642529, 1427602, 643996]
3912F43996k85435N95334N81500R14222J536136j655882j422380P35700M2506
3903A685697j273199j05826L98307q8687J954886R39955k575594j064314K038102
3894A909327J25514l62915j200627q33862R26214m01621K02484L10605L05887
3885I81006K05654P60262j047860o00726P57289N10242q53329K43652O52196m87577
3875A120809j066280J64447K329595J125785m76550j266440K08794L65713l62734
3866B143139K51001J29549R93464R49205j420044q88719N281P82489O66889K07854
3856C820108r52951P92630r91310r60140j012346J330140J545339j09655k804538
3847F57277j98043j88309J026627J411711j379185r09435J152349l20875j838537
$$ y = [643996, 358561, 953895, 1535395, 2449617, 3985753, 2329871, 907491, 1643191, 1685697, 412498, 306672, 704979, 616292, 2571178, 3511133, 935539, -128775, 1909327, 2034841, 1671926, 471299, -362563, 563651, 162030, 364514, 675119, 981006, 1186660, 1946922, 899062, 298336, 1055625, 1565867, 712538, 956190, 1608386, 1120809, 54529, 218976, 2548571, 3674356, 3197806, 1931366, 2140160, 2505873, 2143139, 2394140, 2523689, 3517153, 4466358, 3046314, 2157595, 2162876, 2945365, 3612254, 3820108, 2867157, 3659787, 2668477, 1708337, 695991, 2026131, 3571470, 3461815, 657277, 459234, 270925, 1297552, 2709263, 1330078, 420643, 1572992, 1252117, -586420]
3838e86420k82553P76669O91024l82533R68073n1625q99844P39077L87494j01803
3828A257559o88914j062687M03856J038554J150388m08667j142098K2308J187954
3819A758253M12874L44280j429906L2761K020134P3662k201140j94218m98113
3810C18587J91539J891233m48660j832284M22058O24166j299655k73049J598109
3801A192044L12677r99399p7617l46645j294369R090J036565k93388j157359K050179
3791D31778J08494j480948J034392P99171r03279R52421R07890j295878j041175
3782d87134R42225l75794n6168O55234O57532l57526R44900k48150j06982n11159
3772A056978R18572L45072J8487p47611j027486q65318J452391R7848M2070R40214
$$ y = [-586420, -868973, -92304, 598720, 216187, 1184260, 1132635, 232791, 971868, 1359362, 1257559, 568645, -494042, -90186, 948368, 2098756, 1690089, 547991, 570299, 1758253, 2171127, 2515407, 1085501, 1118262, 3138396, 3212058, 1010918, 816700, 318587, 510126, 2401359, 1952699, 120415, 542473, 1166639, -133016, -406065, 1192044, 1504721, 505322, 427705, 81060, -1213309, -1204219, -167654, -461042, -1618401, 431778, 540272, -940676, 93716, 892887, -10392, 942029, 1849919, 554041, -487134, 455091, 79297, 23129, 678363, 1335895, 978369, 1923269, 1675119, 1568137, 1056978, 1975550, 2320622, 2339109, 1591498, 564012, -301306, 1151085, 1248933, 1291003, 2231217]
3762B231217j005500L90523j76876n16366n3557R15174j254733l26517m11280
3753b07915l4911J53546J91822J35948l04328K69521P15188J37873j01684o28755
3743C26305l64422J155624N31437j094001p81897j635387P298O29293K156530
3734I30780J648574q39801q26628J015534l52700j545135r3341K13434m05460
3725b54743K26004J702769m91910r37944J204060M89903p70236o17899L98068
3716I48072J31100P7236k8823q3184o78323o60195K80819n54589J13608K102646
3706A648367Q57527o15307L98627r76983j170403l22341O8584k32391J226285
3697H81965J212253j019563k26512R40143l34m04389n09529o94591M93882O08829
$$ y = [2231217, 1225717, 1616240, 1439364, 922998, 869441, 1784615, 529882, 203365, -207915, -242826, -89280, 102542, 238490, -65838, 203683, 918871, 1056744, 955060, 326305, -38117, 1117507, 1648944, 554943, -226954, -1862341, -1855043, -1225750, 930780, 2579354, 1739553, 912925, 1928459, 1575759, 30624, -62717, 150717, -254743, -28739, 1674030, 1182120, 244176, 1448236, 1938139, 1167903, 550004, 948072, 1079172, 1156408, 1127585, 1044401, 366078, -294117, -13298, -567887, -454279, 1648367, 2505894, 1890587, 2289214, 1312231, 141828, -180513, -111929, -344320, 881965, 2094218, 1074655, 848143, 1788286, 1787952, 1383563, 874034, 179443, 673325, 1282154]
3687A282154P47665m04810q59893N36566N51584K4239M7694K45374l18400j020597
3677H31576L48956J18987J54927N49047N12113j530352M60233K9692o34385L12931
3667A153725L47132n00885M54280n21372o82481p26856J83475J130367J559434
3658B396819n59499j052749n88049k61128m56441R40038J032040l29465q97074
3649B24492K14771P38471l06745N8916l16638Q00077O17559J42163l50233p55241
3639A067592l30014J194711J29193n17658n20141O51396R8067o18936R34702L36493
3629B425405m11882L89620o74024m95441k0062P9330j410334k4661J292691J529670
3619B680312j348178q95223L31358J363199n53570k128943n34927J984256K05426
$$ y = [1282154, 2029819, 1625009, 765116, 1301682, 1853266, 1877505, 1925199, 2170573, 1852173, 831576, 1180532, 1299519, 1454446, 2003493, 2515606, 985254, 1445487, 1475179, 840794, 1153725, 1500857, 999972, 1454252, 932880, 250399, -476457, -292982, 837385, 2396819, 1837320, 784571, 196522, -64606, -521047, 418991, 1451031, 1121566, 224492, 439263, 1177734, 870989, 929905, 613267, 1413344, 2030903, 2173066, 1822833, 1067592, 737578, 1932289, 2061482, 1543824, 1023683, 1675079, 1773146, 1154210, 2088912, 2425405, 2013523, 2403143, 1729119, 1233678, 1213616, 1292946, -117388, -142049, 1150642, 2680312, 1332134, 436911, 768269, 2131468, 1577898, -551045, -1085972, 898284, 1103710]
3610A103710O5221K49061j176392m29648J439760Q69258o58951q06916O02834
3601A257937K68259j252158M37292J300491m28410o88693O81227K40738j85581
3592A631102P57091k50317j387383R70152J173806l47356l92057p06123q4967
3583A363948J02673j86634R77056M69625j135641K4944N49405O47157p7088j745277
3573I90168k3659M61636K41722Q87907L18231j365341J21105O0034L87051K01654
3563B280508k65544l59636J90129R5614j45406P28897K12043K24684L35842j086857
3553B210274K71595N8164j046975J027162K110144j296380j165016J093265N67606
3544C829839n5987j555080p11354J287171K257537q75051j361754m09843L66659
$$ y = [1103710, 1168931, 1417992, 241600, -188048, 1251712, 2120970, 1462019, 655103, 1257937, 1526196, 274038, 711330, 2011821, 1583411, 894718, 1575945, 1816683, 1631102, 2388193, 2137876, 750493, 1720645, 2894451, 2547095, 2155038, 1448915, 1363948, 1466621, 1279987, 2257043, 2726668, 1591027, 1615971, 2165376, 2812533, 2735445, 990168, 966509, 1428145, 1669867, 2557774, 2876005, 1510664, 1631769, 1691803, 2078854, 2280508, 2014964, 1655328, 1845457, 1941071, 1795665, 2524562, 2736605, 2961289, 3297131, 2210274, 2481869, 2540033, 1493058, 2520220, 4630364, 3333984, 2168968, 3262233, 3829839, 3773852, 2218772, 1507418, 2794589, 5052126, 4177075, 2815321, 2405478, 2772137]
3535B772137R70695J371211n02930j216493P5137k01867M89197k38229k69589
3526C249269O63415j30066L73588R33052K23945j173169J82015O16779n74177
3517D364651n58487J140405L41876j19262J679010J90065o87842M6248P54245
3508G150909j476644M95045P26426J419526j83867j67494J685771J34373p98887
3499H985158r11934N96313P11146J9186K16902R98468Q13843J226798l74609n85904
3489A1695367J027441J050762J323873K01341N93455J270306m0460l26366q36293
3480A5959426j067910q20027o33006j430691k200469m34180j222502m72183o47014
3471G031444J00338j186253j17853L26108j28514k164300m88495m2767J086924
$$ y = [2772137, 3742832, 5114043, 4611113, 3394620, 3469757, 3267890, 3757087, 3518858, 3249269, 3912684, 3782618, 4156206, 5089258, 5313203, 4140034, 4322049, 4938828, 4364651, 3806164, 4946569, 5288445, 5169183, 6848193, 7038258, 6350416, 6396664, 7150909, 5674265, 6169310, 6895736, 8315262, 8131395, 7963901, 9649672, 9784045, 8985158, 8073224, 8669537, 9380683, 9399869, 9616771, 10615239, 11429082, 12655880, 12281271, 11695367, 12722808, 13773570, 15097443, 15298784, 15892239, 17162545, 17122085, 16795719, 15959426, 14891516, 14071489, 13438483, 12007792, 9807323, 9373143, 8150641, 7678458, 7031444, 7131782, 5945529, 5827676, 6153784, 6025270, 3860970, 3372475, 3329708, 4416632]
3462D416632Q80571j43771o46207j214367J168057K56184j828695j503972J334901
3453B719333N86037O10938l57173K88218j184535o04916N97035K35872r19569
3444A971240Q11975o29548K12551P35296r68130j186005J043704N90452J23792
3435B705327j038890q6317j74857M9151M48201K57584j294322J322195Q63222
3426C051294j679473j115687k9375J435817O41826j33829P34658M22944k248318
3417A079857N87282M69411j09067r52365M85951k09688j74641J899725J505928
3408D582393l035228q54928K340494j659157q00743J191873k29247k84178N56199
3399A807478P2613p19586J064386N03265j899453L128J640811P25282j869760
$$ y = [4416632, 5297203, 5153432, 4507225, 3292858, 4460915, 4717099, 2888404, 1384432, 2719333, 3305370, 3916308, 3559135, 3847353, 2662818, 2057902, 2654937, 2890809, 1971240, 2783215, 2153667, 2366218, 3101514, 2133384, 947379, 1991083, 2581535, 2705327, 1666437, 1580120, 1405263, 1454414, 1902615, 2160199, 865877, 2188072, 3051294, 1371821, 256134, 226759, 1662576, 2304402, 2170573, 2905231, 3328175, 1079857, 1667139, 2136550, 2027483, 1075118, 1561069, 1351381, 1176740, 3076465, 4582393, 1547165, 692237, 3032731, 1373574, 572831, 1764704, 1535457, 1251279, 1807478, 1880091, 1160505, 2224891, 2728156, 828703, 831831, 2472642, 3197924, 1328164]
3390A328164j37502L72345P77741Q52379J01046k685207r08409K273354R33724
3381B907635j328508N37922P31947j122719K43190p44123p8851L50365J336165
3372B833023l95148j075208K77789N83916J02948o96174P56738L71354o48169
3363B111069o544q25467j43161K17389J560227n19648L43085l97096Q02844k73535
3353B869163p67449p01463Q17947r97381p3857R08836j084617L49047j88803l51515
3343G79908P7924J396858l96481n45580K34270L28002o93692o24285J787673P90946
3333C135543j428554j6579p13917n26141Q51396L5873L64378M11198L14144J319683
3323C747024j696462j020132M39893N00437j098412k93203J154343o51680n38865
$$ y = [1328164, 1190662, 1563007, 2340748, 3193127, 3294173, 608966, -299443, 1973911, 2907635, 1579127, 2117049, 2848996, 1726277, 1969467, 1225344, 1146493, 1496858, 2833023, 2437875, 1362667, 1640456, 2224372, 2327320, 1631146, 2387884, 2759238, 2111069, 2104525, 1279058, 1135897, 1353286, 2913513, 2393865, 2736950, 2339854, 3142698, 2869163, 2101714, 1400251, 2218198, 1220817, 1146960, 2055796, 971179, 1320226, 1131423, 779908, 857832, 2254690, 1858209, 1312629, 1546899, 1874901, 1181209, 556924, 2344597, 3135543, 1706989, 1690410, 976493, 450352, 1301748, 1337621, 1701999, 2113197, 2427341, 3747024, 2050562, 1030430, 1470323, 1970760, 872348, 579145, 1733488, 1081808, 542943]
3314E42943K09633J416600o94399L78866K42298j211537r85309J490753M67302
3305A857150p40919J76894J43362n09514l24445J731229o81734r49412m4819O62632
3295A320424R82962N24258J85131j153452j121329M76489L5762j250934M30177
3286D29488K071025m85765J530173M68389q22634j923305j27866l62948P45777
3277A522334N5079l59069j126402J060673J344550n58043l9065J619996j75920
3268C344133j776013k8146r34489N8452Q89479N84306J125238n97688N83421J455860
3258D704553j382133n09010K207383J398783j678915j36371R97788O52619P65521
3249G020218J664743o25439L05747K110764K014896j377080j750243M26274k97250
$$ y = [542943, 752576, 2169176, 1474777, 1853643, 2095941, 884404, -100905, 1389848, 1857150, 1116231, 1293125, 1436487, 926973, 602528, 2333757, 1652023, 702611, 657792, 1320424, 2303386, 2827644, 3012775, 1859323, 737994, 1214483, 1250245, -689, 429488, 2500513, 2014748, 3544921, 4013310, 3190676, 1267371, 1139505, 776557, 1522334, 1577413, 1218344, 91942, 1152615, 2497165, 1939122, 1900057, 3520053, 3344133, 1568120, 1539974, 605485, 663937, 1553416, 2137722, 3262960, 2665272, 3248693, 4704553, 3322420, 2813410, 5020793, 6419576, 4740661, 4604290, 5602078, 6254697, 7020218, 8684961, 8059522, 8365269, 10476033, 12490929, 11113849, 9363606, 9789880, 9492630]
3240I492630J094801p45030j262935K35681L4583L72592q46315j741244n71762
3231F063001M69931J84168j193785j479533O54907K193615L36636j069999K03264
3222F362205K51716R2655j73696L32299n58081J627575L759023K184967j64374
3213A3714289P92565K5908J248477J705120J260469Q12184J565632L42121j2251
3204B1454514j491852j847637j007307j136064j091422q54011j978097j057140
3196A0990984k136117j20439K27359O0332O9766j68062j213041q40903j6161J26767
3186F980485J089008r33028J165935O66895n14396o78541L67219p38896K163033
3177I567714J575055O47049O07289M79289J337L71597m26659N43876R34848n04795
$$ y = [9492630, 10587431, 9842401, 8579466, 8815147, 8849730, 9222322, 8376007, 6634763, 6063001, 6532932, 6717100, 5523315, 4043782, 4698689, 6892304, 7228940, 6158941, 6362205, 6613921, 6706576, 6532880, 6865179, 6307098, 7934673, 11693696, 13878663, 13714289, 14506854, 14532762, 15781239, 17486359, 18746828, 19559012, 21124644, 21466765, 21454514, 19962662, 18115025, 17107718, 15971654, 14880232, 14026221, 12048124, 10990984, 8854867, 8734428, 8961787, 9022119, 9091885, 8923823, 7710782, 6869879, 6853718, 6980485, 8069493, 7136465, 8302400, 8969295, 8454899, 7776358, 8143577, 7404681, 9567714, 11142769, 11789818, 12397107, 12876396, 12877733, 13249330, 12822671, 13366547, 14301395, 13796600]
3167A3796600j205491r86577j509705j135800n2185L12640K78998O11069k63085
3158I846464j174729n87260P4053k4428r92002N39980o6243m37979o67486P64148
3148G274518p95665p9326J516975j351878j800347m64162k02709O53928L54185
3139E105519p16401l37399m5360p68561l40475J44925l95629j01697Q86304P15585
3129D146811j412877k04796J021176M54949q06896l64392n86191m22760j038250
3120G86774R15748J017527n545J67513o69874j074253R78061O11493n97764M26537
3110B556217o8801m99826K49672K38460J4533O23512J84674j67269n89471m32950
3100B108751n52776K86730K9648R40461K55870j229570p45225J101824j553231
$$ y = [13796600, 12591109, 11604532, 10094827, 8959027, 8906842, 9219482, 9498480, 10109549, 9846464, 8671735, 8084475, 8158528, 8134100, 7142098, 7682078, 7615835, 7177856, 6510370, 7274518, 6478853, 6399527, 7916502, 6564624, 4764277, 4300115, 4097406, 4751334, 5105519, 4389118, 4051719, 4006359, 3237798, 2897323, 3042248, 2646619, 2544922, 3431226, 4146811, 2733934, 2529138, 3550314, 4005263, 3198367, 2833975, 2247784, 1825024, 786774, 1702522, 2720049, 2714504, 2882017, 2212143, 1137890, 2115951, 2727444, 2129680, 2556217, 2487416, 1987590, 2237262, 2475722, 2490255, 3113767, 3298441, 3131172, 2541701, 2108751, 1555975, 1842705, 1872353, 2812814, 3068684, 1839114, 1093889, 2195713, 642482]
3091F42482K82038P20153q23455Q57787m18850j061789J183174K65847j11407
3082A535980L86032k367188l78430J653663o10807o26407L90923o15591J088853
3073D57028J055245l94605K73334L3344n68412l62262j229276O88244J035286
3064I87926q11422m78242J771000r6685j053308J13072O97928J7701O98571K06517
3054B053058j634335N1841m80350j84728K45324M12497J414475o32380r70556
3045B74846m4888P32305M30184m90259n73355l74553K1597P5430L07332K34187
3035E92826O13572j01696r48628o30054J113746K7618k13831m43099K59633o8217
3025B01870j045747J167039J5674k6265k53420l45850M15497R11379j066709j14237
$$ y = [642482, 924520, 1644673, 821218, 1679005, 1260155, 198366, 1381540, 1647387, 1535980, 1922012, -445176, -823606, 830057, 219250, -407157, -16234, -631825, 457028, 1512273, 1117668, 1391002, 1424346, 855934, 493672, -735604, -47360, 987926, 176504, -301738, 1469262, 1372577, 319269, 432341, 1130269, 1147970, 1846541, 2053058, 418723, 470564, -9786, -194514, 50810, 463307, 1877782, 1245402, 274846, 229958, 962263, 1392447, 902188, 328833, -45720, -24123, 51307, 358639, 592826, 1206398, 1104702, 156074, -473980, 639766, 667384, 453553, 10454, 270087, 201870, -843877, 323162, 338836, 312571, 59151, -286699, 128798, 1040177, -26532, -140769]
3015a40769l4132P46919k00086p55770j094434J17375K467857O22085j489226
3006B39819j76414Q3134j55769J52126q55999L22376Q34949J75028l55573j02302
2996A61375O2441K92235j49133q2093j66772l51811n66563O87037J130780m76773
2986E40723o02731L7602r81078Q38289O62358l28391k41165J417575o62422j157939
2976d77179l54466k70371j686J077061N43607L24314r49095M36925L05571o37050
2966b369o31802L12622K7671M05499N77683J12907k05024L37617N13209j411063
2956C6950j935219O17608J361001M75221L92092J67000m77358p72L82631j108372
2946h9218m50865J245418K71952p27483o01700q19295J344200P10437j51013r0909
$$ y = [-140769, -174901, 572018, 371932, -383838, -1478272, -1360897, 1106960, 1729045, 239819, 63405, 146539, -9230, 142896, -713103, -390727, 444222, 619250, 263677, 161375, 223816, 516051, 366918, 284825, 118053, -233758, -800321, -113284, 1017496, 540723, -62008, -24406, -1005484, -167195, 495163, 166772, -74393, 1343182, 680760, -477179, -831645, -1102016, -1103702, -26641, 516966, 841280, -107815, 329110, 634681, -2369, -634171, -321549, -293878, 111621, 689304, 802211, 597187, 934804, 1448013, 36950, -1898269, -1280661, 80340, 555561, 947653, 1114653, 637295, 636523, 1019154, -89218, -540083, 705335, 977287, 249804, -351896, -1171191, 173009, 883446, 732433, 641524]
2936F41524J393269j035119k177562j147573J959736J376108N80376j29701j264963
2927A96095j352941M82660J029521J32002q84546J011875K181108j258926k062612
2918e25764K43501k03076J261401J504852n21338k094271O44301P88347n7042
2909A040911l46688Q24448R19522q33191k14551q50049M8191M35490J72650J25951
2899A322684n82493j46820J080690k01366k32475L52383N63696j60891p98519
2890A196889k94709K05305L28214Q89814n13390O75978J543350p94623k412534
2881H24294J092536o2118k9490P60576J068924o76999k47738p19368j0442P72510
2871B772685P3743K40376M69538j239636N66296R11081j033938O02464J006500
$$ y = [641524, 2034793, 999674, -1177888, -2325461, -365725, 1010383, 1590759, 1461058, 196095, -1156846, -674186, 355335, 487337, -397209, 614666, 2795774, 1536848, -525764, -282263, -485339, 776062, 2280914, 1759576, -334695, 309606, 1097953, 1040911, 694223, 1518671, 2438193, 1605002, 1390451, 540402, 588593, 1024083, 1196733, 1322684, 740191, 593371, 1674061, 1472695, 1240220, 1592603, 2156299, 1995408, 1196889, 902180, 1107485, 1435699, 2325513, 1812123, 2488101, 4031451, 3236828, 824294, 1916830, 1854712, 1825222, 2585798, 3654722, 2977723, 2729985, 2010617, 2000175, 2772685, 2846428, 3086804, 3556342, 2316706, 2883002, 3794083, 2760145, 3362609, 4369109]
2862D369109N74314j191412l23159N12487J35978J369592J441154p13656o30012
2853E544395o66003J010446k26866j487024R97783J915420k009668j612463J470177
2844D936197L11182j344986J78974J122158j659528p61621Q55809K11054o37764
2835C211475K111082P63493r60471p40807k88472M52729k92659J5260R86284J78401
2825E436315j78340J617711j256334Q96084K491521o80276j231428R00344l87221
2816G608376j130849j08024p71301p15213J886417O38065j447502j713118J373174
2807E620025j330484j293688Q42120J035164j18496J341923r80048p41513q84136
2798C490867N4664J360113r16032p00145R86347M6468j734151K16432O72278O22885
$$ y = [4369109, 4943423, 3752011, 3428852, 3941339, 4077317, 5446909, 6888063, 6174407, 5544395, 4878392, 5888838, 5661972, 4174948, 5172731, 7088151, 5078483, 3466020, 4936197, 5247379, 3902393, 4081367, 5203525, 3543997, 2782376, 3638185, 3849239, 3211475, 5322557, 6086050, 5125579, 4384772, 4096300, 4549029, 4256370, 4271630, 5257914, 5436315, 5257975, 6875686, 5619352, 6515436, 9006957, 8326681, 7095253, 7995597, 7608376, 6477527, 6369503, 5598202, 4882989, 6769406, 7407471, 5959969, 4246851, 5620025, 4289541, 2995853, 3837973, 4873137, 4754641, 6096564, 5116516, 4375003, 3490867, 3545531, 4905644, 3989612, 3289467, 4275814, 4322282, 2588131, 2804563, 3476841, 4099726]
2788D099726J960989P1961k231780N71026Q06129j405010o53534J560267L55287
2779E135061J85386j132947k774245p80661K426551k71037R65132K73823j863088
2770B163975j04502R07230j33558o61657J096467K99009q69765l54376L02873
2761B645696j301421J365283O58763j001597J79532O02122k077405n7246J097278
2752B111005l13193R9775P66208L74224p33895m81108O77034L10786j469475q74144
2742D67217o62427R16344K1128O23897J70858n3811j91382P52347j436634m27108
2732A80429M20137J20334q66913Q83723o05938P72805K78291P9966M16578q77458
2722H01954j790272J784032R754n57186M24733J066819r27998j367292Q80453
$$ y = [4099726, 6060715, 6132676, 3900896, 4471922, 5278051, 3873041, 3219507, 4779774, 5135061, 5320447, 4187500, 1413255, 632594, 3059145, 2788108, 3753240, 4027063, 2163975, 2059473, 2966703, 2833145, 2171488, 3267955, 3566964, 2697199, 2342823, 2645696, 1344275, 2709558, 3368321, 2366724, 2546256, 3148378, 1070973, 1013727, 2111005, 1797812, 1897587, 2663795, 3038019, 2304124, 1823016, 2500050, 2810836, 1341361, 467217, -195210, 721134, 742262, 1366159, 1537017, 1483206, 1291824, 2044171, 607537, 180429, 600566, 720900, -146013, 737710, 131772, 904577, 1182868, 1262834, 1679412, 801954, -988318, 795714, 805468, 248282, 673015, 1739834, 811836, -555456, 324997]
2713C24997K39829k59219k46448j82710Q83398P84868p17851k86874k67510J75850
2703D48330K72468k12592o81635J23084M59089M76284L94295n06685j201190p5933
2693e04485R52653k25909q8572J21676j43441Q57579q10472k09959R09809j23073
2683G35806n80996l50326J36087P580K62675K46303O3852R3319j73534L12513
2673G53279j95909j109288l74866J390659Q88186o99119j600169J051390K81119
2664C85282M32814m06021p35332o31646J102622O98574k81834k24945R65921j047631
2654B57804l42442j64493p43384J94804Q16317n03538O21252L05514j01798J59492
2644D99528p67427m40054J306834M51329m31075n09820n45504P98862K71469j110554
$$ y = [324997, 564826, 305607, 59159, -123551, 759847, 1544715, 826864, 539990, 272480, 448330, 720798, 508206, -173429, -50345, 408744, 885028, 1279323, 772638, -428552, -504485, 448168, 222259, 133687, 255363, 111922, 969501, 159029, -50930, 858879, 735806, 154810, -195516, -59429, -51849, 210826, 457129, 520981, 614300, 440766, 753279, 557370, -551918, -926784, 463875, 1352061, 652942, -947227, 104163, 385282, 818096, 412075, -323257, -954903, 147719, 846293, 564459, 339514, 1305435, 257804, -84638, -249131, -992515, -797711, 18606, -484932, 136320, 441834, 340036, 499528, -267899, -707953, 598881, 1050210, 619135, 109315, -436189, 362673, 634142, -476412]
2634d76412O38278L29914l85759J503660P80834o32192J02944j746514p0332J548430
2624A592851R9565J85838O32712K16741O3079n78876r0348j262358O8413J251446
2614B179063N29100k036941j590407M26556L66154J01144Q56020q51784P94893
2605G73798J820618j547102k289526l57162M46175J97402J047000O27295o3727
2596F54771n81841o48629l37190P69234p16105R24280J83428P4885M03066M57419
2586A183318j747407n28899J234436K403389q57695N27695j781328l57351L17327
2577C93485p70904K99943J577748J021100p36739p46615M98395M91470l58368
2568A669515j137568J40500J644328j358166j064500N54024m33280K98413J108984
$$ y = [-476412, 161866, 491780, 106021, 1609681, 2390515, 1758323, 1861267, 114753, 44421, 1592851, 1692416, 1878254, 2510966, 2727707, 2790786, 2211910, 2121562, 859204, 927617, 2179063, 2708163, 671222, -919185, -492629, -126475, -25331, 830689, -21095, 773798, 2594416, 1047314, -1242212, -1599374, -1153199, -955797, 91203, 718498, 654771, 72930, -575699, -912889, -143655, -859760, 64520, 247948, 322833, 725899, 1183318, -564089, -1092988, 141448, 2544837, 1687142, 2214837, 433509, 76158, 393485, -377419, -77476, 1500272, 2521372, 1784633, 1038018, 1536413, 2027883, 1669515, 531947, 672447, 2316775, 958609, -105891, 448133, 14853, 313266, 1422250]
2559A422250j049870n32272J307663M98780j526969q20903Q91452M66420j801383
2550a144832K23707J067148o66995J783195J221848j899365J32976R50623p53410
2541I14895m48340n98205J441581L2553l93537J219096O35238j091074k69613
2532A442594n38084j47164Q91535m40074j037218J944354J828242j064845j386101
2523A493239j5395n52200k44682J333074j336442K86772M79631q40883k98329
2514C04785J739037n85969O97653M03262q20455j559801R5140J50451M17050L64903
2504A206056P68483l28055M90185J087070q15310o40850m2051p40239L04760J130088
2494B420137o36027p64119N35541J969621p83775j495009P25470N11272j084262
$$ y = [1422250, 372380, -159892, 1147771, 1646551, 119582, -701321, 190131, 656551, -1144832, -921125, 146023, -520972, 1262223, 2484071, 584706, 717682, 1668305, 914895, 466555, -131650, 1309931, 1342484, 948947, 2168043, 2803281, 1712207, 1442594, 904510, 757346, 1648881, 1208807, 171589, 2115943, 3944185, 2879340, 1493239, 1477844, 925644, 680962, 2014036, 677594, 964366, 1443997, 603114, 304785, 2043822, 1457853, 2155506, 2558768, 1738313, 178512, 273652, 424103, 841153, 1206056, 1974539, 1646484, 2136669, 3223739, 2408429, 1767579, 1725528, 985289, 1290049, 2420137, 1784110, 1019991, 1555532, 3525153, 2741378, 1246369, 1971839, 2483111, 1398849]
2485A398849N68192o30508K08272n30942k16109J806632O82749o35112L48750
2476C000773j974698r46980K040020m2940j560287J520853m36585l63734R0286
2467A326708P28169J118838L33183j412312N07409k77670r20001J57072J28434
2458A689830Q30031J6342J879374o26927j595382Q4508J987821j0896j203391
2449C051310o74914j35118O6747P55337R14693j518188O87263K064861j117594
2440D094397m81159M25480n66818o99417O78750M28276Q31800j280396J383114
2431D814027N98105q89022n69195J03180J88610L02213O35454M27617r91329q30751
2421C788909L22616m61683L13143J246862j75659k24955m2988k41150k95738L99955
$$ y = [1398849, 1967041, 1336533, 1544805, 1013863, 797754, 2604386, 3287135, 2652023, 3000773, 1026075, 79095, 2119115, 2076175, 515888, 2036741, 1600156, 1236422, 1326708, 2054877, 3173715, 3506898, 2094586, 2601995, 2324325, 1404324, 1561396, 1689830, 2519861, 2536203, 4415577, 3788650, 2193268, 2277776, 4265597, 4254701, 3051310, 2376396, 2241278, 2308025, 3063362, 3978055, 2459867, 3147130, 5211991, 4094397, 3613238, 4038718, 3471900, 2772483, 3451233, 3879509, 4711309, 3430913, 4814027, 5412132, 4523110, 3953915, 4057095, 4245705, 4547918, 5183372, 5610989, 4619660, 3788909, 4111525, 3649842, 3962985, 5209847, 5034188, 4809233, 4766245, 4525095, 4229357, 4629312]
2411D629312J475532L3387j42949J072503p29304j502987J423229j92016K96509
2402F363216J715015L64336L28536L42354J166454r7152p46774J21118O07941
2393A0165044m76730J333833L92233J345596J370009p39856k30888k12563N14282
2384A3460960J395262J350430O24278L66087P80536J712536J278365J722206L146381
2375B5837041L539458K292464L710911N091420L245154K951437L952905J907216
2367E2528006L498094M600080O505287R814528J5787071J9463353K6963944M3085233
2359A82245596O5594332Q7364269Q6197869L0508435m5006851p6342059p8792068
2352B51769523o1069624m4918347l6105890k7924512j8939977j1265437r516831
$$ y = [4629312, 6104844, 6138231, 5995282, 7067785, 6338481, 4835494, 6258723, 6066707, 6363216, 8078231, 8442567, 8771103, 9113457, 10279911, 10182759, 9435985, 9557103, 10165044, 9688314, 11022147, 11414380, 12759976, 14129985, 13390129, 13159241, 12946678, 13460960, 14856222, 16206652, 16830930, 17197017, 17977553, 19690089, 20968454, 22690660, 25837041, 29376499, 31668963, 35379874, 40471294, 43716448, 46667885, 50620790, 52528006, 56026100, 60626180, 67131467, 76945995, 92733066, 112196419, 139160363, 182245596, 247839928, 335204197, 421402066, 451910501, 406903650, 330561591, 251769523, 190699899, 145781552, 109675662, 81751150, 62811173, 51545736, 42028905]
2345D2028905n198291l336803l781935q21726J370047k165151m162695k665641
2337B1266710j994105j790478j358275k036366k360781k26326J027717p87183
2329A1740913j637298j984813M39020K33745j100377q86701L6793j284528J764679
2320G321433N41603k039100j152302M10004q57268n34178P66514N32517l48877
2311D640346Q07417p92889j960741j77075J985129R9776P8609r65537l88124M39401
2301C766312m87639j695891Q55609J461802j264004L49267O57640j632712L80038
2292B390422K092654j844321j362105P33406p61658m92472O73021q00799K94353
2283I22501J511411o93128k086917J76782Q63988m1107M04057O44757r15512M50601
$$ y = [42028905, 36830614, 33493811, 29711876, 28890150, 30260197, 28095046, 23932351, 21266710, 19272605, 17482127, 16123852, 14087486, 11726705, 11500379, 12528096, 11740913, 10103615, 8118802, 8557822, 8791567, 7691190, 6804489, 6841282, 5556754, 7321433, 7863036, 5823936, 4671634, 5081638, 4224370, 3690192, 4456706, 4989223, 4640346, 5447763, 4654874, 2694133, 2517058, 4502187, 4601963, 4680572, 3715035, 3326911, 3766312, 3278673, 1582782, 2438391, 3900193, 2636189, 2985456, 3643096, 2010384, 2390422, 4483076, 2638755, 1276650, 2010056, 1248398, 755926, 1428947, 628148, 922501, 2433912, 1740784, -346133, -169351, 694637, 653530, 1057587, 1702344, 786832, 1237433]
2273A237433p07591p89053o30177L71210J308995N56862j837807O08999O28784
2264G47655l40876K47942M44947q62767L44343j24852N9974j154533l83912M30833
2254e91246Q98737K89587J468607k40044j814823m46609Q83873K28198Q5233m32437
2244C29076k0383L48262j73512l51862l96105l75844N04363M56154m4402n14351
2234b38604n18164K16377K33583n52781p30364L61947O460J166695N78948L12151
2224H36248q76937k95024m57056Q4300j17867M54519j74715k70491o80728N60150
2214i37601K6913o49339J051281J898761J09115o86027j438529p90884J6309Q41819
2204e58182L74905O79564o29367o91377K83038m39457m35086O01090K16275Q31397
$$ y = [1237433, 529842, -259211, -889388, -518178, 790817, 1347679, -490128, 118871, 747655, 406779, 654721, 1099668, 236901, 581244, 456392, 516366, -638167, -1022079, -591246, 307491, 597078, 2065685, 1825641, 10818, -435791, 448082, 676280, 761513, 329076, 308693, 656955, 483443, 131581, -264524, -640368, -136005, 320149, 275747, -238604, -756768, -540391, -306808, -859589, -1589953, -1228006, -1221546, -54851, 524097, 836248, -40689, -335713, -792769, -708469, -826336, -371817, -546532, -817023, -1497751, -937601, -910688, -1560027, -508746, 1390015, 1499130, 813103, -625426, -1416310, -1400001, -558182, -183277, 496287, -133080, -824457, -541419, -980876, -1415962, -814872, -598597, 232800]
2194B32800l2303m60753K68679j367577j334453L54729J340157j35005K33057
2185i00669O37648l94504J51275n5394J16799l75423J52811l95347Q1963K6634
2175i54207n56696L22598J137010J050637J56316j76412j619192m78930M11525
2166g07351N31796r79098J057202O36645j121988k36912M94411M14640O13793
2157G03138J25892j766807J37794J179291l84501P4005M518j62540k15523J05708
2147a99025k216338J53970J998776J673319l09868j85849j376355l95199N39487
2138c17082j76085r5465j52850N70292m02151L5540o09135K16799O26875O49160
2128C45898P80035r82783k032091R2968J644406P09116R5226j175959j140968
$$ y = [232800, 200497, -260256, 8423, -1359154, -2693607, -2338878, -998721, -1133726, -900669, -263021, -657525, -506250, -561644, -444845, -820268, -667457, -1062804, -980841, -954207, -1510903, -1188305, -51295, 999342, 1155658, 979246, -639946, -1118876, -707351, -175555, -1154653, -97451, 539194, -582794, -819706, -325295, 89345, 703138, 829030, -937777, -799983, 379308, -5193, 68812, 73330, -89210, -304733, -199025, -2415363, -2261393, -262617, 1410702, 1100834, 914985, -461370, -856569, -317082, -493167, -588632, -741482, -171190, -573341, -537801, -1146936, -930137, -303262, 345898, 1125933, 143150, -1888941, -1795973, -151567, 557549, 652775, -523184, -1664152]
2119a664152J191654J203089j79625j054337J40510R6628L05824j068830j51853
2110a181092n56308J046501K051720l47534j693167n68615O90901j92671J265332
2101E15067k44726j90424p67339m30813P06265O65060j77938Q51378J87897j122310
2091g883j84135Q55460L40094M78023N68730N43812o88999j004123P20767M51870
2081B073616j321804K46014r70942k214369J131536J523333L8891m33352J558697
2072A631620r76349j142252r6554j73678k39619P96537j15749l4521p30085r8263
2062a178913M55446M56122p2168j09264L64673j098003j615635J790497J272345
2053B65100q11370r9983J89928j500652R02992J495231j9519Q73620L0493r25249
$$ y = [-1664152, -472498, 730591, 550966, -503371, -362861, -266233, 39591, -1029239, -1181092, -1737400, -690899, 1360821, 1013287, -679880, -1248495, -557594, -750265, 515067, 270341, 79917, -687422, -1118235, -411970, 253090, 75152, 926530, 1114427, -7883, -192018, 663442, 1003536, 1481559, 2050289, 2594101, 1905102, 900979, 1621746, 2073616, 751812, 997826, 26884, -2187485, -1055949, 467384, 506275, 72923, 1631620, 655271, -486981, -583535, -757213, -996832, -200295, -316044, -350565, -1080650, -1178913, -723467, -267345, -339513, -448777, -84104, -1182107, -2797742, -1007245, 265100, -546270, -646253, -456325, -1956977, -1053985, 441246, 421727, 1295347, 1325840, 400591]
2043D00591r66003j33105j91658J025059Q44020n7774m86663M30312p06403r3859
2033F4517Q33499j04679r03944l67634q07861M28034J515506o51332l38284L82649
2023E0471n04304M78594p581j04085o86662M24466N6409j721774n36339R18986
2013a631819J009184P64381P19825n45499k645695j281936J693153J495574N52111
2004A29279L52106j047272p17695P55634m39104J1066K68342N0380Q44772j03808
1994A03700k594466O86881J231218J934224L1137j193679p23744k4529o53101
1985a202359R39938L01503m66495J400010m64728o90589j058562L6716K64254
1976i40312Q18031N36567n17962o78782l76859q745J34674Q23512q11188k42591
$$ y = [400591, -565412, -698517, -890175, 134884, 978904, 921130, 434467, 864779, 158376, 64517, 898016, 793337, -110607, -478241, -1286102, -858068, 657438, 6106, -332178, 50471, -453833, 24761, 17180, -86905, -773567, -349101, -292692, -2014466, -2550805, -1631819, -622635, 141746, 861571, 316072, -2329623, -3611559, -1918406, -422832, 129279, 481385, -565887, -1283582, -527948, -967052, -955986, -687644, -637264, 207508, 103700, -2490766, -1803885, -572667, 1361557, 1392694, 199015, -524729, -549258, -1202359, -262421, 39082, -427413, 972597, 507869, -182720, -1241282, -1204566, -940312, -122281, 414286, -103676, -782458, -1159317, -1168062, -1033388, -209876, -1021064, -1263655]
1966a263655Q54812q41724J72136J817590k47157k020879M83373l31767l48381
1957a725652P0701R72074p8220K49014J562438j24036j267840o72854l0416o85492
1947a730283J562516l30551j8704L82669M37686q36963J015378j70094j008198
1938f96544m94812l19114P57263M70673N43266j383176K15949J352108l00971
1929A44642m21618J4923j300327J208158K19173P02613j267408J86276M43785
1920f9783K95074j90260R64257j678799n96727O04417J236643q76155R13477N8506
1910F60650N9150m8785n44753r40648o81820J005633J507278K55702o62161k26654
1900C83592M1542N72835q19454o9727q77225j40167n24459L03730J153103N72970
$$ y = [-1263655, -408843, -1250567, -1078431, 739159, 492002, -1528877, -1045504, -1377271, -1725652, -1654951, -682877, -761097, -512083, 1050355, 926319, -341521, -1014375, -1044791, -1730283, -167767, -498318, -517022, -134353, 303333, -533630, 481748, 311654, -696544, -1191356, -1510470, -753207, -282534, 260732, -1122444, -906495, 445613, 144642, -276976, -262053, -1562380, -354222, -135049, 567564, -699844, -513568, -69783, 225291, 35031, 999288, -679511, -1276238, -671821, 564822, -311333, 602144, 660650, 719800, 671015, 126262, -814386, -1496206, -490573, 1016705, 1272407, 610246, 383592, 425134, 997969, 178515, 108788, -768437, -908604, -1433063, -1129333, 23770, 596740]
1890E96740l73574l3872J87602M00922k241640r28467k99037O91460K171888J02061
1880B74083j148771n27898K37525J323732o24743o48619R79753l34775o62784
1871a132497J94426M13621p21956R01326q8694j30308J151216R5223j164361n99922
1861a081926P34115J180562J52712j304426p98216m9309J058080J95024O40375
1852G26991p60583Q87601o09382J76083j39353J8558q45733P71223M38980Q07167
1842A471552r48593q88949j398845J253663Q48702l62495p09819K8359J77662
1833e28763J006727q47181n60765q40402J04182P96631K61232P60750k37113o01804
1823f86506l89400L45491N72593o7344q53150O52754J467362n56879k021762J0330
$$ y = [596740, 223166, 189294, 376896, 777818, -1463822, -2392289, -2691326, -1999866, 172022, 274083, -874688, -1402586, -1165061, 158671, -466072, -1114691, -134938, -469713, -1132497, -938071, -524450, -1246406, -345080, -433774, -564082, 587134, 682357, -482004, -1081926, -347811, 832751, 985463, -318963, -1117179, -1166488, -108408, 86616, 726991, -33592, 854009, 244627, 420710, 281357, 299915, -545818, 225405, 664385, 1471552, 522959, -365990, -1764835, -511172, 337530, -24965, -734784, -706425, -528763, 477964, -369217, -929982, -1770384, -1666202, -869571, -608339, 152411, -84702, -686506, -1075906, -730415, -157822, -225166, -1078316, -425562, 1041800, 484921, -1536841, -1526511]
1813a526511J59271J321257O55762j47014p30454J44532R30476p23252j328325
1804a244258M22761K62733J111395j027813o34854l19086R9656R78627J149249
1795G98410J34686q99440j079646L27358p69195J159632N03464j209479l42661
1786a376871J432707J209K51714J46703n04535J19961R96601J30124j125387j266194
1776a193968K71671P65101Q67546J545198q04678k772757J157537J562491j180764
1767B17377r85733Q63898n25675k93525N53530l44182j757086J564094J995264
1758A287962o83842j526775o7704n39667q77603J053095M9590p5403J078125j16896
1748d19118m41817q14085L10506R56963o5744m68895R40266m32019j493645K91105
$$ y = [-1526511, -1367240, -45983, 609779, 462765, -267689, -123157, 807319, 84067, -1244258, -821497, -558764, 552631, -475182, -1110036, -1429122, -1329466, -350839, 798410, 933096, 33656, -1045990, -718632, -1487827, -328195, 175269, -1034210, -1376871, 55836, 57045, 308759, 455462, -49073, 70888, 1067489, 1197613, 72226, -1193968, -922297, -157196, 710350, 2255548, 1450870, -1321887, -164350, 1398141, 217377, -768356, 95542, -430133, -723658, -170128, -514310, -2271396, -707302, 1287962, 604120, -922655, -990359, -1530026, -2407629, -1354534, -1304944, -1380347, -302222, -419118, -860935, -1675020, -1364514, -407551, -473295, -942190, -1924, -433943, -1927588, -1636483]
1738a636483J131695N26583L62791M50536j218750J99176J09104R31685L40456
1729A196793o32464j143054J674612r4313o88010K66400L51994j8589l55429m75383
1719H2557m72113l3188J030188k83670l63059L24561K88022r80914J87960K72181
1709E2525o86850p8851J1570J33586r99133R8044J464578k71394j831951K395068
1699B87192N5351j030808N56958j68708j745170P48810J222679j272977n03716
1690a850389R11601Q78102M08974J98824k65867j297431K76337J257752n56571
1681c8668p32479p6573O08739N1506j17656k43789j34680L3274J528616L3273
1671I11563n86021l39872O00640n70081m40686o63361N15305l08557P56285J163064
$$ y = [-1636483, -504788, 21795, 384586, 835122, -383628, -184452, -75348, 856337, 1196793, 564329, -578725, 1095887, 1001574, 313564, 579964, 931958, 913369, 557940, 82557, -389556, -422744, 607444, 323774, -39285, 285276, 573298, -407616, -219656, 52525, -634325, -713176, -701606, -568020, -1567153, -1469109, -4531, -275925, -2107876, 287192, 342543, -688265, -131307, -300015, -2045185, -1296375, -73696, -1346673, -1850389, -938788, -60686, 348288, 547112, 281245, -1016186, -739849, 517903, -38668, -771147, -847720, -238981, -187475, -305131, -548920, -683600, -650326, 878290, 911563, 325542, -14330, 586310, 16229, -424457, -1087818, -572513, -881070, -124785, 1038279]
1661A038279j580190q79363O88593P41557M48547r53988Q88383M83356k037286
1652a162112p94285Q16065K34035L18420J005651l70251j563918Q42519J159757
1643D85881n54015r20228N38253K94573o28100J80297m56876Q93768J136299j332503
1633c62651n76565M83956K08954m493o37168J194381P41501j386795Q7523n54357
1623h05714p48360Q74898J722578l051n51710j035624J19233j302944J531322
1614a99372J918778m62464o48284m71833P8437j389605l34775O06847J76599K13262
1604e12410J529957l38830q92095p44477J373477K79366j454294o18719J028184
1595c49841p53462o85592J895453M84882q99441K313223n81197j459115j080225
$$ y = [1038279, -541911, -1421274, -732681, 8876, 457423, -496565, 391818, 875174, -1162112, -1956397, -1140332, -906297, -587877, 417774, 47523, -1516395, -673876, 485881, -68134, -988362, -450109, -155536, -783636, -603339, -1060215, -166447, 969852, -362651, -939216, -455260, -246306, -250799, -887967, 306414, 1047915, -338880, -251357, -805714, -1554074, -679176, 1043402, 1040351, 488641, -546983, -427750, -1730694, -199372, 1719406, 1256942, 608658, 136825, 215262, -1174343, -1509118, -902271, -725672, -512410, 1017547, 678717, -213378, -957855, 415622, 694988, -759306, -1378025, -349841, -1103303, -1788895, 106558, 591440, -308001, 2005222, 1424025, -35090, -1115315]
1586a115315N40412p19921k22441J120260J031484j286339M20380K80829o71701
1577f22352n69106J4489Q82304r57376m08125J754355r44152j065117J169369
1568g45711l61184k09128J351491o26403l64409O5046l85657O08524Q36001O06835
1558G75405j279963j092144K59705R30250M20324l8389L81445N7046q2085r414
1548C22180K40791j932710N60802J874462K05733j298840m74428k3687J520576
1539I94879P70634k80583k076612k092447J263076K254J45752o35471O06477K010426
1529G08385J795151k102572k183413q55773P02052N11362Q82869q76855k64150
1520a682944L32588J391783j136334P39599L40808m94050p73384J036783o1917
$$ y = [-1115315, -574903, -1294824, -1517265, -397005, 634479, -651860, -231480, 49349, -622352, -1191458, -1176969, -294665, -1252041, -1660166, 94189, -849963, -1915080, -745711, -1106895, -1316023, 35468, -590935, -955344, -890298, -1275955, -667431, 168570, 775405, -504558, -1596702, -1336997, -406747, 13577, -24812, 356633, 413679, 331594, 322180, 562971, -1369739, -808937, 1065525, 1271258, -27582, -502010, -525697, 994879, 1765513, 1484930, -591682, -2684129, -1421053, -1418799, -1273047, -1908518, -1302041, 708385, 2503536, 400964, -1782449, -2638222, -1936170, -1424808, -541939, -1418794, -1682944, -1350356, 41427, -1094907, -355308, -14500, -508550, -1281934, -245151, -307068]
1511c07068o04886p92134J492122J5493O73611K39997p16417m43563J560166j87690
1501I29631p83211P32354J5570k82264p37968q26077P56294O1466m11131J169580
1491F24244r42009j90578J021850m57674L53892o13660j92869j93380j460336
1482b050520P3355n84575J383070J183539J36559j167994J026482q52338p32487
1473a584909L00318L15664j256248k9927J583678j43024n41865Q46669K76820
1464b32824J79397m91375k24949Q09153L3078n98305J580605m60728n10320k40399
1454a56667Q11761l12050M84918k83248N38537o46881R6456M18363j039313J07965
1444A9841J451867l91214p61299j476119J9777N97777K04455q37403J73777O9716
$$ y = [-307068, -911954, -1704088, -211966, -196473, 477138, 717135, 718, -442845, 1117321, 929631, 146420, 878774, 894344, 612080, -125888, -951965, -195671, -134205, -545336, 624244, -317765, -508343, 513507, 55833, 409725, -203935, -396804, -590184, -2050520, -1977165, -2561740, -1178670, 4869, 141428, -1026566, -84, -852422, -1584909, -1284591, -968927, -2225175, -2255102, -671424, -814448, -1356313, -509644, -232824, -53427, -544802, -769751, 39402, 72480, -525825, 1054780, 594052, 83732, -156667, 655094, 343044, 827962, 544714, 1083251, 436370, 532826, 951189, -88124, 19841, 1471708, 1080494, 319195, -1156924, -1137147, -539370, -334915, -1172318, -998541, -928825]
1434i28825N88415J49889M07311m52845p83679j57163m87473l58145L17501M36646
1424a268368n18893N75813J284221J348792j200056j566819K69612O81502n21435
1415i15631L40611o2121m04134P32410J603711m85602r16453j08947O44444M02941
1405H31229R20401j736989r09137o92177J625680J165392k84375k111924R57781
1396b34119J553193j016162q30672n02086o19938J214035P44639q59407j593481
1387b143998K30272J481536o45763k60478M22284j54504J069957k75034p53595
1378a029323k88743Q24199p84282q41320R51013R99780N30403L70905r60165r66796
1368a194329J91921N13533J55947O47698O30574P01287p30722j105475k76205
$$ y = [-928825, -340410, -190521, 216790, -236055, -1019734, -1176897, -1664370, -2022515, -1705014, -1268368, -1787261, -1211448, 72773, 1421565, 221509, -1345310, -1075698, -394196, -915631, -575020, -637141, -1041275, -308865, 1294846, 809244, -107209, -216156, 428288, 831229, 1751630, 14641, -894496, -1586673, 39007, 1204399, 920024, -1191900, -234119, 1319074, 302912, -527760, -1029846, -1649784, -435749, 308890, -550517, -2143998, -1913726, -432190, -1077953, -1338431, -916147, -1070651, -694, -275728, -1029323, -1318066, -493867, -1278149, -2119469, -1168456, -168676, 361727, 732632, -227533, -1194329, -1002408, -488875, -332928, 314770, 945344, 1646631, 915909, -189566, -465771]
1359d65771O72053m18479K139038n32362k028945j04364O14901P04203o84494
1350a04220R38718j98591o31357k10163O81012p49299q05622K42935J198046j59639
1340B01820j536254q93712M7679R28837J987870K84836j573425j004659k99370
1331a856378J83460J043337o85957J261500L84815j68826j067257K76962n52941
1322a181285Q28895O37643P28055o9083r63761j27818l26846M37353R85323M50209
1312A398685j338702r61622J999799P91618k584580P13634K338043m99940q92725
1303I64210j165081j801065N59248J334629M88249N2451n37306J332401j089047
1294A38689k196655R48388k03334k95637J944379j217600n63219J652943k27000
$$ y = [-465771, 206282, -212197, 1926841, 1394479, -634466, -738830, -123929, 580274, -104220, 834498, 635907, 4550, -205613, 475399, -273900, -1079522, -836587, 361459, 201820, -1334434, -2228146, -2180467, -1251630, 736240, 1021076, -552349, -1557008, -1856378, -1672918, -629581, -1315538, -54038, 330777, 161951, -905306, -628344, -1181285, -352390, 285253, 1013308, 944225, -19536, -147354, -474200, -36847, 948476, 1398685, 59983, -901639, 1098160, 1889778, -694802, 18832, 2356875, 1856935, 964210, -200871, -2001936, -1442688, -108059, 380190, 432641, -104665, 1227736, 138689, -2057966, -1109578, -1312912, -1608549, 335830, -881770, -1444989, 207954, -19046]
1285a9046j505143J17752L73004J71709r1753k76810O4303L41168P09652O72312
1275E57148J16040r72382p37180M06962O50291j11859R75405o11117j75907J663963
1265A761364p88454j300384N85672M85200N07765k020367o7953K321680J79728
1256A664251j024552J224760j036248q31386j35182p30908n82329J347972J347308
1247A243686l38588j806145J442721j43294j277761J415723l23754q61596Q82050
1238B33042k66439j877488l65478J557793J300522o88210K21522P23484j173611
1229c34863q11386J259361l58556l70652r7025N3478r1842J38171O33325P11311
1219G31322r5554j45004j722263o21198K173786J360343j072280k92437k3890
$$ y = [-19046, -1524189, -1406437, -1033433, -861724, -953477, -1230287, -1165984, -824816, -115164, 557148, 673188, -299194, -1036374, -629412, 20879, -90980, 884425, 273308, 97401, 1761364, 972910, -327474, 258198, 743398, 1251163, -769204, -837157, 1484523, 1664251, 639699, 1864459, 828211, -3175, -138357, -869265, -1451594, -103622, 1243686, 905098, -901047, 541674, 398380, -879381, 536342, 212588, -649008, 233042, -33397, -1910885, -2276363, -718570, 581952, -106258, 115264, 838748, -334863, -1146249, 113112, -245444, -616096, -713121, -659643, -751485, -613314, 20011, 731322, 635768, 490764, -1231499, -1852697, 321089, 1681432, 609152, 316715, 292825]
1210B92825o24109q99570m42219p1905K435467K335322j246322j899495m51348
1201e71354K40783l844m79087Q12628P49868n21835K81604n06899j406580J037178
1191c67538K454328j172124k544193K81376O38259j323961J452997O08938M4375
1182G2457Q35911p46618k1869j80938j377117J222253K70590r70498M85451k13806
1172f24184m67668J242120L04467l71037J54719p22816P32079n24599o55563R39230
1162F748L54916k74308l34464J89271Q6541j151152P63683O02166j158573j3440
1152i28612R85619p44207j62117L41439Q82654J039461p90924k534910j58467
1143b070064M85491K92302k3121K80201J217474L79807Q75356l61483j912922
$$ y = [292825, -331284, -1230854, -1673073, -1744978, 690489, 3025811, 1779489, -120006, -571354, -330571, -334415, -813502, -874, 748994, 227159, 508763, 1864, -1404716, -367538, 2086790, 914666, -1629527, -1348151, -709892, -2033853, -580856, 28082, 72457, 908368, 161750, 139881, -41057, -1418174, -195921, 74669, -895829, -410378, -624184, -1091852, 150268, 454735, 83698, 238417, -484399, 247680, -276919, -932482, 6748, 361664, 87356, -247108, -57837, 28704, -1122448, -358765, 243401, -915172, -928612, 57007, -687200, -849317, -507878, 374776, 1414237, 623313, -1911597, -2070064, -1584573, -1292271, -1315392, -1035191, 182283, 562090, 1437446, 1075963, -836959]
1134h36959l11341R40198j62533L03816k57819o248J75966J32070N61051J83280
1124G21481J84283O24028j283882q05220N83959P49314j036351j22554J60919
1115b24023K01746O64612N74100j090160p46558J009360k84762j087660J434420
1106D51075k58402j971380K541830k29006j261497q10586k08718Q19153N09582
1097d17949N46588L8876P7979l26634l48877J40482m25411n98088Q91129j53525
1087e75430p3980o3840l20436L37447M66132O4752M28683J396519q09991j152155
1077c02299p75834q95440J449786M11082R65795L75535m39219l10110n22149m49007
1067d91860M87126L11532K41246L26297M84198n42829k178183K36522J607928
$$ y = [-836959, -1148300, -208102, -370635, -66819, -324638, -330886, -154920, -22850, 538201, 721481, 905764, 1529792, 245910, -559310, 24649, 773963, -262388, -384942, -224023, -22277, 642335, 1216435, 126275, -620283, 389077, 104315, -983345, 451075, 192673, -1778707, 763123, 534117, -727380, -1537966, -1746684, -927531, -417949, 128639, 167515, 245494, -81140, -430017, -289535, -714946, -1313034, -421905, -575430, -649410, -713250, -1033686, -696239, -230107, -165355, 263328, 1659847, 849856, -302299, -1078133, -1973573, -523787, -112705, 853090, 1228625, 789406, 479296, -42853, -491860, -4734, 306798, 548044, 874341, 1358539, 815710, -1362473, -1125951, 481977]
1058D81977J351392l40488q57768q55990r90509P76660J118923r81516j141936
1049a439255J915933O88512j653744j6201J95849l49571N71074M99772j982382
1040a570013m86903J830890N00575o44853L98420Q8030j000429p44396N45314
1031a083365R52382j00494P13607P17949j545563n40273m67198M55989J683534
1022G86568K46895M00960K40541j978078o66479J38019l63712J996438N15672
1013A316824r84563n12825Q45958q5010K70765j149387j165148J307703Q71532
1004G15849j025758k83808l00750l66370J621543P09562k619789p79759J997118
995c32162L4504Q3480j12555q56713k0095J359700L24135p36086j109030k42998
$$ y = [481977, 1833369, 1492881, 635113, -220877, -1211386, -434726, 684197, -297319, -1439255, 476678, 1165190, -488554, -504755, -308906, -658477, -87403, 412369, -1570013, -2056916, -226026, 274549, -370304, 28116, 116146, -884283, -1628679, -1083365, -130983, -231477, 482130, 1200079, -345484, -885757, -1352955, -896966, 786568, 1033463, 1434423, 1674964, -303114, -969593, -831574, -1195286, 801152, 1316824, 332261, -180564, 665394, 580384, 851149, -298238, -1463386, -155683, 715849, -309909, -593717, -894467, -1260837, 360706, 1070268, -1549521, -2329280, -332162, -297658, -214178, -326733, -1183446, -1203541, 156159, 480294, -255792, -1364822, -1607820]
985a607820J096477P86277r07282J020538k41848l15154R1332P56239j718605
976a039846P04025j67139l53718L89150J587746q90214m09315j56230Q24258K96800
966G85517q02650n63531l34321J206326J70065j219419q63944R99870N88369N12820
956D79102m12255j38859J384001n60314j472671L507m39872J42829R22222K79571
946A87261r18336N15311k62987j64156N25342J562794j149127K00852j042924
937e45970r17554J767305k38539j088259J644503k3477k042193M89019M01610
928e53555l04363J028256M05264r26837q03911j39048p97712j66489P08085J954624
918D04314Q0284j234454j139864O91382J16904M26407J689762j196524r68994
$$ y = [-1607820, -511343, 274934, -632348, 388190, 146342, -168812, -77480, 678759, -1039846, -335821, -502960, -856678, -467528, 1120218, 230004, -179311, -335541, 488717, 785517, -17133, -580664, -914985, 291341, 461406, -758013, -1621957, -622087, -33718, 479102, 66847, -72012, 1311989, 751675, -720996, -717489, -1157361, -1014532, -92310, 187261, -731075, -215764, -478751, -642907, -117565, 1445229, 296102, 496954, -545970, -1463524, 303781, 65242, -1023017, 621486, 598009, -1444184, -955165, -553555, -857918, 170338, 575602, -351235, -1155146, -1294194, -2091906, -2258395, -1550310, 404314, 484598, -749856, -1889720, -1198338, -1081434, -655027, 1034735, -161789, -1130783]
909a130783J9270m50708N97271Q96898J598900j1998n02982j073755k9736q94885
899i82508N60289J157217N15869j00442m25303j985876O02863J551842O84397
890A578348K51935p64570j510030l36579L09888r81819o9862J007139O48777P21236
880H54463j768252j060755k03588R95211K095608P68892k514324j487318P43175
871a576888q97536Q54309O23053m44863Q45917J593015L0522n19603j161456Q10430
861A56900j298883j42976R91449n72130N55459O26282K00283P33844k22588M60457
851A488097o46888j049781L97216P96869q12964l60801L33649k21995Q55585J175463
841A954450j216958j443983p02146J514609m70038l79694J551596j623026n62190
$$ y = [-1130783, -1111513, -1562221, -964950, -68052, 1530848, 1518850, 1015868, -57887, -87623, -982508, -422219, 734998, 1250867, 1150425, 725122, -1260754, -657891, 893951, 1578348, 1830283, 1065713, -444317, -780896, -471008, -1452827, -1522689, -515550, 133227, 854463, -913789, -1974544, -2178132, -1182921, 912687, 1681579, -832745, -2320063, -1576888, -2474424, -1620115, -997062, -1441925, -596008, 997007, 1027529, 507926, -653530, 156900, -1141983, -1284959, -293510, -865640, -310181, 316101, 516384, 1250228, 1027640, 1488097, 841209, -208572, 188644, 985513, 172549, -188252, 145397, -76598, 778987, 1954450, 737492, -706491, -1408637, 105972, -364066, -743760, 807836, -815190, -1377380]
832a377380J898344m85191o50084J96914n01039J45818K80429O50405p94272n56136
822a192192K004351L35190j171685k40389n49531k77851J558506j23332K96020
813F39087l73805j098227P6169J332323p2505J388942j469128j385201j46997
804a109342P43147J219822R2207j285118J571407n87117j556413J89283o7055
795g89179l59846J609374j70613k7877j89527M14418M90948q93636J005051k04657
785H84456j607750j048285O19322J079939J180454r49743O42597J432269j202410
776A030849j067386l99305l89660J424734L3225j140617O212j259447L89617K250313
766H78535n6327R99902r00056q79092j399576J98455M6830P66694q98135K81458
$$ y = [-1377380, 520964, 35773, -614311, -417397, -918436, -772618, -492189, 158216, -636056, -1192192, 812159, 1147349, -24336, -264725, -814256, -1092107, 466399, 343067, 639087, 265282, -832945, -756776, 575547, 503042, 1891984, 422856, -962345, -1109342, -366195, 853627, 945834, -339284, 1232123, 645006, -911407, -722124, -789179, -1149025, 460349, 289736, 261859, 72332, 486750, 977698, 84062, 1089113, 884456, -723294, -1771579, -1152257, -72318, 1108136, 158393, 800990, 2233259, 1030849, -36537, -435842, -825502, 599232, 632457, -508160, -501948, -1761395, -1371778, 878535, 822208, 1822110, 922054, 42962, -1356614, -1158159, -1111329, -344635, -1242770, -961312]
756i61312L04480O97381J057623j607080j36829J803339j87942j556410n23638
747a110388o24425R53120J311972k8467J60105o54724J091993L83558n30521n44363
737D07860p9792l15842J175851P16235j362691j405866J426331J234957j320605
728D76438j208098P18128L93637L6308J937083r59237k737391J259228o20018
719g03922j229003O76416R48887l16021R1673L96509R8906N36392l5195r19720
709d55078k049155M09750J817240P16593o84037m42002N3772N79857K84391O3887
699B95218o93430N66092P40399j444355J63471Q75773m21560M13219J808096J37852
689B440775k500616Q9952K25493j45405l38714J863680r0725j090939k8814k14979
$$ y = [-961312, -656832, 40549, 1098172, -508908, -645737, 1157602, 969660, -586750, -1110388, -1734813, -781693, 530279, 501812, 661917, 7193, 1099186, 1482744, 952223, 407860, 328068, 12226, 1188077, 1904312, 541621, -864245, 562086, 1797043, 476438, -731660, -13532, 380105, 416413, 2353496, 1394259, -1343132, -83904, -703922, -1932925, -1256509, -307622, -623643, -531970, -135461, -36555, 499837, 464642, -455078, -2504233, -2094483, -277243, 439350, -244687, -686689, -632917, -53060, 231331, 295218, -398212, 167880, 908279, -536076, -372605, 503168, 81608, 494827, 2302923, 2440775, -59841, 30111, 255604, 110199, -228515, 1635165, 1544440, 453501, 424687, 209708]
679B09708j014155J251551k7798p68778R54022j688074J86778O53275J5552J193
669b26726j33373R3219k06579k207651j31451K449369J362663r3225j553152j187722
659a834628M40775J052011O1579l54388J15026J175224R63968j762082m14579
650e57094J41966J77940R72985L76279j091406k43140n16162Q72771J4090p33319
640e85090J156050m09970j133809J272148J0061r01168n13052K43495P93579J31327
630F3571o86583L9261k14009k89866J547593o62333j383164J62098J224966m72174
620f70640J323705J60684j140890n68225J107129j57631o87832O98833j035842
611i70709N49100J189517q93951m10344J418883j610257O5710J456831K51120
$$ y = [209708, -804447, 447104, 419306, -349472, 604550, -1083524, -896746, -243471, -227919, -226726, -360099, -266880, -473459, -2681110, -2812561, -363192, 999471, 906246, -646906, -1834628, -1393853, -341842, -280263, -634651, -519625, 655599, 1619567, -142515, -557094, -415128, -237188, 735797, 1112076, 20670, -222470, -738632, 134139, 148229, -585090, 570960, 160990, -972819, 299329, 309390, -591778, -1104830, -861335, -67756, 63571, -623012, -583751, -797760, -1087626, 459967, -202366, -1585530, -1423432, -198466, -670640, 653065, 813749, -327141, -895366, 211763, 54132, -633700, 65133, -970709, -421609, 767908, -126043, -536387, 882496, -727761, -662051, 794780, 1045900]
602A045900o72507j139423J310430p73898j48652O25627o90776J22000K69067
593e2232m65760L73080l17851m30976J461085M0946l34004N98093j607585n52633
583a287837N59466m30189l01100J575175o49879L74347J19653L92610q03073M90378
573C9551K26933l27295r71663j21001j73309J118048R37766q22758P851J170087
563A084210j877335j54261O73506J73686N68990J184845j238552k073504O35733
554a022682L3423k50485O03596N48652n53489J239544j94561O40994j222980k54600
544d32588J111517j190626j724480J388943m00247j87728J436824m7628j06228
535a52241M22509O72819o53837j771452J118209k23656r16032P98244K71712r19483
$$ y = [1045900, 373393, -766030, 544400, -229498, -378150, 247477, -443299, -321299, -52232, -517992, -144912, -462763, -893739, 567346, 608292, 274288, 872381, -735204, -1287837, -728371, -1158560, -1459660, 115515, -534364, -160017, -40364, 352246, -450827, 39551, 266484, -60811, -1032474, -1153475, -1326784, -208736, 729030, -93728, -85877, 1084210, -793125, -947386, -273880, -100194, 468796, 1653641, 415089, -1658415, -1022682, -989259, -1239744, -636148, -87496, -640985, 598559, 403998, 1044992, -177988, -432588, 678929, -511697, -2236177, -847234, -1247481, -1435209, 1615, -46013, -152241, 270268, 943087, 289250, -1482202, -363993, -587649, -1503681, -705437, -433725, -1353208]
525a353208M01597J704974K85132p90263k61766n61218n80077Q07665J461565
516A114401l90883j622106K5921J094538L96615j21440p82725P50643J73994R2976
506G31934j058088j49753R27774k05973j245515J315821J079426j25047m88661
497G81918r84629j675472J330036J213204o6240j285794P8417O20136M21529q20320
487c87215J2332n93874O31039K40936r56996l48562K84044q33127R64642J903850
477I17069j45642q32196o65590k36533N36238O72588l25092n43611O9769J810428
467A257428j312016j42471l95650J13421L54472J032795p53202L26215M49228
458I30220m61887n22349m2559o00392j20844r32738j35543K360733J104620j22771
$$ y = [-1353208, -951611, 753363, 1038495, 248232, -13534, -574752, -1154829, -347164, 1114401, 723518, -898588, -872667, 221871, 618486, 497046, -285679, 464964, 638958, 731934, -326154, -475907, 451867, 245894, -999621, 316200, 1395626, 1270579, 781918, -202711, -1878183, -548147, 665057, 598817, -686977, -608560, 11576, 433105, -387215, -374883, -968757, -337718, -96782, -1053778, -1402340, -1118296, -1951423, -986781, 917069, 771427, -60769, -726359, -962892, -426654, 245934, -79158, -622769, -553000, 1257428, -54588, -197059, -592709, -479288, -124816, 907979, 154777, 480992, 930220, 468333, -54016, -96575, -696967, -817811, -1750549, -1886092, 474641, 1579261, 1456490]
448A456490o06550r35401j645415L60784M79718r93583L29774J382040j17540
439b89683j58014L44719l3885Q7206j58082n25197M30495K71039q58994L48864
429e41532n07393L69890N06350K56723q87783j21035J199867J19467j242361O56897
419a90910Q93650l32420q9923n47511r22492P84556Q01107j360150p74946J115159
409f23880Q70713O49960m01562r99965m18191N27215j584Q8683q49600J55868
399a002343L30505M45647O20047r98450o43785K35728J068542K16950p07431q35400
389a269990J263152r6860k46189m00986n67874O46886P53779m1634j175296o9111
379a204123J807631P65438j265060Q51215k8033p66355j42788j03895m43493j729
$$ y = [1456490, 849940, -85461, -1730876, -1370092, -890374, -1883957, -1554183, -172143, -289683, -447697, -102978, -136863, -49657, -207739, -732936, -302441, -31402, -890396, -541532, -1048925, -679035, -172685, 84038, -803745, -924780, 275087, 394554, -847807, -190910, 702740, 370320, 280397, -267114, -1189606, -405050, 396057, -964093, -1739039, -623880, 246833, 896793, 495231, -504734, -922925, -395710, -397294, -308611, -1158211, -1002343, -671838, -226191, 393856, -604594, -1248379, -1012651, 55891, 272841, -434590, -1269990, -6838, -103698, -349887, -750873, -1318747, -671861, 81918, 40284, -1135012, -1204123, 603508, 1368946, 103886, 955101, 927068, 160713, 17925, -85970, -529463, -531192]
369e31192J03607R76081k20638o76190J127649k1839L30389L00152n18614p44213
359A25192q95282p8362J95174P0512J14344R45006M78075q8519r92432j314394
349a440686R72203J170643n80500n46704j48770o62357L79794Q26224K93222p79660
339e16591K74657K2150j330657J492605M57819q82085J406357j00499j394016
330e70260K53974n02108m52645O93873J073868O55108j241035k86678M27750O12486
320F64333j71696K1600m89493q57250P89689J0005q16974l61332J688780J234030
310A711692j056718n29752L17445j492194m14534J827054l45308J81342m27614
301b28587k48044m67339R00093K10196o3248p08647L90337J286298j084753r53447
$$ y = [-531192, -427585, 548496, 327858, -348332, 779317, 757478, 1087867, 1388019, 869405, 125192, -770090, -848452, -653278, -582766, -468422, 476584, 954659, 866140, -126292, -1440686, -468483, 702160, 121660, -425044, -573814, -1236171, -856377, -30153, 263069, -516591, -241934, -219784, -1550441, -57836, 399983, -482102, 924255, 823756, -570260, -316286, -818394, -1271039, -577166, 496702, 1151810, -89225, -375903, 51847, 664333, 492637, 514237, 24744, -832506, -42817, -32812, -849786, -1211118, 477662, 1711692, 654974, 125222, 442667, -1049527, -1464061, 362993, 17685, 199027, -228587, -476631, -943970, -43877, 166319, 103071, -605576, -215239, 1071059, -13694, -967141]
291i67141l1168N05399O30843l99198p07265M08778J237260j34353k063740R4488
281a426097K505400k24939r34132p34632j20468P47396O1274j87163q1502L39248
271e5615Q28060j66468j466799L22040P29981k34289l64745n12042k15679J038178
261i7378o7496l02231J76419O94797J59086m21232n50572k18871o48703P87066
251d89115K05752J066458O61938j900480k52923N59421M06829k45424N8927l4181
241C7202r8168m58136k33452k44550P95147N44288M91061p4780j49934n46260
231F2418k79204j60233j174205j88474K431247K64228p20104j72189O2650m20518
221b94384N04604o25523o57863Q20910j30135P56280n0131j478222O60669J615896
$$ y = [-967141, -998309, -492910, 137933, -261265, -968530, -559752, 677508, 543155, -1520585, -1426097, 1079303, 854364, -79768, -814400, -934868, -187472, -126198, -313361, -394863, -55615, 772445, 605977, -860822, -538782, 191199, -43090, -407835, -919877, -1135556, -97378, -164874, -467105, -290686, 404111, 563197, 141965, -408607, -627478, -1276181, -489115, -283363, 783095, 1445033, -455447, -708370, -148949, 257880, 12456, 71383, 37202, -60966, -519102, -752554, -997104, -201957, 342331, 833392, 758612, 608678, 62418, -216786, -377019, -1551224, -1739698, 691549, 955777, 235673, 63484, 126134, -294384, 210220, -415303, -1073166, -252256, -382391, 373889, 323758, -1154464, -493795, 1122101]
211A122101j798872K23251J428165n00071K83975J00888l14335k4216n93587N86177
201E13476q21240j751755J016637J671451n48058m457N87730L89364k07105o53982
191A92061p97828q88862N33234N33646k69152l89741N2017O50033J314097K63190
181A192695j004745r26355k62979M86984M66234q27820m03772K79372M60938J026762
171D87314O6865o96890Q928k56869J20258Q90730r00984J23939k33229O90854
161C00916m10435m18669l3132O92247p56733O15236K60081J12515l51901M24276
151D34401J84075j092104p11637Q42868p05020j059281J532591R93127o54921
142b35901M53133l45523p89862O1848J89514j97792M75369O22375M5800q66179
$$ y = [1122101, -676771, -453520, 974645, 474574, 758549, 859437, 545102, 520886, -72701, 513476, -307764, -2059519, -1042882, 628569, 80511, 76054, 663784, 1053148, 846043, 192061, -605767, -1494629, -961395, -427749, -696901, -1086642, -1034625, -384592, 929505, 1192695, 187950, -738405, -1001384, -514400, -48166, -875986, -1279758, -1000386, -539448, 487314, 554179, -142711, -133783, -390652, -270394, 620336, -280648, -156709, -389938, 300916, -109519, -528188, -561320, 130927, -625806, -10570, 249511, 362026, 10125, 434401, 618476, -473628, -1185265, -342397, -1047417, -2106698, -574107, 419020, -235901, 217232, -128291, -918153, -856305, -666791, -864583, -389214, 233161, 278961, -587218]
132e87218p96268P67840o9513m7553k5656N64959O26864k15410k81870K67460
122B03635l37755P21082j073418j589453R43821R31479k44646N34990J12145N5752
112B57632M69413K51199J7128n12210J74581q97239p48066K67517L17049n09317
102i12313J096070J426879l63999l96516r2356q17638m95998P41268o24212q59538
92a298353R00427M38109o46323O61074L9615J22647O4831l87310l7493o7192p44742
81i54710R03268R417m78780j89762j25247j133140J620453J44925L63233j14189
71D5468p04345k79161P76696l2493o24981J24087Q99072p46722r33741K20354
61a255766O91458P91420R45387n96187M633p26350l19001l79902N72431M28406
$$ y = [-587218, -1383486, -615646, -685159, -732712, -758368, -193409, 433455, 218045, -63825, 203635, -134120, 586962, -486456, -2075909, -1132088, -200609, -445255, 89735, 201880, 257632, 727045, 978244, 995372, 483162, 657743, -239496, -987562, -720045, -402996, -912313, 183757, 1610636, 1246637, 850121, 757765, -59873, -555871, 185397, -438815, -1298353, -397926, 40183, -606140, 54934, 94549, 217196, 282027, -105283, -142776, -209968, -954710, -51442, -42025, -520805, -710567, -835814, -1968954, -348501, -203576, 159657, 45468, -658877, -938038, -161342, -193835, -818816, -694729, 204343, -542379, -1476120, -1255766, -564308, 227112, 1172499, 576312, 580945, -145405, -464406, -844308, -271877, 156529]
51A56529n27925O75761n60801J93620J58783J9595Q4540M59882n22967n24464
41c87447l08838K35412k57684P67941M22636j565848k03484J22148M16738K026
31g56400P39821O38991m40692q58558o88551J22279j17877N18562J46393j70012
21h66044J2881Q26965m22815q04983R75107J29126p55628l09719O87995J86946
11c40169m08959M63951k8255j90457l8741K20249n17715N66467k49019P15478
1A92830r83082
0g90252
$$ y = [156529, -371396, 304365, -256436, -62816, 95967, 115562, 200102, 659984, 137017, -387447, -696285, -460873, -718557, 49384, 472020, -1093828, -1297312, -1175164, -758426, -756400, -16579, 622412, 181720, -676838, -1365389, -1243110, -1360987, -842425, -696032, -866044, -853163, -26198, -449013, -1253996, -278889, -149763, -905391, -1215110, -527115, -340169, -749128, -285177, -313432, -503889, -542630, -322381, -840096, -273629, -522648, 192830, -790252]
$$ Imaginary data points
##PAGE= N=2
##DATA TABLE= (X++(I..I)), XYDATA
16383C80265k67692p52278J77483j22047j79562P11493j30331j05265J029041
16374G41107P6754j192099n97565Q22035L55156o67357n269N43908Q38884K84777
16364A200331p78327j108167J505359l68043k96700k34641O93752P5401k61500
16355D27465M67388K54845q03903L38163R18914r66756k50786N61558l56689r30476
16345c40277l32425J008890L41919l19116J93823J82566n98683O63363J42835
16336I42895n46372P4210l10281l81845M1722R35314O16688p33267r37130J400299
16326A102233L31634n01981q53407M3369R70598l8118m55364n0013o2585M43272
16316I29638J020541J66376o25612M67689o72100k98225R8040L86501M11111k99066
$$ y = [380265, 112573, -639705, -462222, -584269, -763831, -52338, -182669, -287934, 741107, 817861, -374238, -971803, -149768, 205388, -461969, -467238, 76670, 915554, 1200331, 422004, -686163, 819196, 451153, 154453, -80188, 613564, 688965, 427465, 894853, 1149698, 345795, 683958, 1602872, 636116, 385330, 946888, 590199, -340277, -672702, 336188, 678107, 358991, 552814, 735380, 136697, 800060, 942895, 396523, 470733, 160452, -221393, -179671, 755643, 1372331, 639064, -298066, 1102233, 1433867, 931886, 78479, 121848, 1092446, 1054328, 598964, 548951, 486366, 929638, 1950179, 2116555, 1490943, 1958632, 1286532, 988307, 1086347, 1472848, 1883959, 1584893]
16306A584893n94580J15396P5757Q41965M6447j48149L99455j081518k83048M12630
16296A369248o11862l00411J220556q0177j215039J027136N91236q62331P25725
16287A864081R90064j174340j337201q72625N244O80255J449089Q54144j99242
16278B259469R2025r39310M1400m66681j66742n2483P79407l0088K60690m01914
16268A375773J06979J38996J139955L40643l76031j365114k13854J2896J93363
16259A353606M17117J41690q80796J33357N29063Q75438q12218K1775N12913K82567
16249B574512r27779J54178m30902R1835P06562L74834j18152r29146j01736N03123
16239A897329M55414M70889O19665p57035q95357M18059J23222m64789k14234
$$ y = [1584893, 990313, 1105709, 1181466, 2023431, 2069878, 1921729, 2321184, 1239666, 956618, 1369248, 757386, 456975, 1677531, 1597354, 382315, 1409451, 2000687, 1138356, 1864081, 2854145, 1679805, 342604, -530021, -524777, 155478, 1604567, 2458711, 2259469, 2351494, 1412184, 1453584, 986903, 820161, 767678, 1547085, 1516997, 1777687, 1375773, 1482752, 1621748, 2761703, 3102346, 2726315, 1361201, 1147347, 1160243, 1353606, 1770723, 1912413, 1031617, 1164974, 1694037, 2569475, 1757257, 1779032, 2291945, 2574512, 1646733, 1800911, 1370009, 1461844, 2168406, 2543240, 2425088, 1495942, 1394206, 1897329, 2352743, 2823632, 3443297, 2686262, 1790905, 2208964, 2332186, 1867397, 1653163]
16230A653163J186092L78142n69819K97984m61447j068956K06291J043619m91397
16221B173672M96425p27789K56515M23440J0347q54815k66011L75754L14084r55809
16211A245813K04334p60955N717J977677j21078j201589Q19975O1825k23328p59442
16201A248949J45676m78439R05632N15628M55705j416820M70910Q69536m5208
16192B671569Q22093N4037r70636m83353j99589N48606J278071l82156l30908
16183C007734p2136J239944J22558j244888n11598M79576M80687M68428p09374
16174C260931j256573j95821O90713L74700K4120O28805M78498j394937j291031
16165A319405O74058k55599k2461O22863j09905n70428N93548o3516m90024P71351
$$ y = [1653163, 2839255, 3217397, 2647578, 2945562, 2484115, 1415159, 1621450, 2665069, 2173672, 2670097, 1942308, 2198823, 2622263, 2632610, 1777795, 1511784, 1887538, 2201622, 1245813, 1450147, 689192, 694909, 2672586, 2551508, 1349919, 2169894, 2231719, 2008391, 1248949, 1394625, 916186, 1821818, 2337446, 2793151, 1376331, 1847241, 2716777, 2671569, 3493662, 3547699, 2577063, 2093710, 1894121, 2442727, 3720798, 3338642, 3007734, 2935598, 4175542, 4298100, 3053212, 2541614, 3021190, 3501877, 3970305, 3260931, 2004358, 1808537, 2499250, 2873950, 2898070, 3526875, 4005373, 2610436, 1319405, 1993463, 1737864, 1715403, 2338266, 2228361, 1657933, 2251481, 2187965, 1697941, 2469292]
16155B469292J059268j93174o61279n49400P80017n2260j227285k69539J138951
16146B494591O66636M56014k83883q82938R731K302885K7701k502107l10279R42414
16136B920765J53410N24294P60720j360719L67370J157257L93852k220374K95614
16127B992189R43238l55568K27273N15754j287557j430224J374104J540827n00393
16118D019643j17079J7959n94511k47558K11472J028394j873193k02509J844798
16109D087416j234731j028931J215815r44240l6304J282661J249346j080083k208897
16100A302052L21460O01411J79654J291623L8695j854487M86138K08867M97670
16091C073083p5109p23910M95192P16580o95693l07077K10934J089058L60134
$$ y = [2469292, 3528560, 3335386, 2674107, 2124707, 2904724, 2852464, 1625179, 1355640, 2494591, 3161227, 3617241, 3333358, 2450420, 2460151, 4763036, 4790737, 2288630, 1978351, 2920765, 3074175, 3598469, 4359189, 2998470, 3365840, 4523097, 4916949, 2696575, 2992189, 3935427, 3579859, 3807132, 4322886, 3035329, 1605105, 2979209, 4520036, 4019643, 3902564, 3920523, 3326012, 3078454, 3289926, 4318320, 2445127, 2242618, 4087416, 2852685, 1823754, 3039569, 2095329, 2059025, 3341686, 4591032, 3510949, 1302052, 1623512, 2224923, 2404577, 3696200, 3734895, 1880408, 2366546, 2575413, 3073083, 2997974, 2274064, 2769256, 3485836, 2790143, 2483066, 2694000, 3783058, 4143192]
16082D143192q1386J38972p82479r38907R98570j312113J4879J070209N52099
16073C803036J48139m09244r09875J328831n46408M47936k82858j403596L85204
16064B561165O13404k28124j04392m17546R42510J54156p09708Q06013q76690
16055B740788n86590Q12563K55330m12841Q59977o73697O8770R83774r49676j045350
16045B053048L66927J77380Q52002K50701L48703N504o28253n73135l47907N91073
16035C096043M67577n45490Q12880m1777j390149J333947J08902j559991J927370
16026D209312n5206j447330L74658m13614q47248N11904J186493K658o99669L16880
16016C138838M34842J723j84558l61948k67563n89578l09947R17088K10298n70331
$$ y = [4143192, 4061806, 4200778, 3418299, 2479392, 3477962, 2165849, 2180728, 3250937, 3803036, 3951175, 3541931, 2632056, 3960887, 3414479, 3862415, 3579557, 2175961, 2561165, 3174569, 2946445, 2842053, 2424507, 3367017, 3521173, 2811465, 3617478, 2740788, 2154198, 2966761, 3222091, 2809250, 3669227, 2995530, 3064300, 4048074, 3098398, 2053048, 2419975, 2597355, 3449357, 3700058, 4048761, 4054265, 3426012, 2852877, 2504970, 3096043, 3563620, 3018130, 3831010, 3789233, 2399084, 3733031, 3841933, 2281942, 4209312, 4154106, 2706776, 3081434, 2667820, 1820572, 2332476, 3518969, 3521627, 2821958, 3138838, 3573680, 3575403, 3390845, 3028897, 2761334, 2171756, 1861809, 2778897, 2989195, 2418864]
16006B418864J110271N44558p27478o25793n11985J36347M21151M59594m70769
15997B754760p79840O56780Q13428o18075M70878L90131k95071q64351k54500
15988B274140k24791N67883J97894J39043N94179m60818K96755N34956j040587
15979B878654r77147J772949l9235j124005N76881R4815l70047J364805l12291
15970C865379k127497J024736N58117O30377J3009j155222n0642K10534l86118
15961B582673O20882m97076m69910Q18673Q55038o41209m91112p08300m54120
15952A615539L92926J798300n42310j257156J47412J066002j29189l25414q99404
15943A866706l92942J081968R64426M5773j306771K03455J087288K56211o83649
$$ y = [2418864, 3529135, 4073693, 3346215, 2720422, 2208437, 2344784, 2765935, 3225529, 2754760, 1974920, 2631700, 3445128, 2827053, 3297931, 3688062, 3392991, 2528640, 2274140, 2049349, 2617232, 2815126, 2954169, 3548348, 3087530, 3384285, 3919241, 2878654, 1901507, 3674456, 3635221, 2511216, 3088097, 3182912, 2812865, 4177670, 3865379, 1737882, 2762618, 3320735, 3951112, 3964121, 2808899, 2758257, 2968791, 2582673, 3203555, 2706479, 2236569, 3055242, 3910280, 3269071, 2777959, 2069659, 1615539, 2008465, 3806765, 3264455, 2007299, 2154711, 3220713, 3091524, 2766110, 1866706, 1473764, 2555732, 3520158, 3565931, 2259160, 2462615, 3549903, 3806114, 3122465]
15934C122465r03525L33892R49389l4163j23545k92323R31273M86120j196573
15925C273010j112357Q55757K48250Q82938j171016l8365m70675N34505L39935
15916C341982p46809o13271J217340O3246p50640R99751m53175n60359q7938L21065
15906B731192j017209R64079K89756k57782q10481J173010J269516q16702p31924
15897B793455N14085j14100J78330N91865j291169o22465K263077l8821j126712
15888C147545M73332m41313n06023K239359J46197j547814J20734K82753r46091
$$ y = [3122465, 2218940, 2552832, 3502221, 3468058, 3344513, 3052190, 3983463, 4469583, 3273010, 2160653, 3016410, 3264660, 4147598, 2976582, 2938217, 2467542, 3002047, 3341982, 2595173, 1981902, 3199242, 3262488, 2511848, 3511599, 3058424, 2498065, 2410127, 2731192, 1713983, 2678062, 2967818, 2710036, 1899555, 3072565, 4342081, 3525379, 2793455, 3307540, 3193440, 3371770, 3963635, 2672466, 2050001, 4313078, 4274257, 3147545, 3620877, 3179564, 2673541, 4912900, 5059097, 3511283, 3632017, 3914770, 2968679]
$$ [...]
##END NTUPLES=NMR SPECTRUM
##END=
