##TITLE=1H_DE-80H_X3
 200.13MHz, d2o
 8 sc
 
 19ns.26.2.2025
##JCAMPDX= 6.0         $$ Bruker NMR JCAMP-DX V2.0
##DATA TYPE= NMR SPECTRUM
##DATA CLASS= NTUPLES
##ORIGIN= UXNMR, Bruker Analytische Messtechnik GmbH
##OWNER= pz
$$ XWIN-NMR		Version 3.5
$$ Mon Apr 20 10:57:13 2026 Russian Standard Time (UT+4h)  Yarkov@DPX200
##.OBSERVE FREQUENCY= 200.1313
##.OBSERVE NUCLEUS= ^1H
##.ACQUISITION MODE= SIMULTANEOUS
##.ACQUISITION SCHEME= undefined
##.AVERAGES= 8
##.DIGITISER RES= 18
##SPECTROMETER/DATA SYSTEM= spect
##.PULSE SEQUENCE= zg30
##.SOLVENT NAME= DMSO
##.SHIFT REFERENCE= (INTERNAL, DMSO, 0, 15.5166)
##AUDIT TRAIL= $$ (NUMBER, WHEN, WHO, WHERE, WHAT)
$$ ##TITLE= Audit trail, XWIN-NMR		Version 3.5
$$ ##JCAMPDX= 5.01
$$ ##ORIGIN= Bruker BioSpin GmbH
$$ ##OWNER= Yarkov
$$ C:/Bruker/XWIN-NMR/data/yarkov2/nmr/H-C/1/pdata/1/auditp.txt
$$ ##AUDIT TRAIL=  $$ (NUMBER, WHEN, WHO, WHERE, WHAT)
(   1,<2026-04-20 10:56:37.03 +0400>,<Yarkov>,<DPX200>,
      <created by zg, POWCHK disabled, PULCHK disabled
       configuration hash MD5:
       00 E9 B6 7A A2 85 ED C7 34 08 36 98 17 FE 4E 26
       data hash MD5: 16K
       B9 7A 38 B2 97 00 C0 DD BB EB 6D 91 B7 D2 A3 1C>)
(   2,<2026-04-20 10:56:42.43 +0400>,<Yarkov>,<DPX200>,
      <Start of raw data processing
       efp BC_mod = 2 LB = 0.25 FT_mod = 6 PKNL = 1 PHC0 = -5302.316 PHC1 = 11.42193 SI = 16K 
       data hash MD5: 16K
       66 14 88 E2 84 84 C3 09 FC AB 1C BE BD BF 8D 8A>)
$$ ##END=
$$ 
$$ hash MD5
$$ 5E 9C F0 0F E9 5B E8 DC FE B1 25 2A E4 8C 66 3E
##$RELAX= 
##$RELAX= 
##$RELAX= 
##$RELAX= 
##$RELAX= 
##$RELAX= 
$$ Bruker specific parameters
$$ --------------------------
##$DU= <C:/Bruker/XWIN-NMR>
##$EXPNO= 1
##$NAME= <H-C>
##$PROCNO= 1
##$TYPE= <nmr>
##$USER= <yarkov2>
##$AMP= (0..31)
100 100 100 100 100 100 100 100 100 100 100 100 100 100 100 100 100 100 
100 100 100 100 100 100 100 100 100 100 100 100 100 100 
##$AQSEQ= 0
##$AQ_mod= 1
##$AUNM= <au_zg>
##$AUTOPOS= <>
##$BF1= 200.13
##$BF2= 200.13
##$BF3= 200.13
##$BF4= 200.13
##$BF5= 200.13
##$BF6= 200.13
##$BF7= 200.13
##$BF8= 200.13
##$BYTORDA= 1
##$CFDGTYP= 0
##$CFRGTYP= 5
##$CHEMSTR= <none>
##$CNST= (0..31)
1 1 145 1 1 1 1 1 1 1 1 1 1 1 1 1 1 1 1 1 1 1 1 1 1 1 1 1 1 1 1 1 
##$CPDPRG= <>
##$CPDPRG1= <>
##$CPDPRG2= <>
##$CPDPRG3= <>
##$CPDPRG4= <mlev>
##$CPDPRG5= <mlev>
##$CPDPRG6= <mlev>
##$CPDPRG7= <mlev>
##$CPDPRG8= <mlev>
##$CPDPRGB= <>
##$CPDPRGT= <>
##$D= (0..31)
0 0.7 0 0 0 0 0 0 0 0 0 0.03 0 0 0 0 0 0 0 0 0 0 0 0 0 0 0 0 0 0 0 0 
##$DATE= 1776668196
##$DBL= (0..7)
120 120 120 120 120 120 120 120 
##$DBP= (0..7)
150 150 150 150 150 150 150 150 
##$DBP07= 0
##$DBPNAM0= <>
##$DBPNAM1= <>
##$DBPNAM2= <>
##$DBPNAM3= <>
##$DBPNAM4= <>
##$DBPNAM5= <>
##$DBPNAM6= <>
##$DBPNAM7= <>
##$DBPOAL= (0..7)
0.5 0.5 0.5 0.5 0.5 0.5 0.5 0.5 
##$DBPOFFS= (0..7)
0 0 0 0 0 0 0 0 
##$DE= 6
##$DECBNUC= <off>
##$DECIM= 32
##$DECNUC= <off>
##$DECSTAT= 4
##$DIGMOD= 1
##$DIGTYP= 9
##$DL= (0..7)
0 120 120 120 120 120 120 120 
##$DP= (0..7)
$$ [...]
##$SUBNAM2= <"">
##$SUBNAM3= <"">
##$SUBNAM4= <"">
##$SUBNAM5= <"">
##$SUBNAM6= <"">
##$SUBNAM7= <"">
##$SUBNAM8= <"">
##$SUBNAM9= <"">
##$SW= 18.0517328524113
##$SWIBOX= (0..15)
0 0 2 0 0 0 0 0 0 0 0 0 0 0 0 0 
##$SW_h= 3612.71676300578
##$TD= 16384
##$TD0= 1
##$TE= 0
##$TE2= 300
##$TE3= 300
##$TEG= 300
##$TL= (0..7)
0 120 120 120 120 120 120 120 
##$TP= (0..7)
150 150 150 150 150 150 150 150 
##$TP07= 0
##$TPNAME0= <>
##$TPNAME1= <>
##$TPNAME2= <>
##$TPNAME3= <>
##$TPNAME4= <>
##$TPNAME5= <>
##$TPNAME6= <>
##$TPNAME7= <>
##$TPOAL= (0..7)
0.5 0.5 0.5 0.5 0.5 0.5 0.5 0.5 
##$TPOFFS= (0..7)
0 0 0 0 0 0 0 0 
##$TUNHIN= 0
##$TUNHOUT= 0
##$TUNXOUT= 0
##$USERA1= <user>
##$USERA2= <user>
##$USERA3= <user>
##$USERA4= <user>
##$USERA5= <user>
##$V9= 5
##$VALIST= <valist>
##$VCLIST= <CCCCCCCCCCCCCCC>
##$VD= 0
##$VDLIST= <DDDDDDDDDDDDDDD>
##$VPLIST= <PPPPPPPPPPPPPPP>
##$VTLIST= <TTTTTTTTTTTTTTT>
##$WBST= 1024
##$WBSW= 4
##$XGAIN= (0..3)
0 0 0 0 
##$XL= 0
##$YL= 0
##$YMAX_a= 85072
##$YMIN_a= -92073
##$ZGOPTNS= <>
##$ZL1= 120
##$ZL2= 120
##$ZL3= 120
##$ZL4= 120
##$ABSF1= 0
##$ABSF2= 0
##$ABSG= 0
##$ABSL= 0
##$ALPHA= 0
##$AQORDER= 0
##$ASSFAC= 0
##$ASSFACI= 0
##$ASSFACX= 0
##$ASSWID= 0
##$AUNMP= <proc_1d>
##$AZFE= 0.1
##$AZFW= 0.1
##$BCFW= 0
##$BC_mod= 2
##$BYTORDP= 0
##$COROFFS= 0
##$CY= -3
##$DATMOD= 1
##$DC= 0
##$DFILT= <>
##$DTYPP= 0
##$F1P= 0
##$F2P= 0
##$FCOR= 1
##$FTSIZE= 16384
##$FT_mod= 6
##$GAMMA= 0
##$GB= 0
##$INTBC= 1
##$INTSCL= 3.241238e-09
##$ISEN= 128
##$LB= 0.25
##$LEV0= 0
##$LPBIN= 0
##$MAXI= 10000
##$MC2= 0
##$MEAN= 0
##$ME_mod= 0
##$MI= 1.114404
##$NCOEF= 0
##$NC_proc= -8
##$NLEV= 6
##$NOISF1= 3.799351
##$NOISF2= 2.8
##$NSP= 0
##$NTH_PI= 0
##$NZP= 0
##$OFFSET= 15.51662
##$PC= 1
##$PHC0= -5302.316
##$PHC1= 11.42193
##$PH_mod= 1
##$PKNL= yes
##$PPARMOD= 0
##$PSCAL= 0
##$PSIGN= 0
##$REVERSE= no
##$SF= 200.13000101799
##$SI= 16384
##$SIGF1= 3
##$SIGF2= 2
##$SINO= 0.751879
##$SIOLD= 32768
##$SREGLST= <19F.Aceton>
##$SSB= 0
##$STSI= 16384
##$STSR= 0
##$SW_p= 3612.71676300578
##$SYMM= 0
##$S_DEV= 0
##$TDeff= 16384
##$TDoff= 0
##$TI= <>
##$TILT= no
##$TM1= 0
##$TM2= 0
##$TOPLEV= 0
##$USERP1= <user>
##$USERP2= <user>
##$USERP3= <user>
##$USERP4= <user>
##$USERP5= <user>
##$WDW= 1
##$XDIM= 16384
##$YMAX_p= 452395803
##$YMIN_p= -4647824
$$ End of Bruker specific parameters
$$ ---------------------------------
##NTUPLES= NMR SPECTRUM
##VAR_NAME=  FREQUENCY,     SPECTRUM/REAL,   SPECTRUM/IMAG
##SYMBOL=    X,             R,               I
##VAR_TYPE=  INDEPENDENT,   DEPENDENT,       DEPENDENT
##VAR_FORM=  AFFN,          ASDF,            ASDF
##VAR_DIM=   16384,         16384,           16384
##UNITS=     HZ,            ARBITRARY UNITS, ARBITRARY UNITS
##FACTOR=    0.220516191357247, 1,           1
##FIRST=     3105.34111281687, 0,            0
##LAST=      -507.375650188914, 0,           0
##MIN=       -507.375650188914, -4647824,    0
##MAX=       3105.34111281687, 452395803,    0
$$ Real data points
##PAGE= N=1
##DATA TABLE= (X++(R..R)), XYDATA
$$ [...]
11854e16162L35867p06276O533J198949J201610j069687J43382J47318m87397
11845B54137L74468j189045J330819k18530N94706K0907j287394R04480Q70159
11836A654707o86841j24028L1099p56414j184214O72856k75539Q98556k65984
11827c5802j025253J80983K37194J197493O64802o83029o35198o3865L97586k60293
11817b5382J13499K92828J78365o3842j82413J93131q35495j72385N12538m03750
11807c92906q49112O49469n68792p8084Q96116n52717O59700N31861j326489K15234
11797h15720J505150l37904J540636N92139j248246M61914K68335n54815q15352
11788E96137L9844R2289o51900J189003P90404P85073k196862j385030r96650
$$ plain form
11854 -516162 -180295 -886571 -880038 318911 1520521 450834 594216 741534 254137
11845 254137 628605 -560440 770379 551849 1146555 1167462 -119932 784548 1654707
11836 1654707 967866 843838 874937 118523 -1065691 -392835 -668374 230182 -35802
11827 -35802 -1061055 -880072 -642878 554615 1219417 536388 -98810 -162675 234911 -25382
11817 -25382 88117 380945 559310 495468 313055 506186 -329309 -501694 10844 -392906
11807 -392906 -1242018 -592549 -1161341 -1239425 -343309 -896026 -236326 295535 -1030954 -815720
11797 -815720 689430 351526 1892162 2484301 1236055 1697969 1966304 1411489 596137
11788 596137 635981 728270 76370 1265373 2055777 2840850 643988 -741042 -1737692
11779a737692p25334P86331Q51225J069031n91661J084516n19794J93866k95375
11770A15113l33088j155909m63752R84587K360671l90669j359618o7507l00307
11761f10479L46208R16546m92710j122329K03349r08384k45050Q19376M59776
11752f33697P09199P8060O48460J58444n30813m08541l78648J16317P29075j53822
11742C34034M38730J09742K6895p28655j496272m54878n57158O61446N52211O60269
11732d53636k39372Q40619q6826j306208K9608M69679K44400M42897M92489J014452
11722A448102k51413J81050q78862m7027j23333J066296o77740j257167m15976
11713i56070o25743J263613K21596Q53855J6490L03418o72972j9518o86701O91022
$$ plain form
11779 -1737692 -2463026 -1676695 -825470 243561 -348100 736416 216622 410488 115113
11770 115113 -217975 -1373884 -1837636 -853049 1507622 1116953 -242665 -310172 -610479
11761 -610479 -264271 652275 159565 -962764 -759415 -1667799 -1912849 -1093473 -633697
11752 -633697 75502 153562 802022 960466 429653 21112 -357536 -241219 487856 334034
11742 334034 772764 882506 909401 180746 -1315526 -1770404 -2327562 -1666116 -1113905 -453636
11732 -453636 -693008 147611 60785 -1245423 -1215815 -746136 -501736 -58839 433650 1448102
11722 1448102 1196689 1377739 498877 451850 328517 1394813 717073 -540094 -956070
11713 -956070 -1581813 -318200 -96604 757251 773741 1077159 404187 384669 -302032 388990
11703C88990M63596n16370l43177r09420O58158r74422M68739j17082q99796J076963
11693g03821l85716j12657K12165J218157n30830r43588k51211K98972J146022
11684e2507o94233O83906O12764O01908J58454j191377j000424N27884J056560
11675G02935o5613j038070q67893O98059l52048m71771J416240m71571k98481
11666g48213O75605o57477L22695O0082J12418j552632K00763J318722P18282
11657D50245r06528r5771j353005l57935J803900J30348Q16608j378377r06420
11648a796935N03724R9715j8129K28273j137101p78359J051764K85015M30197
11639a131836J505831j829444O70237q3720n35444k3500J78603J46956N87087
$$ plain form
11703 388990 852586 336216 -6961 -916381 -258223 -1232645 -763906 -880988 -1780784 -703821
11693 -703821 -1089537 -1202194 -990029 228128 -302702 -1246290 -1497501 -1198529 -52507
11684 -52507 -746740 -62834 549930 1151838 1310292 118915 -881509 -353625 702935
11675 702935 637322 -400748 -1268641 -570582 -922630 -1394401 21839 -449732 -748213
11666 -748213 -72608 -730085 -407390 -347308 -234890 -1787522 -1586759 -268037 450245
11657 450245 -456283 -552054 -1905059 -2262994 -459094 -328746 487862 -890515 -1796935
11648 -1796935 -1293211 -1193496 -1211625 -983352 -2120453 -2898812 -1847048 -1562033 -1131836
11639 -1131836 373995 -1455449 -785212 -868932 -1404376 -1427876 -1249273 -1102317 -515230
11630e15230p16174o41892O33520j51090J528375j41955r94207K02071O48214
11621a48368j081721k76404O38253p65931R36221J334738M04039J140878j45865
11612B035840j300503m24255K79543j188193K7311j400804K17481R84834P6256
11603f92490k72033j28149n21373K61587P14216L22375Q57369K68839j588596
11594g78255K08896n12915o75534K74800j307870K83254Q63795O57072J437138
11585D50381J116750p66809k44361n04716J58914l30912K87751n59963J33143
11576b59822R8293K16076P70870O49652j16748j260n40575q84485O52951k7487
11566E57465j601419m89765O30873O5100M12637Q67632n23410j235869J05266
$$ plain form
11630 -515230 -1231404 -1873296 -1239776 -1390866 137509 -4446 -998653 -796582 -148368
11621 -148368 -1230089 -1506493 -868240 -1634171 -697950 636788 1040827 2181705 2035840
11612 2035840 735337 311082 590625 -597568 -570257 -1971061 -1753580 -768746 -692490
11603 -692490 -964523 -1092672 -1614045 -1352458 -638242 -315867 541502 810341 -778255
11594 -778255 -569359 -1082274 -1757808 -1483008 -2790878 -2507624 -1643829 -986757 450381
11585 450381 1567131 800322 555961 51245 210159 -120753 166998 -392965 -259822
11576 -259822 -161529 54547 825417 1475069 1358321 1357061 816486 -67999 584952 557465
11566 557465 -1043954 -1533719 -902846 -837746 -425109 442523 -80887 -1316756 -1211490
11557a211490M51473j08918O39305J10660o67633P35686Q33070K86308k383819
11548a315358j917603k60326J954142J001105L61719J242171j082360K4196M54752
11539D62438J7537j287979m53666M3309m59879J276610K226292K04211j716651
11530C12222p93596J215047j76062J73230Q09435J96618n94405k23276j97519
11521G21694r32957m14531K69236k37302j233509O63445K59509q70468p66452
11512b541335R85199P63357J163515M09437J090618m42129k81525O46998n78289
11503A215846r61853R00895n04822o43542L25799J204698P32145k99907L09805
11494B279064j85920J817n97274l08090j040833K75129m22040q21838J11554k04609
$$ plain form
11557 -1211490 -760017 -868935 -229630 -118970 -786603 -50917 782153 1068461 -1315358
11548 -1315358 -3232961 -3493287 -1539145 -538040 -176321 1065850 -16510 7686 462438
11539 462438 479975 -808004 -1261670 -1218361 -1678240 -401630 1824662 2028873 312222
11530 312222 -481374 733673 557611 730841 1540276 1736894 1142489 919213 721694
11521 721694 -211263 -625794 -356558 -593860 -1827369 -1163924 -904415 -1774883 -2541335
11512 -2541335 -1556136 -792779 370736 780173 1870791 1428662 1147137 1794135 1215846
11503 1215846 253993 1154888 650066 6524 332323 1537021 2269166 1969259 2279064
11494 2279064 2093144 2094961 1497687 1189597 148764 423893 1853 -819985 -708431 -913040
11484i13040P38443J108499n32657J75167K68343l12473p55762p05510j60665
11475a089655m78544j488063R29629l14456Q17866J997398l07895q88267L52940
11466d69047l42082M34189J458842q96624P49444j277117j243310J630244n99661
11457e55122m89225K26543o39685P17318K141701J05417p09754l9779j203082
11448d45668O27623j042384k798l95078n62179n25789J119517j75693Q94911P3400
11438d34138p98525O81143N92891j7618r89818l10016q35916P46920M35998k50090
11428a179169J46701O86218K56273K25553J115767N17703o9750r5432n16900K29580
11418A316544l49434K59833j647857N76302J112357m01627l77706q0450J04117
$$ plain form
11484 -913040 -174597 933902 401245 576412 844755 532282 -223480 -928990 -1089655
11475 -1089655 -1568199 -3056262 -2126633 -2441089 -1623223 374175 66280 -821987 -469047
11466 -469047 -811129 -376940 1081902 185278 934722 -342395 -1585705 44539 -555122
11457 -555122 -1044347 -817804 -1457489 -740171 1401530 1506947 797193 757414 -445668
11448 -445668 181955 -860429 -863227 -1258305 -1820484 -2346273 -1226756 -1402449 -507538 -434138
11438 -434138 -1232663 -551520 41371 23753 -966065 -1276081 -2111997 -1365077 -929079 -1179169
11428 -1179169 -1032468 -346250 -89977 135576 1251343 1769046 1699296 1603864 1086964 1316544
11418 1316544 967110 1226943 -420914 155388 1267745 866118 488412 407962 512079
11409E12079J67247P65754o31044q11987m24280n13153k26880l03215O74508o59824
11399a450795J28413J418155J698430M94198r24413r34972r57965p1634L90120
11390b10463L58096r7722J5448Q14556m57112j15263k75494p44689k86475M9912
11380i49206J45264J291102J069983l09050o10965r10551n71550m08573N21859
11371g31687J081147p5049o31607j364871o88240J477612O17080l99110o96025
11362a410750O5926O00715J386708r62069j5410n1670p27900j194290N58176K09239
11352a541325L55296R08824n53176l59795K4862R4438j176583o32742J546279
11343a333922m30134j29475J75471m60754P22097N61152M85234J353806J383490
$$ plain form
11409 512079 679326 1445080 814036 2049 -422231 -935384 -1162264 -1465479 -790971 -1450795
11399 -1450795 -1322382 95773 1794203 2288401 1363988 429016 -528949 -600583 -210463
11390 -210463 147633 49911 65359 879915 422803 307540 32046 -712643 -999118 -949206
11380 -949206 -803942 487160 1557143 1248093 637128 -273423 -844973 -1253546 -731687
11371 -731687 349460 274411 -357196 -1722067 -2410307 -932695 -315615 -714725 -1410750
11362 -1410750 -1344824 -744109 642599 -319470 -334880 -386550 -1114450 -2308740 -1750564 -1541325
11352 -1541325 -1186029 -277205 -830381 -1190176 -1165314 -1070876 -2247459 -2880201 -1333922
11343 -1333922 -1764056 -1893531 -1718060 -2178814 -1456717 -895565 -410331 943475 2326965
11334B326965p0224l20951q81856m94333k4462j39154n77813O40016P75586J54311
11324A388085j055529q95672j20902q89078l88150J998571N29678M7324R01064
11315A515391j83721j778645p87149j488030q3109P00919O83443k74544M50406
11306a245039O17196J365068m13206j660732j58330M46291M37603n45842k10900
11297a367891n77526Q31269j123356L56838L94479O36138J479529J78631l25292
11288D82819J76707O5747r5738p9876Q72527O67287m68566j503924O72892R25936
11278A715811r05662M24706n61188o62917J215156j10225q60270p63148J69293
11269c38444J0397j324494l72330J221839j90418k59219M33578n38994L70814
$$ plain form
11334 2326965 2256741 1935790 1053934 559601 535139 395985 -181828 458188 1233774 1388085
11324 1388085 332556 -563116 -684018 -1573096 -1961246 37325 567003 614327 1515391
11315 1515391 1331670 -446975 -1234124 -2722154 -2805263 -2104344 -1420901 -1695445 -1245039
11306 -1245039 -627843 737225 324019 -1336713 -1495043 -1048752 -611149 -1156991 -1367891
11297 -1367891 -1945417 -1114148 -2237504 -1880666 -1486187 -850049 629480 808111 482819
11288 482819 659526 725273 629535 549659 1422186 2089473 1620907 116983 789875 1715811
11278 1715811 810149 1234855 673667 10750 1225906 1115681 255411 -507737 -338444
11269 -338444 -328047 -1652541 -2024871 -803032 -993450 -1252669 -819091 -1358085 -987271
11260i87271L52521j186391K28176p16121k01714j36511K8953J179763J715189
11251B76594l10452j665176P55361n93399J059011J485302M96177q49905O72144
11242A325657q04912q12018N64324J036036q37803j457808J029864O31456o01538
11233G3258n24105k93879k71825K81604J347897j826501m89325P11583m04620
11224a395913k99516p5757r0406l96746M7549K72566J516187m39261J27397j056078
11214a789978N63850Q88957k8747o82371r3774O36851L99865j54328L6529j92447
11204d15593N36960N99489m8599N29648k65651j045187j121188L24679L38002
11195e67440O69865n37327o48817K19802L45929K67825J046739k06868n01060
$$ plain form
11260 -987271 -634750 -1821141 -1592965 -2309086 -2510800 -2647311 -2618358 -1438595 276594
11251 276594 -33858 -1699034 -943673 -1537072 -478061 1007241 1503418 653513 1325657
11242 1325657 520745 -291273 273051 1309087 471284 -986524 43340 674796 73258
11233 73258 -450847 -744726 -1016551 -734947 612950 -1213551 -1702876 -991293 -1395913
11224 -1395913 -1695429 -1771186 -1861592 -2258338 -2210789 -1938223 -422036 -861297 -733900 -1789978
11214 -1789978 -1226128 -337171 -365918 -1048289 -1142063 -505212 -105347 -259675 -223146 -415593
11204 -415593 121367 720856 672257 1201905 936254 -108933 -1230121 -905442 -567440
11195 -567440 102425 -434902 -1083719 -863917 -517988 -250163 796576 589708 88648
11186H8648P09523r78756n24069m55846o51482J54579K98967k0935J278818o02492
11176g03045M99052M17607l24169p85405J055242L06492L76249M97119p65654
11167E73488m10106k78251J368545Q0992L90591j606840P13390n18287J534692
11158A848214O64329j505168j176765n02437o39137M47930Q5153r13114J85772
11149a505223l27537k01757J393653O90083j017739M67162m33343n83790J320939
11140a97552N41348r84015P18280m54222j061546j045323M76855M35417O04275
11131i66483J114383n82703j150507l507K79234r450M19579J61284j280627l29073
11121b347870J107338O46183r10687j10666l01106o86275J342477R95513J28282
$$ plain form
11186 88648 798171 -180585 -704654 -1160500 -1811982 -1657403 -1358436 -1379371 -100553 -703045
11176 -703045 -203993 213614 -110555 -895960 159282 465774 842023 1339142 573488
11167 573488 163382 -114869 1253676 1334668 1725259 118419 831809 313522 1848214
11158 1848214 2512543 1007375 -169390 -671827 -1310964 -863034 -777881 -1690995 -1505223
11149 -1505223 -1832760 -2034517 -640864 49219 -968520 -501358 -934701 -1518491 -197552
11140 -197552 343796 -640219 78061 -376161 -1437707 -2483030 -2006175 -1570758 -966483
11131 -966483 147900 -434803 -1585310 -1588817 -1309583 -1319033 -899454 -738170 -2018797 -2347870
11121 -2347870 -1240532 -594349 -1505036 -1615702 -1916808 -2603083 -1260606 -265093 -136811
11112a36811j063915j017055k17616J37004Q21654O83025M61729N6980R82596
11103G07591l37007j283339l32269O93010J72836o41700O85718J451874k19586
11094H97128J43358L79113q77856K60065j52184j395436M45244K47092j65767
11085b19243j87321j241425P74212L76246Q2343r27752J054206o25227Q58916
11076e5045q73499P23030R29502l81613L3930K0765r8004j08919Q31893n45134
11066D76906P95369M25442j79592j11864K12446M40867M6018j131160j302019
11057c27587k80669p7957j624367M02345L94044J04712J035258R30129j063913
11048e08005l9067O85846l36508L92655r21111p70276m39703L77996O24273p78976
$$ plain form
11112 -136811 -1200726 -2217781 -2435397 -2298393 -1476739 -793714 -331985 -275005 707591
11103 707591 370584 -912755 -1245024 -552014 -379178 -1020878 -335160 1116714 897128
11094 897128 1040486 1419599 541743 801808 649624 -745812 -300568 -53476 -219243
11085 -219243 -406564 -1647989 -873777 -497531 -415188 -1342940 -288734 -913961 -55045
11076 -55045 -928544 -205514 723988 342375 376305 397070 299066 190147 1022040 476906
11066 476906 1272275 1697717 1518125 1406261 1618707 2059574 2105592 974432 -327587
11057 -327587 -608256 -686213 -2310580 -1908235 -1514191 -1409479 -374221 555908 -508005
11048 -508005 -547072 138774 -197734 194921 -726190 -1496466 -1936169 -1558173 -933900 -1712876
11038a712876m85500k42454J135412L8194J704731J09899n90671o97309j031776
11029a772350m41790J385453P07986q03384o88723J44049p6769R10054J306344
11020F70870P33333k12857n29161R82919M07500K74810K35147j253124j270840
11011C8597k18788m62826j139898j41365J124900M94184M04607k41122J145607
11002A003896k02400k81937k00120j015451p25569J075681j00o20352P28599N43563
10992C05810n72676m88914R51301N62093j052572N20720Q73087l46852N19438
10983A271435N53438j589375q02891L92080j14668M32630P75850J247758j406581
10974G59676j98890Q73997m3891P70228Q62880o23172j816613o61551o55140J041596
$$ plain form
11038 -1712876 -2198376 -2440830 -1305418 -1267224 437507 547406 -43265 -740574 -1772350
11029 -1772350 -2214140 -828687 -120701 -924085 -1612808 -1468759 -1545528 -635474 670870
11020 670870 1404203 1191346 662185 1645104 2052604 2327414 2562561 1309437 38597
11011 38597 -180191 -643017 -1782915 -1924280 -799380 -305196 99411 -141711 1003896
11002 1003896 801496 519559 319439 -696012 -1421581 -345900 -346000 -966352 -237753 305810
10992 305810 -266866 -755780 195521 757614 -294958 225762 1098849 751997 1271435
10983 1271435 1824873 235498 -567393 -175313 -289981 142649 918499 2166257 759676
10974 759676 560786 1434783 1390892 2161120 3024000 2400828 584215 -77336 -732476 309120
10964C09120k7610J85891q9551l30678K07230J566942m28915q80095o18628l81136
10954d87430P50495n26059k27608n64255n12904P38114J531051j230395r1346
10945f20337K78239j2502Q44871J299641l07346k47714o05799k38200K5864P82424
10935A199141L5532J5123m42507L17315M99281p26528o72152N51499J029804L49862
10925B156370J74659j899752j78926m67886J52059K9632K90569j67373j120008
10916a030656r19338P59093J961694J095230q28425q39934j642903L50571n16856
10907a611524l871P46826J199658P88158j235294N38856L64724m47294j025936
10898f85697L96931K41510m23570k17225q80563N1516J446929J135763M73562
$$ plain form
10964 309120 281510 467401 377850 47172 254402 1821344 1392429 512334 -106294 -487430
10954 -487430 263065 -262994 -490602 -1054857 -1567761 -829647 701404 -528991 -620337
10945 -620337 -342098 -354600 490271 1789912 1482566 1234852 629053 390853 416717 1199141
10935 1199141 1234673 1249796 807289 1124604 1623885 897357 225205 776704 1806508 2156370
10925 2156370 2331029 431277 252351 -215535 -63476 -33844 256725 89352 -1030656
10916 -1030656 -1949994 -1190901 770793 1866023 1037598 197664 -1445239 -1094668 -1611524
10907 -1611524 -1615395 -868569 331089 1119247 -116047 422809 787533 340239 -685697
10898 -685697 -288766 -47256 -470826 -688051 -1568614 -1517098 -70169 1065594 1539156
10889A539156j475394K25393o82216p95805J19820J462643n88015j088839L37903
10880i45354J13796O82855J87748m08326l85308K97215j334914p47016K00140
10871b339164J79250J203634O80174L4215n01341J1794j161338q49057M1518J078123
10861a622192J330551j271593N58804M00923n16147J148674O66438j756400p04381
10852a765323R21917m63613J186182N95424m80693j29305j142159q5857Q33281
10843e30146j55969k47251O90047j218343J275788m46067j344469N46813P52864
10834f76733N34753J191164m7294j268568K70790r80130K55525R57249K45923
10825D82679O44950o16345n9721O47458n5026k36452j54565k5423o95027J738678
$$ plain form
10889 1539156 63762 289155 -393061 -1188866 -1069046 393597 -194418 -1283257 -945354
10880 -945354 -831558 -148703 39045 -369281 -754589 -457374 -1792288 -2539304 -2339164
10871 -2339164 -2159914 -956280 -276106 -241891 -743232 -731438 -1892776 -2741833 -2700315 -1622192
10861 -1622192 -291641 -1563234 -1004430 -603507 -1119654 29020 695458 -1060942 -1765323
10852 -1765323 -843406 -1307019 -120837 474587 -6106 -135411 -1277570 -1363427 -530146
10843 -530146 -686115 -933366 -243319 -1461662 -185874 -631941 -1976410 -1429597 -676733
10834 -676733 -141980 1049184 1001890 -266678 4112 -976018 -720493 236756 482679
10825 482679 1127629 511284 451563 1099021 1043995 807543 652978 627555 -67472 1671206
10815A671206j47758J47894J72899n21977j89620j493090j025856L40299P58851
10806b87152J42997J728086k32968k116511O35911L12363q66449J163101R34539
10797A413917j912760o33545l75594J06102Q32877k63593J131730n10886j86161
10788c97913P77782j85664r02297P23910J5453j477438N86671p95272R72289J292304
10778F09825p88041J22607K32432q44006j69064Q44550j156074N95915Q04817
10769B52961q99284j88881j46518M2383n75590R84504R05806P43452o43505J7258
10759D92586j13633O0527R52423J54213k98734p76630R5622j545129P82307k75347
10749d71795j68255J578499M38338k42480r3244j84198k41069M21129m5975j228846
$$ plain form
10815 1671206 1523448 1671342 1844241 1322264 1132644 -360446 -1386302 -1046003 -287152
10806 -287152 -144155 1583931 1350963 -765548 -129637 182726 -683723 479378 1413917
10797 1413917 -498843 -1132388 -1507982 -1401880 -569003 -832596 299134 -211752 -397913
10788 -397913 379869 194205 -708092 15818 31271 -1446167 -859496 -1654768 -682479 609825
10778 609825 -178216 -55609 176823 -667183 -836247 8303 -1147771 -551856 252961
10769 252961 -646323 -835204 -981722 -939339 -1514929 -530425 375381 1118833 475328 492586
10759 492586 378953 439480 1391903 1546116 1247382 470752 566374 -978755 -196448 -471795
10749 -471795 -640050 938449 1376787 1134307 1041063 856865 615796 1036925 990950 -237896
10739b37896M98182l81248J058517N98299L62293N55251j025849j735188r7009
10730d04648P79581k69950M83717q10623K79751L62950K77651r09899j117344
10721a328814O0090J586038J78287j23355o45752j057530l75943R06180K92267
10712e08532o6573o50656k22048R62847R06411J47112O10940j043079q06760J347855
10702F77517r32473j180908m28048J84485L8280O10491R67455N85971J21930Q18718
10692A463418k66337j003258j55552j95038k348780k06166J666494J292564P42127
10683I89472N52434j008211k58695l54021K66125K5007j180807P42263o74413
10674i00846P68524J116452K46823r69932j887345j065680J114803Q55877M15469
$$ plain form
10739 -237896 260286 -120962 937555 1535854 1898147 2453398 1427549 -307639 -404648
10730 -404648 374933 104983 588700 -221923 57828 420778 698429 -211470 -1328814
10721 -1328814 -1268724 317314 495601 372246 -273506 -1331036 -1706979 -800799 -508532
10712 -508532 -575105 -1225761 -1447809 -484962 421449 568561 1179501 136422 -670338 677517
10702 677517 -254956 -1435864 -1863912 -1679427 -1641147 -1030656 -63201 522770 644700 1463418
10692 1463418 1197081 193823 38271 -156767 -2505547 -2711713 -1045219 247345 989472
10683 989472 1541906 533695 275000 -79021 187104 212111 -968696 -226433 -900846
10674 -900846 -132322 984130 1230953 261021 -1626324 -2692004 -1577201 -721324 -305855
10665c05855M63825m33334K87445n4216p62097P55040m31480j77347l48855o3083
10655a069957M7064J281291N95803j085707j37054P88777J092315J64728N14912
10646B192172j78178j425010q8943Q20029q75091J86406M91989r76931o18737
10637d72294O36992K3765j047813K43300R88461o64655J52963m76213K6214K58206
10627c31074m3268N71336o14015j444723J198791k33238k02305J795142o2974
10618F33672r74696j58027P56727q10550m20642R74826L60613r92489L9478O62725
10608G1637j145199q2005J594351p91343K24140J079911m79207k76911O89657
10599H85031k87162p90181n46406n58122j36459p04194J194468N81984J58594
$$ plain form
10665 -305855 157970 -275364 12081 -42135 -804232 -49192 -480672 -658019 -1006874 -1069957
10655 -1069957 -1022893 258398 854201 -231506 -368560 420217 1512532 1677260 2192172
10646 2192172 2013994 588984 500041 1320070 444979 631385 1123374 146443 -472294
10637 -472294 164698 188463 -859350 -616050 372411 -292244 -139281 -615494 -589280 -331074
10627 -331074 -374342 196994 -417021 -1861744 -662953 -896191 -1098496 696646 633672
10618 633672 -341024 -499051 257676 -552874 -973516 1310 361923 -630566 -591088 71637
10608 71637 -1073562 -1155567 438784 -352559 -128419 951492 472285 195374 885031
10599 885031 597869 -192312 -738718 -1296840 -1433299 -2137493 -943025 -361041 -202447
10590b02447Q27140j61209q38796n3290p48802l82277M51832J160800m08048Q0366
10580b74731r93326l55664N21014J34456M12550N62623o02819j048770J025805
10571f18862N71656L70795l5617n75679j379291J515746j47113m77515m69987
10562a245867K26132J41616l4613q15284k52398p91417R97676J098040k20482
10553h96597O12189O82562j343509K84039J581861M41824Q79719r31161n32769
10544G78158n14948k6607m14875J132124P40466N75270p24336r82049L9759N4413
10534F57375l55642J43973q47583P72125J27674m61120o98410j27197m78496o45524
10524a912825N60674O0597k8602J37761J281967j49948N49061q16075j608264
$$ plain form
10590 -202447 624693 463484 -375312 -428602 -1177404 -1559681 -1107849 52951 -355097 -274731
10580 -274731 -1268057 -1623721 -1102707 -968251 -555701 6922 -595897 -1644667 -618862
10571 -618862 -47206 323589 287972 -287707 -1666998 -151252 -298365 -775880 -1245867
10562 -1245867 -1019735 -878119 -912732 -1728016 -1980414 -2771831 -1774155 -676115 -896597
10553 -896597 -284408 398154 -945355 -661316 920545 1362369 2242088 1310927 778158
10544 778158 263210 236603 -178272 953852 1694318 2269588 1545252 563203 602962 657375
10534 657375 301733 445706 -401877 370248 497922 36802 -661608 -788805 -1267301 -1912825
10524 -1912825 -1352151 -1291554 -1320156 -1182395 99572 -50376 498685 -317390 -1925654
10515a925654M5916P58752R63164R11805K65878L78060j604362j113175J43909
10506a175707J248834P80782J609323j73010q03537j31005j444990p4038p42297
10497i05645o11806K23652J4218k24005J710735N44285l91121Q06192l45415j226535
10487d05445l45704N15010k17927l41832N51598k30612j262180M34568J335929
10478C3405m94684o32521J227542j72655o26628R71598J00719j456408N76288
10469d73344J102562l49307l51983N6980P0493j60948N01162N98296n55927j482454
10459a044470m18778P2882j20133O81674J20690j085866m49445N42427q56530
10450b557549j606990m83285J070295M11298R04630j45507k61189M16246k51544
$$ plain form
10515 -1925654 -1879738 -1120986 -157822 753983 1019861 1397921 -206441 -1319616 -1175707
10506 -1175707 73127 853909 2463232 2290222 1486685 1355680 -89310 -163348 -905645
10497 -905645 -1517451 -1293799 -1279581 -1503586 207149 751434 360313 1166505 821090 -405445
10487 -405445 -751149 -236139 -454066 -795898 -244300 -474912 -1737092 -1302524 33405
10478 33405 -461279 -1093800 133742 -38913 -665541 306057 406776 -1049632 -473344
10469 -473344 629218 279911 -72072 -15092 55401 -105547 395615 993911 437984 -1044470
10459 -1044470 -1463248 -1390366 -1510499 -828825 -708135 -1794001 -2243446 -1701019 -2557549
10450 -2557549 -4164539 -4647824 -3577529 -3166231 -2261601 -2407108 -2668297 -2252051 -2503595
10441b503595R01100o35782j37021q22548L69317J169501J580806P63028M2476
10432G27282p57719K36098J364634j32766q91528L20434J08169n62274N32582
10423I44912n8363n12946j011546j049500k7564j8152j64434q35952l02741P01989
10413b334297J990048J754515m14557m27424l92220P20471r66791R62454k13252
10404F78947j115105K36770m24017N89539J203863N82488k87144N37354K37313
10395B240008k32278r10476j098968M32879J66492o60452k31881j590003n92847
10386b477526J758418Q76101j31348J257283m44193k43526R79084L54418r01211
10377A027500l65739j290476p82305K78950J210031L41286p19421l80369J174279
$$ plain form
10441 -2503595 -1602495 -2238277 -2375298 -3197846 -2828529 -1659028 -78222 684806 727282
10432 727282 -30437 205661 1570295 1437529 546001 866435 974604 412330 944912
10423 944912 886549 373603 -637943 -1687443 -1715007 -1733159 -1897593 -2733545 -3036286 -2334297
10413 -2334297 -344249 1410266 995709 568285 176065 896536 -70255 892199 678947
10404 678947 -436158 -199388 -623405 -33866 1169997 1752485 1465341 2002695 2240008
10395 2240008 2007730 1097254 -1714 431165 597657 -62795 -294676 -1884679 -2477526
10386 -2477526 -719108 156993 25645 1282928 838735 595209 1574293 1928711 1027500
10377 1027500 661761 -628715 -1411020 -1132070 77961 419247 -300174 -680543 493736
10368D93736M40447m1908J27661j796041l25410O23670n18898k68743J552659
10359B87173n05257o65962q05008j87787K123132J91556p54407r56610O02518
10350f70652J11084L77119p70837n38834M08188l52160L84745k42034J440509
10341A47128K53424l61623n6816J201971r4983q19466k87634j588514L85935Q26409
10331c94169j168077n89962K45913J183807o49050J706436J389449M03733p12599
10322A415481p00787q69107N16599Q83024j052150o29513j9911J219685N08820
10313A272141M71011p85304o13686J005350P4187J17099p58285r03457j96685
10304c17629J343841M68964K32863J335874j618593j226271n69659k16566j137439
$$ plain form
10368 493736 934183 892275 1019936 -776105 -1101515 -477845 -996743 -1265486 287173
10359 287173 -218084 -884046 -1689054 -1876841 246291 437847 -316560 -1273170 -670652
10350 -670652 -559568 -182449 -953286 -1492120 -1083932 -1436092 -1051347 -1293381 147128
10341 147128 400552 38929 -17887 1184084 1089101 269635 -17999 -1606513 -1220578 -394169
10331 -394169 -1562246 -2152208 -1906295 -722488 -1371538 334898 1724347 2128080 1415481
10322 1415481 714694 -154413 362186 1245210 193060 -436453 -456364 763321 1272141
10313 1272141 1743152 957848 344162 1349512 1423699 1540798 782513 -120944 -317629
10304 -317629 1026212 1495176 1728039 3063913 1445320 219049 -350610 -567176 -1704615
10295a704615o02511N41700n24974J285365P90874l38294p10959N59489J79131
10286e24794j904217J242664L21827j39750Q3391R2878Q93858O04635M60977j12633
10276A018836p53665R8492J154182q97840j41573R33388k91732o96514M59036
10267H82610O66837o1849n70884j681133K43022r19932m95796M72641j50986P10515
10257i04955J267838n52940k295505j37591j89119k66103Q77598N37860R06755
10248g56162j85354J44617O57766K83147O3108k16812n05903j154114R35710J72894
10238e61103j54859N95857O39982m23875K23141N92810J422482m94642j519122
10229C20671o37681j592452R32115N39523m80723m41311L81517N43911N3997K26166
$$ plain form
10295 -1704615 -2307126 -1765426 -2290400 -1005035 -214161 -552455 -1263414 -703925 -524794
10286 -524794 -2429011 -1186347 -864520 -1004270 -920879 -828001 65857 670492 1131469 1018836
10276 1018836 265171 363663 1517845 620005 478432 1411820 1120088 423574 882610
10267 882610 1549447 1487598 916714 -764419 -521397 -1441329 -1937125 -1464484 -1615470 -904955
10257 -904955 362883 -190057 -2485562 -2623153 -2812272 -3078375 -2200777 -1662917 -756162
10248 -756162 -941516 -796899 -139133 144014 207122 -9690 -515593 -1669707 -733997 -561103
10238 -561103 -715962 -120105 519877 96002 319143 911953 2334435 1839793 320671
10229 320671 -317010 -1909462 -977347 -437824 -918547 -1359858 -978341 -434430 -380433 -154267
10219a54267p49867l60541k37474Q7853J524674J84592m5782o41590K2663j56306
10209e26045J28105N59729o09900o7534O27867p76769r28038P0089L03367o84971
10199a904100P38430J152115K06607j47189o58249j65540k40854Q38230M95904
10190C15354r89982L04399j23347J593115J71787j335567K53483k026680n58123
10181b395561O97649P40482K31274N07523n3208k53230P64432M81581j52202k178190
10171a609450k64703K180664q4396l71380J044101p45195o73724Q26804m77912
10162a75191l21144l76937N33864j013276J13683J420468L10720r74394o08887
10153a091094J713932j97833J69382O293L89966q95976l19390O82558j028564
$$ plain form
10219 -154267 -904134 -1264675 -1502149 -1414296 110378 294970 249188 -392402 -369739 -526045
10209 -526045 -397940 161789 -448111 -515645 112222 -664547 -1592585 -1522496 -1219129 -1904100
10199 -1904100 -1165670 -13555 193052 45863 -612386 -777926 -1018780 -180550 315354
10190 315354 -674628 -370229 -493576 1099539 1271326 -64241 189242 -1837438 -2395561
10181 -2395561 -1697912 -957430 -726156 -218633 -271841 -525071 239361 720942 568740 -1609450
10171 -1609450 -1874153 306511 222115 -149265 894836 149641 -524083 302721 -175191
10162 -175191 -496335 -873272 -339408 -1352684 -1239001 181467 492187 -482207 -1091094
10153 -1091094 622838 425005 594387 600680 990646 94670 -224720 457838 -570726
10144e70726Q51072J021996p89356o77575n84256J82625j357035L5044J485038
10135d03173J75907J037000P74618m05310q43896N25966j506727o75128O22423
10126f98320N47451j354J239734Q41401O03762k028937p34666l57896n10605J461729
10116C62299l54666j116914m37173J656572j145149m1137L14664L34169j99062
10107f26397L60331P77470J02445r02968M82344j148975p51869J683187J380572
10098A356140n96921n57045J240145j014642l72178J48284k67353k52233O11822
10089B96019M93947N40342p57354N79171r17261k038102n17770J924662l21433
10080g17779K32926J279287l53273N99286j7726q27905m22970k5451J141547L30945
$$ plain form
10144 -570726 280346 1302342 512986 -164589 -748845 -566220 -1923255 -1888211 -403173
10135 -403173 -227266 809734 1584352 1179042 335146 861112 -645615 -1320743 -698320
10126 -698320 -150869 -152223 1087511 1928912 2532674 503737 -230929 -588825 -1099430 362299
10116 362299 7633 -1109281 -1546454 110118 -1035031 -1076168 -761504 -427335 -626397
10107 -626397 -266066 511404 613849 -289119 193225 -955750 -1707619 -24432 1356140
10098 1356140 759219 202174 1442319 427677 55499 203783 -63570 -315803 296019
10089 296019 789966 1330308 572954 1152125 234864 -1803238 -2321008 -396346 -717779
10080 -717779 -484853 794434 441161 1040447 1022721 194816 -228154 -253605 887942 1218887
10070A218887q43796P25360N3181j657386m75109J105844n48516R14283k79933
10061B12815r06800N95478j12491l84017m63918j10018P25314K59730L95242j47413
10051F3922O30439k90143r16693n12259m6592M09429m03111Q93270O61710O88401
10041A178373N30909J56555q68799N02552K27891m33696n08682o7797q31932P034
10031a07592P07375m2995N74860m53359n95720n97364K34288j342723j475333
10022c098563n88257p15879J129707K109584O72275q18275R10915M63358l78313
10013c13448Q27895n04195j467546R42762Q91062N49710L11023o36593m57966
10004A42704n5272m65144N91896k09990l99408J817509K63988M61099r85395k097629
$$ plain form
10070 1218887 375091 1100451 1153632 -503754 -978863 126981 -421535 492748 212815
10061 212815 -693985 -98507 -210998 -595015 -1058933 -1168951 -443637 -183907 211335 63922
10051 63922 694361 404218 -512475 -1024734 -1071326 -661897 -1065008 -171738 489972 1178373
10041 1178373 1709282 1865837 997038 1499590 1727481 1293785 785103 717306 -114626 -107592
10031 -107592 599783 556788 1131648 678289 82569 -514795 -280507 -1623230 -3098563
10022 -3098563 -3686820 -4402699 -3272992 -1163408 -491133 -1309408 -398493 64865 -313448
10013 -313448 514447 10252 -1457294 -514532 376530 926240 1237263 600670 142704
10004 142704 87432 -377712 214184 4194 -395214 1422295 1686283 2147382 1161987 -935642
9994i35642r95926Q13736q29307J202196L65137q70337K88783J27106M17462Q93429
9984D76637L58700j196224O2920n84779J378027K39652n76120K59153o0911J68706
9974E25761J334294J66527j146775J37082q93523k646M67077K2314p22118P88860
9964F76853l46187J51138k84500j561970o67319K88234r95110K44106J344017
9955a150738Q36588L80342N15316m14633M0226l27576j380429M57928J61577Q35087
9945d6312j005371p76269L99378P30580J72703L81124P53620p3752P30596k87475
9935I78822r87927K93716M63488m14186j70326N96452J9998q7157L90509P92769
9925A876158q5649j74947q71475j085079L9346O28907K17515j301818m47384O64160
$$ plain form
9994 -935642 -1931568 -1117832 -1947139 -744943 -379806 -1250143 -961360 -834254 -416792 476637
9984 476637 835337 -360887 -297967 -882746 495281 734933 158813 417966 357055 525761
9974 525761 1860055 2026582 879807 1016889 123366 120720 587797 610111 -112007 676853
9964 676853 330666 481804 197304 -1364666 -2031985 -1743751 -2738861 -2494755 -1150738
9955 -1150738 -314150 66192 581508 166875 207101 -120475 -1500904 -1042976 -881399 -46312
9945 -46312 -1051683 -1827952 -1428574 -697994 -525291 -144167 609453 535701 1266297 978822
9935 978822 -9105 284611 748099 333913 163587 760039 780037 692880 1083389 1876158
9925 1876158 1790509 1615562 744087 -340992 -301646 327261 544776 -757042 -1204426 -540266
9915e40266p91326l84166P11658k31081M02635L66237P14254K87851p36174n32341
9905g32719m36120m67361n4358N57234j664757k66863J308900J120043O36724
9896G23J361332M08378j166127j262107R9440P68151l76540m28745r96816p23740
9886b316051O94141J581044K21290o10441q0685J00098j121506M92019J391515
9877C51424n68303q39967M96590K08205P67842J653112l18297p80025n71660O09240
9867A008161q01703P44054q49625k23779Q7677J59400j91870m29077n86009j214461
9857b297232j35448L43749Q53264L29287N49160p61371o47194j64464Q08866j550086
9847b671469l10683L17279J230494N84219L74468o7512o39477N67356R3787J059293
$$ plain form
9915 -540266 -1331592 -1715758 -1004100 -1235181 -832546 -466309 247945 535796 -200378 -732719
9905 -732719 -1168839 -1636200 -1690558 -1133324 -2798081 -3064944 -1756044 -636001 723
9896 723 1362055 1770433 604306 -657801 -558361 209790 -166750 -595495 -1592311 -2316051
9886 -2316051 -1621910 -40866 180424 -430017 -510702 -410604 -1532110 -1040091 351424
9877 351424 -216879 -1056846 -560256 -352051 415791 2068903 1750606 970581 398921 1008161
9867 1008161 206458 950512 100887 -122892 -35215 124185 -67685 -496762 -1082771 -2297232
9857 -2297232 -2432680 -2088931 -1235667 -906380 -357220 -1118591 -1765785 -1930249 -1121383 -2671469
9847 -2671469 -2982152 -2664873 -1434379 -850160 -475692 -543204 -1182681 -615325 -521538 537755
9837E37755j442855k8798o1429j27422O69833L09784j433732j236908M98469R66874
9827a348429P06495K52157k78063p83702j09785N15123Q21404l47264L82298J118996
9817I29230m29664j320042L4658q87151P85521Q90657J41741k25765L13958n91149
9807c58006o35891O29251k39093k72770r6624L23788k74648K07582J332333l9621
9797E76301n71125J185344j63467j448854Q18434O63167j439351J47004k30805
9788d63352r86201K98428J256437R0744j184173n4693J335040r3484j85780m28527
9778d15561l04059o22742M119L99878p19791N98913J3521j54855p78399J378719
9768f00257R30641o51384j015745J008960J157234K69967K12637Q1928o69181
$$ plain form
9837 537755 -905100 -933898 -995327 -1122749 -452916 -143132 -1576864 -2813772 -2315303 -1348429
9827 -1348429 -641934 -389777 -667840 -1451542 -1561327 -1046204 -224800 -572064 -189766 929230
9817 929230 499566 -820476 -785818 -1672969 -887448 3209 144950 -80815 233143 -358006
9807 -358006 -993897 -364646 -603739 -876509 -973133 -649345 -923993 -716411 615922 576301
9797 576301 5176 1190520 1027053 -421801 396633 1059800 -379551 -232547 -463352
9788 -463352 -1449553 -1151125 105312 196056 -988117 -1042810 292230 198746 12966 -415561
9778 -415561 -719620 -1342362 -1338243 -938365 -1658156 -1059243 -1045722 -1200577 -1978976 -600257
9768 -600257 330384 -321000 -1336745 -327785 829449 1099416 1312053 1393981 724800
9759G24800r35258M79263j201277M82621J556119P41225o12214J27356r22232
9750D40403j268494m64372j4977J145771K12451n44361m72047J4250J017580P57507
9740H23711j826535l47619P85892P51794P19414O07760k191180J85259p46467
9731a237971m10097O97203P83394n70175k00711o97134l9316J374414r88191l52472
9721a641056j019445K15840R75321R10943n39036l08001o49006Q30908J539435
9712C15903Q02133R75230J86478j987725j166501p31314O79763J852310K69750
9703A196027q89651j016640m6860n1779L92602N73181l47062q63917K25318L95060
9693d33721P54381O22013l85750j357006J03851M10601m80717l85513m23703N42996
$$ plain form
9759 724800 -210458 268805 -932472 -449851 1106268 1847493 1235279 1362635 440403
9750 440403 -828091 -1292463 -1307440 -161669 50782 -493579 -965626 -951376 66204 823711
9740 823711 -1002824 -1350443 -564551 187243 906657 1514417 -676763 -491504 -1237971
9731 -1237971 -1648068 -950865 -167471 -737646 -938357 -1635491 -1674807 -300393 -1288584 -1641056
9721 -1641056 -2660501 -2444661 -1469340 -558397 -1097433 -1405434 -2054440 -1223532 315903
9712 315903 1118036 2093266 2279744 292019 -874482 -1605796 -926033 926277 1196027
9703 1196027 306376 -710264 -757124 -808903 -416301 156880 -190182 -1054099 -828781 -433721
9693 -433721 320660 942673 556923 -800083 -696232 -285631 -766348 -1151861 -1575564 -1032568
9683a032568M93508k8907q43492j11207P90190K95416m88085m9893m62689J4830
9673a422897m83757R48484M60925P47090l02421n57464m5227Q76292J87122j035203
9663f27056P36670P87124R34935O48452j323090m00282N36198O3611J268064M53637
9653C078263J22250M19466p66446r93338O704k15990p71366j399231q49161K2582
9643a346267K05573J38002Q47143j24442j17948N77317q59539O23773J356997
9634A300609M03470L77028j34226l69009j110633q6597m94516q6276n13088K38028
9624d75210n06820K13482R08982m95647n52741n66079K25922L71799K68223J89523
9614d18566n68378J00779J190886J02247p55978l81483M44481J090868K18351
$$ plain form
9683 -1032568 -539060 -567967 -1411459 -1522666 -732476 -437060 -925145 -975038 -1437727 -1422897
9673 -1422897 -1906654 -958170 -497245 249845 -52576 -610040 -655267 221025 408147 -627056
9663 -627056 109614 896738 1831673 2480125 1157035 756753 1292951 1356562 2624626 3078263
9653 3078263 3200513 3619979 2853533 1860195 1866899 1650909 879543 -519688 -1368849 -1346267
9643 -1346267 -1140694 -1002692 -155549 -279991 -397939 179378 -680161 -56388 1300609
9634 1300609 1704079 2081107 1946881 1577872 467239 380642 -113874 -200150 -713238 -475210
9624 -475210 -982030 -768548 140434 -355213 -907954 -1474033 -1248111 -876312 -608089 -418566
9614 -418566 -986944 -886165 304721 406968 -349010 -730493 -286012 804856 1023207
9605A023207J81263L73383q29614r43026o66423K58369m88395J640841l05428
9596B44177q06279M07878M80960O0878k40074J047533O44257j376064o62289p445
9586b06468m37081P61455l53864r83503K00440J45397j22280L24716n43233J213292
9576a129j06573j158661L00760J30879o02616O245l16269K98361R1612j01473
9566a458864J72094L24446R76548j84226k37612m33486J817581l58380L70980
9557I89081J989563l21991J38536p51309j482000k39035r7090N57375n40083j9157
9547B23890P59701P49610k88235Q0395O09653r44913j104930o0894N00286j103010
9537e78447q04748p5921N95409K09629J184917o04186k143738m15541Q99141R0642
$$ plain form
9605 1023207 1204470 1577853 748239 -194787 -861210 -602841 -1091236 549605 244177
9596 244177 -562102 -154224 326736 387614 147540 1195073 1839330 463266 -199023 -206468
9586 -206468 -643549 117906 -235958 -1219461 -1019021 -873624 -995904 -671188 -1214421 -1129
9576 -1129 -107702 -1266363 -965603 -834724 -1437340 -1431095 -1747364 -1449003 -1357391 -1458864
9566 -1458864 -1286770 -962324 14224 -170002 -407614 -841100 976481 618101 989081
9557 989081 2978644 2656653 2795189 2043880 561880 322845 225755 783130 243047 223890
9547 223890 983591 1733201 1444966 1525361 2135014 1190101 85171 24277 524563 -578447
9537 -578447 -1383195 -1459116 -863707 -654078 530839 -73347 -2217085 -2632626 -1733485 -1642843
9527a642843Q42597J533471K02923j105441Q15973J498278j58870j338981M7661
9518F94768p12702j39027O92285J788821n24603m81648J351702o64538o29915
9509A375143k47907k11100p75709p07194O27806K48041j316623J647540J108378
9500A748375p44553j8473L50354o90380j317314o31137M6879k8795J489115K69635
9490D73706q60781m17230J102100k65092m95331J470949O72455p98053r4794J066941
9480A854870J367302K461941Q69977m10825j139105J194544n02803j315361j328073
9471C052467j591051j362458K4057l47N53339l65989L7543K49281M41815R14833
9461A953490l58995k035468r77151R36702J028585N01353q19220O42069K61549
$$ plain form
9527 -1642843 -800246 733225 936148 -169293 646680 2144958 1986088 647107 694768
9518 694768 -17934 -156961 535324 2324145 1799542 1317894 2669596 2005058 1375143
9509 1375143 1127236 916136 140427 -566767 61039 309080 -1007543 639997 1748375
9500 1748375 1003822 985349 1335703 645323 -671991 -1303128 -1256249 -1285044 204071 473706
9490 473706 -387075 -804305 297795 32703 -462628 1008321 1680776 882723 787929 1854870
9480 1854870 3222172 5684113 6554090 6143265 5004160 6198704 5695901 4380540 3052467
9471 3052467 1461416 98958 123015 122668 676007 310018 347561 596842 1038657 1953490
9461 1953490 1594495 -440973 -1418124 -481422 547163 1048516 229296 871365 1132914
9452A132914J257574N93720j043558k133910J100414K04637N56187N44081N59887
9443B771946j184485J70980N20080O63421r903j022363m40067k85163J354744
9434B539190J391606j27991r47429J33682j298364L31867k38843K33711j89457
9425A827972j569062m86338K85948M30083R85534l95532j530229l6071L91740
9416i5955j052270P24460O87191O1773K41093l08609L47547Q06601L94020q93723
9406I12128L77772K37842J458018L53172q95416l2635K62702J47552n90791n45912
9396A684432j12592j058140o01629N28395N72426J03526k17771l16469k04178
9387C78000J178395P06490j343122j698617L32905M35225O07366N60417M7469
$$ plain form
9452 1132914 2390488 2984208 1940650 -193260 907154 1111791 1667978 2212059 2771946
9443 2771946 1587461 1758441 2278521 2941942 2932039 1909676 1469609 1184446 2539190
9434 2539190 3930796 3802805 2855376 2989058 1690694 2022561 1783718 2017429 1827972
9425 1827972 258910 -227428 58520 488603 1474137 1078605 -451624 -487695 -95955
9416 -95955 -1148225 -423765 263426 325199 566292 257683 605230 1411831 1805851 912128
9406 912128 1289900 1527742 2985760 3338932 2443516 2410881 2673583 2821135 2230344 1684432
9396 1684432 1571840 513700 -87929 440466 1012892 1116418 898647 582178 378000
9387 378000 1556395 2262885 919763 -778854 -445949 -10724 596642 1157059 1204528
9378A204528N0158k70233j27332L23118m93551p37825J13796l26042q8872J762499
9368A410244l54906n87642j49285n23120k79548K62091P00591m60764r9486r1894
9358a73719N93645l75163Q79280J032180L63843N37190j032030L60703J12414
9349B298343L77483R64812o81573J151133N7424r1924l92030l63576j130356L44350
9339B534086o93693o17175N82520L37866L00104q698o8368L14139j373161o72798
9329F34822O10756O3118p20854P11274n06235r34482K047518n532o9914P26490
9319B556961O90053r47475L36110l58243l27154j740913R88046j71252l90662
9310F35471M31721N70592l92347l8719J065873K91672j14057Q9487j045597q24708
$$ plain form
9378 1204528 1254686 984453 857121 1180239 686688 -51137 62659 -263383 -352255 1410244
9368 1410244 1055338 467696 318411 -204709 -484257 -222166 478425 17661 -81825 -173719
9358 -173719 419926 44763 924043 1956223 2320066 2857256 1825226 2185929 2298343
9349 2298343 2675826 3640638 2959065 4110198 4167622 4075698 3683668 3320092 2189736 2534086
9339 2534086 1840393 1223218 1805738 2143604 2443708 2435010 2366642 2680781 1307620 634822
9329 634822 1245578 1308696 587842 1299116 792881 -141601 1905917 1900385 1830471 2556961
9319 2556961 3247014 2299539 2635649 2277406 1950252 209339 1197385 1026133 635471
9310 635471 1067192 1637784 1245437 1206718 2272591 2564263 2450206 2539693 1494096 669388
9300F69388O09333M98511L50023n6858O85449M58471m82116m82199M46963r97037
9290A699928k78797L08540Q50755J92878J121378L59493j212918j51421K22889
9281C112725j5155m12564Q03130J60408N76504K08656N47060L54755Q16704p83942
9271E368281j663493j618845l93437M33581m35860l0810k7373o02230O19697J269462
9261B918973j25253J89079j84560n21159k96988J324740J054572p78077k14410
9252C366917k19230n56195M18259N96103N39331n41349j92958m83590p87076R33427
9242C073639O79058N0585l65319O84615N23589p4638r29366j269377j012135m30123
9232I30528J481316J658484O90833l94346K09411r02516r5348P71348m34188j048069
$$ plain form
9300 669388 1278721 1777232 2127255 2070397 2755846 3214317 2732201 2250002 2696965 1699928
9290 1699928 1421131 1729671 2580426 2773304 3894682 4254175 3041257 2889836 3112725
9281 3112725 3097570 2685006 3488136 3648544 4225048 4433704 4980764 5335519 6152223 5368281
9271 5368281 3704788 2085943 1692506 2126087 1690227 1659417 1632044 1029814 1649511 2918973
9261 2918973 2793720 2982799 2798239 2277080 1980092 3304832 4359404 3581327 3366917
9252 3366917 3147687 2591492 3009751 3605854 4145185 3603836 3410878 2927288 2140212 3073639
9242 3073639 3752697 3803282 3437963 4122578 4646167 4571529 3642163 2372786 1360651 930528
9232 930528 2411844 4070328 4761161 4366815 4576226 3673710 3578362 4349710 3915522 2867453
9222B867453m5488M19198Q7361o21610K98598q31997m00041J093325J38862R90941
9212C996602j14184k58802m18397J32796Q64335J65839l61327k03400o62242N6140
9202C197360k57693L50389l95632n824J3886M81655P67935k5917P91933l41668
9192D576424k85902j22474L86914K4412J007371L90479R27086l21238R37971O57328
9182H178371K6040j61231R22707j130892J89239l58815N25991J090494L25031
9173I606935j82521q52791k76656N5499P71042L08032O76261p75856m63601r58961
9163G907383l57506k59928N87807r14140O56314J094692j27286l89711J155620
9154I353245q28117k6368J249513J49362Q72418J075860N33479j106355P56004
$$ plain form
9222 2867453 2821965 3241163 3328524 2706914 3005512 2173515 1773474 2866799 3005661 3996602
9212 3996602 3882418 3623616 3205219 3338015 4202350 4368189 4006862 3803462 3141220 3197360
9202 3197360 2939667 3290056 2894424 2888600 2902486 3384141 4152076 4126159 4918092 4576424
9192 4576424 4290522 4168048 4554962 4579374 5586745 5977224 6904310 6583072 7521043 8178371
9182 8178371 8204411 8043180 8965887 7834995 8024234 7665419 8191410 9281904 9606935
9173 9606935 9424414 8571623 8294967 8350466 9121508 9429540 10105801 9329945 8866344 7907383
9163 7907383 7549877 7289949 7877756 6963616 7619930 8714622 8587336 8197625 9353245
9154 9353245 8525128 8498760 9748273 9897635 10770053 11845913 12379392 11273037 12029041
9145A2029041j31645l6076k75919M54743J330202J92319p00444M09911l59347
9136A2912785K61790M25858J69738M21971J011538O61639L08886p55210R33903
9127A6352898M27135n63197K30022J146956O42887k48188J276220N42464J197318
9118B1004515Q01812J670792j92190J498425P50928j2995P63582J121885J193969
9109B8600723K071770J420893Q51732L123032J139517J469166K701782J799463
9101D3178078K463493K825616J837346K907459L290243L237589M346575L624126
9093F7710525N028115M359621M334816N929513O471920P499347R006683J1309578
9085A21650118J2719445J6009418J7620430J7910475K0322430K0351872K0371032
$$ plain form
9145 12029041 11897396 11861320 11585401 12040144 13370346 13562665 12862221 13272132 12912785
9136 12912785 13174575 13600433 13770171 14192142 15203680 15865319 16174205 15418995 16352898
9127 16352898 16780033 16216836 16446858 17593814 18236701 17988513 19264733 19807197 21004515
9118 21004515 21806327 23477119 23284929 24783354 25534282 25521287 26284869 27406754 28600723
9109 28600723 30672493 32093386 32945118 36068150 37207667 38676833 41378615 43178078
9101 43178078 45641571 48467187 50304533 53211992 56502235 59739824 64086399 67710525
9093 67710525 72738640 77098261 81433077 87362590 93834510 101333857 110340540 121650118
9085 121650118 134369563 150378981 167999411 185909886 206232316 226584188 246955220
9078B46955220J7119638J5066899J3306976J2054037J0410608Q615391Q249108
9071C31777877J0005118J3457902J5112096J4776561J2994264J3004665J0742244
9064D21870727J0495876J1051174N499465K178555J300006j027633k718188m676040
9056D43973942j0274506j4402623j8223657j9330280j9776311k1646372k2090343
9049C18229850k0778314k2198048j9457202j8289012j7840955j6532975j4293503
9042A88839841j3516858j2514591j0051449j0029724p651008p624256n703441
9035A21748514o074004o918860n428337n119032m779358l996744k760888k751688
9027H3919603k902613j817883k774937k472586j844723p94290l085683k467838
$$ plain form
9078 246955220 264074858 279141757 292448733 304502770 314913378 323528769 331777877
9071 331777877 341782995 355240897 370352993 385129554 398123818 411128483 421870727
9064 421870727 432366603 443417777 448917242 451095797 452395803 451368170 448649982 443973942
9056 443973942 433699436 419296813 401073156 381742876 361966565 340320193 318229850
9049 318229850 297451536 275253488 255796286 237507274 219666319 203133344 188839841
9042 188839841 175322983 162808392 152756943 142727219 135076211 127451955 121748514
9035 121748514 115674510 108755650 103327313 98208281 93428923 89432179 86671291 83919603
9027 83919603 81016990 79199107 76424170 73951584 72106861 71312571 68226888 65759050
9019F5759050j700897j043446k416174j596605o67581k575880k066941j316597
9011E2374929j368985j835949L19037j81751n37461J77385J82398j520767j225433
9002D6383403O08100r51822j550082N60747J113172K52176p50095j332394j557591
8993D2775614J826015J301192L49609J195631J66479J308034L39823J850188J716536
8984E2829121K262552J853095L732033M627014R064402J1319271J4105980K2143016
8976A21936484K8102324L0376741K2904812R896071o959007j9752539k7203268
8969A59301618k7912621k2229971j6152327j1134546p373766p132960m580480
8962F2784947k833354m142810l766329j546244j438208j776839O29070n13935
$$ plain form
9019 65759050 64058153 63014707 60598533 59001928 58334347 55758467 53691526 52374929
9011 52374929 51005944 49169995 49489032 49307281 48769820 48947205 49129603 47608836 46383403
9002 46383403 46991503 46039681 44489599 45050346 46163518 46415694 45665599 44333205 42775614
8993 42775614 44601629 45902821 46252430 47448061 47614540 48922574 49262397 51112585 52829121
8984 52829121 55091673 56944768 60676801 65303815 74368217 85687488 99793468 121936484
8976 121936484 150038808 180415549 203320361 213216432 206257425 186504886 159301618
8969 159301618 131388997 109159026 93006699 81872153 74498387 67365427 62784947
8962 62784947 59951593 55808783 52042454 50496210 49058002 47281163 47910233 47396298
8954D7396298J044540Q48237L67036q56435J366213J316991J310097J94514J326355
8945E4313846L496913K303446M281624O554763P597550J2683423J8405045K2631066
8937A32267676L2957817L9887011L8837753K6150861M390014k0788752l6486218
8930B17216162l9714914l3521139k5081458j7758670j3454228j1940486r647884
8923F6097383o139505n560216o406407m129309l829881j768999m72027m09136
8915C7381903k371675j583369L04259j81549k285607j171038j436250k609543
8907B6047131r31673n65905K54150j036241j763577p63070m10222N51869J437919
8898B2820381j080079k012880N98770R65352k213195j394157n92917O46776r66025
$$ plain form
8954 47396298 48440838 49289075 49656111 48799676 50165889 51482880 52792977 52987491 54313846
8945 54313846 57810759 60114205 64395829 70950592 78548142 91231565 109636610 132267676
8937 132267676 165225493 205112504 243950257 270101118 274491132 253702380 217216162
8930 217216162 177501248 143980109 118898651 101139981 87685753 75745267 66097383
8923 66097383 59957878 54397662 47991255 43861946 40032065 38263066 37791039 37381903
8915 37381903 35010228 33426859 33731118 33549569 31263962 30092924 28656674 26047131
8907 26047131 25115458 24549553 24803703 23767462 22003885 21240815 20830593 21382462 22820381
8898 22820381 21740302 19727422 20326192 21291544 19078349 17684192 17091275 17738051 16772026
8889A6772026N24259k72107j348190j189177K8525p97925m64524J516428j261620
8880A3507695p94232R30589J181071k0614j113193r43829m1228o54062K2558M68429
8870A2543184Q37053K59154K25302Q4940J40422q23586j418912j636732j032278
8861I178547R69361J217457M00135N21059M88963q61749K45746p99370M19220
8852A1779369p45342j108369q52936o89812l47006l28457J00274K75038N54060
8843H636819l92558P27999r6860j140876l89507o01086N06062J891888N34195
8834I676076r93463j156816M92360Q28076o24532j82663n82642q0313Q13601P08315
8824H897999L48779Q82524r19859j311585m90355N57643m79997j53646q61936
$$ plain form
8889 16772026 17296285 17024178 15675988 14486811 14515336 13717411 13252887 14769315 13507695
8880 13507695 12713463 13644052 14825123 14804509 13691316 12747487 12706259 12052197 12074755 12543184
8870 12543184 13380237 13639391 13864693 13949633 14090055 13266469 11847557 10210825 9178547
8861 9178547 10147908 11365365 11765500 12286559 12775522 11913773 12159519 11360149 11779369
8852 11779369 11034027 9925658 9072722 8382910 8035904 7707447 7807721 8082759 8636819
8843 8636819 8244261 8972260 8875400 7734524 7345017 6743931 7249993 9141881 9676076
8834 9676076 8682613 7525797 8018157 8846233 8221701 8039038 7456396 7376083 8189684 8897999
8824 8897999 9246778 10129302 9209443 7897858 7407503 7965146 7485149 7331503 6469567
8815F469567L92178O73228j29559n86895j091354J127194R05574n38698o39847
8806F581388k63210j99654J123353K52009k32003L53356M40167o28735J120220
8797H546891m06811K6370J61876r02493o07721J056415J78017j692247m96393
8788E863904N31664M20922O08275o08275j03587N97835J89942P57475K83401n1951
8778H489605J092846n7723p82191K56278L71773O78098j63131q40026J407482
8769A0453011J637638j913122K16812M25350p1101J482701m85929r94029j12851
8760A0638480M50284Q6262O86428P43147J519706O92591o50348J289163J722945
8751A7178658N00674l21270L9516K620198K826086J702571J967830J706887J172612
$$ plain form
8815 6469567 6861745 7534973 7405414 6818519 5727165 6854359 7759933 7221235 6581388
8806 6581388 6318178 6118524 7241877 7493886 7261883 7615239 8055406 7426671 8546891
8797 8546891 8140080 8166450 8328326 7425833 6818112 7874527 8052544 6360297 5863904
8788 5863904 6395568 6816490 7424765 6816490 6712903 7310738 7500680 8258155 8541556 8489605
8778 8489605 9582451 9524728 8742537 8998815 9370588 10048686 9885555 9045529 10453011
8769 10453011 12090649 10177527 10394339 10819689 10748588 12231289 11745360 10751331 10638480
8760 10638480 11088764 11175026 11861454 12604601 14124307 14816898 14166550 15455713 17178658
8751 17178658 17679332 17358062 17397578 20017776 22843862 24546433 26514263 28221150 29393762
8742B9393762L205395L084915L573476N998740P667248P566683Q740586J1656718
8734H0887523J0746864Q898622P719332P346936M389771K454741K485017J377403
8726A26306209q42221j055453K04922K8809J187025L84544j678306l633048k659521
8717A18242960l433499o733282q286657p146466p695289r558268p937531o111123
8709F1340845n604823m780657l567924k352873q98055K04528n04393P15593K053147
8700D6605388L920765L453624L675663N827645O428940N458787M414567O815200
8692H6600579O349849L141571L734095J273542O40985k71301k865076k032617
8684I6571627L29096O6682L90492p57691l195244j924640k082018m054029n817668
$$ plain form
8742 29393762 32599157 35684072 39257548 45256288 52923536 60490219 69230805 80887523
8734 80887523 91634387 100533009 108252341 115599277 119989048 122443789 124928806 126306209
8726 126306209 125463988 124408535 124613457 124642266 125829291 126213835 124535529 120902481 118242960
8717 118242960 114809461 108076179 99789522 92643056 84947767 75389499 67451968 61340845
8709 61340845 55736022 50955365 47387441 45034568 44136513 44341041 43836648 44552241 46605388
8700 46605388 50526153 53979777 57655440 63483085 69912025 75370812 79785379 86600579
8692 86600579 92950428 96091999 99826094 101099636 101740621 101469320 98604244 96571627
8684 96571627 96900723 96967405 97357897 96600206 93404962 91480322 89398304 85344275 79526607
8675G9526607o500871p949296o282838o781994n527667o091556o478842l611363
8667C0302180k124089k116230j080612j927473k121187j106704j044086j006472
8659A7775327J53019m71459K06395K01661l09166n59141q38747k366282j036110
8650A2755497M65517M21678j057434n11830j88435L56754N18896K26169p54993
8641A2231819j528889p24192J05180k74760m67506n77074l46472K9987J266444
8632I714537J305847j463824K38693p44282n93533k48878R1412j32630n03860
8623G663482M8681j69147Q54304j258825m54999Q98241K57710M05731N65485o38840
8613H171823k66837n47838j268524m6958n79075k17419J40403l7650Q33694J180502
$$ plain form
8675 79526607 73025736 65076440 58793602 52011608 46483941 40392385 33913543 30302180
8667 30302180 28178091 26061861 24981249 23053776 20932589 19825885 18781799 17775327
8659 17775327 17928346 17456887 17663282 17864943 17555777 16996636 16157889 13791607 12755497
8650 12755497 13221014 13642692 12585258 12073428 11884993 12241747 12760643 12986812 12231819
8641 12231819 10702930 9978738 10083918 9809158 9341652 8764578 8418106 8448093 9714537
8632 9714537 11020384 9556560 9795253 9050971 8457438 8208560 8299972 8167342 7663482
8623 7663482 7712163 7543016 8397320 7138495 6683496 7581737 7839447 8245178 8810663 8171823
8613 8171823 7904986 7357148 6088624 6041666 5462591 5245172 5385575 5347925 6181619 7362121
8603G362121l03970m63757P17310K12926J36575j238473o97581J060584n95996
8594F189739k41727M33107j208799j47071M49341j893494q18839J556347l77353
8585C941251o81155M31818m64252K74389r94235K74545O20632K17597n02220L77478
8575C495848L13848p628L90789o29277j204655L32558l22170j460755O32195J392908
8565B933661J24016j827034j8848Q90762O39932Q27548J328488j457367j041884
8556B399274R49123j389513j386262J310791M25479j495657L51917M72278n3452
8547A583978M66540P70805p58845K95666k76302l40037j29821K90618J01815R802
8537B014219l81996K35253J025602Q45942J404832J49228l78786l76142n29956
$$ plain form
8603 7362121 7058151 6594394 7311704 7524630 7661205 6422732 5725151 6785735 6189739
8594 6189739 5948012 6381119 5172320 5025249 5474590 3581096 2762257 4318604 3941251
8585 3941251 3260096 3691914 3227662 3502051 2507816 2782361 3402993 3620590 3118370 3495848
8575 3495848 3809696 3802068 4192857 3563580 2358925 2691483 2369313 908558 1540753 2933661
8565 2933661 3057677 1230643 1211795 2102557 2742489 3570037 4898525 3441158 2399274
8556 2399274 3348397 1958884 572622 1883413 2308892 813235 1165152 1637430 1583978
8547 1583978 2050518 2821323 2062478 2358144 2081842 1741805 1611984 1902602 2004417 2014219
8537 2014219 1632223 1867476 2893078 3739020 5143852 5293080 4914294 4538152 4008196
8528D008196L1868m92896j580256k9704P79369j029544P68088n6829m20459Q99700
8518B877533n99277j105480P90134R73102j565290m29301N74999P82977J138175
8509C437572R39947n72763J471681K761561J445923J962219M395342M139657K841989
8500B2823128J503681j712163k118328m179445l741224l231071k273842j6863
8492G053873n37227j439222K85866Q51222l62549n98925p49473p74734k1144j783483
8482A924204j380687R10807P98204P12630Q4130L44395n47570j44359l00366q05684
8472A595704k84243J344776R2156k11775J400251J6373O489j136994L39478o76226
8462B485989M75887r9421j7793N39285J68045J19815j184175o7202p29314K05796
$$ plain form
8528 4008196 4040064 3547168 1966912 1937208 2716577 1687033 2455121 2398292 1977833 2877533
8518 2877533 2278256 1172776 1962910 2936012 1370722 941421 1516420 2299397 3437572
8509 3437572 4377519 3804756 5276437 8037998 9483921 11446140 15841482 19981139 22823128
8500 22823128 24326809 22614646 20496318 16316873 12575649 9344578 7070736 7053873
8492 7053873 6516646 5077424 5363290 6214512 5851963 5253038 4503565 3728831 3707687 1924204
8482 1924204 543517 1454324 2252528 2965158 3049288 3393683 2846113 2701754 2401388 1595704
8472 1595704 1311461 2656237 2748393 2536618 3936869 3953242 3959731 2822737 3162215 2485989
8462 2485989 2961876 2862455 2844662 3383947 3551992 3671807 2487632 2420430 1691116 1896912
8452A896912l56813q99174M31429J232043o60611O45458O19175o05190j042460
8443A260769N88245j397145j42607J72815j88o25684J18790M07217q37390j03052
8433e58230m90316J453248j68193k94621J82081J062694R07678O38603n15192
8424B217752p72997J129139l08803Q62431m54812j19120l34716j044383k57925
8415I16566J757340J374529j773069n07959l52420M31100J741662n51815j153284
8406A882650o61949R25173k50333q54486J69035J075829o86972n96240J294471
8397B297178k14058M49661m7489j282788r70136J433095q07398j513200L61506
8388b93629J247662J382265o06339p61534L71752m44467r93839J134003N46340
$$ plain form
8452 1896912 1540099 640925 1072354 2304397 1643786 2289244 2908419 2303229 1260769
8443 1260769 1849014 451869 309262 482077 481889 -143795 -25005 382212 -455178 -558230
8433 -558230 -1048546 404702 236509 -58112 123969 1186663 2094341 2732944 2217752
8424 2217752 1444755 2573894 2265091 3127522 2672710 2553590 2218874 1174491 916566
8415 916566 2673906 4048435 2275366 1767407 1414987 1846087 3587749 3035934 1882650
8406 1882650 1220701 2145874 1895541 1041055 1210090 2285919 1598947 1002707 2297178
8397 2297178 2083120 2532781 2485292 1202504 232368 1665463 858065 -655135 -293629
8388 -293629 954033 2336298 1729959 968425 1340177 895710 -98129 1035874 1582214
8379A582214r62903J343974j101938j10004J362282J144761M13865q26455K61887
8370C107683O74p09779j178772J202100o80780k25187P85196J14254r61672m31867
8360A021850l65273m24457P86487L49842L16137o94506P56835J118904J583766
8351D449585O00625o64200j463767j901679r15101R37588J94325Q12485J00842
8342B150703k03143j89719N66069J060329R48762j482105j633437P3909m54808
8333H36560Q95441L72129K63350M20461J276709p83763k24848j055052p97621
8324A203366k87170o04178P4113J386792M41994j716313Q62622K47429o4652O2879
8314A606882m71165k35313p63520j38885J33566Q08123J344106M7393j231897
$$ plain form
8379 1582214 619311 1963285 861347 751343 2113625 3258386 3672251 2845796 3107683
8370 3107683 3108357 2398578 1219806 2421906 1741126 1515939 2301135 2415389 1453717 1021850
8360 1021850 656577 232120 1018607 1368449 1684586 990080 1746915 2865819 4449585
8351 4449585 5050210 4386010 2922243 1020564 105463 1043051 1237376 2049861 2150703
8342 2150703 1947560 1757841 2323910 3384239 4333001 2850896 1217459 1291368 836560
8333 836560 1732001 2104130 2367480 2787941 4064650 3280887 3056039 2000987 1203366
8324 1203366 916196 312018 386131 1772923 2214917 498604 1361226 1608655 1544003 1606882
8314 1606882 1135717 900404 136884 -2001 131565 939688 2283794 2331187 1099290
8305A099290j908121N07012J500703K81254M28175J38310R45041p5437l3741R31887
8295C814373p22069r55303j06441q90658q74210J004844l90495j124754O83248
8286D38535Q34292r51891n64831r37651Q25996J40343M87611O56573j57074o37448
8276A34455J019566J76057o17646K111532n13443j089872L80453L29628n77473
8267A353257l51798p49425P62896J124531M33976l54843p07431r29405Q36803
8258A418561J261351m80953J155780L27887j057552q37056N53971p38272j200095
8249D03622r61186J75119j18301J925237J385552J26683k33431r2544j064586
8240A546165j493995N17219m47600o29351k79639o291q84963j52040J124659q56264
$$ plain form
8305 1099290 -808831 -301819 1198884 1480138 1908313 2046623 2991664 2916227 2882486 3814373
8295 3814373 3092304 2137001 2030560 1139902 265692 1270536 880041 -244713 438535
8286 438535 1272827 320936 -243895 -1181546 -355550 -215207 272404 928977 771903 134455
8276 134455 1154021 1330078 712432 2823964 2310521 1220649 1601102 1930730 1353257
8267 1353257 1001459 252034 1014930 2139461 2573437 2218594 1511163 581758 1418561
8258 1418561 2679912 2198959 3354739 3682626 2625074 1788018 2341989 1603717 403622
8249 403622 -557564 -382445 -500746 1424491 2810043 2936726 2703295 2610751 1546165
8240 1546165 52170 569389 121789 -507562 -787201 -793492 -1678455 -1830495 -705836 -1562100
8230a562100J194529J245516M70823J412808r81720L982o92919n40465n28857
8221B1597K868349o30327J37162J009517n27842n48664R15907j355547j907910
8212a7758J295422J340498j106352j047170j142242q05367j893183J417520J198168
8203g60464j149634n83465J642806n55055M69626L329778k891084j398448N76075
8194a319865J850671Q60211M351850l127908k391825r97650m43782L135011M15010
8185B331723K058079N84710k672026m58498k74678k255000k094667J07605J485867
8176a186885J142398p99108K13646J449111q42576O87430k20040m44195P99250
8167G99031N7297o13089R68108J910916o17968j956625j509179k29613J44608
$$ plain form
8230 -1562100 -367571 877945 1348768 2761576 1779856 1783838 1090919 550454 21597
8221 21597 2889946 2259619 2396781 3406298 2878456 2329792 3245699 1890152 -17758
8212 -17758 1277664 2618162 1511810 464640 -677602 -1482969 -3376152 -1958632 -760464
8203 -760464 -1910098 -2493563 -850757 -1405812 -936186 2393592 -497492 -1895940 -1319865
8194 -1319865 530806 1391017 5742867 2614959 223134 -774516 -1218298 1916713 2331723
8185 2331723 4389802 4974512 2302486 1843988 1569310 -685690 -2780357 -2672752 -1186885
8176 -1186885 -44487 -843595 -629949 819162 -23414 664016 443976 -219 799031
8167 799031 856328 243239 1211347 3122263 2504295 547670 -961509 -1191122 -1046514
8158a046514J81569O45789l10119P48372m3139N14830O18487R88367J07825q22461
8148A583006k62389O77551J140714j21L34295j918728m35093K430R09243N05028
8138B535936j798576j130729o54023J708988J552525j125942j221184j504608
8130a637613L06768K140019J452611r92872j333733K69118j484162K175556O08519
8121A504211J63032j084675J67843K62951j68458o40989j51377r35817j64732
8112a048011J891091p696K42698p1569k1804J39095N12818n09542Q1987j038601
8102A70466l57116J606598N69763j084222Q5957n47233q59435L09890J826778
8093A721446L46303N42735m84514j276661m88511L40387Q11353n33780q92392
$$ plain form
8158 -1046514 -864945 -219156 -529275 219097 175958 690788 1309275 2297642 2405467 1583006
8148 1583006 1320617 1998168 3138882 3138761 3473056 1554328 1119235 1121665 2030908 2535936
8138 2535936 737360 -393369 -1047392 661596 2214121 1088179 -133005 -1637613
8130 -1637613 -1330845 809174 2261785 1268913 -64820 204298 -1279864 895692 1504211
8121 1504211 1667243 582568 750411 1013362 844904 203915 52538 -883279 -1048011
8112 -1048011 843080 835384 1078082 1006513 984709 1123804 1636622 1127080 1209067 170466
8102 170466 -186650 1419948 1989711 905489 991446 444213 -415222 -105332 1721446
8093 1721446 2067749 2610484 2125970 849309 360798 701185 1512538 978758 86366
8084H6366n394j65746r45248M45406R83674n69832J011374J528754K06532O58074
8074C233960k70833q40966K4719l36994n59622q00353m35370K6300l10756P6947
8064a92968J27511J236616j8929j166468L5957l41802J312518Q66387j362685
8055D96137r44080Q97728K03569O85593P49571j025464j659989r01229K29158
8046a269006O70623K24920J48150n43009o91374K274921M66588p60224j43375
8037C78214Q50547O32332O31967N82282m58967O29291o18323J39822j6976r17241
8027A832948j5638k78468o61416j549198M76847L42981j969683J912305P30184
8018H20862p50334k04240Q6210n22815M34137M17253J66106K73425K50364k90235
$$ plain form
8084 86366 80972 -84774 -1030022 -584616 399058 -170774 840600 2369354 2575886 3233960
8074 3233960 2963127 2122161 2146880 1809886 1250264 449911 14541 40841 -269915 -192968
8064 -192968 -65457 1171159 1152230 -14238 21719 -320083 992435 1858822 496137
8055 496137 -447943 449785 653354 1338947 2088518 1063054 -596935 -1498164 -1269006
8046 -1269006 -598383 -373463 -225313 -768322 -1459696 815225 1281813 521589 378214
8037 378214 1228761 1861093 2493060 3075342 2616375 3245666 2627343 2767165 2750189 1832948
8027 1832948 1817310 1538842 877426 -671772 -194925 148056 -1821627 90678 820862
8018 820862 70528 -133712 -47502 -570317 -136180 281073 447179 720604 970968 680733
8008F80733p3224K33440P85753N76603j090249K06862M45046M01951m1111p41728
7998A384076R17054J50511j78807J73254p57197n47894R06909K14521l076992
7989h14565M80135L88653p38188L96007J047510m68451P5555N78651K88933J45194
7979A379434L60999p93844j097202n07424L051128N08475j035233J364617r17784
7970B313166K84675J456097j852085j52566m22285o69914J313845J93300m31296
7961B032937K05705l71060j505157J153283j023537j583203L8476q4123J779818
7952F43139J143304j070027J18398q19916K48182Q47638m58654j46354O4912m2766
7942E27856j07271K248102Q2390R64885q29823j708882l4132o0115n79759k16048
$$ plain form
8008 680733 607509 840949 1626702 2203305 1113056 1319918 1764964 2166915 2125804 1384076
7998 1384076 2301130 2451641 2272834 2446088 1688891 1140997 2047906 2262427 -814565
7989 -814565 -334430 54223 -683965 -287958 759552 291101 366656 945307 1234240 1379434
7979 1379434 1740433 946589 -150613 -658037 2393091 2901566 1866333 3230950 2313166
7970 2313166 2597841 4053938 2201853 2049287 1627002 957088 2270933 2464233 2032937
7961 2032937 2238642 1867582 362425 1515708 492171 -1091032 -1052556 -1136679 643139
7952 643139 1786443 716416 834814 14898 263080 1110718 652064 505710 570622 527856
7942 527856 420585 2668687 2751077 3715962 2886139 1177257 1143125 1083010 503251 287203
7932B87203J131086j2699K58541Q61831m94864K2550l26706q36004M56871k61568
7922A086241O95217p6283k03504J37045m22337j549349o26141J26609P28213R2311
7912a1978P56955p13894P66108o14904J07777J06666j150048P67076m12089o42749
7902a041080J158805J698504k51851p71505l71788R72505N36469n96430k92082
7893A041547P71385j060540j01505n76613R76190J587546K88543j309525o19879
7884I97149K52986J656786n08203q03649p43177Q69123k30526J128132J049077
7875C667698m3179l6571r26330Q92181n03996P11782k18370j488999p854J512473
7865C558835j103670l33925j466916J26252M53261m0470o29454q04921q90474
$$ plain form
7932 287203 1418289 1405590 1664131 2525962 2031098 2053648 1726942 890938 1347809 1086241
7922 1086241 1781458 1705175 1501671 1638716 1216379 -332970 -959111 -832502 -104289 -11978
7912 -11978 744977 31083 797191 182287 290064 396730 -753318 13758 -398331 -1041080
7902 -1041080 117725 1816229 1564378 792873 421085 1393590 1930059 1333629 1041547
7893 1041547 1812932 752392 650887 74274 1050464 2638010 2926553 1617028 997149
7884 997149 1250135 2906921 2398718 1595069 851892 1721015 1490489 2618621 3667698
7875 3667698 3624519 3587948 2661618 3553799 3049803 3761585 3543215 2054216 2046362 3558835
7865 3558835 2455165 2121240 654324 780576 1233837 1193367 563913 -241008 -1131482
7856a131482P82835J050557j05309r1632J72506j40631O32275K62756J152383
7847B584258n56674k198938R10799R46473O22451R67694M62731r84447J87703
7838B942050J686038j595212j976963k54391J063616k76570l13172Q22956j025625
7829A072727l64231J66607m1326m74128O52230R65762j589079r05305J497467
7820I80724K7162m52576Q89580O65038K98925l73304Q35702L03984m11906j67158
7810B596171j493115j449463O07385Q80474M75948j088471j38088p3333k73470
7801D4038o79838P74649j371629l62866J912565p66971L33790K46567K39226n74211
7791b04680M90431M33778N53131j276739k82783O89773L73233Q89988n13763j299182
$$ plain form
7856 -1131482 -348647 701910 596601 504969 677475 536844 1169119 1431875 2584258
7847 2584258 2027584 -171354 739445 1685918 2308369 3276063 3738794 2754347 2942050
7838 2942050 4628088 3032876 1055913 801522 1865138 1588568 1275396 2098352 1072727
7829 1072727 708496 875103 833777 359649 1011879 1977641 388562 -516743 980724
7820 980724 1007886 555310 1444890 2109928 2408853 2035549 2871251 3175235 2763329 2596171
7810 2596171 1103056 -346407 260978 1141452 1617400 528929 390841 317508 44038
7801 44038 -635800 138849 -1232780 -1595646 316919 -450052 -116262 130305 369531 -204680
7791 -204680 285751 719529 1272660 -4079 -286862 402911 776144 1666132 1152369 -146813
7781a46813J837884N43842J151019Q7358k105044j114670R73450k78966O95571
7772A643631l40454n72022K93185O62656J740768q56180j005039j391687p45025
7763e70167M93124J879249l00605m52560j98040k82865O25682k39191j656263
7754g01636O08620P4669L77433j96941O28439M35174k18515m41987R6770o44623
7744A7403o56935N24797q39519N75680O65426Q64798j046923N2183Q33228J279074
7734B269212j677651J07522k21206j07062J89399m62163n78407K92247J420708
7725A232599J400618j52798j155203J423899M99962q14921J129291J288187j618154
7716C233480N24125r61683j077619n63259k91616q31318J89015O17056J636550
$$ plain form
7781 -146813 1691071 2234913 3385932 3473290 1368246 253576 1227026 948060 1643631
7772 1643631 1303177 731155 1024340 1686996 3427764 2571584 1566545 174858 -570167
7763 -570167 -77043 1802206 1501601 1049041 851001 568136 1193818 954627 -701636
7754 -701636 -93016 -18347 359086 162145 790584 1225758 1007243 565256 662026 17403
7744 17403 -639532 -114735 -954254 -378574 286852 1151650 104727 156910 990138 2269212
7734 2269212 591561 699083 477877 370815 560214 98051 -480356 -188109 1232599
7725 1232599 2633217 2480419 1325216 2749115 3249077 2434156 3563447 4851634 3233480
7716 3233480 3757605 2795922 1718303 1155044 863428 32110 221125 838181 2474731
7707B474731j13106j418388O1378m96019j287069l3517l35242k11225K126580
7698G68123o9865L10196n1924k27369L16684R46997o55885J296337R4574O6166
7688B794034P16703Q47443k36920p79676k183488r20775N85942L38943N93773
7679A755979j818669k15360M05931N98244K65096k82972j81959O7502p22570N31994
7669D03216j67519P6237M99638M77378Q51208Q53364j172298p05277M38597r4972
7659A459572M36576r48558r34312N08071J024641m32697j1836l53576K82395j18949
7649I11327J13292k30442k38159p9286N25588L57451K24132K69072k373376p65404
7639a285805L62497J158006M77048P60968q71280o37605k46414N81245l31752
$$ plain form
7707 2474731 2361625 943237 1004615 508596 -778473 -811990 -1147232 -1358457 768123
7698 768123 698258 1008454 956530 729161 1045845 1992842 1336957 2633294 2727868 2794034
7688 2794034 3510737 4358180 4121260 3341584 1158096 237321 823263 1162206 1755979
7679 1755979 -62690 -278050 127881 726125 991221 708249 526290 593792 -128778 403216
7669 403216 235697 311934 811572 1288950 2140158 2993522 1821224 1115947 1554544 1459572
7659 1459572 1896148 947590 13278 521349 1545990 1113293 1101457 747881 1030276 911327
7649 911327 1024619 794177 556018 476732 1002320 1359771 1583903 1852975 -520401 -1285805
7639 -1285805 -923308 234698 711746 1472714 601434 -36171 -282585 298660 -33092
7630c3092M23540l87152K36756J164264J92025J89123m60191j048763j25022O80058
7620H31546m64244L10190J38175l56963O64293j50733l78692O3548q31306M00120
7610B25934K01461m59856N47023R16897m20606P71356l74716k145080M39388L61620
7600F3421p2508N48750q09939p18120J606170M99404P79465j010158o69164q18765
7590f01444o32628l7382J488751j43698j863235L02733L2855R39493M25065N79362
7580D89872r12638k31857M70199M39946j68257L10686O19553o29420j230957O13127
7570b29746O60204j72582m1327l56851j730454q1764J449089l52772O41291N47156
7560C32244r57223o22270L88422K28882J210159m71490N77460K10269P65886N58267
$$ plain form
7630 -33092 390448 3296 240052 1404316 1596341 1785464 1325273 276510 151488 831546
7620 831546 367302 677492 815667 458704 1122997 972264 593572 657120 -174186 225934
7610 225934 427395 -32461 514562 1431459 1010853 1782209 1407493 -737587 -298199 63421
7600 63421 -9087 539663 -270276 -988396 617774 1117178 1896643 886485 217321 -601444
7590 -601444 -1234072 -1271454 217297 73599 -1789636 -1486903 -1454048 -514555 -89490 489872
7580 489872 -422766 -654623 -184424 255522 87265 397951 1017504 388084 -842873 -229746
7570 -229746 430458 257876 216549 -140302 -1870756 -1952520 -503431 -856203 -214912 332244
7560 332244 -624979 -1247249 -858827 -629945 580214 108724 686184 896453 1662339 2220606
7550B220606k60416j066248j941088M28264k29244J90637p50062M27015j148898
7541b129434N81993O57547K70230M91204O06932j199234j23235J564187N95039
7532A315229n26115q08115J1054m71467N62484N96652Q1772Q63738J182895j220678
7522A587449r21582P20731k65493o48281O15246q89343R7761j019629l54624Q61927
7512b15838J104247K30795j987467N6704Q71121Q01735j79189o74751r04205J062366
7502A65518l66102j233880j7382J237370j16301j68168m23089K72958O37556J359690
7492A348170L05744o68643O66152n14734j441866J82598K27656r25986M5184L96635
7482c79090J969208O83158J74500j696158k33049o17215M46051j457203j027072
$$ plain form
7550 2220606 1960190 893942 -1047146 -618882 -848126 -657489 -1407551 -980536 -2129434
7541 -2129434 -1547441 -889894 -619664 -128460 478472 -720762 -843997 720190 1315229
7532 1315229 789114 -19001 -7947 -479414 83070 679722 761494 1625232 2808127 1587449
7522 1587449 665867 1386598 1121105 472824 1088070 198727 296488 -723141 -1077765 -215838
7512 -215838 888409 1119204 -868263 -811559 59562 861297 682108 7357 -896848 165518
7502 165518 -200584 -1434464 -1451846 -214476 -330777 -498945 -922034 -649076 -11520 1348170
7492 1348170 1653914 985271 1651423 1136689 -305177 -122579 105077 -820909 -775725 -379090
7482 -379090 1590118 2273276 2447776 751618 518569 -98646 347405 -1109798 -2136870
7473b136870J065393p05450K38986N7898J067504J138535o24635p47036N1654
7464e94021l48025Q91980K8511m04310L08630P08889j686603q6927J82190l58419
7454a358105j119873O02213J147481Q43015O12562p5927l44983p64249R59854
7445E01988p54287l38128k58186K223950M09131l30160O20611Q19699j381735
7436A512883m10992M5252j72113R39627L56441o46755j191881l57953L15820q06035
7426d15706j663295J251541L50120M30280N35944L18557p79465m27392R3247J24634
7416a81535N00814j83436o26091r55718K21791J470669J19964p34447R11492M99484
7406A042987N88232m16470q35611k03146O49808O02840J84053q90581P6332K81397
$$ plain form
7473 -2136870 -1071477 -1776927 -1537941 -1480043 -412539 725996 101361 -645675 -594021
7464 -594021 -942046 -50066 -21555 -425865 -117235 591654 -1094949 -1181876 -999686 -1358105
7454 -1358105 -2477978 -1875765 -728284 114731 727293 651366 306383 -457866 501988
7445 501988 -252299 -590427 -848613 1375337 1784468 1454308 2074919 2894618 1512883
7436 1512883 1101891 1147143 975030 1914657 2271098 1624343 432462 74509 390329 -415706
7426 -415706 -2079001 -827460 -477340 -47060 488884 807441 27976 -399416 -306169 -181535
7416 -181535 319279 135843 -490248 -1445966 -1224175 246494 366458 -367989 543503 1042987
7406 1042987 1631219 1214749 379138 175992 825800 1428640 1612693 722112 798444 1079841
7396A079841k39304l99254J045564L25605p8580R6711L21056j079222m40551N10596
7386A142462l81961N26556j60046p27204j00998R06777M63688n88142j326719
7377b45587j483084J108941Q90004M5851O12988k05450o88853p60936J160125
7368D33999M10314l74272l18585P77259n74912R93433P28445k165522K32370J249509
7358A392038k14508q5510P86378n72334p92117o89376Q85494J106820p82294l61213
7348F73378o79082n15684R42529J507457j583782l76415M39957N32950O2264K03446
7338A207018O97251n96665n84612L22479P4890o36947L72341K38333Q8663P74626
7328A957377n2009q67513o41126K3052J69943l47427j39907Q39069K12737J20838
$$ plain form
7396 1079841 840537 441283 1486847 1812452 1733872 1830583 2151639 1072417 631866 1142462
7386 1142462 760501 1287057 1127011 399807 298809 1205586 1669274 1081132 -245587
7377 -245587 -1728671 -619730 270274 316125 929113 723663 34810 -726126 433999
7368 433999 844313 470041 151456 928715 353803 1347236 2075681 -89841 142529 1392038
7358 1392038 1177530 1092020 1878398 1306064 513947 -175429 710065 1816885 1034591 673378
7348 673378 -5704 -521388 421141 1928598 344816 -31599 408358 941308 1003572 1207018
7338 1207018 1904269 1307604 722992 1045471 1120361 483414 855755 1094088 1182751 1957377
7328 1957377 1905368 1037855 396729 419781 589724 242297 102390 941459 1154196 1275034
7318A275034L32760Q8324L34088j53387r50231o30784q2011K79017O48385N4304
7308A195499r66339Q9116o96133j56640R77040n28960L75747K14267K74173L52092
7298A129862O54536j888412m14301L01403M30160J179110K67491j35147o86288
7289H38414J42397O56245O64354K52864k14007r18334q66964J568693J103110
7280C226772j065782l46089p30209m49466J322031J371856L06300o2433j250922
7271B322058N7643n17162r02478j08954o6636r18082k62420J253912m09018o79889
7261b31026R11368J82040k85101M66951J498376q19534r17679n69342q39400k36481
7251h39828Q04213J126784l23690J27466M04390j72467j547671N70667Q03669
$$ plain form
7318 1275034 1607794 1696118 2030206 1876819 926588 295804 213793 492810 1141195 1195499
7308 1195499 229160 318276 -377857 -534497 442543 -86417 289330 503597 777770 1129862
7298 1129862 1784398 -104014 -518315 -216912 213248 1392358 1659849 1524702 838414
7289 838414 980811 1637056 2301410 2554274 2340267 1421933 554969 2123662 3226772
7280 3226772 2160990 1814901 1084692 635226 1957257 3329113 3635413 3572980 2322058
7271 2322058 2379701 1862539 960061 851107 784471 -133611 -396031 857881 448863 -231026
7261 -231026 680342 862382 577281 1044232 2542608 1723074 805395 236053 -603347 -839828
7251 -839828 -35615 1091169 767479 894945 1299335 1126868 -420803 149864 953533
7242I53533r50156m43575L86064l85269P3482p6686J56851N98864j5557L02414
7232E99965o4051N01802J92044J484930j403981j744658J004641k97775m67044
7223a94127q16491K78310O61606q75040m54096m54624l86124L24170K1529k06318
7213b101205R83564P03481r69001j170958j534538P73766J629940p81630k7494
7204b494075J398531m18189P68368J741076l05509o14609Q35728M2019L82802
7195A336142O60373O80915m75071j100416N78747J41051j119129M33595q48589
7186B87618p6340L0922M55391K0062j618366K13173R78921J460502J32530M33442
7176B317855p31435r64094l28548p88139p6018K91988n52958j1219k7365J101752
$$ plain form
7242 953533 3377 -440198 -54134 -439403 -365921 -442607 -285756 313108 297551 599965
7232 599965 535914 1037716 1229760 2714690 1310709 -433949 570692 272917 -194127
7223 -194127 -1010618 -732308 -70702 -945742 -1399838 -1854462 -2240586 -1916416 -1894887 -2101205
7213 -2101205 -1117641 -414160 -1383161 -2554119 -4088657 -3314891 -1684951 -2466581 -2494075
7204 -2494075 -1095544 -1513733 -745365 995711 690202 75593 911321 953340 1336142
7195 1336142 1996515 2677430 2202359 1101943 1680690 1821741 702612 1136207 287618
7186 287618 211278 242200 697591 717653 -900713 -687540 291381 1751883 1884413 2317855
7176 2317855 1586420 622326 293778 -494361 -570379 -278391 -831349 -842568 -869933 231819
7166B31819L88794j000349k76467N28572R72962K98389m6742n99159J354908l7078
7156A815649K82362J49518j65487Q6192p35145p17264R50200J529359j328533
7147A866851n60770q79946o14392J093890J54986j216577J247373m32514n87415
7138G1486J393658n81547l55646p12999j050294L45571J295750J01781j29373
7129C78387p81768K63118O68547l89303j362146n65311o19428R75711J511210
7120G9017m04741J355337k19510j632618J60171J53367K71968J112176q44684
7111C0483r54812N27477N04828J53309J97928o3413J704009l21508q27051N14500
7101A465750l60280R9662R39959o94358j144857K21133q04822o62188k02008m70020
$$ plain form
7166 231819 620613 -379736 -656203 -127631 845331 1143720 1096978 497819 1852727 1815649
7156 1815649 2098011 2247529 2082042 2168234 1433089 715825 1666025 3195384 1866851
7147 1866851 1306081 426135 -188257 905633 1060619 -155958 1091415 658901 71486
7138 71486 1465144 883597 527951 -185048 -1235342 -889771 405979 507760 378387
7129 378387 -403381 -140263 528284 138981 -1223165 -1788476 -2407904 -1432193 79017
7120 79017 -325724 1029613 810103 -822515 -662344 -508977 -237009 875167 30483
7111 30483 -924329 -396852 107976 261285 459213 395800 2099809 1778301 951250 1465750
7101 1465750 1105470 1205132 2145091 1450733 305876 527009 -277813 -940001 -1142009 -1612029
7091a612029Q99151n39443l75045R62899L24652l68317j07834q65570q54068J304647
7081a230957o85647J07832N68328P14605j78464L94683j646990P49656R53982
7072b52972O2887O11484l63067P89521q781L36195p08711K36095j260205O48156
7062I0602L68265p49187P70793l6832j411156R40659Q78819L8561n31684l29200
7052B9640j11778M77005n6311R49946Q05887k399423N11524j25310J8194M50868
7042E50242P20738k12935J48649Q08483k77097j142094q4395R46653p15016Q7215
7032H30443l27214L1408l73722l13388j291946K70523j41893O48148J586157Q01513
7022A720029P20197j18168j401451l14456O83684J02098l30504q97256P61362
$$ plain form
7091 -1612029 -712878 -1252321 -1627366 -664467 -339815 -708132 -815966 -1681536 -2535604 -1230957
7081 -1230957 -1916604 -1808772 -1240444 -525839 -704303 -309620 -1956610 -1206954 -252972
7072 -252972 -190085 421399 58332 847853 839072 1175267 466556 702651 -557554 90602
7062 90602 458867 -290320 480473 443641 -967515 -26856 851963 890524 358840 29640
7052 29640 -82138 394867 338556 1288502 2094389 -305034 206490 81180 99374 550242
7042 550242 1270980 1058045 1206694 2015177 1738080 595986 511591 1458244 743228 830443
7032 830443 503229 534637 160915 -152473 -1444419 -1173896 -1315789 -667641 918516 1720029
7022 1720029 2440226 2322058 920607 606151 1289835 1391933 1061429 164173 925535
7013I25535R78098R34551n24610n26089l80245p3895Q10622J720260N16829r52035
7003C429021m09362o94861l32592P75030M41428j351557j015145Q33043k08182
6994A466823J24287K96687n28336j069816j16750L85015q12825r89009n3861K96860
6984a000925n84485N03900P43990Q99252k30575J086757j32512r08124Q1199K41068
6974F99545L82254j607825J234411J20527r58409J650671R37662j458749J44018
6965A144105M36784k26002M66961Q35551k36543r06798l72143P97073j114192
6956H24796r79719J112197j57563o50000J404535j80568j37773N49680n54300
6947A231285o36767p84654P6623j00093L67585J77486J259521j77365j187422
$$ plain form
7013 925535 1903633 2838184 2313574 1787485 1407240 1333345 2143967 3864227 4381056 3429021
7003 3429021 3019659 2324798 1992206 2767236 3208664 1857107 841962 1675005 1466823
6994 1466823 1591110 1887797 1359461 289645 172895 557910 -254915 -1243924 -1297785 -1000925
6984 -1000925 -1585410 -1081510 -337520 561732 331157 1417914 1285402 377278 458477 699545
6974 699545 1081799 -526026 708385 828912 -129497 1521174 2458836 1000087 1144105
6965 1144105 1580889 1354887 1821848 2657399 2420856 1514058 1141915 1938988 824796
6956 824796 -154923 957274 799711 149711 1554246 1373678 1235905 1785585 1231285
6947 1231285 594518 -190136 -113513 -213606 153979 331465 1590986 1413621 226199
6938B26199l35941J48812M30116p95326L12661q95502L8281J514744J076253l19845
6928A400452j97276k91217n46115M95013J021524j50718j404972k24142j338245
6919a235696K88006N52347N76310m26043K85195r103m29001O56287N89991N65155
6909A413448n36723J40192n5089O75159J449788M80233j315820j18371q83349
6900A249468q53102P3832Q35181m17793m59148r35315j56508J054384q35934m98860
6890i43795j529154m34972K317847J085366P64723P98425j928953o06887J52045
6881c25355R77641N23098l561j309860k12172o7540R37083L92696p89637m50217
6871c27824L19043j339622J94769R67603P5831L89627j779681q87531O15989J872869
$$ plain form
6938 226199 -109742 39070 469186 -326140 -13479 -908981 -870700 644044 1720297 1400452
6928 1400452 1203176 911959 365844 860857 1882381 1731663 326691 102549 -1235696
6919 -1235696 -947690 -395343 180967 -245076 40119 31016 -397985 258302 848293 1413448
6909 1413448 876725 1016917 961828 1636987 3086775 3567008 2251188 2132817 1249468
6900 1249468 396366 470198 1305379 887586 428438 -506877 -663385 390999 -444935 -943795
6890 -943795 -2472949 -2907921 -590074 495292 1260015 2058440 129487 -477400 -325355
6881 -325355 652286 1175384 1171823 -138037 -350209 -417749 519334 912030 122393 -327824
6871 -327824 -8781 -1348403 -1153634 -186031 -110200 279427 -1500254 -2387785 -1771796 101073
6861A01073O27808k26787j068327j35911k80306m60222J200870j95975O62112
6852B24335J184295m84929Q56367l31181r16706j259241J60753J383672R81216
6843A798581m27798j347205p1617o92672L21488n3678n60154p35385Q98992k46892
6833a116340k19818J065445K06777k46993J30110Q86553j33547K80397J27034
6824I79618k11035L41692R5033j30621j137889p40289J429664O90150K28225j55725
6814A388823q23584r96148N72578m15964k19782J61815k16777J264147q09011
6805i3903Q72479n2653j428966K56002J170871K24193L22492j80589j14993M62267
6795A437200l12391l32925r45238o2285n97967L00682n31260O31376M77080k15652
$$ plain form
6861 101073 728881 502094 -566233 -702144 -982450 -1442672 -241802 -437777 224335
6852 224335 1408630 923701 1780068 1448887 532181 -727060 -566307 817365 1798581
6843 1798581 1370783 23578 -48039 -740711 -419223 -472901 -1033055 -1768440 -869448 -1116340
6833 -1116340 -1336158 -270713 -63936 -310929 -180819 705734 572187 852584 979618
6824 979618 768583 1110275 1205308 1074687 -63202 -803491 626173 1316323 1544548 1388823
6814 1388823 565239 -430909 141669 -274295 -494077 -332262 -549039 715108 -93903
6805 -93903 778576 725923 -703043 -447041 723830 948023 1270515 1089926 974933 1437200
6795 1437200 1124809 791884 -153354 -215639 -813606 -512924 -1044184 -412808 64272 -151380
6785a51380m47644N3460j23045o4181Q00295J839770M12801j509044j266039l81297
6775h36304m30882J035180J832127q56438N16320o084n02110j198818K55181p08697
6765i00525m76348k72707P68820J403763L5293k29945O54816J53776k41210m14707
6755D81026N2763n71373j017829J407881k51838p4049J717586O97274k068109
6746C73332n48635K44414o27221j019814J489024j99966j481555L28577K167807
6737G25963N85644O41093n5213j743767j434779P36269J031459q497K28592N69544
6727A276308J074039q24410M85762m24862j574896j238746R57763l19983K05901
6718c83124R82119K56910n66053L50482K80378o07517j127733n23053m1373m59459
$$ plain form
6785 -151380 -599024 -545564 -668609 -732790 67505 1907275 2320076 811032 -455007 -836304
6775 -836304 -1267186 -232006 1600121 743683 1260003 1253919 751809 -447009 -191828 -900525
6765 -900525 -1376873 -1649580 -880760 523003 558296 328351 983167 1136943 895733 481026
6755 481026 533789 -37584 -1055413 352468 100630 26581 1744167 2441441 373332
6746 373332 -175303 69111 -558110 -1577924 -88900 -288866 -1770421 -1441844 725963
6737 725963 1311607 1952700 1897487 153720 -1281059 -544790 486669 478172 706764 1276308
6727 1276308 2350347 1525937 2011699 1586837 11941 -1226805 -269042 -589025 -383124
6718 -383124 598995 855905 289852 640334 920712 313195 -814538 -1337591 -1378964 -1838423
6708a838423P20154J544738J9814J61469J406363j128895K39066n62412j84512
6699C77362l68666Q8482o38132Q29274r9135J585462J123130r19627J024l14833
6689A664341l49492J01649J124474n84494k36058K13404R14818L30932j147955
6680B031619o58203p96627j57805J739370K78567q44051r35883j27196m02579
6671A27212J272544Q6412J01526m47306n75187Q15182m92016R5284m88431J88997
6661F84217k48933r22758J144682o22610N77551M40397P70875L32474k1540p00947
6651A433408k44833o47198m57082J349758j183691O48292L14714m6674n93799
6642E72895J70108J5021q93505O99141L50665J163792j62178j23129L74226j371064
$$ plain form
6708 -1838423 -1118269 426469 446283 607752 2014115 885220 1124286 561874 377362
6699 377362 8696 97178 -540954 288320 189185 1774647 2897777 1978150 1979174 1664341
6689 1664341 1314849 1416498 2540972 1956478 1720420 1933824 2848642 3179574 2031619
6680 2031619 1373416 576789 418984 2158354 2436921 1592870 656987 529791 127212
6671 127212 1399756 1486168 1587694 1140388 565201 1380383 888367 983651 495220 684217
6661 684217 435284 -487474 657208 34598 612149 1052546 1823421 2155895 2134355 1433408
6651 1433408 1188575 541377 84295 1434053 250362 898654 1213368 1166694 572895
6642 572895 743003 758024 -135481 563660 914325 2078117 1915939 1792810 2167036 795972
6632G95972l65050K79112o98079o46184J230726O73114m50764L24198Q49229J62309
6622B154583p43531M80994j382676k98539J543523L46981j030196j766796P32290
6613C6633J8116P40626J204997K25579j498808o49512j22792L4973N05933M51232
6603I46977m03070n08619J077299m2111m24135p89261N6396O35064L83698k07854
6593G24384j44704k45322O88214O03647p22861p56765j73789o50674q01455J446354
6583c2971K73280R7663M34731n97998j22622P16192j02420O6759O9322Q1731P43171
6572A626838o34668p31708k29635P91604o70389q79021k79096K62645R48674Q66440
6562A071684N86951r9510J55150k43362m00213M8904Q89764m79278j345991q1133
$$ plain form
6632 795972 430922 710034 11955 -634229 596497 1269611 818847 1143045 1992274 2154583
6622 2154583 1411052 1892046 509370 210831 1754354 2101335 1071139 -695657 36633
6613 36633 54749 795375 2000372 2225951 727143 77631 -45161 -10188 495745 946977
6603 946977 543907 35288 1112587 1070476 646341 -142920 -86524 548540 932238 724384
6593 724384 579680 334358 1022572 1626219 903358 146593 -27196 -677870 -1479325 -32971
6583 -32971 240309 337972 772703 174705 52083 768275 665855 732614 801936 883667 1626838
6572 1626838 992170 260462 30827 822431 152042 -726979 -1006075 -743430 205244 1071684
6562 1071684 1658635 1559125 1714275 1470913 1070700 1119604 2009368 1530090 184099 102966
6552A02966K85193J142712k40813q15746j355k00434L22409O84102M9371r08221
6542D20184j745817j007052Q2628L48467P24327Q04980j043379J408049Q78865
6533H71252j410056K11314J98100n17613l51025q5983l64734K308291q47955p74461
6523g62870m78254o04942O11338P3927m35831R38826K92099q48085P15869l90151
6513h88074M98707k87975r32761P94928J523289J5583r268q54864R10859O89411
6503A459835r79912j213510k98119M62254M90279J08602j216975j95832J200732
6494a82646L00209J43610K013618Q10508o99509r08930p10237M00043O25780M88358
6484B280804p17259j720656M19930M15282M59739K0853K30962j109872l01692
$$ plain form
6552 102966 388159 1530871 1290058 474312 472957 272523 594932 1279034 1328405 420184
6542 420184 -1325633 -2332685 -2250057 -1901590 -1177263 -372283 -1415662 -7613 871252
6533 871252 -538804 -327490 -129390 -647003 -998028 -1084011 -1448745 859546 11591 -762870
6523 -762870 -1241124 -1846066 -1234728 -1160801 -1596632 -657806 -365707 -1213792 -497923 -888074
6513 -888074 -389367 -677342 -1610103 -815175 708114 723697 714429 -140435 770424 1459835
6503 1459835 479923 -733587 -1031706 -569452 -79173 29429 -1187546 -1383378 -182646
6494 -182646 117563 261173 2274791 3085299 2385790 1476860 766623 1166666 1792446 2280804
6484 2280804 1563545 -157111 262819 678101 1137840 1158693 1389655 279783 -21909
6475b1909p04975J03704P70262o62593m23262L45084n06290J236272J207201j75313
6465A168181M80380Q45333j419165O600K71315P42969L26686j740589O6541j241588
6455d93337n09262O72108M41509J89390K447646l53242k01340J38001k72338n29402
6445A529733r05556l95497N95432Q43317q63255l5160J52774J30659N16591j689572
6435a20534p17716j86442k6058J420682P31090m72016m03352n92265o72226J321985
6425B83148M02542j172674n53317J95492J690950J628240J46589l92395n83893
6416A644682o20056L83678O68744j094849Q6663K76427J04428J293399N15163
6407C258279q05913j637621j092487J233065J056505Q3220J185520m35198o57757
$$ plain form
6475 -21909 -726884 -623180 147082 -515511 -938773 -593689 -1099979 136293 1343494 1168181
6465 1168181 1648561 2493894 1074729 1081329 1352644 2095613 2422299 681710 748251 -493337
6455 -493337 -1002599 -330491 111018 300408 2748054 2394812 2193472 2331473 2059135 1529733
6445 1529733 624177 228680 824112 1667429 804174 769014 921788 1052447 1569038 -120534
6435 -120534 -838250 -1024692 -1050750 369932 1101022 629006 225654 -366611 -1038837 283148
6425 283148 685690 -486984 -1040301 -844809 846141 2474381 2620970 2228575 1644682
6416 1644682 1024626 1408304 2077048 982199 1068862 1345289 1449717 2743116 3258279
6407 3258279 2452366 814745 -277742 955323 2011828 2095048 3280568 2845370 2187613
6398B187613r55126M58376o26299m95970K11498j361294j12644N58328o69018
6389h04536r18314p99877L58868J082498q46570l59722L77695M42008j91977M08578
6379a251349j097138l72957M44818K52942J306338O37715J29299L29156j88425
6370A90399l13302L20485J20264l45561J77691q7466L0206n08510R7429O07234
6360B88869m61756J088011Q37932j026041j92437j19247j00218n05463L795N29594
6350C43039j131540k25499p92599Q26678R34350J96251J12558n50179o51366K96778
6340f41529R00092o9745l80663Q97685r88462q08237J397477J348439p17367j768803
6330h31113L11373L69965P2264O00854K27883q07264P69553Q55491j482802l68968
$$ plain form
6398 2187613 1232487 1690863 1064564 568594 780092 -581202 -693846 -135518 -804536
6389 -804536 -1722850 -2522727 -2163859 -1081361 -1927931 -2287653 -1909958 -1467950 -1659927 -1251349
6379 -1251349 -2348487 -2721444 -2276626 -2023684 -717346 -79631 49668 378824 190399
6370 190399 -122903 197582 317846 -27715 149976 62510 92716 -415794 -318365 288869
6360 288869 -172887 915124 1753056 727015 534578 415331 315113 -190350 -186555 343039
6350 343039 -788501 -1014000 -1806599 -979921 -45571 150680 263238 -286941 -938307 -641529
6340 -641529 258563 188818 -191845 705840 -282622 -1090859 306618 1655057 937690 -831113
6330 -831113 -519740 -149775 -77511 523343 751226 -56038 713515 1569006 86204 -282764
6320b82764O95969J09386j09252n15953J304809K6992n36947J515162J046234
6311C253636p33260j296353o89506q81436N0891J008602K66610K39467M40408
6302A659059Q31782r284j162975N40490O34582k245131n97368M6931K54575o15499
6292f62838L0895K66232k09981N10408P04986K85334o43871L65082k60221j146308
6282g60282j97585M41896l47135r97586Q40808J289711M45324J85350m81835J13641
6272E32307k5170O9103q72455j79630L33123P11280R09410j380878o11971K009204
6262A494323n27237j012140J550188l54639j386627R4900k32081P3836R04448
6253F04971N82898q68796j737960k97330Q47976R9829Q04591K260939r54684j85550
$$ plain form
6320 -282764 413205 522591 413339 -102614 1202195 1229187 692240 2207402 3253636
6311 3253636 2520376 1224023 534517 -346919 -296028 712574 979184 1218651 1659059
6302 1659059 2490841 2481557 1318582 1859072 2493654 248523 -348845 -301914 -47339 -662838
6292 -662838 -631943 -365711 -575692 -65284 639702 925036 281165 646247 386026 -760282
6282 -760282 -957867 -515971 -863106 -1860692 -1019884 269827 715151 900501 418666 532307
6272 532307 507137 576240 -296215 -475845 -142722 568558 1477968 97090 -514881 1494323
6262 1494323 967086 -45054 1505134 1150495 -236132 -141232 -373313 -299477 604971
6253 604971 1187869 319073 -1418887 -1716217 -868241 -768412 36179 2297118 1342434 1156884
$$ [...]
##END NTUPLES=NMR SPECTRUM
##END=
